{"text_format":"1","workbook":"xlsx","n_sheets":3,"sheets":["S09","Tests","DDM"],"not_rendered":{"charts":0,"images":2,"macros":1,"external_links":0,"defined_names":22,"comments":2,"pivot_tables":0},"unopened":[],"bounds":{"document_bytes":16777216,"sheet_cells":100000,"rows_first":2000,"rows_last":500,"rows_between":2000,"halvings":0,"cell_chars":16384,"cell_head_chars":4096},"cells_cut":0,"cells_raw":0,"read":"whole","date_system":"1900"}

{"sheet":"S09","index":0,"n_rows":9,"n_cols":23,"rows_kept":9,"cut":false,"hidden":false,"merged":[]}
[null,"Übersicht",null,{"$f":"#REF!","v":{"$error":"#REF!"}},null,{"$f":"MID(CELL(\"dateiname\",B1),FIND(\"]\",CELL(\"dateiname\",B1))+1,255)","v":"S09"},{"$f":"COUNTA($B$7:$TM$7)","v":19},{"$f":"_xlfn.SHEET()","v":1},8,{"$f":"I1+(SUM(COUNTIF(B8:B2631,{\">\"\"\",\"<1E+55\"})))-1","v":8},{"$f":"SUBSTITUTE(ADDRESS(2,G1-COUNTA($B$7:$TU$7)+2,4),2,)","v":"B"},"W",{"$f":"L1&I1","v":"W8"},{"$f":"K1&I1","v":"B8"},{"$f":"L1&J1","v":"W8"},{"$f":"(SUM(COUNTIF(B8:B933,{\">\"\"\",\"<1E+55\"})))","v":1},{"$f":"COLUMN(DP:DP)","v":120},{"$f":"COLUMN(DQ:DQ)","v":121},{"$f":"MAX(W8:W932)","v":0},{"$f":"COUNT(W8:W932)","v":0}]
[null,"Projekt/-Nr.:",null,"Sanierung S9",null,{"$f":"F1","v":"S09"},null,null,{"$f":"COUNTIFS(I8:I945,\"offen\")","v":0},"Restarbeiten 2024","Klärungsbedarf","Revidiert / Neu"]
[null,"Stand:",null,"2024-12-02",null,null,null,null,{"$f":"COUNTIFS(I8:I945,\"in Arbeit\")","v":0},"Änderung PL","Achtung Formel"]
[null,"Druckdatum:",null,{"$f":"TODAY()","v":"2024-12-06"},{"$f":"DDM!P9:P11","v":{"$error":"#VALUE!"}},null,null,null,{"$f":"COUNTIFS(I8:I945,\"erledigt\")","v":2},"Änderung BL","Änderung UTG"]
[null,"Letzter Bearbeiter:",null,"M. Franke",{"$f":"IF(E8=\"\",DDM!$R$9:$R$14,IF(E8=DDM!$R$9,DDM!$L$9:$L$40,IF(E8=DDM!$R$10,DDM!$P$9:$P$40,IF(E8=DDM!$R$11,DDM!$L$44:$L$100,IF(E8=DDM!$R$12,DDM!$P$44:$P$86)))))","v":{"$error":"#VALUE!"}},{"$f":"IF(E8=\"\",INDIRECT(DDM!$R$9:$R$14),IF(E8=INDIRECT(DDM!$R$9),inrirekt(DDM!$L$9:$L$40),IF(E8=INDIRECT(DDM!$R$10),INDIRECT(DDM!$P$9:$P$40),IF(E8=INDIRECT(DDM!$R$11),INDIRECT(DDM!$L$44:$L$100),IF(E8=INDIRECT(DDM!$R$12),INDIRECT(DDM!$P$44:$P$86))))))","v":{"$error":"#VALUE!"}},null,null,{"$f":"COUNTIFS(I8:I9949,\"in Prüfung\")","v":0}]
[null,"Letzte Begehung: ",null,"2024-11-27",{"$f":"IF('S09'!F2=\"\",DDM!R9:R10,\"\")","v":""},{"$f":"INDIRECT(IF(E8=\"\",DDM!$R$9:$R$14,IF(E8=DDM!$R$9,DDM!$L$9:$L$40,IF(E8=DDM!$R$10,DDM!$P$9:$P$40,IF(E8=DDM!$R$11,DDM!$L$44:$L$100,IF(E8=DDM!$R$12,DDM!$P$44:$P$86))))))","v":{"$error":"#VALUE!"}},"v1.1",null,null,null,5]
[null,"Pos","Kurzbeschreibung Restarbeiten","Verant-\nwortlich","zu erledigen\ndurch","erfasst\nam","Kommentar / Beschreibung","letzte Bearbeitung","Status","zu erledigen\nbis","erledigt am ","abgenommen von","Quelle","Gewerk","Bild-\nZeile","Bild-\nLink","Prio","Bestell-\nNr.","PSP-Element",null,"Hilfstabelle"]
[null,{"$f":"IF(C8<>\"\",MAX(B$6:B7)+1,\"\")","v":1},"asdasdasdasd",null,null,"2022-03-14","asdsadasd",null,"erledigt",null,null,null,null,null,null,{"$f":"IF(O8=\"\",\"\",HYPERLINK(\"#Bilder!\"&O8&\":\"&O8,\"Link\"))","v":""},null,null,null,null,{"$f":"IF(B8<>\"\",IF(OR(I8=#REF!,I8=#REF!,I8=#REF!),ROW(),\"\"),\"\")","v":{"$error":"#REF!"}},{"$f":"IFERROR(IF(ROW(N1)>COUNTA($U$8:$U$933),\"\",INDEX($U:$U,SMALL(IF(U$8:U$933<>\"\",ROW($8:$933)),ROW(N1)))),\"\")","v":""},{"$f":"IFERROR(V8,\"\")","v":""}]
[null,{"$f":"IF(C9<>\"\",MAX(B$6:B8)+1,\"\")","v":""},null,null,null,"2022-03-14","asdasdasd",null,"erledigt",null,null,null,null,null,null,{"$f":"IF(O9=\"\",\"\",HYPERLINK(\"#Bilder!\"&O9&\":\"&O9,\"Link\"))","v":""},null,null,null,null,{"$f":"IF(B9<>\"\",IF(OR(I9=#REF!,I9=#REF!,I9=#REF!),ROW(),\"\"),\"\")","v":""},{"$f":"IFERROR(IF(ROW(N2)>COUNTA($U$8:$U$933),\"\",INDEX($U:$U,SMALL(IF(U$8:U$933<>\"\",ROW($8:$933)),ROW(N2)))),\"\")","v":""},{"$f":"IFERROR(V9,\"\")","v":""}]

{"sheet":"Tests","index":1,"n_rows":0,"n_cols":0,"rows_kept":0,"cut":false,"hidden":true,"merged":[]}

{"sheet":"DDM","index":2,"n_rows":86,"n_cols":24,"rows_kept":86,"cut":false,"hidden":false,"merged":[]}
[null,"Index",null,{"$f":"#REF!","v":{"$error":"#REF!"}},null,{"$f":"MID(CELL(\"dateiname\",B1),FIND(\"]\",CELL(\"dateiname\",B1))+1,255)","v":"DDM"},{"$f":"COUNTA($B$7:$TN$7)","v":0},{"$f":"_xlfn.SHEET()","v":3},8,{"$f":"I1+(SUM(COUNTIF(B8:B2620,{\">\"\"\",\"<1E+55\"})))-1","v":19},{"$f":"SUBSTITUTE(ADDRESS(2,G1-COUNTA($B$7:$TV$7)+2,4),2,)","v":"B"},"W",{"$f":"L1&I1","v":"W8"},{"$f":"K1&I1","v":"B8"},{"$f":"L1&J1","v":"W19"},{"$f":"(SUM(COUNTIF(B8:B922,{\">\"\"\",\"<1E+55\"})))","v":12},{"$f":"COLUMN(DQ:DQ)","v":121},{"$f":"COLUMN(DR:DR)","v":122},{"$f":"MAX(X8:X913)","v":0},{"$f":"COUNT(X8:X913)","v":0}]
[null,"Projekt/-Nr.:"]
[null,"Stand:",null,"2024-11-28"]
[null,"Druckdatum:",null,{"$f":"TODAY()","v":"2024-12-06"}]
[null,"Editor:",null,"M. Franke"]
[null,"Letzte Begehung: ",null,"2024-08-09",null,null,"v1.1"]
[]
[null,"Gewerk",null,null,"Spalte1","Name","Vorname","Nachname","Host",null,null,"Host_Abt",null,null,"Host_MA",null,null,"AuswahlName",null,"Prio",null,"Status",null,"Verantwortlich"]
[null,"Stahlbau",null,null,null,{"$f":"IF(tbl_Uniper[[#This Row],[Nachname]]=\"\",\"\",LEFT(tbl_Uniper[[#This Row],[Vorname]],1)&\". \"&tbl_Uniper[[#This Row],[Nachname]])","v":"M. Mustermann1"},"Max","Mustermann1","UST-Projektleitung",null,{"$f":"IF((IF((COUNTIF(I$9:I9,I9)>1)=FALSE,I9,\"\"))=0,\"\",(IF((COUNTIF(I$9:I9,I9)>1)=FALSE,I9,\"\")))","v":"UST-Projektleitung"},{"$f":"IFERROR(IF(ROW(K1)>COUNTA($K$9:$K$31),\"\",INDEX($K:$K,SMALL(IF(K$9:K$31<>\"\",ROW($9:$31)),ROW(K1)))),\"\")","v":"UST-Projektleitung"},null,{"$f":"IF((IF((COUNTIF(F$9:F9,F9)>1)=FALSE,F9,\"\"))=0,\"\",(IF((COUNTIF(F$9:F9,F9)>1)=FALSE,F9,\"\")))","v":"M. Mustermann1"},{"$f":"IFERROR(IF(ROW(N1)>COUNTA($N$9:$N$31),\"\",INDEX($N:$N,SMALL(IF(N$9:N$31<>\"\",ROW($9:$31)),ROW(N1)))),\"\")","v":"M. Mustermann1"},{"$f":"IF(O9=\"\",\"\",INDEX(tbl_Uniper[],MATCH(O9,tbl_Uniper[Name],0),5))","v":"UST-Projektleitung"},null,"Host Abt",null,1,null,"offen"]
[null,"Tiefbau",null,null,null,{"$f":"IF(tbl_Uniper[[#This Row],[Nachname]]=\"\",\"\",LEFT(tbl_Uniper[[#This Row],[Vorname]],1)&\". \"&tbl_Uniper[[#This Row],[Nachname]])","v":"M. Mustermann1"},"Max","Mustermann1","UST",null,{"$f":"IF((IF((COUNTIF(I$9:I10,I10)>1)=FALSE,I10,\"\"))=0,\"\",(IF((COUNTIF(I$9:I10,I10)>1)=FALSE,I10,\"\")))","v":"UST"},{"$f":"IFERROR(IF(ROW(K2)>COUNTA($K$9:$K$31),\"\",INDEX($K:$K,SMALL(IF(K$9:K$31<>\"\",ROW($9:$31)),ROW(K2)))),\"\")","v":"UST"},null,{"$f":"IF((IF((COUNTIF(F$9:F10,F10)>1)=FALSE,F10,\"\"))=0,\"\",(IF((COUNTIF(F$9:F10,F10)>1)=FALSE,F10,\"\")))","v":""},{"$f":"IFERROR(IF(ROW(N2)>COUNTA($N$9:$N$31),\"\",INDEX($N:$N,SMALL(IF(N$9:N$31<>\"\",ROW($9:$31)),ROW(N2)))),\"\")","v":"g. Müller"},{"$f":"IF(O10=\"\",\"\",INDEX(tbl_Uniper[],MATCH(O10,tbl_Uniper[Name],0),5))","v":"UST"},null,"Host_MA",null,2,null,"in Arbeit"]
[null,"Hochbau",null,null,null,{"$f":"IF(tbl_Uniper[[#This Row],[Nachname]]=\"\",\"\",LEFT(tbl_Uniper[[#This Row],[Vorname]],1)&\". \"&tbl_Uniper[[#This Row],[Nachname]])","v":"M. Mustermann1"},"Max","Mustermann1","UST",null,{"$f":"IF((IF((COUNTIF(I$9:I11,I11)>1)=FALSE,I11,\"\"))=0,\"\",(IF((COUNTIF(I$9:I11,I11)>1)=FALSE,I11,\"\")))","v":""},{"$f":"IFERROR(IF(ROW(K3)>COUNTA($K$9:$K$31),\"\",INDEX($K:$K,SMALL(IF(K$9:K$31<>\"\",ROW($9:$31)),ROW(K3)))),\"\")","v":"UST-Bauleitung"},null,{"$f":"IF((IF((COUNTIF(F$9:F11,F11)>1)=FALSE,F11,\"\"))=0,\"\",(IF((COUNTIF(F$9:F11,F11)>1)=FALSE,F11,\"\")))","v":""},{"$f":"IFERROR(IF(ROW(N3)>COUNTA($N$9:$N$31),\"\",INDEX($N:$N,SMALL(IF(N$9:N$31<>\"\",ROW($9:$31)),ROW(N3)))),\"\")","v":"g. Fischer"},{"$f":"IF(O11=\"\",\"\",INDEX(tbl_Uniper[],MATCH(O11,tbl_Uniper[Name],0),5))","v":"UTG"},null,"Fimen",null,3,null,"erledigt"]
[null,"Piping",null,null,null,{"$f":"IF(tbl_Uniper[[#This Row],[Nachname]]=\"\",\"\",LEFT(tbl_Uniper[[#This Row],[Vorname]],1)&\". \"&tbl_Uniper[[#This Row],[Nachname]])","v":"M. Mustermann1"},"Max","Mustermann1","UST-Bauleitung",null,{"$f":"IF((IF((COUNTIF(I$9:I12,I12)>1)=FALSE,I12,\"\"))=0,\"\",(IF((COUNTIF(I$9:I12,I12)>1)=FALSE,I12,\"\")))","v":"UST-Bauleitung"},{"$f":"IFERROR(IF(ROW(K4)>COUNTA($K$9:$K$31),\"\",INDEX($K:$K,SMALL(IF(K$9:K$31<>\"\",ROW($9:$31)),ROW(K4)))),\"\")","v":"UT"},null,{"$f":"IF((IF((COUNTIF(F$9:F12,F12)>1)=FALSE,F12,\"\"))=0,\"\",(IF((COUNTIF(F$9:F12,F12)>1)=FALSE,F12,\"\")))","v":""},{"$f":"IFERROR(IF(ROW(N4)>COUNTA($N$9:$N$31),\"\",INDEX($N:$N,SMALL(IF(N$9:N$31<>\"\",ROW($9:$31)),ROW(N4)))),\"\")","v":"A. Peters"},{"$f":"IF(O12=\"\",\"\",INDEX(tbl_Uniper[],MATCH(O12,tbl_Uniper[Name],0),5))","v":"UTG"},null,"Firmen_MA",null,null,null,"in Prüfung"]
[null,"EMSR",null,null,null,{"$f":"IF(tbl_Uniper[[#This Row],[Nachname]]=\"\",\"\",LEFT(tbl_Uniper[[#This Row],[Vorname]],1)&\". \"&tbl_Uniper[[#This Row],[Nachname]])","v":"M. Mustermann1"},"Max","Mustermann1","UST",null,{"$f":"IF((IF((COUNTIF(I$9:I13,I13)>1)=FALSE,I13,\"\"))=0,\"\",(IF((COUNTIF(I$9:I13,I13)>1)=FALSE,I13,\"\")))","v":""},{"$f":"IFERROR(IF(ROW(K5)>COUNTA($K$9:$K$31),\"\",INDEX($K:$K,SMALL(IF(K$9:K$31<>\"\",ROW($9:$31)),ROW(K5)))),\"\")","v":"UTG"},null,{"$f":"IF((IF((COUNTIF(F$9:F13,F13)>1)=FALSE,F13,\"\"))=0,\"\",(IF((COUNTIF(F$9:F13,F13)>1)=FALSE,F13,\"\")))","v":""},{"$f":"IFERROR(IF(ROW(N5)>COUNTA($N$9:$N$31),\"\",INDEX($N:$N,SMALL(IF(N$9:N$31<>\"\",ROW($9:$31)),ROW(N5)))),\"\")","v":""},{"$f":"IF(O13=\"\",\"\",INDEX(tbl_Uniper[],MATCH(O13,tbl_Uniper[Name],0),5))","v":""}]
[null,"Doku",null,null,null,{"$f":"IF(tbl_Uniper[[#This Row],[Nachname]]=\"\",\"\",LEFT(tbl_Uniper[[#This Row],[Vorname]],1)&\". \"&tbl_Uniper[[#This Row],[Nachname]])","v":"g. Müller"},"g","Müller","UST",null,{"$f":"IF((IF((COUNTIF(I$9:I14,I14)>1)=FALSE,I14,\"\"))=0,\"\",(IF((COUNTIF(I$9:I14,I14)>1)=FALSE,I14,\"\")))","v":""},{"$f":"IFERROR(IF(ROW(K6)>COUNTA($K$9:$K$31),\"\",INDEX($K:$K,SMALL(IF(K$9:K$31<>\"\",ROW($9:$31)),ROW(K6)))),\"\")","v":""},null,{"$f":"IF((IF((COUNTIF(F$9:F14,F14)>1)=FALSE,F14,\"\"))=0,\"\",(IF((COUNTIF(F$9:F14,F14)>1)=FALSE,F14,\"\")))","v":"g. Müller"},{"$f":"IFERROR(IF(ROW(N6)>COUNTA($N$9:$N$31),\"\",INDEX($N:$N,SMALL(IF(N$9:N$31<>\"\",ROW($9:$31)),ROW(N6)))),\"\")","v":""},{"$f":"IF(O14=\"\",\"\",INDEX(tbl_Uniper[],MATCH(O14,tbl_Uniper[Name],0),5))","v":""}]
[null,"Prozess",null,null,null,{"$f":"IF(tbl_Uniper[[#This Row],[Nachname]]=\"\",\"\",LEFT(tbl_Uniper[[#This Row],[Vorname]],1)&\". \"&tbl_Uniper[[#This Row],[Nachname]])","v":""},null,null,"UST",null,{"$f":"IF((IF((COUNTIF(I$9:I15,I15)>1)=FALSE,I15,\"\"))=0,\"\",(IF((COUNTIF(I$9:I15,I15)>1)=FALSE,I15,\"\")))","v":""},{"$f":"IFERROR(IF(ROW(K7)>COUNTA($K$9:$K$31),\"\",INDEX($K:$K,SMALL(IF(K$9:K$31<>\"\",ROW($9:$31)),ROW(K7)))),\"\")","v":""},null,{"$f":"IF((IF((COUNTIF(F$9:F15,F15)>1)=FALSE,F15,\"\"))=0,\"\",(IF((COUNTIF(F$9:F15,F15)>1)=FALSE,F15,\"\")))","v":""},{"$f":"IFERROR(IF(ROW(N7)>COUNTA($N$9:$N$31),\"\",INDEX($N:$N,SMALL(IF(N$9:N$31<>\"\",ROW($9:$31)),ROW(N7)))),\"\")","v":""},{"$f":"IF(O15=\"\",\"\",INDEX(tbl_Uniper[],MATCH(O15,tbl_Uniper[Name],0),5))","v":""}]
[null,"Montage",null,null,null,{"$f":"IF(tbl_Uniper[[#This Row],[Nachname]]=\"\",\"\",LEFT(tbl_Uniper[[#This Row],[Vorname]],1)&\". \"&tbl_Uniper[[#This Row],[Nachname]])","v":""},null,null,"UT",null,{"$f":"IF((IF((COUNTIF(I$9:I16,I16)>1)=FALSE,I16,\"\"))=0,\"\",(IF((COUNTIF(I$9:I16,I16)>1)=FALSE,I16,\"\")))","v":"UT"},{"$f":"IFERROR(IF(ROW(K8)>COUNTA($K$9:$K$31),\"\",INDEX($K:$K,SMALL(IF(K$9:K$31<>\"\",ROW($9:$31)),ROW(K8)))),\"\")","v":""},null,{"$f":"IF((IF((COUNTIF(F$9:F16,F16)>1)=FALSE,F16,\"\"))=0,\"\",(IF((COUNTIF(F$9:F16,F16)>1)=FALSE,F16,\"\")))","v":""},{"$f":"IFERROR(IF(ROW(N8)>COUNTA($N$9:$N$31),\"\",INDEX($N:$N,SMALL(IF(N$9:N$31<>\"\",ROW($9:$31)),ROW(N8)))),\"\")","v":""},{"$f":"IF(O16=\"\",\"\",INDEX(tbl_Uniper[],MATCH(O16,tbl_Uniper[Name],0),5))","v":""}]
[null,"Anstrich",null,null,null,{"$f":"IF(tbl_Uniper[[#This Row],[Nachname]]=\"\",\"\",LEFT(tbl_Uniper[[#This Row],[Vorname]],1)&\". \"&tbl_Uniper[[#This Row],[Nachname]])","v":""},null,null,"UT",null,{"$f":"IF((IF((COUNTIF(I$9:I17,I17)>1)=FALSE,I17,\"\"))=0,\"\",(IF((COUNTIF(I$9:I17,I17)>1)=FALSE,I17,\"\")))","v":""},{"$f":"IFERROR(IF(ROW(K9)>COUNTA($K$9:$K$31),\"\",INDEX($K:$K,SMALL(IF(K$9:K$31<>\"\",ROW($9:$31)),ROW(K9)))),\"\")","v":""},null,{"$f":"IF((IF((COUNTIF(F$9:F17,F17)>1)=FALSE,F17,\"\"))=0,\"\",(IF((COUNTIF(F$9:F17,F17)>1)=FALSE,F17,\"\")))","v":""},{"$f":"IFERROR(IF(ROW(N9)>COUNTA($N$9:$N$31),\"\",INDEX($N:$N,SMALL(IF(N$9:N$31<>\"\",ROW($9:$31)),ROW(N9)))),\"\")","v":""},{"$f":"IF(O17=\"\",\"\",INDEX(tbl_Uniper[],MATCH(O17,tbl_Uniper[Name],0),5))","v":""}]
[null,"Blitzschutz",null,null,null,{"$f":"IF(tbl_Uniper[[#This Row],[Nachname]]=\"\",\"\",LEFT(tbl_Uniper[[#This Row],[Vorname]],1)&\". \"&tbl_Uniper[[#This Row],[Nachname]])","v":""},null,null,"UT",null,{"$f":"IF((IF((COUNTIF(I$9:I18,I18)>1)=FALSE,I18,\"\"))=0,\"\",(IF((COUNTIF(I$9:I18,I18)>1)=FALSE,I18,\"\")))","v":""},{"$f":"IFERROR(IF(ROW(K10)>COUNTA($K$9:$K$31),\"\",INDEX($K:$K,SMALL(IF(K$9:K$31<>\"\",ROW($9:$31)),ROW(K10)))),\"\")","v":""},null,{"$f":"IF((IF((COUNTIF(F$9:F18,F18)>1)=FALSE,F18,\"\"))=0,\"\",(IF((COUNTIF(F$9:F18,F18)>1)=FALSE,F18,\"\")))","v":""},{"$f":"IFERROR(IF(ROW(N10)>COUNTA($N$9:$N$31),\"\",INDEX($N:$N,SMALL(IF(N$9:N$31<>\"\",ROW($9:$31)),ROW(N10)))),\"\")","v":""},{"$f":"IF(O18=\"\",\"\",INDEX(tbl_Uniper[],MATCH(O18,tbl_Uniper[Name],0),5))","v":""}]
[null,"Maschine",null,null,null,{"$f":"IF(tbl_Uniper[[#This Row],[Nachname]]=\"\",\"\",LEFT(tbl_Uniper[[#This Row],[Vorname]],1)&\". \"&tbl_Uniper[[#This Row],[Nachname]])","v":"g. Fischer"},"g","Fischer","UTG",null,{"$f":"IF((IF((COUNTIF(I$9:I19,I19)>1)=FALSE,I19,\"\"))=0,\"\",(IF((COUNTIF(I$9:I19,I19)>1)=FALSE,I19,\"\")))","v":"UTG"},{"$f":"IFERROR(IF(ROW(K11)>COUNTA($K$9:$K$31),\"\",INDEX($K:$K,SMALL(IF(K$9:K$31<>\"\",ROW($9:$31)),ROW(K11)))),\"\")","v":""},null,{"$f":"IF((IF((COUNTIF(F$9:F19,F19)>1)=FALSE,F19,\"\"))=0,\"\",(IF((COUNTIF(F$9:F19,F19)>1)=FALSE,F19,\"\")))","v":"g. Fischer"},{"$f":"IFERROR(IF(ROW(N11)>COUNTA($N$9:$N$31),\"\",INDEX($N:$N,SMALL(IF(N$9:N$31<>\"\",ROW($9:$31)),ROW(N11)))),\"\")","v":""},{"$f":"IF(O19=\"\",\"\",INDEX(tbl_Uniper[],MATCH(O19,tbl_Uniper[Name],0),5))","v":""}]
[null,null,null,null,null,{"$f":"IF(tbl_Uniper[[#This Row],[Nachname]]=\"\",\"\",LEFT(tbl_Uniper[[#This Row],[Vorname]],1)&\". \"&tbl_Uniper[[#This Row],[Nachname]])","v":""},"Karl",null,"UTG",null,{"$f":"IF((IF((COUNTIF(I$9:I20,I20)>1)=FALSE,I20,\"\"))=0,\"\",(IF((COUNTIF(I$9:I20,I20)>1)=FALSE,I20,\"\")))","v":""},{"$f":"IFERROR(IF(ROW(K12)>COUNTA($K$9:$K$31),\"\",INDEX($K:$K,SMALL(IF(K$9:K$31<>\"\",ROW($9:$31)),ROW(K12)))),\"\")","v":""},null,{"$f":"IF((IF((COUNTIF(F$9:F20,F20)>1)=FALSE,F20,\"\"))=0,\"\",(IF((COUNTIF(F$9:F20,F20)>1)=FALSE,F20,\"\")))","v":""},{"$f":"IFERROR(IF(ROW(N12)>COUNTA($N$9:$N$31),\"\",INDEX($N:$N,SMALL(IF(N$9:N$31<>\"\",ROW($9:$31)),ROW(N12)))),\"\")","v":""},{"$f":"IF(O20=\"\",\"\",INDEX(tbl_Uniper[],MATCH(O20,tbl_Uniper[Name],0),5))","v":""}]
[null,null,null,null,null,{"$f":"IF(tbl_Uniper[[#This Row],[Nachname]]=\"\",\"\",LEFT(tbl_Uniper[[#This Row],[Vorname]],1)&\". \"&tbl_Uniper[[#This Row],[Nachname]])","v":"A. Peters"},"Andreas","Peters","UTG",null,{"$f":"IF((IF((COUNTIF(I$9:I21,I21)>1)=FALSE,I21,\"\"))=0,\"\",(IF((COUNTIF(I$9:I21,I21)>1)=FALSE,I21,\"\")))","v":""},{"$f":"IFERROR(IF(ROW(K13)>COUNTA($K$9:$K$31),\"\",INDEX($K:$K,SMALL(IF(K$9:K$31<>\"\",ROW($9:$31)),ROW(K13)))),\"\")","v":""},null,{"$f":"IF((IF((COUNTIF(F$9:F21,F21)>1)=FALSE,F21,\"\"))=0,\"\",(IF((COUNTIF(F$9:F21,F21)>1)=FALSE,F21,\"\")))","v":"A. Peters"},{"$f":"IFERROR(IF(ROW(N13)>COUNTA($N$9:$N$31),\"\",INDEX($N:$N,SMALL(IF(N$9:N$31<>\"\",ROW($9:$31)),ROW(N13)))),\"\")","v":""},{"$f":"IF(O21=\"\",\"\",INDEX(tbl_Uniper[],MATCH(O21,tbl_Uniper[Name],0),5))","v":""}]
[null,null,null,null,null,{"$f":"IF(tbl_Uniper[[#This Row],[Nachname]]=\"\",\"\",LEFT(tbl_Uniper[[#This Row],[Vorname]],1)&\". \"&tbl_Uniper[[#This Row],[Nachname]])","v":""},null,null,"UTG",null,{"$f":"IF((IF((COUNTIF(I$9:I22,I22)>1)=FALSE,I22,\"\"))=0,\"\",(IF((COUNTIF(I$9:I22,I22)>1)=FALSE,I22,\"\")))","v":""},{"$f":"IFERROR(IF(ROW(K14)>COUNTA($K$9:$K$31),\"\",INDEX($K:$K,SMALL(IF(K$9:K$31<>\"\",ROW($9:$31)),ROW(K14)))),\"\")","v":""},null,{"$f":"IF((IF((COUNTIF(F$9:F22,F22)>1)=FALSE,F22,\"\"))=0,\"\",(IF((COUNTIF(F$9:F22,F22)>1)=FALSE,F22,\"\")))","v":""},{"$f":"IFERROR(IF(ROW(N14)>COUNTA($N$9:$N$31),\"\",INDEX($N:$N,SMALL(IF(N$9:N$31<>\"\",ROW($9:$31)),ROW(N14)))),\"\")","v":""},{"$f":"IF(O22=\"\",\"\",INDEX(tbl_Uniper[],MATCH(O22,tbl_Uniper[Name],0),5))","v":""}]
[null,null,null,null,null,{"$f":"IF(tbl_Uniper[[#This Row],[Nachname]]=\"\",\"\",LEFT(tbl_Uniper[[#This Row],[Vorname]],1)&\". \"&tbl_Uniper[[#This Row],[Nachname]])","v":""},null,null,"UTG",null,{"$f":"IF((IF((COUNTIF(I$9:I23,I23)>1)=FALSE,I23,\"\"))=0,\"\",(IF((COUNTIF(I$9:I23,I23)>1)=FALSE,I23,\"\")))","v":""},{"$f":"IFERROR(IF(ROW(K15)>COUNTA($K$9:$K$31),\"\",INDEX($K:$K,SMALL(IF(K$9:K$31<>\"\",ROW($9:$31)),ROW(K15)))),\"\")","v":""},null,{"$f":"IF((IF((COUNTIF(F$9:F23,F23)>1)=FALSE,F23,\"\"))=0,\"\",(IF((COUNTIF(F$9:F23,F23)>1)=FALSE,F23,\"\")))","v":""},{"$f":"IFERROR(IF(ROW(N15)>COUNTA($N$9:$N$31),\"\",INDEX($N:$N,SMALL(IF(N$9:N$31<>\"\",ROW($9:$31)),ROW(N15)))),\"\")","v":""},{"$f":"IF(O23=\"\",\"\",INDEX(tbl_Uniper[],MATCH(O23,tbl_Uniper[Name],0),5))","v":""}]
[null,null,null,null,null,{"$f":"IF(tbl_Uniper[[#This Row],[Nachname]]=\"\",\"\",LEFT(tbl_Uniper[[#This Row],[Vorname]],1)&\". \"&tbl_Uniper[[#This Row],[Nachname]])","v":""},null,null,"UTG",null,{"$f":"IF((IF((COUNTIF(I$9:I24,I24)>1)=FALSE,I24,\"\"))=0,\"\",(IF((COUNTIF(I$9:I24,I24)>1)=FALSE,I24,\"\")))","v":""},{"$f":"IFERROR(IF(ROW(K16)>COUNTA($K$9:$K$31),\"\",INDEX($K:$K,SMALL(IF(K$9:K$31<>\"\",ROW($9:$31)),ROW(K16)))),\"\")","v":""},null,{"$f":"IF((IF((COUNTIF(F$9:F24,F24)>1)=FALSE,F24,\"\"))=0,\"\",(IF((COUNTIF(F$9:F24,F24)>1)=FALSE,F24,\"\")))","v":""},{"$f":"IFERROR(IF(ROW(N16)>COUNTA($N$9:$N$31),\"\",INDEX($N:$N,SMALL(IF(N$9:N$31<>\"\",ROW($9:$31)),ROW(N16)))),\"\")","v":""},{"$f":"IF(O24=\"\",\"\",INDEX(tbl_Uniper[],MATCH(O24,tbl_Uniper[Name],0),5))","v":""}]
[null,null,null,null,null,{"$f":"IF(tbl_Uniper[[#This Row],[Nachname]]=\"\",\"\",LEFT(tbl_Uniper[[#This Row],[Vorname]],1)&\". \"&tbl_Uniper[[#This Row],[Nachname]])","v":""},null,null,"UST Betrieb",null,{"$f":"IF((IF((COUNTIF(I$9:I31,I25)>1)=FALSE,I25,\"\"))=0,\"\",(IF((COUNTIF(I$9:I31,I25)>1)=FALSE,I25,\"\")))","v":""},{"$f":"IFERROR(IF(ROW(K17)>COUNTA($K$9:$K$31),\"\",INDEX($K:$K,SMALL(IF(K$9:K$31<>\"\",ROW($9:$31)),ROW(K17)))),\"\")","v":""},null,{"$f":"IF((IF((COUNTIF(F$9:F25,F25)>1)=FALSE,F25,\"\"))=0,\"\",(IF((COUNTIF(F$9:F25,F25)>1)=FALSE,F25,\"\")))","v":""},{"$f":"IFERROR(IF(ROW(N17)>COUNTA($N$9:$N$31),\"\",INDEX($N:$N,SMALL(IF(N$9:N$31<>\"\",ROW($9:$31)),ROW(N17)))),\"\")","v":""},{"$f":"IF(O25=\"\",\"\",INDEX(tbl_Uniper[],MATCH(O25,tbl_Uniper[Name],0),5))","v":""}]
[null,null,null,null,null,{"$f":"IF(tbl_Uniper[[#This Row],[Nachname]]=\"\",\"\",LEFT(tbl_Uniper[[#This Row],[Vorname]],1)&\". \"&tbl_Uniper[[#This Row],[Nachname]])","v":""},null,null,"UST Betrieb",null,{"$f":"IF((IF((COUNTIF(I$9:I32,I26)>1)=FALSE,I26,\"\"))=0,\"\",(IF((COUNTIF(I$9:I32,I26)>1)=FALSE,I26,\"\")))","v":""},{"$f":"IFERROR(IF(ROW(K18)>COUNTA($K$9:$K$31),\"\",INDEX($K:$K,SMALL(IF(K$9:K$31<>\"\",ROW($9:$31)),ROW(K18)))),\"\")","v":""},null,{"$f":"IF((IF((COUNTIF(F$9:F26,F26)>1)=FALSE,F26,\"\"))=0,\"\",(IF((COUNTIF(F$9:F26,F26)>1)=FALSE,F26,\"\")))","v":""},{"$f":"IFERROR(IF(ROW(N18)>COUNTA($N$9:$N$31),\"\",INDEX($N:$N,SMALL(IF(N$9:N$31<>\"\",ROW($9:$31)),ROW(N18)))),\"\")","v":""},{"$f":"IF(O26=\"\",\"\",INDEX(tbl_Uniper[],MATCH(O26,tbl_Uniper[Name],0),5))","v":""}]
[null,null,null,null,null,{"$f":"IF(tbl_Uniper[[#This Row],[Nachname]]=\"\",\"\",LEFT(tbl_Uniper[[#This Row],[Vorname]],1)&\". \"&tbl_Uniper[[#This Row],[Nachname]])","v":""},null,null,"UST Betrieb",null,{"$f":"IF((IF((COUNTIF(I$9:I38,I27)>1)=FALSE,I27,\"\"))=0,\"\",(IF((COUNTIF(I$9:I38,I27)>1)=FALSE,I27,\"\")))","v":""},{"$f":"IFERROR(IF(ROW(K19)>COUNTA($K$9:$K$31),\"\",INDEX($K:$K,SMALL(IF(K$9:K$31<>\"\",ROW($9:$31)),ROW(K19)))),\"\")","v":""},null,{"$f":"IF((IF((COUNTIF(F$9:F27,F27)>1)=FALSE,F27,\"\"))=0,\"\",(IF((COUNTIF(F$9:F27,F27)>1)=FALSE,F27,\"\")))","v":""},{"$f":"IFERROR(IF(ROW(N19)>COUNTA($N$9:$N$31),\"\",INDEX($N:$N,SMALL(IF(N$9:N$31<>\"\",ROW($9:$31)),ROW(N19)))),\"\")","v":""},{"$f":"IF(O27=\"\",\"\",INDEX(tbl_Uniper[],MATCH(O27,tbl_Uniper[Name],0),5))","v":""}]
[null,null,null,null,null,{"$f":"IF(tbl_Uniper[[#This Row],[Nachname]]=\"\",\"\",LEFT(tbl_Uniper[[#This Row],[Vorname]],1)&\". \"&tbl_Uniper[[#This Row],[Nachname]])","v":""},null,null,null,null,{"$f":"IF((IF((COUNTIF(I$9:I39,I28)>1)=FALSE,I28,\"\"))=0,\"\",(IF((COUNTIF(I$9:I39,I28)>1)=FALSE,I28,\"\")))","v":""},{"$f":"IFERROR(IF(ROW(K20)>COUNTA($K$9:$K$31),\"\",INDEX($K:$K,SMALL(IF(K$9:K$31<>\"\",ROW($9:$31)),ROW(K20)))),\"\")","v":""},null,{"$f":"IF((IF((COUNTIF(F$9:F28,F28)>1)=FALSE,F28,\"\"))=0,\"\",(IF((COUNTIF(F$9:F28,F28)>1)=FALSE,F28,\"\")))","v":""},{"$f":"IFERROR(IF(ROW(N20)>COUNTA($N$9:$N$31),\"\",INDEX($N:$N,SMALL(IF(N$9:N$31<>\"\",ROW($9:$31)),ROW(N20)))),\"\")","v":""},{"$f":"IF(O28=\"\",\"\",INDEX(tbl_Uniper[],MATCH(O28,tbl_Uniper[Name],0),5))","v":""}]
[null,null,null,null,null,{"$f":"IF(tbl_Uniper[[#This Row],[Nachname]]=\"\",\"\",LEFT(tbl_Uniper[[#This Row],[Vorname]],1)&\". \"&tbl_Uniper[[#This Row],[Nachname]])","v":""},null,null,null,null,{"$f":"IF((IF((COUNTIF(I$9:I40,I29)>1)=FALSE,I29,\"\"))=0,\"\",(IF((COUNTIF(I$9:I40,I29)>1)=FALSE,I29,\"\")))","v":""},{"$f":"IFERROR(IF(ROW(K21)>COUNTA($K$9:$K$31),\"\",INDEX($K:$K,SMALL(IF(K$9:K$31<>\"\",ROW($9:$31)),ROW(K21)))),\"\")","v":""},null,{"$f":"IF((IF((COUNTIF(F$9:F29,F29)>1)=FALSE,F29,\"\"))=0,\"\",(IF((COUNTIF(F$9:F29,F29)>1)=FALSE,F29,\"\")))","v":""},{"$f":"IFERROR(IF(ROW(N21)>COUNTA($N$9:$N$31),\"\",INDEX($N:$N,SMALL(IF(N$9:N$31<>\"\",ROW($9:$31)),ROW(N21)))),\"\")","v":""},{"$f":"IF(O29=\"\",\"\",INDEX(tbl_Uniper[],MATCH(O29,tbl_Uniper[Name],0),5))","v":""},null,{"$f":"IF(Q7=\"\",tbl_AuswahlName[AuswahlName],IF(Q7=$R$9,DDM_Host_Abt,IF(Q7=$R$10,DDM_Host_MA_Name,IF(Q7=$R$11,DDM_Firmen,IF(Q7=$R$12,DDM_Firmen_MA)))))","v":"Host Abt"}]
[null,null,null,null,null,{"$f":"IF(tbl_Uniper[[#This Row],[Nachname]]=\"\",\"\",LEFT(tbl_Uniper[[#This Row],[Vorname]],1)&\". \"&tbl_Uniper[[#This Row],[Nachname]])","v":""},null,null,null,null,{"$f":"IF((IF((COUNTIF(I$9:I41,I30)>1)=FALSE,I30,\"\"))=0,\"\",(IF((COUNTIF(I$9:I41,I30)>1)=FALSE,I30,\"\")))","v":""},{"$f":"IFERROR(IF(ROW(K22)>COUNTA($K$9:$K$31),\"\",INDEX($K:$K,SMALL(IF(K$9:K$31<>\"\",ROW($9:$31)),ROW(K22)))),\"\")","v":""},null,{"$f":"IF((IF((COUNTIF(F$9:F30,F30)>1)=FALSE,F30,\"\"))=0,\"\",(IF((COUNTIF(F$9:F30,F30)>1)=FALSE,F30,\"\")))","v":""},{"$f":"IFERROR(IF(ROW(N22)>COUNTA($N$9:$N$31),\"\",INDEX($N:$N,SMALL(IF(N$9:N$31<>\"\",ROW($9:$31)),ROW(N22)))),\"\")","v":""},{"$f":"IF(O30=\"\",\"\",INDEX(tbl_Uniper[],MATCH(O30,tbl_Uniper[Name],0),5))","v":""},null,"Host_MA"]
[null,null,null,null,null,{"$f":"IF(tbl_Uniper[[#This Row],[Nachname]]=\"\",\"\",LEFT(tbl_Uniper[[#This Row],[Vorname]],1)&\". \"&tbl_Uniper[[#This Row],[Nachname]])","v":""},null,null,null,null,{"$f":"IF((IF((COUNTIF(I$9:I41,I31)>1)=FALSE,I31,\"\"))=0,\"\",(IF((COUNTIF(I$9:I41,I31)>1)=FALSE,I31,\"\")))","v":""},{"$f":"IFERROR(IF(ROW(K23)>COUNTA($K$9:$K$31),\"\",INDEX($K:$K,SMALL(IF(K$9:K$31<>\"\",ROW($9:$31)),ROW(K23)))),\"\")","v":""},null,{"$f":"IF((IF((COUNTIF(F$9:F31,F31)>1)=FALSE,F31,\"\"))=0,\"\",(IF((COUNTIF(F$9:F31,F31)>1)=FALSE,F31,\"\")))","v":""},{"$f":"IFERROR(IF(ROW(N23)>COUNTA($N$9:$N$31),\"\",INDEX($N:$N,SMALL(IF(N$9:N$31<>\"\",ROW($9:$31)),ROW(N23)))),\"\")","v":""},{"$f":"IF(O31=\"\",\"\",INDEX(tbl_Uniper[],MATCH(O31,tbl_Uniper[Name],0),5))","v":""},null,"Fimen"]
[null,null,null,null,null,null,null,null,null,null,null,null,null,null,null,null,null,"Firmen_MA"]
[null,null,null,null,null,null,null,null,null,null,null,null,null,null,null,null,null,0]
[null,null,null,null,null,null,null,null,null,null,null,null,null,null,null,null,null,0]
[]
[]
[]
[]
[]
[]
[]
[]
[null,null,null,null,"Spalte1","Name","Vorname","Nachname","Fa.",null,null,"Firmen",null,null,"Firmen_MA"]
[null,null,null,null,null,{"$f":"IF(tbl_Firmen[[#This Row],[Nachname]]=\"\",\"\",LEFT(tbl_Firmen[[#This Row],[Vorname]],1)&\". \"&tbl_Firmen[[#This Row],[Nachname]])","v":"T. Mustermann"},"Tobias","Mustermann","Fa. Test 1",null,{"$f":"IF((IF((COUNTIF(I$9:I44,I44)>1)=FALSE,I44,\"\"))=0,\"\",(IF((COUNTIF(I$9:I44,I44)>1)=FALSE,I44,\"\")))","v":"Fa. Test 1"},{"$f":"IFERROR(IF(ROW(K1)>COUNTA($K$44:$K$931),\"\",INDEX($K:$K,SMALL(IF(K$44:K$931<>\"\",ROW($44:$931)),ROW(K1)))),\"\")","v":"Fa. Test 1"},null,{"$f":"IF((IF((COUNTIF(F$44:F86,F44)>1)=FALSE,F44,\"\"))=0,\"\",(IF((COUNTIF(F$44:F86,F44)>1)=FALSE,F44,\"\")))","v":"T. Mustermann"},{"$f":"IFERROR(IF(ROW(N1)>COUNTA($N$44:$N$66),\"\",INDEX($N:$N,SMALL(IF(N$44:N$66<>\"\",ROW($44:$66)),ROW(N1)))),\"\")","v":"T. Mustermann"},{"$f":"IF(O44=\"\",\"\",INDEX(tbl_Firmen[],MATCH(O44,tbl_Firmen[Name],0),5))","v":"Fa. Test 1"}]
[null,null,null,null,null,{"$f":"IF(tbl_Firmen[[#This Row],[Nachname]]=\"\",\"\",LEFT(tbl_Firmen[[#This Row],[Vorname]],1)&\". \"&tbl_Firmen[[#This Row],[Nachname]])","v":""},null,null,"Fa. Test 2",null,{"$f":"IF((IF((COUNTIF(I$9:I45,I45)>1)=FALSE,I45,\"\"))=0,\"\",(IF((COUNTIF(I$9:I45,I45)>1)=FALSE,I45,\"\")))","v":"Fa. Test 2"},{"$f":"IFERROR(IF(ROW(K2)>COUNTA($K$44:$K$931),\"\",INDEX($K:$K,SMALL(IF(K$44:K$931<>\"\",ROW($44:$931)),ROW(K2)))),\"\")","v":"Fa. Test 2"},null,{"$f":"IF((IF((COUNTIF(F$44:F87,F45)>1)=FALSE,F45,\"\"))=0,\"\",(IF((COUNTIF(F$44:F87,F45)>1)=FALSE,F45,\"\")))","v":""},{"$f":"IFERROR(IF(ROW(N2)>COUNTA($N$44:$N$66),\"\",INDEX($N:$N,SMALL(IF(N$44:N$66<>\"\",ROW($44:$66)),ROW(N2)))),\"\")","v":""},{"$f":"IF(O45=\"\",\"\",INDEX(tbl_Firmen[],MATCH(O45,tbl_Firmen[Name],0),5))","v":""}]
[null,null,null,null,null,{"$f":"IF(tbl_Firmen[[#This Row],[Nachname]]=\"\",\"\",LEFT(tbl_Firmen[[#This Row],[Vorname]],1)&\". \"&tbl_Firmen[[#This Row],[Nachname]])","v":""},null,null,null,null,{"$f":"IF((IF((COUNTIF(I$9:I46,I46)>1)=FALSE,I46,\"\"))=0,\"\",(IF((COUNTIF(I$9:I46,I46)>1)=FALSE,I46,\"\")))","v":""},{"$f":"IFERROR(IF(ROW(K3)>COUNTA($K$44:$K$931),\"\",INDEX($K:$K,SMALL(IF(K$44:K$931<>\"\",ROW($44:$931)),ROW(K3)))),\"\")","v":""},null,{"$f":"IF((IF((COUNTIF(F$44:F88,F46)>1)=FALSE,F46,\"\"))=0,\"\",(IF((COUNTIF(F$44:F88,F46)>1)=FALSE,F46,\"\")))","v":""},{"$f":"IFERROR(IF(ROW(N3)>COUNTA($N$44:$N$66),\"\",INDEX($N:$N,SMALL(IF(N$44:N$66<>\"\",ROW($44:$66)),ROW(N3)))),\"\")","v":""},{"$f":"IF(O46=\"\",\"\",INDEX(tbl_Firmen[],MATCH(O46,tbl_Firmen[Name],0),5))","v":""}]
[null,null,null,null,null,{"$f":"IF(tbl_Firmen[[#This Row],[Nachname]]=\"\",\"\",LEFT(tbl_Firmen[[#This Row],[Vorname]],1)&\". \"&tbl_Firmen[[#This Row],[Nachname]])","v":""},null,null,null,null,{"$f":"IF((IF((COUNTIF(I$9:I47,I47)>1)=FALSE,I47,\"\"))=0,\"\",(IF((COUNTIF(I$9:I47,I47)>1)=FALSE,I47,\"\")))","v":""},{"$f":"IFERROR(IF(ROW(K4)>COUNTA($K$44:$K$931),\"\",INDEX($K:$K,SMALL(IF(K$44:K$931<>\"\",ROW($44:$931)),ROW(K4)))),\"\")","v":""},null,{"$f":"IF((IF((COUNTIF(F$44:F89,F47)>1)=FALSE,F47,\"\"))=0,\"\",(IF((COUNTIF(F$44:F89,F47)>1)=FALSE,F47,\"\")))","v":""},{"$f":"IFERROR(IF(ROW(N4)>COUNTA($N$44:$N$66),\"\",INDEX($N:$N,SMALL(IF(N$44:N$66<>\"\",ROW($44:$66)),ROW(N4)))),\"\")","v":""},{"$f":"IF(O47=\"\",\"\",INDEX(tbl_Firmen[],MATCH(O47,tbl_Firmen[Name],0),5))","v":""}]
[null,null,null,null,null,{"$f":"IF(tbl_Firmen[[#This Row],[Nachname]]=\"\",\"\",LEFT(tbl_Firmen[[#This Row],[Vorname]],1)&\". \"&tbl_Firmen[[#This Row],[Nachname]])","v":""},null,null,null,null,{"$f":"IF((IF((COUNTIF(I$9:I48,I48)>1)=FALSE,I48,\"\"))=0,\"\",(IF((COUNTIF(I$9:I48,I48)>1)=FALSE,I48,\"\")))","v":""},{"$f":"IFERROR(IF(ROW(K5)>COUNTA($K$44:$K$931),\"\",INDEX($K:$K,SMALL(IF(K$44:K$931<>\"\",ROW($44:$931)),ROW(K5)))),\"\")","v":""},null,{"$f":"IF((IF((COUNTIF(F$44:F90,F48)>1)=FALSE,F48,\"\"))=0,\"\",(IF((COUNTIF(F$44:F90,F48)>1)=FALSE,F48,\"\")))","v":""},{"$f":"IFERROR(IF(ROW(N5)>COUNTA($N$44:$N$66),\"\",INDEX($N:$N,SMALL(IF(N$44:N$66<>\"\",ROW($44:$66)),ROW(N5)))),\"\")","v":""},{"$f":"IF(O48=\"\",\"\",INDEX(tbl_Firmen[],MATCH(O48,tbl_Firmen[Name],0),5))","v":""}]
[null,null,null,null,null,{"$f":"IF(tbl_Firmen[[#This Row],[Nachname]]=\"\",\"\",LEFT(tbl_Firmen[[#This Row],[Vorname]],1)&\". \"&tbl_Firmen[[#This Row],[Nachname]])","v":""},null,null,null,null,{"$f":"IF((IF((COUNTIF(I$9:I49,I49)>1)=FALSE,I49,\"\"))=0,\"\",(IF((COUNTIF(I$9:I49,I49)>1)=FALSE,I49,\"\")))","v":""},{"$f":"IFERROR(IF(ROW(K6)>COUNTA($K$44:$K$931),\"\",INDEX($K:$K,SMALL(IF(K$44:K$931<>\"\",ROW($44:$931)),ROW(K6)))),\"\")","v":""},null,{"$f":"IF((IF((COUNTIF(F$44:F91,F49)>1)=FALSE,F49,\"\"))=0,\"\",(IF((COUNTIF(F$44:F91,F49)>1)=FALSE,F49,\"\")))","v":""},{"$f":"IFERROR(IF(ROW(N6)>COUNTA($N$44:$N$66),\"\",INDEX($N:$N,SMALL(IF(N$44:N$66<>\"\",ROW($44:$66)),ROW(N6)))),\"\")","v":""},{"$f":"IF(O49=\"\",\"\",INDEX(tbl_Firmen[],MATCH(O49,tbl_Firmen[Name],0),5))","v":""}]
[null,null,null,null,null,{"$f":"IF(tbl_Firmen[[#This Row],[Nachname]]=\"\",\"\",LEFT(tbl_Firmen[[#This Row],[Vorname]],1)&\". \"&tbl_Firmen[[#This Row],[Nachname]])","v":""},null,null,null,null,{"$f":"IF((IF((COUNTIF(I$9:I50,I50)>1)=FALSE,I50,\"\"))=0,\"\",(IF((COUNTIF(I$9:I50,I50)>1)=FALSE,I50,\"\")))","v":""},{"$f":"IFERROR(IF(ROW(K7)>COUNTA($K$44:$K$931),\"\",INDEX($K:$K,SMALL(IF(K$44:K$931<>\"\",ROW($44:$931)),ROW(K7)))),\"\")","v":""},null,{"$f":"IF((IF((COUNTIF(F$44:F92,F50)>1)=FALSE,F50,\"\"))=0,\"\",(IF((COUNTIF(F$44:F92,F50)>1)=FALSE,F50,\"\")))","v":""},{"$f":"IFERROR(IF(ROW(N7)>COUNTA($N$44:$N$66),\"\",INDEX($N:$N,SMALL(IF(N$44:N$66<>\"\",ROW($44:$66)),ROW(N7)))),\"\")","v":""},{"$f":"IF(O50=\"\",\"\",INDEX(tbl_Firmen[],MATCH(O50,tbl_Firmen[Name],0),5))","v":""}]
[null,null,null,null,null,{"$f":"IF(tbl_Firmen[[#This Row],[Nachname]]=\"\",\"\",LEFT(tbl_Firmen[[#This Row],[Vorname]],1)&\". \"&tbl_Firmen[[#This Row],[Nachname]])","v":""},null,null,null,null,{"$f":"IF((IF((COUNTIF(I$9:I51,I51)>1)=FALSE,I51,\"\"))=0,\"\",(IF((COUNTIF(I$9:I51,I51)>1)=FALSE,I51,\"\")))","v":""},{"$f":"IFERROR(IF(ROW(K8)>COUNTA($K$44:$K$931),\"\",INDEX($K:$K,SMALL(IF(K$44:K$931<>\"\",ROW($44:$931)),ROW(K8)))),\"\")","v":""},null,{"$f":"IF((IF((COUNTIF(F$44:F93,F51)>1)=FALSE,F51,\"\"))=0,\"\",(IF((COUNTIF(F$44:F93,F51)>1)=FALSE,F51,\"\")))","v":""},{"$f":"IFERROR(IF(ROW(N8)>COUNTA($N$44:$N$66),\"\",INDEX($N:$N,SMALL(IF(N$44:N$66<>\"\",ROW($44:$66)),ROW(N8)))),\"\")","v":""},{"$f":"IF(O51=\"\",\"\",INDEX(tbl_Firmen[],MATCH(O51,tbl_Firmen[Name],0),5))","v":""}]
[null,null,null,null,null,{"$f":"IF(tbl_Firmen[[#This Row],[Nachname]]=\"\",\"\",LEFT(tbl_Firmen[[#This Row],[Vorname]],1)&\". \"&tbl_Firmen[[#This Row],[Nachname]])","v":""},null,null,null,null,{"$f":"IF((IF((COUNTIF(I$9:I52,I52)>1)=FALSE,I52,\"\"))=0,\"\",(IF((COUNTIF(I$9:I52,I52)>1)=FALSE,I52,\"\")))","v":""},{"$f":"IFERROR(IF(ROW(K9)>COUNTA($K$44:$K$931),\"\",INDEX($K:$K,SMALL(IF(K$44:K$931<>\"\",ROW($44:$931)),ROW(K9)))),\"\")","v":""},null,{"$f":"IF((IF((COUNTIF(F$44:F94,F52)>1)=FALSE,F52,\"\"))=0,\"\",(IF((COUNTIF(F$44:F94,F52)>1)=FALSE,F52,\"\")))","v":""},{"$f":"IFERROR(IF(ROW(N9)>COUNTA($N$44:$N$66),\"\",INDEX($N:$N,SMALL(IF(N$44:N$66<>\"\",ROW($44:$66)),ROW(N9)))),\"\")","v":""},{"$f":"IF(O52=\"\",\"\",INDEX(tbl_Firmen[],MATCH(O52,tbl_Firmen[Name],0),5))","v":""}]
[null,null,null,null,null,{"$f":"IF(tbl_Firmen[[#This Row],[Nachname]]=\"\",\"\",LEFT(tbl_Firmen[[#This Row],[Vorname]],1)&\". \"&tbl_Firmen[[#This Row],[Nachname]])","v":""},null,null,null,null,{"$f":"IF((IF((COUNTIF(I$9:I53,I53)>1)=FALSE,I53,\"\"))=0,\"\",(IF((COUNTIF(I$9:I53,I53)>1)=FALSE,I53,\"\")))","v":""},{"$f":"IFERROR(IF(ROW(K10)>COUNTA($K$44:$K$931),\"\",INDEX($K:$K,SMALL(IF(K$44:K$931<>\"\",ROW($44:$931)),ROW(K10)))),\"\")","v":""},null,{"$f":"IF((IF((COUNTIF(F$44:F95,F53)>1)=FALSE,F53,\"\"))=0,\"\",(IF((COUNTIF(F$44:F95,F53)>1)=FALSE,F53,\"\")))","v":""},{"$f":"IFERROR(IF(ROW(N10)>COUNTA($N$44:$N$66),\"\",INDEX($N:$N,SMALL(IF(N$44:N$66<>\"\",ROW($44:$66)),ROW(N10)))),\"\")","v":""},{"$f":"IF(O53=\"\",\"\",INDEX(tbl_Firmen[],MATCH(O53,tbl_Firmen[Name],0),5))","v":""}]
[null,null,null,null,null,{"$f":"IF(tbl_Firmen[[#This Row],[Nachname]]=\"\",\"\",LEFT(tbl_Firmen[[#This Row],[Vorname]],1)&\". \"&tbl_Firmen[[#This Row],[Nachname]])","v":""},null,null,null,null,{"$f":"IF((IF((COUNTIF(I$9:I54,I54)>1)=FALSE,I54,\"\"))=0,\"\",(IF((COUNTIF(I$9:I54,I54)>1)=FALSE,I54,\"\")))","v":""},{"$f":"IFERROR(IF(ROW(K11)>COUNTA($K$44:$K$931),\"\",INDEX($K:$K,SMALL(IF(K$44:K$931<>\"\",ROW($44:$931)),ROW(K11)))),\"\")","v":""},null,{"$f":"IF((IF((COUNTIF(F$44:F96,F54)>1)=FALSE,F54,\"\"))=0,\"\",(IF((COUNTIF(F$44:F96,F54)>1)=FALSE,F54,\"\")))","v":""},{"$f":"IFERROR(IF(ROW(N11)>COUNTA($N$44:$N$66),\"\",INDEX($N:$N,SMALL(IF(N$44:N$66<>\"\",ROW($44:$66)),ROW(N11)))),\"\")","v":""},{"$f":"IF(O54=\"\",\"\",INDEX(tbl_Firmen[],MATCH(O54,tbl_Firmen[Name],0),5))","v":""}]
[null,null,null,null,null,{"$f":"IF(tbl_Firmen[[#This Row],[Nachname]]=\"\",\"\",LEFT(tbl_Firmen[[#This Row],[Vorname]],1)&\". \"&tbl_Firmen[[#This Row],[Nachname]])","v":""},null,null,null,null,{"$f":"IF((IF((COUNTIF(I$9:I55,I55)>1)=FALSE,I55,\"\"))=0,\"\",(IF((COUNTIF(I$9:I55,I55)>1)=FALSE,I55,\"\")))","v":""},{"$f":"IFERROR(IF(ROW(K12)>COUNTA($K$44:$K$931),\"\",INDEX($K:$K,SMALL(IF(K$44:K$931<>\"\",ROW($44:$931)),ROW(K12)))),\"\")","v":""},null,{"$f":"IF((IF((COUNTIF(F$44:F97,F55)>1)=FALSE,F55,\"\"))=0,\"\",(IF((COUNTIF(F$44:F97,F55)>1)=FALSE,F55,\"\")))","v":""},{"$f":"IFERROR(IF(ROW(N12)>COUNTA($N$44:$N$66),\"\",INDEX($N:$N,SMALL(IF(N$44:N$66<>\"\",ROW($44:$66)),ROW(N12)))),\"\")","v":""},{"$f":"IF(O55=\"\",\"\",INDEX(tbl_Firmen[],MATCH(O55,tbl_Firmen[Name],0),5))","v":""}]
[null,null,null,null,null,{"$f":"IF(tbl_Firmen[[#This Row],[Nachname]]=\"\",\"\",LEFT(tbl_Firmen[[#This Row],[Vorname]],1)&\". \"&tbl_Firmen[[#This Row],[Nachname]])","v":""},null,null,null,null,{"$f":"IF((IF((COUNTIF(I$9:I56,I56)>1)=FALSE,I56,\"\"))=0,\"\",(IF((COUNTIF(I$9:I56,I56)>1)=FALSE,I56,\"\")))","v":""},{"$f":"IFERROR(IF(ROW(K13)>COUNTA($K$44:$K$931),\"\",INDEX($K:$K,SMALL(IF(K$44:K$931<>\"\",ROW($44:$931)),ROW(K13)))),\"\")","v":""},null,{"$f":"IF((IF((COUNTIF(F$44:F98,F56)>1)=FALSE,F56,\"\"))=0,\"\",(IF((COUNTIF(F$44:F98,F56)>1)=FALSE,F56,\"\")))","v":""},{"$f":"IFERROR(IF(ROW(N13)>COUNTA($N$44:$N$66),\"\",INDEX($N:$N,SMALL(IF(N$44:N$66<>\"\",ROW($44:$66)),ROW(N13)))),\"\")","v":""},{"$f":"IF(O56=\"\",\"\",INDEX(tbl_Firmen[],MATCH(O56,tbl_Firmen[Name],0),5))","v":""}]
[null,null,null,null,null,{"$f":"IF(tbl_Firmen[[#This Row],[Nachname]]=\"\",\"\",LEFT(tbl_Firmen[[#This Row],[Vorname]],1)&\". \"&tbl_Firmen[[#This Row],[Nachname]])","v":""},null,null,null,null,{"$f":"IF((IF((COUNTIF(I$9:I57,I57)>1)=FALSE,I57,\"\"))=0,\"\",(IF((COUNTIF(I$9:I57,I57)>1)=FALSE,I57,\"\")))","v":""},{"$f":"IFERROR(IF(ROW(K14)>COUNTA($K$44:$K$931),\"\",INDEX($K:$K,SMALL(IF(K$44:K$931<>\"\",ROW($44:$931)),ROW(K14)))),\"\")","v":""},null,{"$f":"IF((IF((COUNTIF(F$44:F99,F57)>1)=FALSE,F57,\"\"))=0,\"\",(IF((COUNTIF(F$44:F99,F57)>1)=FALSE,F57,\"\")))","v":""},{"$f":"IFERROR(IF(ROW(N14)>COUNTA($N$44:$N$66),\"\",INDEX($N:$N,SMALL(IF(N$44:N$66<>\"\",ROW($44:$66)),ROW(N14)))),\"\")","v":""},{"$f":"IF(O57=\"\",\"\",INDEX(tbl_Firmen[],MATCH(O57,tbl_Firmen[Name],0),5))","v":""}]
[null,null,null,null,null,{"$f":"IF(tbl_Firmen[[#This Row],[Nachname]]=\"\",\"\",LEFT(tbl_Firmen[[#This Row],[Vorname]],1)&\". \"&tbl_Firmen[[#This Row],[Nachname]])","v":""},null,null,null,null,{"$f":"IF((IF((COUNTIF(I$9:I58,I58)>1)=FALSE,I58,\"\"))=0,\"\",(IF((COUNTIF(I$9:I58,I58)>1)=FALSE,I58,\"\")))","v":""},{"$f":"IFERROR(IF(ROW(K15)>COUNTA($K$44:$K$931),\"\",INDEX($K:$K,SMALL(IF(K$44:K$931<>\"\",ROW($44:$931)),ROW(K15)))),\"\")","v":""},null,{"$f":"IF((IF((COUNTIF(F$44:F100,F58)>1)=FALSE,F58,\"\"))=0,\"\",(IF((COUNTIF(F$44:F100,F58)>1)=FALSE,F58,\"\")))","v":""},{"$f":"IFERROR(IF(ROW(N15)>COUNTA($N$44:$N$66),\"\",INDEX($N:$N,SMALL(IF(N$44:N$66<>\"\",ROW($44:$66)),ROW(N15)))),\"\")","v":""},{"$f":"IF(O58=\"\",\"\",INDEX(tbl_Firmen[],MATCH(O58,tbl_Firmen[Name],0),5))","v":""}]
[null,null,null,null,null,{"$f":"IF(tbl_Firmen[[#This Row],[Nachname]]=\"\",\"\",LEFT(tbl_Firmen[[#This Row],[Vorname]],1)&\". \"&tbl_Firmen[[#This Row],[Nachname]])","v":""},null,null,null,null,{"$f":"IF((IF((COUNTIF(I$9:I59,I59)>1)=FALSE,I59,\"\"))=0,\"\",(IF((COUNTIF(I$9:I59,I59)>1)=FALSE,I59,\"\")))","v":""},{"$f":"IFERROR(IF(ROW(K16)>COUNTA($K$44:$K$931),\"\",INDEX($K:$K,SMALL(IF(K$44:K$931<>\"\",ROW($44:$931)),ROW(K16)))),\"\")","v":""},null,{"$f":"IF((IF((COUNTIF(F$44:F101,F59)>1)=FALSE,F59,\"\"))=0,\"\",(IF((COUNTIF(F$44:F101,F59)>1)=FALSE,F59,\"\")))","v":""},{"$f":"IFERROR(IF(ROW(N16)>COUNTA($N$44:$N$66),\"\",INDEX($N:$N,SMALL(IF(N$44:N$66<>\"\",ROW($44:$66)),ROW(N16)))),\"\")","v":""},{"$f":"IF(O59=\"\",\"\",INDEX(tbl_Firmen[],MATCH(O59,tbl_Firmen[Name],0),5))","v":""}]
[null,null,null,null,null,{"$f":"IF(tbl_Firmen[[#This Row],[Nachname]]=\"\",\"\",LEFT(tbl_Firmen[[#This Row],[Vorname]],1)&\". \"&tbl_Firmen[[#This Row],[Nachname]])","v":""},null,null,null,null,{"$f":"IF((IF((COUNTIF(I$9:I60,I60)>1)=FALSE,I60,\"\"))=0,\"\",(IF((COUNTIF(I$9:I60,I60)>1)=FALSE,I60,\"\")))","v":""},{"$f":"IFERROR(IF(ROW(K17)>COUNTA($K$44:$K$931),\"\",INDEX($K:$K,SMALL(IF(K$44:K$931<>\"\",ROW($44:$931)),ROW(K17)))),\"\")","v":""},null,{"$f":"IF((IF((COUNTIF(F$44:F102,F60)>1)=FALSE,F60,\"\"))=0,\"\",(IF((COUNTIF(F$44:F102,F60)>1)=FALSE,F60,\"\")))","v":""},{"$f":"IFERROR(IF(ROW(N17)>COUNTA($N$44:$N$66),\"\",INDEX($N:$N,SMALL(IF(N$44:N$66<>\"\",ROW($44:$66)),ROW(N17)))),\"\")","v":""},{"$f":"IF(O60=\"\",\"\",INDEX(tbl_Firmen[],MATCH(O60,tbl_Firmen[Name],0),5))","v":""}]
[null,null,null,null,null,{"$f":"IF(tbl_Firmen[[#This Row],[Nachname]]=\"\",\"\",LEFT(tbl_Firmen[[#This Row],[Vorname]],1)&\". \"&tbl_Firmen[[#This Row],[Nachname]])","v":""},null,null,null,null,{"$f":"IF((IF((COUNTIF(I$9:I61,I61)>1)=FALSE,I61,\"\"))=0,\"\",(IF((COUNTIF(I$9:I61,I61)>1)=FALSE,I61,\"\")))","v":""},{"$f":"IFERROR(IF(ROW(K18)>COUNTA($K$44:$K$931),\"\",INDEX($K:$K,SMALL(IF(K$44:K$931<>\"\",ROW($44:$931)),ROW(K18)))),\"\")","v":""},null,{"$f":"IF((IF((COUNTIF(F$44:F103,F61)>1)=FALSE,F61,\"\"))=0,\"\",(IF((COUNTIF(F$44:F103,F61)>1)=FALSE,F61,\"\")))","v":""},{"$f":"IFERROR(IF(ROW(N18)>COUNTA($N$44:$N$66),\"\",INDEX($N:$N,SMALL(IF(N$44:N$66<>\"\",ROW($44:$66)),ROW(N18)))),\"\")","v":""},{"$f":"IF(O61=\"\",\"\",INDEX(tbl_Firmen[],MATCH(O61,tbl_Firmen[Name],0),5))","v":""}]
[null,null,null,null,null,{"$f":"IF(tbl_Firmen[[#This Row],[Nachname]]=\"\",\"\",LEFT(tbl_Firmen[[#This Row],[Vorname]],1)&\". \"&tbl_Firmen[[#This Row],[Nachname]])","v":""},null,null,null,null,{"$f":"IF((IF((COUNTIF(I$9:I62,I62)>1)=FALSE,I62,\"\"))=0,\"\",(IF((COUNTIF(I$9:I62,I62)>1)=FALSE,I62,\"\")))","v":""},{"$f":"IFERROR(IF(ROW(K19)>COUNTA($K$44:$K$931),\"\",INDEX($K:$K,SMALL(IF(K$44:K$931<>\"\",ROW($44:$931)),ROW(K19)))),\"\")","v":""},null,{"$f":"IF((IF((COUNTIF(F$44:F104,F62)>1)=FALSE,F62,\"\"))=0,\"\",(IF((COUNTIF(F$44:F104,F62)>1)=FALSE,F62,\"\")))","v":""},{"$f":"IFERROR(IF(ROW(N19)>COUNTA($N$44:$N$66),\"\",INDEX($N:$N,SMALL(IF(N$44:N$66<>\"\",ROW($44:$66)),ROW(N19)))),\"\")","v":""},{"$f":"IF(O62=\"\",\"\",INDEX(tbl_Firmen[],MATCH(O62,tbl_Firmen[Name],0),5))","v":""}]
[null,null,null,null,null,{"$f":"IF(tbl_Firmen[[#This Row],[Nachname]]=\"\",\"\",LEFT(tbl_Firmen[[#This Row],[Vorname]],1)&\". \"&tbl_Firmen[[#This Row],[Nachname]])","v":""},null,null,null,null,{"$f":"IF((IF((COUNTIF(I$9:I63,I63)>1)=FALSE,I63,\"\"))=0,\"\",(IF((COUNTIF(I$9:I63,I63)>1)=FALSE,I63,\"\")))","v":""},{"$f":"IFERROR(IF(ROW(K20)>COUNTA($K$44:$K$931),\"\",INDEX($K:$K,SMALL(IF(K$44:K$931<>\"\",ROW($44:$931)),ROW(K20)))),\"\")","v":""},null,{"$f":"IF((IF((COUNTIF(F$44:F105,F63)>1)=FALSE,F63,\"\"))=0,\"\",(IF((COUNTIF(F$44:F105,F63)>1)=FALSE,F63,\"\")))","v":""},{"$f":"IFERROR(IF(ROW(N20)>COUNTA($N$44:$N$66),\"\",INDEX($N:$N,SMALL(IF(N$44:N$66<>\"\",ROW($44:$66)),ROW(N20)))),\"\")","v":""},{"$f":"IF(O63=\"\",\"\",INDEX(tbl_Firmen[],MATCH(O63,tbl_Firmen[Name],0),5))","v":""}]
[null,null,null,null,null,{"$f":"IF(tbl_Firmen[[#This Row],[Nachname]]=\"\",\"\",LEFT(tbl_Firmen[[#This Row],[Vorname]],1)&\". \"&tbl_Firmen[[#This Row],[Nachname]])","v":""},null,null,null,null,{"$f":"IF((IF((COUNTIF(I$9:I64,I64)>1)=FALSE,I64,\"\"))=0,\"\",(IF((COUNTIF(I$9:I64,I64)>1)=FALSE,I64,\"\")))","v":""},{"$f":"IFERROR(IF(ROW(K21)>COUNTA($K$44:$K$931),\"\",INDEX($K:$K,SMALL(IF(K$44:K$931<>\"\",ROW($44:$931)),ROW(K21)))),\"\")","v":""},null,{"$f":"IF((IF((COUNTIF(F$44:F106,F64)>1)=FALSE,F64,\"\"))=0,\"\",(IF((COUNTIF(F$44:F106,F64)>1)=FALSE,F64,\"\")))","v":""},{"$f":"IFERROR(IF(ROW(N21)>COUNTA($N$44:$N$66),\"\",INDEX($N:$N,SMALL(IF(N$44:N$66<>\"\",ROW($44:$66)),ROW(N21)))),\"\")","v":""},{"$f":"IF(O64=\"\",\"\",INDEX(tbl_Firmen[],MATCH(O64,tbl_Firmen[Name],0),5))","v":""}]
[null,null,null,null,null,{"$f":"IF(tbl_Firmen[[#This Row],[Nachname]]=\"\",\"\",LEFT(tbl_Firmen[[#This Row],[Vorname]],1)&\". \"&tbl_Firmen[[#This Row],[Nachname]])","v":""},null,null,null,null,{"$f":"IF((IF((COUNTIF(I$9:I65,I65)>1)=FALSE,I65,\"\"))=0,\"\",(IF((COUNTIF(I$9:I65,I65)>1)=FALSE,I65,\"\")))","v":""},{"$f":"IFERROR(IF(ROW(K22)>COUNTA($K$44:$K$931),\"\",INDEX($K:$K,SMALL(IF(K$44:K$931<>\"\",ROW($44:$931)),ROW(K22)))),\"\")","v":""},null,{"$f":"IF((IF((COUNTIF(F$44:F107,F65)>1)=FALSE,F65,\"\"))=0,\"\",(IF((COUNTIF(F$44:F107,F65)>1)=FALSE,F65,\"\")))","v":""},{"$f":"IFERROR(IF(ROW(N22)>COUNTA($N$44:$N$66),\"\",INDEX($N:$N,SMALL(IF(N$44:N$66<>\"\",ROW($44:$66)),ROW(N22)))),\"\")","v":""},{"$f":"IF(O65=\"\",\"\",INDEX(tbl_Firmen[],MATCH(O65,tbl_Firmen[Name],0),5))","v":""}]
[null,null,null,null,null,{"$f":"IF(tbl_Firmen[[#This Row],[Nachname]]=\"\",\"\",LEFT(tbl_Firmen[[#This Row],[Vorname]],1)&\". \"&tbl_Firmen[[#This Row],[Nachname]])","v":""},null,null,null,null,{"$f":"IF((IF((COUNTIF(I$9:I66,I66)>1)=FALSE,I66,\"\"))=0,\"\",(IF((COUNTIF(I$9:I66,I66)>1)=FALSE,I66,\"\")))","v":""},{"$f":"IFERROR(IF(ROW(K23)>COUNTA($K$44:$K$931),\"\",INDEX($K:$K,SMALL(IF(K$44:K$931<>\"\",ROW($44:$931)),ROW(K23)))),\"\")","v":""},null,{"$f":"IF((IF((COUNTIF(F$44:F108,F66)>1)=FALSE,F66,\"\"))=0,\"\",(IF((COUNTIF(F$44:F108,F66)>1)=FALSE,F66,\"\")))","v":""},{"$f":"IFERROR(IF(ROW(N23)>COUNTA($N$44:$N$66),\"\",INDEX($N:$N,SMALL(IF(N$44:N$66<>\"\",ROW($44:$66)),ROW(N23)))),\"\")","v":""},{"$f":"IF(O66=\"\",\"\",INDEX(tbl_Firmen[],MATCH(O66,tbl_Firmen[Name],0),5))","v":""}]
[null,null,null,null,null,{"$f":"IF(tbl_Firmen[[#This Row],[Nachname]]=\"\",\"\",LEFT(tbl_Firmen[[#This Row],[Vorname]],1)&\". \"&tbl_Firmen[[#This Row],[Nachname]])","v":""},null,null,null,null,{"$f":"IF((IF((COUNTIF(I$9:I67,I67)>1)=FALSE,I67,\"\"))=0,\"\",(IF((COUNTIF(I$9:I67,I67)>1)=FALSE,I67,\"\")))","v":""},{"$f":"IFERROR(IF(ROW(K24)>COUNTA($K$44:$K$931),\"\",INDEX($K:$K,SMALL(IF(K$44:K$931<>\"\",ROW($44:$931)),ROW(K24)))),\"\")","v":""},null,{"$f":"IF((IF((COUNTIF(F$44:F109,F67)>1)=FALSE,F67,\"\"))=0,\"\",(IF((COUNTIF(F$44:F109,F67)>1)=FALSE,F67,\"\")))","v":""},{"$f":"IFERROR(IF(ROW(N24)>COUNTA($N$44:$N$66),\"\",INDEX($N:$N,SMALL(IF(N$44:N$66<>\"\",ROW($44:$66)),ROW(N24)))),\"\")","v":""},{"$f":"IF(O67=\"\",\"\",INDEX(tbl_Firmen[],MATCH(O67,tbl_Firmen[Name],0),5))","v":""}]
[null,null,null,null,null,{"$f":"IF(tbl_Firmen[[#This Row],[Nachname]]=\"\",\"\",LEFT(tbl_Firmen[[#This Row],[Vorname]],1)&\". \"&tbl_Firmen[[#This Row],[Nachname]])","v":""},null,null,null,null,{"$f":"IF((IF((COUNTIF(I$9:I68,I68)>1)=FALSE,I68,\"\"))=0,\"\",(IF((COUNTIF(I$9:I68,I68)>1)=FALSE,I68,\"\")))","v":""},{"$f":"IFERROR(IF(ROW(K25)>COUNTA($K$44:$K$931),\"\",INDEX($K:$K,SMALL(IF(K$44:K$931<>\"\",ROW($44:$931)),ROW(K25)))),\"\")","v":""},null,{"$f":"IF((IF((COUNTIF(F$44:F110,F68)>1)=FALSE,F68,\"\"))=0,\"\",(IF((COUNTIF(F$44:F110,F68)>1)=FALSE,F68,\"\")))","v":""},{"$f":"IFERROR(IF(ROW(N25)>COUNTA($N$44:$N$66),\"\",INDEX($N:$N,SMALL(IF(N$44:N$66<>\"\",ROW($44:$66)),ROW(N25)))),\"\")","v":""},{"$f":"IF(O68=\"\",\"\",INDEX(tbl_Firmen[],MATCH(O68,tbl_Firmen[Name],0),5))","v":""}]
[null,null,null,null,null,{"$f":"IF(tbl_Firmen[[#This Row],[Nachname]]=\"\",\"\",LEFT(tbl_Firmen[[#This Row],[Vorname]],1)&\". \"&tbl_Firmen[[#This Row],[Nachname]])","v":""},null,null,null,null,{"$f":"IF((IF((COUNTIF(I$9:I69,I69)>1)=FALSE,I69,\"\"))=0,\"\",(IF((COUNTIF(I$9:I69,I69)>1)=FALSE,I69,\"\")))","v":""},{"$f":"IFERROR(IF(ROW(K26)>COUNTA($K$44:$K$931),\"\",INDEX($K:$K,SMALL(IF(K$44:K$931<>\"\",ROW($44:$931)),ROW(K26)))),\"\")","v":""},null,{"$f":"IF((IF((COUNTIF(F$44:F111,F69)>1)=FALSE,F69,\"\"))=0,\"\",(IF((COUNTIF(F$44:F111,F69)>1)=FALSE,F69,\"\")))","v":""},{"$f":"IFERROR(IF(ROW(N26)>COUNTA($N$44:$N$66),\"\",INDEX($N:$N,SMALL(IF(N$44:N$66<>\"\",ROW($44:$66)),ROW(N26)))),\"\")","v":""},{"$f":"IF(O69=\"\",\"\",INDEX(tbl_Firmen[],MATCH(O69,tbl_Firmen[Name],0),5))","v":""}]
[null,null,null,null,null,{"$f":"IF(tbl_Firmen[[#This Row],[Nachname]]=\"\",\"\",LEFT(tbl_Firmen[[#This Row],[Vorname]],1)&\". \"&tbl_Firmen[[#This Row],[Nachname]])","v":""},null,null,null,null,{"$f":"IF((IF((COUNTIF(I$9:I70,I70)>1)=FALSE,I70,\"\"))=0,\"\",(IF((COUNTIF(I$9:I70,I70)>1)=FALSE,I70,\"\")))","v":""},{"$f":"IFERROR(IF(ROW(K27)>COUNTA($K$44:$K$931),\"\",INDEX($K:$K,SMALL(IF(K$44:K$931<>\"\",ROW($44:$931)),ROW(K27)))),\"\")","v":""},null,{"$f":"IF((IF((COUNTIF(F$44:F112,F70)>1)=FALSE,F70,\"\"))=0,\"\",(IF((COUNTIF(F$44:F112,F70)>1)=FALSE,F70,\"\")))","v":""},{"$f":"IFERROR(IF(ROW(N27)>COUNTA($N$44:$N$66),\"\",INDEX($N:$N,SMALL(IF(N$44:N$66<>\"\",ROW($44:$66)),ROW(N27)))),\"\")","v":""},{"$f":"IF(O70=\"\",\"\",INDEX(tbl_Firmen[],MATCH(O70,tbl_Firmen[Name],0),5))","v":""}]
[null,null,null,null,null,{"$f":"IF(tbl_Firmen[[#This Row],[Nachname]]=\"\",\"\",LEFT(tbl_Firmen[[#This Row],[Vorname]],1)&\". \"&tbl_Firmen[[#This Row],[Nachname]])","v":""},null,null,null,null,{"$f":"IF((IF((COUNTIF(I$9:I71,I71)>1)=FALSE,I71,\"\"))=0,\"\",(IF((COUNTIF(I$9:I71,I71)>1)=FALSE,I71,\"\")))","v":""},{"$f":"IFERROR(IF(ROW(K28)>COUNTA($K$44:$K$931),\"\",INDEX($K:$K,SMALL(IF(K$44:K$931<>\"\",ROW($44:$931)),ROW(K28)))),\"\")","v":""},null,{"$f":"IF((IF((COUNTIF(F$44:F113,F71)>1)=FALSE,F71,\"\"))=0,\"\",(IF((COUNTIF(F$44:F113,F71)>1)=FALSE,F71,\"\")))","v":""},{"$f":"IFERROR(IF(ROW(N28)>COUNTA($N$44:$N$66),\"\",INDEX($N:$N,SMALL(IF(N$44:N$66<>\"\",ROW($44:$66)),ROW(N28)))),\"\")","v":""},{"$f":"IF(O71=\"\",\"\",INDEX(tbl_Firmen[],MATCH(O71,tbl_Firmen[Name],0),5))","v":""}]
[null,null,null,null,null,{"$f":"IF(tbl_Firmen[[#This Row],[Nachname]]=\"\",\"\",LEFT(tbl_Firmen[[#This Row],[Vorname]],1)&\". \"&tbl_Firmen[[#This Row],[Nachname]])","v":""},null,null,null,null,{"$f":"IF((IF((COUNTIF(I$9:I72,I72)>1)=FALSE,I72,\"\"))=0,\"\",(IF((COUNTIF(I$9:I72,I72)>1)=FALSE,I72,\"\")))","v":""},{"$f":"IFERROR(IF(ROW(K29)>COUNTA($K$44:$K$931),\"\",INDEX($K:$K,SMALL(IF(K$44:K$931<>\"\",ROW($44:$931)),ROW(K29)))),\"\")","v":""},null,{"$f":"IF((IF((COUNTIF(F$44:F114,F72)>1)=FALSE,F72,\"\"))=0,\"\",(IF((COUNTIF(F$44:F114,F72)>1)=FALSE,F72,\"\")))","v":""},{"$f":"IFERROR(IF(ROW(N29)>COUNTA($N$44:$N$66),\"\",INDEX($N:$N,SMALL(IF(N$44:N$66<>\"\",ROW($44:$66)),ROW(N29)))),\"\")","v":""},{"$f":"IF(O72=\"\",\"\",INDEX(tbl_Firmen[],MATCH(O72,tbl_Firmen[Name],0),5))","v":""}]
[null,null,null,null,null,{"$f":"IF(tbl_Firmen[[#This Row],[Nachname]]=\"\",\"\",LEFT(tbl_Firmen[[#This Row],[Vorname]],1)&\". \"&tbl_Firmen[[#This Row],[Nachname]])","v":""},null,null,null,null,{"$f":"IF((IF((COUNTIF(I$9:I73,I73)>1)=FALSE,I73,\"\"))=0,\"\",(IF((COUNTIF(I$9:I73,I73)>1)=FALSE,I73,\"\")))","v":""},{"$f":"IFERROR(IF(ROW(K30)>COUNTA($K$44:$K$931),\"\",INDEX($K:$K,SMALL(IF(K$44:K$931<>\"\",ROW($44:$931)),ROW(K30)))),\"\")","v":""},null,{"$f":"IF((IF((COUNTIF(F$44:F115,F73)>1)=FALSE,F73,\"\"))=0,\"\",(IF((COUNTIF(F$44:F115,F73)>1)=FALSE,F73,\"\")))","v":""},{"$f":"IFERROR(IF(ROW(N30)>COUNTA($N$44:$N$66),\"\",INDEX($N:$N,SMALL(IF(N$44:N$66<>\"\",ROW($44:$66)),ROW(N30)))),\"\")","v":""},{"$f":"IF(O73=\"\",\"\",INDEX(tbl_Firmen[],MATCH(O73,tbl_Firmen[Name],0),5))","v":""}]
[null,null,null,null,null,{"$f":"IF(tbl_Firmen[[#This Row],[Nachname]]=\"\",\"\",LEFT(tbl_Firmen[[#This Row],[Vorname]],1)&\". \"&tbl_Firmen[[#This Row],[Nachname]])","v":""},null,null,null,null,{"$f":"IF((IF((COUNTIF(I$9:I74,I74)>1)=FALSE,I74,\"\"))=0,\"\",(IF((COUNTIF(I$9:I74,I74)>1)=FALSE,I74,\"\")))","v":""},{"$f":"IFERROR(IF(ROW(K31)>COUNTA($K$44:$K$931),\"\",INDEX($K:$K,SMALL(IF(K$44:K$931<>\"\",ROW($44:$931)),ROW(K31)))),\"\")","v":""},null,{"$f":"IF((IF((COUNTIF(F$44:F116,F74)>1)=FALSE,F74,\"\"))=0,\"\",(IF((COUNTIF(F$44:F116,F74)>1)=FALSE,F74,\"\")))","v":""},{"$f":"IFERROR(IF(ROW(N31)>COUNTA($N$44:$N$66),\"\",INDEX($N:$N,SMALL(IF(N$44:N$66<>\"\",ROW($44:$66)),ROW(N31)))),\"\")","v":""},{"$f":"IF(O74=\"\",\"\",INDEX(tbl_Firmen[],MATCH(O74,tbl_Firmen[Name],0),5))","v":""}]
[null,null,null,null,null,{"$f":"IF(tbl_Firmen[[#This Row],[Nachname]]=\"\",\"\",LEFT(tbl_Firmen[[#This Row],[Vorname]],1)&\". \"&tbl_Firmen[[#This Row],[Nachname]])","v":""},null,null,null,null,{"$f":"IF((IF((COUNTIF(I$9:I75,I75)>1)=FALSE,I75,\"\"))=0,\"\",(IF((COUNTIF(I$9:I75,I75)>1)=FALSE,I75,\"\")))","v":""},{"$f":"IFERROR(IF(ROW(K32)>COUNTA($K$44:$K$931),\"\",INDEX($K:$K,SMALL(IF(K$44:K$931<>\"\",ROW($44:$931)),ROW(K32)))),\"\")","v":""},null,{"$f":"IF((IF((COUNTIF(F$44:F117,F75)>1)=FALSE,F75,\"\"))=0,\"\",(IF((COUNTIF(F$44:F117,F75)>1)=FALSE,F75,\"\")))","v":""},{"$f":"IFERROR(IF(ROW(N32)>COUNTA($N$44:$N$66),\"\",INDEX($N:$N,SMALL(IF(N$44:N$66<>\"\",ROW($44:$66)),ROW(N32)))),\"\")","v":""},{"$f":"IF(O75=\"\",\"\",INDEX(tbl_Firmen[],MATCH(O75,tbl_Firmen[Name],0),5))","v":""}]
[null,null,null,null,null,{"$f":"IF(tbl_Firmen[[#This Row],[Nachname]]=\"\",\"\",LEFT(tbl_Firmen[[#This Row],[Vorname]],1)&\". \"&tbl_Firmen[[#This Row],[Nachname]])","v":""},null,null,null,null,{"$f":"IF((IF((COUNTIF(I$9:I76,I76)>1)=FALSE,I76,\"\"))=0,\"\",(IF((COUNTIF(I$9:I76,I76)>1)=FALSE,I76,\"\")))","v":""},{"$f":"IFERROR(IF(ROW(K38)>COUNTA($K$44:$K$931),\"\",INDEX($K:$K,SMALL(IF(K$44:K$931<>\"\",ROW($44:$931)),ROW(K38)))),\"\")","v":""},null,{"$f":"IF((IF((COUNTIF(F$44:F118,F76)>1)=FALSE,F76,\"\"))=0,\"\",(IF((COUNTIF(F$44:F118,F76)>1)=FALSE,F76,\"\")))","v":""},{"$f":"IFERROR(IF(ROW(N33)>COUNTA($N$44:$N$66),\"\",INDEX($N:$N,SMALL(IF(N$44:N$66<>\"\",ROW($44:$66)),ROW(N33)))),\"\")","v":""},{"$f":"IF(O76=\"\",\"\",INDEX(tbl_Firmen[],MATCH(O76,tbl_Firmen[Name],0),5))","v":""}]
[null,null,null,null,null,{"$f":"IF(tbl_Firmen[[#This Row],[Nachname]]=\"\",\"\",LEFT(tbl_Firmen[[#This Row],[Vorname]],1)&\". \"&tbl_Firmen[[#This Row],[Nachname]])","v":""},null,null,null,null,{"$f":"IF((IF((COUNTIF(I$9:I77,I77)>1)=FALSE,I77,\"\"))=0,\"\",(IF((COUNTIF(I$9:I77,I77)>1)=FALSE,I77,\"\")))","v":""},{"$f":"IFERROR(IF(ROW(K39)>COUNTA($K$44:$K$931),\"\",INDEX($K:$K,SMALL(IF(K$44:K$931<>\"\",ROW($44:$931)),ROW(K39)))),\"\")","v":""},null,{"$f":"IF((IF((COUNTIF(F$44:F119,F77)>1)=FALSE,F77,\"\"))=0,\"\",(IF((COUNTIF(F$44:F119,F77)>1)=FALSE,F77,\"\")))","v":""},{"$f":"IFERROR(IF(ROW(N34)>COUNTA($N$44:$N$66),\"\",INDEX($N:$N,SMALL(IF(N$44:N$66<>\"\",ROW($44:$66)),ROW(N34)))),\"\")","v":""},{"$f":"IF(O77=\"\",\"\",INDEX(tbl_Firmen[],MATCH(O77,tbl_Firmen[Name],0),5))","v":""}]
[null,null,null,null,null,{"$f":"IF(tbl_Firmen[[#This Row],[Nachname]]=\"\",\"\",LEFT(tbl_Firmen[[#This Row],[Vorname]],1)&\". \"&tbl_Firmen[[#This Row],[Nachname]])","v":""},null,null,null,null,{"$f":"IF((IF((COUNTIF(I$9:I78,I78)>1)=FALSE,I78,\"\"))=0,\"\",(IF((COUNTIF(I$9:I78,I78)>1)=FALSE,I78,\"\")))","v":""},{"$f":"IFERROR(IF(ROW(K40)>COUNTA($K$44:$K$931),\"\",INDEX($K:$K,SMALL(IF(K$44:K$931<>\"\",ROW($44:$931)),ROW(K40)))),\"\")","v":""},null,{"$f":"IF((IF((COUNTIF(F$44:F120,F78)>1)=FALSE,F78,\"\"))=0,\"\",(IF((COUNTIF(F$44:F120,F78)>1)=FALSE,F78,\"\")))","v":""},{"$f":"IFERROR(IF(ROW(N35)>COUNTA($N$44:$N$66),\"\",INDEX($N:$N,SMALL(IF(N$44:N$66<>\"\",ROW($44:$66)),ROW(N35)))),\"\")","v":""},{"$f":"IF(O78=\"\",\"\",INDEX(tbl_Firmen[],MATCH(O78,tbl_Firmen[Name],0),5))","v":""}]
[null,null,null,null,null,{"$f":"IF(tbl_Firmen[[#This Row],[Nachname]]=\"\",\"\",LEFT(tbl_Firmen[[#This Row],[Vorname]],1)&\". \"&tbl_Firmen[[#This Row],[Nachname]])","v":""},null,null,null,null,{"$f":"IF((IF((COUNTIF(I$9:I79,I79)>1)=FALSE,I79,\"\"))=0,\"\",(IF((COUNTIF(I$9:I79,I79)>1)=FALSE,I79,\"\")))","v":""},{"$f":"IFERROR(IF(ROW(K41)>COUNTA($K$44:$K$931),\"\",INDEX($K:$K,SMALL(IF(K$44:K$931<>\"\",ROW($44:$931)),ROW(K41)))),\"\")","v":""},null,{"$f":"IF((IF((COUNTIF(F$44:F121,F79)>1)=FALSE,F79,\"\"))=0,\"\",(IF((COUNTIF(F$44:F121,F79)>1)=FALSE,F79,\"\")))","v":""},{"$f":"IFERROR(IF(ROW(N36)>COUNTA($N$44:$N$66),\"\",INDEX($N:$N,SMALL(IF(N$44:N$66<>\"\",ROW($44:$66)),ROW(N36)))),\"\")","v":""},{"$f":"IF(O79=\"\",\"\",INDEX(tbl_Firmen[],MATCH(O79,tbl_Firmen[Name],0),5))","v":""}]
[null,null,null,null,null,{"$f":"IF(tbl_Firmen[[#This Row],[Nachname]]=\"\",\"\",LEFT(tbl_Firmen[[#This Row],[Vorname]],1)&\". \"&tbl_Firmen[[#This Row],[Nachname]])","v":""},null,null,null,null,{"$f":"IF((IF((COUNTIF(I$9:I80,I80)>1)=FALSE,I80,\"\"))=0,\"\",(IF((COUNTIF(I$9:I80,I80)>1)=FALSE,I80,\"\")))","v":""},{"$f":"IFERROR(IF(ROW(K42)>COUNTA($K$44:$K$931),\"\",INDEX($K:$K,SMALL(IF(K$44:K$931<>\"\",ROW($44:$931)),ROW(K42)))),\"\")","v":""},null,{"$f":"IF((IF((COUNTIF(F$44:F122,F80)>1)=FALSE,F80,\"\"))=0,\"\",(IF((COUNTIF(F$44:F122,F80)>1)=FALSE,F80,\"\")))","v":""},{"$f":"IFERROR(IF(ROW(N37)>COUNTA($N$44:$N$66),\"\",INDEX($N:$N,SMALL(IF(N$44:N$66<>\"\",ROW($44:$66)),ROW(N37)))),\"\")","v":""},{"$f":"IF(O80=\"\",\"\",INDEX(tbl_Firmen[],MATCH(O80,tbl_Firmen[Name],0),5))","v":""}]
[null,null,null,null,null,{"$f":"IF(tbl_Firmen[[#This Row],[Nachname]]=\"\",\"\",LEFT(tbl_Firmen[[#This Row],[Vorname]],1)&\". \"&tbl_Firmen[[#This Row],[Nachname]])","v":""},null,null,null,null,{"$f":"IF((IF((COUNTIF(I$9:I81,I81)>1)=FALSE,I81,\"\"))=0,\"\",(IF((COUNTIF(I$9:I81,I81)>1)=FALSE,I81,\"\")))","v":""},{"$f":"IFERROR(IF(ROW(K43)>COUNTA($K$44:$K$931),\"\",INDEX($K:$K,SMALL(IF(K$44:K$931<>\"\",ROW($44:$931)),ROW(K43)))),\"\")","v":""},null,{"$f":"IF((IF((COUNTIF(F$44:F123,F81)>1)=FALSE,F81,\"\"))=0,\"\",(IF((COUNTIF(F$44:F123,F81)>1)=FALSE,F81,\"\")))","v":""},{"$f":"IFERROR(IF(ROW(N38)>COUNTA($N$44:$N$66),\"\",INDEX($N:$N,SMALL(IF(N$44:N$66<>\"\",ROW($44:$66)),ROW(N38)))),\"\")","v":""},{"$f":"IF(O81=\"\",\"\",INDEX(tbl_Firmen[],MATCH(O81,tbl_Firmen[Name],0),5))","v":""}]
[null,null,null,null,null,{"$f":"IF(tbl_Firmen[[#This Row],[Nachname]]=\"\",\"\",LEFT(tbl_Firmen[[#This Row],[Vorname]],1)&\". \"&tbl_Firmen[[#This Row],[Nachname]])","v":""},null,null,null,null,{"$f":"IF((IF((COUNTIF(I$9:I82,I82)>1)=FALSE,I82,\"\"))=0,\"\",(IF((COUNTIF(I$9:I82,I82)>1)=FALSE,I82,\"\")))","v":""},{"$f":"IFERROR(IF(ROW(K44)>COUNTA($K$44:$K$931),\"\",INDEX($K:$K,SMALL(IF(K$44:K$931<>\"\",ROW($44:$931)),ROW(K44)))),\"\")","v":""},null,{"$f":"IF((IF((COUNTIF(F$44:F124,F82)>1)=FALSE,F82,\"\"))=0,\"\",(IF((COUNTIF(F$44:F124,F82)>1)=FALSE,F82,\"\")))","v":""},{"$f":"IFERROR(IF(ROW(N39)>COUNTA($N$44:$N$66),\"\",INDEX($N:$N,SMALL(IF(N$44:N$66<>\"\",ROW($44:$66)),ROW(N39)))),\"\")","v":""},{"$f":"IF(O82=\"\",\"\",INDEX(tbl_Firmen[],MATCH(O82,tbl_Firmen[Name],0),5))","v":""}]
[null,null,null,null,null,{"$f":"IF(tbl_Firmen[[#This Row],[Nachname]]=\"\",\"\",LEFT(tbl_Firmen[[#This Row],[Vorname]],1)&\". \"&tbl_Firmen[[#This Row],[Nachname]])","v":""},null,null,null,null,{"$f":"IF((IF((COUNTIF(I$9:I83,I83)>1)=FALSE,I83,\"\"))=0,\"\",(IF((COUNTIF(I$9:I83,I83)>1)=FALSE,I83,\"\")))","v":""},{"$f":"IFERROR(IF(ROW(K45)>COUNTA($K$44:$K$931),\"\",INDEX($K:$K,SMALL(IF(K$44:K$931<>\"\",ROW($44:$931)),ROW(K45)))),\"\")","v":""},null,{"$f":"IF((IF((COUNTIF(F$44:F125,F83)>1)=FALSE,F83,\"\"))=0,\"\",(IF((COUNTIF(F$44:F125,F83)>1)=FALSE,F83,\"\")))","v":""},{"$f":"IFERROR(IF(ROW(N40)>COUNTA($N$44:$N$66),\"\",INDEX($N:$N,SMALL(IF(N$44:N$66<>\"\",ROW($44:$66)),ROW(N40)))),\"\")","v":""},{"$f":"IF(O83=\"\",\"\",INDEX(tbl_Firmen[],MATCH(O83,tbl_Firmen[Name],0),5))","v":""}]
[null,null,null,null,null,{"$f":"IF(tbl_Firmen[[#This Row],[Nachname]]=\"\",\"\",LEFT(tbl_Firmen[[#This Row],[Vorname]],1)&\". \"&tbl_Firmen[[#This Row],[Nachname]])","v":""},null,null,null,null,{"$f":"IF((IF((COUNTIF(I$9:I84,I84)>1)=FALSE,I84,\"\"))=0,\"\",(IF((COUNTIF(I$9:I84,I84)>1)=FALSE,I84,\"\")))","v":""},{"$f":"IFERROR(IF(ROW(K46)>COUNTA($K$44:$K$931),\"\",INDEX($K:$K,SMALL(IF(K$44:K$931<>\"\",ROW($44:$931)),ROW(K46)))),\"\")","v":""},null,{"$f":"IF((IF((COUNTIF(F$44:F126,F84)>1)=FALSE,F84,\"\"))=0,\"\",(IF((COUNTIF(F$44:F126,F84)>1)=FALSE,F84,\"\")))","v":""},{"$f":"IFERROR(IF(ROW(N41)>COUNTA($N$44:$N$66),\"\",INDEX($N:$N,SMALL(IF(N$44:N$66<>\"\",ROW($44:$66)),ROW(N41)))),\"\")","v":""},{"$f":"IF(O84=\"\",\"\",INDEX(tbl_Firmen[],MATCH(O84,tbl_Firmen[Name],0),5))","v":""}]
[null,null,null,null,null,{"$f":"IF(tbl_Firmen[[#This Row],[Nachname]]=\"\",\"\",LEFT(tbl_Firmen[[#This Row],[Vorname]],1)&\". \"&tbl_Firmen[[#This Row],[Nachname]])","v":""},null,null,null,null,{"$f":"IF((IF((COUNTIF(I$9:I85,I85)>1)=FALSE,I85,\"\"))=0,\"\",(IF((COUNTIF(I$9:I85,I85)>1)=FALSE,I85,\"\")))","v":""},{"$f":"IFERROR(IF(ROW(K47)>COUNTA($K$44:$K$931),\"\",INDEX($K:$K,SMALL(IF(K$44:K$931<>\"\",ROW($44:$931)),ROW(K47)))),\"\")","v":""},null,{"$f":"IF((IF((COUNTIF(F$44:F127,F85)>1)=FALSE,F85,\"\"))=0,\"\",(IF((COUNTIF(F$44:F127,F85)>1)=FALSE,F85,\"\")))","v":""},{"$f":"IFERROR(IF(ROW(N42)>COUNTA($N$44:$N$66),\"\",INDEX($N:$N,SMALL(IF(N$44:N$66<>\"\",ROW($44:$66)),ROW(N42)))),\"\")","v":""},{"$f":"IF(O85=\"\",\"\",INDEX(tbl_Firmen[],MATCH(O85,tbl_Firmen[Name],0),5))","v":""}]
[null,null,null,null,null,{"$f":"IF(tbl_Firmen[[#This Row],[Nachname]]=\"\",\"\",LEFT(tbl_Firmen[[#This Row],[Vorname]],1)&\". \"&tbl_Firmen[[#This Row],[Nachname]])","v":""},null,null,null,null,{"$f":"IF((IF((COUNTIF(I$9:I86,I86)>1)=FALSE,I86,\"\"))=0,\"\",(IF((COUNTIF(I$9:I86,I86)>1)=FALSE,I86,\"\")))","v":""},{"$f":"IFERROR(IF(ROW(K48)>COUNTA($K$44:$K$931),\"\",INDEX($K:$K,SMALL(IF(K$44:K$931<>\"\",ROW($44:$931)),ROW(K48)))),\"\")","v":""},null,{"$f":"IF((IF((COUNTIF(F$44:F128,F86)>1)=FALSE,F86,\"\"))=0,\"\",(IF((COUNTIF(F$44:F128,F86)>1)=FALSE,F86,\"\")))","v":""},{"$f":"IFERROR(IF(ROW(N43)>COUNTA($N$44:$N$66),\"\",INDEX($N:$N,SMALL(IF(N$44:N$66<>\"\",ROW($44:$66)),ROW(N43)))),\"\")","v":""},{"$f":"IF(O86=\"\",\"\",INDEX(tbl_Firmen[],MATCH(O86,tbl_Firmen[Name],0),5))","v":""}]