{"text_format":"1","workbook":"xlsx","n_sheets":3,"sheets":["Tabelle1","Tabelle2","Tabelle1 (2)"],"not_rendered":{"charts":0,"images":36,"macros":1,"external_links":0,"defined_names":1,"comments":2,"pivot_tables":0},"unopened":[],"bounds":{"document_bytes":16777216,"sheet_cells":100000,"rows_first":2000,"rows_last":500,"rows_between":2000,"halvings":0,"cell_chars":16384,"cell_head_chars":4096},"cells_cut":0,"cells_raw":0,"read":"whole","date_system":"1900"}

{"sheet":"Tabelle1","index":0,"n_rows":879,"n_cols":20,"rows_kept":879,"cut":false,"hidden":false,"merged":[]}
[null,"Nr.","Nr","Datum","Fracht","Start","LC","Flagge","Spedition","Ziel","LC","Flagge","Spedition","km","Vergütung","Gewicht Lieferung","Strafen"]
[null,1,2,"2024-06-25","Traktoren","Graz","AT",{"$f":"VLOOKUP(G2,Tabelle2!$B$3:$C$38,2,)","v":{"$error":"#VALUE!"}},"FCP","Linz","AT",{"$f":"VLOOKUP(K2,Tabelle2!$B$3:$C$38,2,)","v":{"$error":"#VALUE!"}},"RTLog",249,4663,null,0]
[null,2,3,"2024-06-25","Traktoren","Graz","AT",{"$f":"VLOOKUP(G3,Tabelle2!$B$3:$C$38,2,)","v":{"$error":"#VALUE!"}},"FCP","Klagenfurt a.W.","AT",{"$f":"VLOOKUP(K3,Tabelle2!$B$3:$C$38,2,)","v":{"$error":"#VALUE!"}},"EuroAcres",218,4667,null,0]
[null,3,6,"2024-06-25","Große Eisenrohre","Linz","AT",{"$f":"VLOOKUP(G4,Tabelle2!$B$3:$C$38,2,)","v":{"$error":"#VALUE!"}},"ITCC","Innsbruck","AT",{"$f":"VLOOKUP(K4,Tabelle2!$B$3:$C$38,2,)","v":{"$error":"#VALUE!"}},"RTLog",325,5080,null,0]
[null,4,1,"2024-06-25","Äpfel","Graz","AT",{"$f":"VLOOKUP(G5,Tabelle2!$B$3:$C$38,2,)","v":{"$error":"#VALUE!"}},"LKWLog","Graz","AT",{"$f":"VLOOKUP(K5,Tabelle2!$B$3:$C$38,2,)","v":{"$error":"#VALUE!"}},"RTLog",1,362,null,200]
[null,5,8,"2024-06-25","Motorradreifen","Graz","AT",{"$f":"VLOOKUP(G6,Tabelle2!$B$3:$C$38,2,)","v":{"$error":"#VALUE!"}},"LKWLog","Salzburg","AT",{"$f":"VLOOKUP(K6,Tabelle2!$B$3:$C$38,2,)","v":{"$error":"#VALUE!"}},"RTLog",281,5968,null,0]
[null,6,4,"2024-06-25","Traktoren","Linz","AT",{"$f":"VLOOKUP(G7,Tabelle2!$B$3:$C$38,2,)","v":{"$error":"#VALUE!"}},"PoSped","Graz","AT",{"$f":"VLOOKUP(K7,Tabelle2!$B$3:$C$38,2,)","v":{"$error":"#VALUE!"}},"RTLog",249,5304,null,0]
[null,7,5,"2024-06-25","Olivenöl","Linz","AT",{"$f":"VLOOKUP(G8,Tabelle2!$B$3:$C$38,2,)","v":{"$error":"#VALUE!"}},"PoSped","Prag","CZ",{"$f":"VLOOKUP(K8,Tabelle2!$B$3:$C$38,2,)","v":{"$error":"#VALUE!"}},"EuroGoodies",306,4325,null,400]
[null,8,7,"2024-06-25","Milchpulver","Prag","CZ",{"$f":"VLOOKUP(G9,Tabelle2!$B$3:$C$38,2,)","v":{"$error":"#VALUE!"}},"Tradeaux","Erfurt","DE",{"$f":"VLOOKUP(K9,Tabelle2!$B$3:$C$38,2,)","v":{"$error":"#VALUE!"}},"Sellplan",344,5378,null,0]
[null,9,15,"2024-06-26","Große Eisenrohre","Metz","FR",{"$f":"VLOOKUP(G10,Tabelle2!$B$3:$C$38,2,)","v":{"$error":"#VALUE!"}},"PoSped","Frankfurt","DE",{"$f":"VLOOKUP(K10,Tabelle2!$B$3:$C$38,2,)","v":{"$error":"#VALUE!"}},"WGCC",351,7947,null,400]
[null,10,11,"2024-06-26","Rohrleitungszbehör","Salzburg","AT",{"$f":"VLOOKUP(G11,Tabelle2!$B$3:$C$38,2,)","v":{"$error":"#VALUE!"}},"RTLog","Stuttgart","DE",{"$f":"VLOOKUP(K11,Tabelle2!$B$3:$C$38,2,)","v":{"$error":"#VALUE!"}},"Stokes",349,7723,null,0]
[null,11,13,"2024-06-26","Altkunststoff","Bern","CH",{"$f":"VLOOKUP(G12,Tabelle2!$B$3:$C$38,2,)","v":{"$error":"#VALUE!"}},"Sellplan","Dijon","FR",{"$f":"VLOOKUP(K12,Tabelle2!$B$3:$C$38,2,)","v":{"$error":"#VALUE!"}},"Stokes",216,3536,null,0]
[null,12,9,"2024-06-26","Stilles Mineralwasser in Flaschen","Salzburg","AT",{"$f":"VLOOKUP(G13,Tabelle2!$B$3:$C$38,2,)","v":{"$error":"#VALUE!"}},"Shuttle Cola","Brünn","CZ",{"$f":"VLOOKUP(K13,Tabelle2!$B$3:$C$38,2,)","v":{"$error":"#VALUE!"}},"LKWLog",336,7334,null,0]
[null,13,12,"2024-06-26","Milch ","Stuttgart","DE",{"$f":"VLOOKUP(G14,Tabelle2!$B$3:$C$38,2,)","v":{"$error":"#VALUE!"}},"Stokes","Bern","CH",{"$f":"VLOOKUP(K14,Tabelle2!$B$3:$C$38,2,)","v":{"$error":"#VALUE!"}},"Sellplan",336,8772,null,0]
[null,14,14,"2024-06-26","Mineralwasser","Dijon","FR",{"$f":"VLOOKUP(G15,Tabelle2!$B$3:$C$38,2,)","v":{"$error":"#VALUE!"}},"Stokes","Metz","FR",{"$f":"VLOOKUP(K15,Tabelle2!$B$3:$C$38,2,)","v":{"$error":"#VALUE!"}},"PoSped",251,5496,null,0]
[null,15,10,"2024-06-26","Gabelstapler","Brünn","CZ",{"$f":"VLOOKUP(G16,Tabelle2!$B$3:$C$38,2,)","v":{"$error":"#VALUE!"}},"Trameri","Salzburg","AT",{"$f":"VLOOKUP(K16,Tabelle2!$B$3:$C$38,2,)","v":{"$error":"#VALUE!"}},"RTLog",343,8367,null,0]
[null,16,16,"2024-06-26","Gabelstapler","Frankfurt","DE",{"$f":"VLOOKUP(G17,Tabelle2!$B$3:$C$38,2,)","v":{"$error":"#VALUE!"}},"WGCC","Luxemburg","LU",{"$f":"VLOOKUP(K17,Tabelle2!$B$3:$C$38,2,)","v":{"$error":"#VALUE!"}},"SanBuilders",330,8480,21720,800]
[null,17,19,"2024-06-27","Autos","Manchester","GB",{"$f":"VLOOKUP(G18,Tabelle2!$B$3:$C$38,2,)","v":{"$error":"#VALUE!"}},"FCP","Amsterdam","NL",{"$f":"VLOOKUP(K18,Tabelle2!$B$3:$C$38,2,)","v":{"$error":"#VALUE!"}},"LKWLog",301,8802,null,0]
[null,18,20,"2024-06-27","Rohrleitunngszubehör","Amsterdam","NL",{"$f":"VLOOKUP(G19,Tabelle2!$B$3:$C$38,2,)","v":{"$error":"#VALUE!"}},"LKWLog","Hannover","DE",{"$f":"VLOOKUP(K19,Tabelle2!$B$3:$C$38,2,)","v":{"$error":"#VALUE!"}},"Tradeaux",328,7563,null,0]
[null,19,18,"2024-06-27","Reifen","Rotterdam","NL",{"$f":"VLOOKUP(G20,Tabelle2!$B$3:$C$38,2,)","v":{"$error":"#VALUE!"}},"PoSped","Manchester","GB",{"$f":"VLOOKUP(K20,Tabelle2!$B$3:$C$38,2,)","v":{"$error":"#VALUE!"}},"FCP",227,6321,null,0]
[null,20,17,"2024-06-27","Raupenbagger","Luxemburg","LU",{"$f":"VLOOKUP(G21,Tabelle2!$B$3:$C$38,2,)","v":{"$error":"#VALUE!"}},"SanBuilders","Rotterdam","NL",{"$f":"VLOOKUP(K21,Tabelle2!$B$3:$C$38,2,)","v":{"$error":"#VALUE!"}},"PoSped",343,8763,null,0]
[null,21,22,"2024-06-28","Leere Paletten","Rostock","DE",{"$f":"VLOOKUP(G22,Tabelle2!$B$3:$C$38,2,)","v":{"$error":"#VALUE!"}},"Sellplan","Prag","CZ",{"$f":"VLOOKUP(K22,Tabelle2!$B$3:$C$38,2,)","v":{"$error":"#VALUE!"}},"Tradeaux",550,10964,null,0]
[null,22,21,"2024-06-28","Einmachgläser","Hanover","DE",{"$f":"VLOOKUP(G23,Tabelle2!$B$3:$C$38,2,)","v":{"$error":"#VALUE!"}},"Tradeaux","Rostock","DE",{"$f":"VLOOKUP(K23,Tabelle2!$B$3:$C$38,2,)","v":{"$error":"#VALUE!"}},"Sellplan",346,9085,null,400]
[null,23,23,"2024-06-28","Äpfel","Prag","CZ",{"$f":"VLOOKUP(G24,Tabelle2!$B$3:$C$38,2,)","v":{"$error":"#VALUE!"}},"Tradeaux","Salzburg","AT",{"$f":"VLOOKUP(K24,Tabelle2!$B$3:$C$38,2,)","v":{"$error":"#VALUE!"}},"RTLog",381,8967,null,0]
[null,24,25,"2024-06-30","Kautschuk","Bratislava","SK",{"$f":"VLOOKUP(G25,Tabelle2!$B$3:$C$38,2,)","v":{"$error":"#VALUE!"}},"PoSped","Linz","AT",{"$f":"VLOOKUP(K25,Tabelle2!$B$3:$C$38,2,)","v":{"$error":"#VALUE!"}},"PoSped",330,8278,21730,0]
[null,25,26,"2024-06-30","Mandeln","Linz","AT",{"$f":"VLOOKUP(G26,Tabelle2!$B$3:$C$38,2,)","v":{"$error":"#VALUE!"}},"PoSped","Klagenfurt a.W.","AT",{"$f":"VLOOKUP(K26,Tabelle2!$B$3:$C$38,2,)","v":{"$error":"#VALUE!"}},"Tradeaux",324,7068,17460,0]
[null,26,28,"2024-06-30","Klebebandrollen","Verona","IT",{"$f":"VLOOKUP(G27,Tabelle2!$B$3:$C$38,2,)","v":{"$error":"#VALUE!"}},"PoSped","Torino","IT",{"$f":"VLOOKUP(K27,Tabelle2!$B$3:$C$38,2,)","v":{"$error":"#VALUE!"}},"transinet",350,7132,18018,0]
[null,27,24,"2024-06-30","Klebebandrollen","Salzburg","AT",{"$f":"VLOOKUP(G28,Tabelle2!$B$3:$C$38,2,)","v":{"$error":"#VALUE!"}},"RTLog","Bratislava","SK",{"$f":"VLOOKUP(K28,Tabelle2!$B$3:$C$38,2,)","v":{"$error":"#VALUE!"}},"PoSped",320,5604,12492,0]
[null,28,27,"2024-06-30","Schnittblumen","Klagenfurt a.W.","AT",{"$f":"VLOOKUP(G29,Tabelle2!$B$3:$C$38,2,)","v":{"$error":"#VALUE!"}},"Tradeaux","Verona","IT",{"$f":"VLOOKUP(K29,Tabelle2!$B$3:$C$38,2,)","v":{"$error":"#VALUE!"}},"PoSped",450,11727,1759,0]
[null,29,29,"2024-06-30","Beton-Bodenplatten","Torino","IT",{"$f":"VLOOKUP(G30,Tabelle2!$B$3:$C$38,2,)","v":{"$error":"#VALUE!"}},"transinet","Zürich","CH",{"$f":"VLOOKUP(K30,Tabelle2!$B$3:$C$38,2,)","v":{"$error":"#VALUE!"}},"RTLog",511,8929,19188,0]
[null,30,4,"2024-07-01","Eiskaffee in Dosen","Mannheim","DE",{"$f":"VLOOKUP(G31,Tabelle2!$B$3:$C$38,2,)","v":{"$error":"#VALUE!"}},"EuroGoodies","Lille","FR",{"$f":"VLOOKUP(K31,Tabelle2!$B$3:$C$38,2,)","v":{"$error":"#VALUE!"}},"Tradeaux",546,12933,21259,0]
[null,31,2,"2024-07-01","Motoröl","Verona","IT",{"$f":"VLOOKUP(G32,Tabelle2!$B$3:$C$38,2,)","v":{"$error":"#VALUE!"}},"PoSped","Innsbruck","AT",{"$f":"VLOOKUP(K32,Tabelle2!$B$3:$C$38,2,)","v":{"$error":"#VALUE!"}},"RTLog",281,7255,18754,0]
[null,32,1,"2024-07-01","Geräucherter Aal","Zürich","CH",{"$f":"VLOOKUP(G33,Tabelle2!$B$3:$C$38,2,)","v":{"$error":"#VALUE!"}},"RTLog","Verona","IT",{"$f":"VLOOKUP(K33,Tabelle2!$B$3:$C$38,2,)","v":{"$error":"#VALUE!"}},"PoSped",492,12231,11481,0]
[null,33,3,"2024-07-01","Milch","Innsbruck","AT",{"$f":"VLOOKUP(G34,Tabelle2!$B$3:$C$38,2,)","v":{"$error":"#VALUE!"}},"RTLog","Mannheim","DE",{"$f":"VLOOKUP(K34,Tabelle2!$B$3:$C$38,2,)","v":{"$error":"#VALUE!"}},"EuroGoodies",548,13474,20500,0]
[null,34,5,"2024-07-02","Radlader","Graz","AT",{"$f":"VLOOKUP(G35,Tabelle2!$B$3:$C$38,2,)","v":{"$error":"#VALUE!"}},"FCP","Nürnberg","DE",{"$f":"VLOOKUP(K35,Tabelle2!$B$3:$C$38,2,)","v":{"$error":"#VALUE!"}},"SanBuilders",515,14881,null,520]
[null,35,8,"2024-07-03","Kokosnussöl","Reims","FR",{"$f":"VLOOKUP(G36,Tabelle2!$B$3:$C$38,2,)","v":{"$error":"#VALUE!"}},"EuroGoodies","Calais","FR",{"$f":"VLOOKUP(K36,Tabelle2!$B$3:$C$38,2,)","v":{"$error":"#VALUE!"}},"Stokes",269,6705,23631,0]
[null,36,7,"2024-07-03","Fischstäbchen","Dortmund","DE",{"$f":"VLOOKUP(G37,Tabelle2!$B$3:$C$38,2,)","v":{"$error":"#VALUE!"}},"LKWLog","Reims","FR",{"$f":"VLOOKUP(K37,Tabelle2!$B$3:$C$38,2,)","v":{"$error":"#VALUE!"}},"Eurogoodies",485,12051,17160,0]
[null,37,10,"2024-07-03","Industrieruß","Birmingham","GB",{"$f":"VLOOKUP(G38,Tabelle2!$B$3:$C$38,2,)","v":{"$error":"#VALUE!"}},"PoSped","Manchester","GB",{"$f":"VLOOKUP(K38,Tabelle2!$B$3:$C$38,2,)","v":{"$error":"#VALUE!"}},"LKWLog",201,2480,3783,0]
[null,38,6,"2024-07-03","Leere Paletten","Nürnberg","DE",{"$f":"VLOOKUP(G39,Tabelle2!$B$3:$C$38,2,)","v":{"$error":"#VALUE!"}},"SanBuilders","Dortmund","DE",{"$f":"VLOOKUP(K39,Tabelle2!$B$3:$C$38,2,)","v":{"$error":"#VALUE!"}},"LKWLog",479,7305,15385,0]
[null,39,9,"2024-07-03","Eisenrohre","Calais","FR",{"$f":"VLOOKUP(G40,Tabelle2!$B$3:$C$38,2,)","v":{"$error":"#VALUE!"}},"Stokes","Birmingham","BG",{"$f":"VLOOKUP(K40,Tabelle2!$B$3:$C$38,2,)","v":{"$error":"#VALUE!"}},"PoSped",342,7760,18760,0]
{"$rows_left_out":840}
{"sheet":"Tabelle2","index":1,"n_rows":38,"n_cols":3,"rows_kept":38,"cut":false,"hidden":false,"merged":[]}
[]
["Länder","LC","Flagge"]
[{"$error":"#VALUE!"},{"$f":"_FV(A3,\"Abkürzung\")","v":"AL"},{"$f":"_FV(A3,\"Bild\")","v":{"$error":"#VALUE!"}}]
[{"$error":"#VALUE!"},{"$f":"_FV(A4,\"Abkürzung\")","v":"BE"},{"$f":"_FV(A4,\"Bild\")","v":{"$error":"#VALUE!"}}]
[{"$error":"#VALUE!"},"BIH",{"$f":"_FV(A5,\"Bild\")","v":{"$error":"#VALUE!"}}]
[{"$error":"#VALUE!"},{"$f":"_FV(A6,\"Abkürzung\")","v":"BG"},{"$f":"_FV(A6,\"Bild\")","v":{"$error":"#VALUE!"}}]
[{"$error":"#VALUE!"},{"$f":"_FV(A7,\"Abkürzung\")","v":"DK"},{"$f":"_FV(A7,\"Bild\")","v":{"$error":"#VALUE!"}}]
[{"$error":"#VALUE!"},{"$f":"_FV(A8,\"Abkürzung\")","v":"DE"},{"$f":"_FV(A8,\"Bild\")","v":{"$error":"#VALUE!"}}]
[{"$error":"#VALUE!"},{"$f":"_FV(A9,\"Abkürzung\")","v":"EE"},{"$f":"_FV(A9,\"Bild\")","v":{"$error":"#VALUE!"}}]
[{"$error":"#VALUE!"},{"$f":"_FV(A10,\"Abkürzung\")","v":"FI"},{"$f":"_FV(A10,\"Bild\")","v":{"$error":"#VALUE!"}}]
[{"$error":"#VALUE!"},{"$f":"_FV(A11,\"Abkürzung\")","v":"FR"},{"$f":"_FV(A11,\"Bild\")","v":{"$error":"#VALUE!"}}]
[{"$error":"#VALUE!"},{"$f":"_FV(A12,\"Abkürzung\")","v":"GR"},{"$f":"_FV(A12,\"Bild\")","v":{"$error":"#VALUE!"}}]
[{"$error":"#VALUE!"},{"$f":"_FV(A13,\"Abkürzung\")","v":"IT"},{"$f":"_FV(A13,\"Bild\")","v":{"$error":"#VALUE!"}}]
[{"$error":"#VALUE!"},{"$f":"_FV(A14,\"Abkürzung\")","v":{"$error":"#VALUE!"}},{"$f":"_FV(A14,\"Bild\")","v":{"$error":"#VALUE!"}}]
[{"$error":"#VALUE!"},{"$f":"_FV(A15,\"Abkürzung\")","v":"HR"},{"$f":"_FV(A15,\"Bild\")","v":{"$error":"#VALUE!"}}]
[{"$error":"#VALUE!"},{"$f":"_FV(A16,\"Abkürzung\")","v":"LV"},{"$f":"_FV(A16,\"Bild\")","v":{"$error":"#VALUE!"}}]
[{"$error":"#VALUE!"},{"$f":"_FV(A17,\"Abkürzung\")","v":"LT"},{"$f":"_FV(A17,\"Bild\")","v":{"$error":"#VALUE!"}}]
[{"$error":"#VALUE!"},{"$f":"_FV(A18,\"Abkürzung\")","v":"LU"},{"$f":"_FV(A18,\"Bild\")","v":{"$error":"#VALUE!"}}]
[{"$error":"#VALUE!"},{"$f":"_FV(A19,\"Abkürzung\")","v":"ME"},{"$f":"_FV(A19,\"Bild\")","v":{"$error":"#VALUE!"}}]
[{"$error":"#VALUE!"},{"$f":"_FV(A20,\"Abkürzung\")","v":"NL"},{"$f":"_FV(A20,\"Bild\")","v":{"$error":"#VALUE!"}}]
[{"$error":"#VALUE!"},"MK",{"$f":"_FV(A21,\"Bild\")","v":{"$error":"#VALUE!"}}]
[{"$error":"#VALUE!"},{"$f":"_FV(A22,\"Abkürzung\")","v":"NO"},{"$f":"_FV(A22,\"Bild\")","v":{"$error":"#VALUE!"}}]
[{"$error":"#VALUE!"},{"$f":"_FV(A23,\"Abkürzung\")","v":"AT"},{"$f":"_FV(A23,\"Bild\")","v":{"$error":"#VALUE!"}}]
[{"$error":"#VALUE!"},{"$f":"_FV(A24,\"Abkürzung\")","v":"PL"},{"$f":"_FV(A24,\"Bild\")","v":{"$error":"#VALUE!"}}]
[{"$error":"#VALUE!"},{"$f":"_FV(A25,\"Abkürzung\")","v":"PT"},{"$f":"_FV(A25,\"Bild\")","v":{"$error":"#VALUE!"}}]
[{"$error":"#VALUE!"},{"$f":"_FV(A26,\"Abkürzung\")","v":"RO"},{"$f":"_FV(A26,\"Bild\")","v":{"$error":"#VALUE!"}}]
[{"$error":"#VALUE!"},{"$f":"_FV(A27,\"Abkürzung\")","v":"RU"},{"$f":"_FV(A27,\"Bild\")","v":{"$error":"#VALUE!"}}]
[{"$error":"#VALUE!"},{"$f":"_FV(A28,\"Abkürzung\")","v":"SE"},{"$f":"_FV(A28,\"Bild\")","v":{"$error":"#VALUE!"}}]
[{"$error":"#VALUE!"},{"$f":"_FV(A29,\"Abkürzung\")","v":"CH"},{"$f":"_FV(A29,\"Bild\")","v":{"$error":"#VALUE!"}}]
[{"$error":"#VALUE!"},{"$f":"_FV(A30,\"Abkürzung\")","v":"RS"},{"$f":"_FV(A30,\"Bild\")","v":{"$error":"#VALUE!"}}]
[{"$error":"#VALUE!"},{"$f":"_FV(A31,\"Abkürzung\")","v":"SK"},{"$f":"_FV(A31,\"Bild\")","v":{"$error":"#VALUE!"}}]
[{"$error":"#VALUE!"},{"$f":"_FV(A32,\"Abkürzung\")","v":"SI"},{"$f":"_FV(A32,\"Bild\")","v":{"$error":"#VALUE!"}}]
[{"$error":"#VALUE!"},{"$f":"_FV(A33,\"Abkürzung\")","v":"ES"},{"$f":"_FV(A33,\"Bild\")","v":{"$error":"#VALUE!"}}]
[{"$error":"#VALUE!"},{"$f":"_FV(A34,\"Abkürzung\")","v":"CZ"},{"$f":"_FV(A34,\"Bild\")","v":{"$error":"#VALUE!"}}]
[{"$error":"#VALUE!"},{"$f":"_FV(A35,\"Abkürzung\")","v":"TR"},{"$f":"_FV(A35,\"Bild\")","v":{"$error":"#VALUE!"}}]
[{"$error":"#VALUE!"},{"$f":"_FV(A36,\"Abkürzung\")","v":"HU"},{"$f":"_FV(A36,\"Bild\")","v":{"$error":"#VALUE!"}}]
[{"$error":"#VALUE!"},{"$f":"_FV(A37,\"Abkürzung\")","v":"GB"},{"$f":"_FV(A37,\"Bild\")","v":{"$error":"#VALUE!"}}]
["Winterwonderland","WL",{"$f":"_xlfn.IMAGE(\"https://trucksbook.eu/data/system/flags/small/xl.png\")","v":{"$error":"#VALUE!"}}]

{"sheet":"Tabelle1 (2)","index":2,"n_rows":879,"n_cols":17,"rows_kept":879,"cut":false,"hidden":false,"merged":[]}
[null,"Nr.","Nr","Datum","Fracht","Start","LC","Spedition","Ziel","LC","Spedition","km","Vergütung","Gewicht Lieferung","Strafen"]
[null,1,2,"2024-06-25","Traktoren","Graz",{"$f":"VLOOKUP(\"DE\",Tabelle2!$B$3:$C$38,2,FALSE)","v":{"$error":"#VALUE!"}},"FCP","Linz","AT","RTLog",249,4663,null,0]
[null,2,3,"2024-06-25","Traktoren","Graz",{"$f":"VLOOKUP(\"at\",Tabelle2!$B$3:$C$38,2,FALSE)","v":{"$error":"#VALUE!"}},"FCP","Klagenfurt a.W.","AT","EuroAcres",218,4667,null,0]
[null,3,6,"2024-06-25","Große Eisenrohre","Linz","AT","ITCC","Innsbruck",{"$f":"VLOOKUP(\"at\",Tabelle2!$B$3:$C$38,2,FALSE)","v":{"$error":"#VALUE!"}},"RTLog",325,5080,null,0]
[null,4,1,"2024-06-25","Äpfel","Graz","AT","LKWLog","Graz","AT","RTLog",1,362,null,200]
[null,5,8,"2024-06-25","Motorradreifen","Graz","AT","LKWLog","Salzburg","AT","RTLog",281,5968,null,0]
[null,6,4,"2024-06-25","Traktoren","Linz","AT","PoSped","Graz","AT","RTLog",249,5304,null,0]
[null,7,5,"2024-06-25","Olivenöl","Linz",{"$f":"VLOOKUP(\"tr\",Tabelle2!$B$3:$C$38,2,FALSE)","v":{"$error":"#VALUE!"}},"PoSped","Prag",{"$f":"VLOOKUP(\"tr\",Tabelle2!$B$3:$C$38,2,FALSE)","v":{"$error":"#VALUE!"}},"EuroGoodies",306,4325,null,400]
[null,8,7,"2024-06-25","Milchpulver","Prag","CZ","Tradeaux","Erfurt","DE","Sellplan",344,5378,null,0]
[null,9,15,"2024-06-26","Große Eisenrohre","Metz","FR","PoSped","Frankfurt","DE","WGCC",351,7947,null,400]
[null,10,11,"2024-06-26","Rohrleitungszbehör","Salzburg","AT","RTLog","Stuttgart","DE","Stokes",349,7723,null,0]
[null,11,13,"2024-06-26","Altkunststoff","Bern","CH","Sellplan","Dijon","FR","Stokes",216,3536,null,0]
[null,12,9,"2024-06-26","Stilles Mineralwasser in Flaschen","Salzburg","AT","Shuttle Cola","Brünn","CZ","LKWLog",336,7334,null,0]
[null,13,12,"2024-06-26","Milch ","Stuttgart","DE","Stokes","Bern","CH","Sellplan",336,8772,null,0]
[null,14,14,"2024-06-26","Mineralwasser","Dijon","FR","Stokes","Metz","FR","PoSped",251,5496,null,0]
[null,15,10,"2024-06-26","Gabelstapler","Brünn","CZ","Trameri","Salzburg","AT","RTLog",343,8367,null,0]
[null,16,16,"2024-06-26","Gabelstapler","Frankfurt","DE","WGCC","Luxemburg","LU","SanBuilders",330,8480,21720,800]
[null,17,19,"2024-06-27","Autos","Manchester","GB","FCP","Amsterdam","NL","LKWLog",301,8802,null,0]
[null,18,20,"2024-06-27","Rohrleitunngszubehör","Amsterdam","NL","LKWLog","Hannover","DE","Tradeaux",328,7563,null,0]
[null,19,18,"2024-06-27","Reifen","Rotterdam","NL","PoSped","Manchester","GB","FCP",227,6321,null,0]
[null,20,17,"2024-06-27","Raupenbagger","Luxemburg","LU","SanBuilders","Rotterdam","NL","PoSped",343,8763,null,0]
[null,21,22,"2024-06-28","Leere Paletten","Rostock","DE","Sellplan","Prag","CZ","Tradeaux",550,10964,null,0]
[null,22,21,"2024-06-28","Einmachgläser","Hanover","DE","Tradeaux","Rostock","DE","Sellplan",346,9085,null,400]
[null,23,23,"2024-06-28","Äpfel","Prag","CZ","Tradeaux","Salzburg","AT","RTLog",381,8967,null,0]
[null,24,25,"2024-06-30","Kautschuk","Bratislava","SK","PoSped","Linz","AT","PoSped",330,8278,21730,0]
[null,25,26,"2024-06-30","Mandeln","Linz","AT","PoSped","Klagenfurt a.W.","AT","Tradeaux",324,7068,17460,0]
[null,26,28,"2024-06-30","Klebebandrollen","Verona","IT","PoSped","Torino","IT","transinet",350,7132,18018,0]
[null,27,24,"2024-06-30","Klebebandrollen","Salzburg","AT","RTLog","Bratislava","SK","PoSped",320,5604,12492,0]
[null,28,27,"2024-06-30","Schnittblumen","Klagenfurt a.W.","AT","Tradeaux","Verona","IT","PoSped",450,11727,1759,0]
[null,29,29,"2024-06-30","Beton-Bodenplatten","Torino","IT","transinet","Zürich","CH","RTLog",511,8929,19188,0]
[null,30,4,"2024-07-01","Eiskaffee in Dosen","Mannheim","DE","EuroGoodies","Lille","FR","Tradeaux",546,12933,21259,0]
[null,31,2,"2024-07-01","Motoröl","Verona","IT","PoSped","Innsbruck","AT","RTLog",281,7255,18754,0]
[null,32,1,"2024-07-01","Geräucherter Aal","Zürich","CH","RTLog","Verona","IT","PoSped",492,12231,11481,0]
[null,33,3,"2024-07-01","Milch","Innsbruck","AT","RTLog","Mannheim","DE","EuroGoodies",548,13474,20500,0]
[null,34,5,"2024-07-02","Radlader","Graz","AT","FCP","Nürnberg","DE","SanBuilders",515,14881,null,520]
[null,35,8,"2024-07-03","Kokosnussöl","Reims","FR","EuroGoodies","Calais","FR","Stokes",269,6705,23631,0]
[null,36,7,"2024-07-03","Fischstäbchen","Dortmund","DE","LKWLog","Reims","FR","Eurogoodies",485,12051,17160,0]
[null,37,10,"2024-07-03","Industrieruß","Birmingham","GB","PoSped","Manchester","GB","LKWLog",201,2480,3783,0]
[null,38,6,"2024-07-03","Leere Paletten","Nürnberg","DE","SanBuilders","Dortmund","DE","LKWLog",479,7305,15385,0]
[null,39,9,"2024-07-03","Eisenrohre","Calais","FR","Stokes","Birmingham","BG","PoSped",342,7760,18760,0]
{"$rows_left_out":839}