{"text_format":"1","workbook":"xlsx","n_sheets":4,"sheets":["Vorl. Variab.  Montl. Ausg.","Ausgabe Jan","Einn Ausg Jahr","Test"],"not_rendered":{"charts":0,"images":0,"macros":1,"external_links":0,"defined_names":9,"comments":0,"pivot_tables":0},"unopened":[],"bounds":{"document_bytes":16777216,"sheet_cells":100000,"rows_first":2000,"rows_last":500,"rows_between":2000,"halvings":0,"cell_chars":16384,"cell_head_chars":4096},"cells_cut":0,"cells_raw":0,"read":"whole","date_system":"1900"}

{"sheet":"Vorl. Variab.  Montl. Ausg.","index":0,"n_rows":292,"n_cols":45,"rows_kept":292,"cut":false,"hidden":true,"merged":[[260,14,260,16],[241,0,241,2],[242,7,242,8],[242,12,242,14],[243,0,243,2],[244,7,244,8],[246,7,246,8],[248,7,248,8],[250,7,250,8],[252,7,252,9],[260,7,260,9],[260,11,260,12],[238,0,238,2],[238,7,238,8],[238,12,238,14],[239,0,239,2],[240,7,240,8],[240,12,240,14],[237,0,237,2],[48,0,85,0],[60,1,62,1],[77,1,78,1],[86,0,123,0],[86,1,88,1],[101,1,103,1],[121,1,122,1],[124,0,161,0],[130,1,131,1],[139,1,140,1],[162,0,199,0],[200,0,235,0],[0,0,5,4],[0,6,0,42],[1,5,2,5],[6,0,8,4],[11,0,46,0],[15,1,17,1],[20,1,22,1]]}
["Mein Haushaltsbuch V 1.0",null,null,null,null,"Monat",{"$f":"I255&\" \"&I256&\"\"","v":"März 2024"}]
[null,null,null,null,null,"Datum",{"$f":"IF(DAY(H259)>=DAY($N$259),\"-\",(TEXT(H259,\"TTT\")))","v":"-"},"-","-","Fr","Sa","So",{"$f":"(TEXT(N259,\"TTT\"))","v":"Mo"},"Di","Mi","Do","Fr","Sa","So","Mo","Di","Mi","Do","Fr","Sa","So","Mo","Di","Mi","Do","Fr","Sa","So","Mo",{"$f":"IF(DAY(AJ259)<DAY($AJ$259),\"-\",(TEXT(AJ259,\"TTT\")))","v":"Di"},"Mi","Do","Fr","Sa","So","-","-","-"]
[null,null,null,null,null,null,{"$f":"IF(DAY(H259)>=DAY($N$259),\"-\",(TEXT(H259,\"TT\")))","v":"-"},"-","-","01","02","03",{"$f":"(TEXT(N259,\"TT\"))","v":"04"},"05","06","07","08","09","10","11","12","13","14","15","16","17","18","19","20","21","22","23","24","25",{"$f":"IF(DAY(AJ259)<DAY($AJ$259),\"-\",(TEXT(AJ259,\"TT\")))","v":"26"},"27","28","29","30","31","-","-","-"]
[null,null,null,null,null,"Feiertage",{"$f":"IF(DAY(H259)>=DAY($N$259),\"-\",_xlfn.XLOOKUP(H259,$J$263:$J$292,$H$263:$H$292,\"\"))","v":"-"},"-","-","","","",{"$f":"_xlfn.XLOOKUP(N259,$J$263:$J$292,$H$263:$H$292,\"\")","v":""},"","","","","","","","","","","","","","","","","","","","","",{"$f":"IF(DAY(AJ259)<DAY($AJ$259),\"-\",_xlfn.XLOOKUP(AJ259,$J$263:$J$292,$H$263:$H$292,\"\"))","v":""},"","","Karfreitag","","Oster-\nSonntag","-","-","-"]
[null,null,null,null,null,"Geburtstage",{"$f":"IF(DAY(H259)>=DAY($N$259),\"-\",_xlfn.XLOOKUP(H259,$M$263:$M$302,$L$263:$L$302,\"\"))","v":"-"},"-","-","","",{"$f":"IF(DAY(M259)>=DAY($N$259),\"-\",_xlfn.XLOOKUP(M259,$M$263:$M$302,$L$263:$L$302,\"\"))","v":""},{"$f":"_xlfn.XLOOKUP(N259,$M$263:$M$302,$L$263:$L$302,\"\")","v":""},{"$f":"_xlfn.XLOOKUP(O259,$M$263:$M$302,$L$263:$L$302,\"\")","v":""},"","","","","","","Karl-Heinz","","","","Ingrid\nWehlitz","","","","","","","","","",{"$f":"IF(DAY(AJ259)<DAY($AJ$259),\"-\",_xlfn.XLOOKUP(AJ259,$M$263:$M$302,$L$263:$L$302,\"\"))","v":""},{"$f":"IF(DAY(AK259)<DAY($AJ$259),\"-\",_xlfn.XLOOKUP(AK259,$M$263:$M$302,$L$263:$L$302,\"\"))","v":""},"","","Gunhild\nLohm.-Elias","","-","-","-"]
[null,null,null,null,null,"Schulferien / Urlaub",{"$f":"IF(DAY(H259)>=DAY($N$259),\"-\",\"\")","v":"-"},"-","-","","",{"$f":"IF(DAY(M259)>=DAY($N$259),\"-\",\"\")","v":""},null,null,null,null,null,null,null,null,null,null,null,null,null,null,null,null,null,null,null,null,null,null,{"$f":"IF(DAY(AJ259)<DAY($AJ$259),\"-\",\"\")","v":""},null,null,null,null,{"$f":"IF(DAY(AO259)<DAY($AJ$259),\"-\",\"\")","v":""},"-","-","-"]
["Variabele Ausgaben",null,null,null,null,"Kalenderwoche",{"$f":"IF(DAY(H259)>=DAY($N$259),\"-\",WEEKNUM(H259,21))","v":"-"},"-","-",9,9,9,{"$f":"WEEKNUM(N259,21)","v":10},10,10,10,10,10,10,11,11,11,11,11,11,11,12,12,12,12,12,12,12,13,{"$f":"IF(DAY(AJ259)<DAY($AJ$259),\"-\",WEEKNUM(AJ259,21))","v":13},13,13,13,13,13,"-","-","-"]
[null,null,null,null,null,"Tagessumme",{"$f":"IF(DAY(H259)>=DAY($N$259),\"-\",IF(SUM(G49:G236)<>0,SUM(G49:G236),\"\"))","v":"-"},"-","-",-205,-205,-205,{"$f":"IF(SUM(M49:M236)<>0,SUM(M49:M236),\"\")","v":-205},{"$f":"IF(SUM(N49:N236)<>0,SUM(N49:N236),\"\")","v":-205},-205,-205,-205,-205,-205,-205,-205,-205,-205,-205,-205,-205,-205,-205,-205,-205,-205,-205,-205,-205,{"$f":"IF(DAY(AJ259)<DAY($AJ$259),\"-\",IF(SUM(AI49:AI236)<>0,SUM(AI49:AI236),\"\"))","v":-205},-205,-205,-205,-205,-205,"-","-","-"]
[null,null,null,null,null,"Wochensumme",{"$f":"IF(DAY(H259)>=DAY($N$259),\"-\",IF((G2=\"So\")*ISNUMBER(G8),SUMIF(7:7,G7,8:8)+(COUNTIF($G2:G2,\"So\")=1)*#REF!,\"\"))","v":"-"},{"$f":"IF(DAY(I259)>=DAY($N$259),\"-\",IF((H2=\"So\")*ISNUMBER(H8),SUMIF(7:7,H7,8:8)+(COUNTIF($G2:H2,\"So\")=1)*#REF!,\"\"))","v":"-"},{"$f":"IF(DAY(J259)>=DAY($N$259),\"-\",IF((I2=\"So\")*ISNUMBER(I8),SUMIF(7:7,I7,8:8)+(COUNTIF($G2:I2,\"So\")=1)*#REF!,\"\"))","v":"-"},{"$f":"IF(DAY(K259)>=DAY($N$259),\"-\",IF((J2=\"So\")*ISNUMBER(J8),SUMIF(7:7,J7,8:8)+(COUNTIF($G2:J2,\"So\")=1)*#REF!,\"\"))","v":""},{"$f":"IF(DAY(L259)>=DAY($N$259),\"-\",IF((K2=\"So\")*ISNUMBER(K8),SUMIF(7:7,K7,8:8)+(COUNTIF($G2:K2,\"So\")=1)*#REF!,\"\"))","v":""},{"$f":"IF(DAY(M259)>=DAY($N$259),\"-\",IF((L2=\"So\")*ISNUMBER(L8),SUMIF(7:7,L7,8:8)+(COUNTIF($G2:L2,\"So\")=1)*#REF!,\"\"))","v":{"$error":"#REF!"}},{"$f":"IF((M2=\"So\")*ISNUMBER(M8),SUMIF(7:7,M7,8:8)+(COUNTIF($G2:M2,\"So\")=1)*#REF!,\"\")","v":""},{"$f":"IF((N2=\"So\")*ISNUMBER(N8),SUMIF(7:7,N7,8:8)+(COUNTIF($G2:N2,\"So\")=1)*#REF!,\"\")","v":""},{"$f":"IF((O2=\"So\")*ISNUMBER(O8),SUMIF(7:7,O7,8:8)+(COUNTIF($G2:O2,\"So\")=1)*#REF!,\"\")","v":""},{"$f":"IF((P2=\"So\")*ISNUMBER(P8),SUMIF(7:7,P7,8:8)+(COUNTIF($G2:P2,\"So\")=1)*#REF!,\"\")","v":""},{"$f":"IF((Q2=\"So\")*ISNUMBER(Q8),SUMIF(7:7,Q7,8:8)+(COUNTIF($G2:Q2,\"So\")=1)*#REF!,\"\")","v":""},{"$f":"IF((R2=\"So\")*ISNUMBER(R8),SUMIF(7:7,R7,8:8)+(COUNTIF($G2:R2,\"So\")=1)*#REF!,\"\")","v":""},{"$f":"IF((S2=\"So\")*ISNUMBER(S8),SUMIF(7:7,S7,8:8)+(COUNTIF($G2:S2,\"So\")=1)*#REF!,\"\")","v":{"$error":"#REF!"}},{"$f":"IF((T2=\"So\")*ISNUMBER(T8),SUMIF(7:7,T7,8:8)+(COUNTIF($G2:T2,\"So\")=1)*#REF!,\"\")","v":""},{"$f":"IF((U2=\"So\")*ISNUMBER(U8),SUMIF(7:7,U7,8:8)+(COUNTIF($G2:U2,\"So\")=1)*#REF!,\"\")","v":""},{"$f":"IF((V2=\"So\")*ISNUMBER(V8),SUMIF(7:7,V7,8:8)+(COUNTIF($G2:V2,\"So\")=1)*#REF!,\"\")","v":""},{"$f":"IF((W2=\"So\")*ISNUMBER(W8),SUMIF(7:7,W7,8:8)+(COUNTIF($G2:W2,\"So\")=1)*#REF!,\"\")","v":""},{"$f":"IF((X2=\"So\")*ISNUMBER(X8),SUMIF(7:7,X7,8:8)+(COUNTIF($G2:X2,\"So\")=1)*#REF!,\"\")","v":""},{"$f":"IF((Y2=\"So\")*ISNUMBER(Y8),SUMIF(7:7,Y7,8:8)+(COUNTIF($G2:Y2,\"So\")=1)*#REF!,\"\")","v":""},{"$f":"IF((Z2=\"So\")*ISNUMBER(Z8),SUMIF(7:7,Z7,8:8)+(COUNTIF($G2:Z2,\"So\")=1)*#REF!,\"\")","v":{"$error":"#REF!"}},{"$f":"IF((AA2=\"So\")*ISNUMBER(AA8),SUMIF(7:7,AA7,8:8)+(COUNTIF($G2:AA2,\"So\")=1)*#REF!,\"\")","v":""},{"$f":"IF((AB2=\"So\")*ISNUMBER(AB8),SUMIF(7:7,AB7,8:8)+(COUNTIF($G2:AB2,\"So\")=1)*#REF!,\"\")","v":""},{"$f":"IF((AC2=\"So\")*ISNUMBER(AC8),SUMIF(7:7,AC7,8:8)+(COUNTIF($G2:AC2,\"So\")=1)*#REF!,\"\")","v":""},{"$f":"IF((AD2=\"So\")*ISNUMBER(AD8),SUMIF(7:7,AD7,8:8)+(COUNTIF($G2:AD2,\"So\")=1)*#REF!,\"\")","v":""},{"$f":"IF((AE2=\"So\")*ISNUMBER(AE8),SUMIF(7:7,AE7,8:8)+(COUNTIF($G2:AE2,\"So\")=1)*#REF!,\"\")","v":""},{"$f":"IF((AF2=\"So\")*ISNUMBER(AF8),SUMIF(7:7,AF7,8:8)+(COUNTIF($G2:AF2,\"So\")=1)*#REF!,\"\")","v":""},{"$f":"IF((AG2=\"So\")*ISNUMBER(AG8),SUMIF(7:7,AG7,8:8)+(COUNTIF($G2:AG2,\"So\")=1)*#REF!,\"\")","v":{"$error":"#REF!"}},{"$f":"IF((AH2=\"So\")*ISNUMBER(AH8),SUMIF(7:7,AH7,8:8)+(COUNTIF($G2:AH2,\"So\")=1)*#REF!,\"\")","v":""},{"$f":"IF(DAY(AJ259)<DAY($AJ$259),\"-\",IF((AI2=\"So\")*ISNUMBER(AI8),SUMIF(7:7,AI7,8:8)+(COUNTIF($G2:AI2,\"So\")=1)*#REF!,\"\"))","v":""},{"$f":"IF(DAY(AK259)<DAY($AJ$259),\"-\",IF((AJ2=\"So\")*ISNUMBER(AJ8),SUMIF(7:7,AJ7,8:8)+(COUNTIF($G2:AJ2,\"So\")=1)*#REF!,\"\"))","v":""},{"$f":"IF(DAY(AL259)<DAY($AJ$259),\"-\",IF((AK2=\"So\")*ISNUMBER(AK8),SUMIF(7:7,AK7,8:8)+(COUNTIF($G2:AK2,\"So\")=1)*#REF!,\"\"))","v":""},{"$f":"IF(DAY(AM259)<DAY($AJ$259),\"-\",IF((AL2=\"So\")*ISNUMBER(AL8),SUMIF(7:7,AL7,8:8)+(COUNTIF($G2:AL2,\"So\")=1)*#REF!,\"\"))","v":""},{"$f":"IF(DAY(AN259)<DAY($AJ$259),\"-\",IF((AM2=\"So\")*ISNUMBER(AM8),SUMIF(7:7,AM7,8:8)+(COUNTIF($G2:AM2,\"So\")=1)*#REF!,\"\"))","v":""},{"$f":"IF(DAY(AO259)<DAY($AJ$259),\"-\",IF((AN2=\"So\")*ISNUMBER(AN8),SUMIF(7:7,AN7,8:8)+(COUNTIF($G2:AN2,\"So\")=1)*#REF!,\"\"))","v":{"$error":"#REF!"}},{"$f":"IF(DAY(AP259)<DAY($AJ$259),\"-\",IF((AO2=\"So\")*ISNUMBER(AO8),SUMIF(7:7,AO7,8:8)+(COUNTIF($G2:AO2,\"So\")=1)*#REF!,\"\"))","v":"-"},{"$f":"IF(DAY(AQ259)<DAY($AJ$259),\"-\",IF((AP2=\"So\")*ISNUMBER(AP8),SUMIF(7:7,AP7,8:8)+(COUNTIF($G2:AP2,\"So\")=1)*#REF!,\"\"))","v":"-"},{"$f":"IF(DAY(AR259)<DAY($AJ$259),\"-\",IF((AQ2=\"So\")*ISNUMBER(AQ8),SUMIF(7:7,AQ7,8:8)+(COUNTIF($G2:AQ2,\"So\")=1)*#REF!,\"\"))","v":"-"},null,{"$f":"IF(LOOKUP(9,1/(AG2:AQ2<>\"-\"),AG2:AQ2)=\"So\",0,SUMIF(7:7,LOOKUP(9,1/(AG2:AQ2<>\"-\"),AG7:AQ7),8:8))","v":0}]
[null,"Hauptkategorie","Unterkategorie","Summe","Summe","Prozent. Verteilung",{"$f":"IF(DAY(H259)>=DAY($N$259),\"-\",\"Betrag\")","v":"-"},"-","-","Betrag","Betrag","Betrag","Betrag","Betrag","Betrag","Betrag","Betrag","Betrag","Betrag","Betrag","Betrag","Betrag","Betrag","Betrag","Betrag","Betrag","Betrag","Betrag","Betrag","Betrag","Betrag","Betrag","Betrag","Betrag",{"$f":"IF(DAY(AJ259)<DAY($AJ$259),\"-\",\"Betrag\")","v":"Betrag"},"Betrag","Betrag","Betrag","Betrag","Betrag","-","-","-"]
[]
["Schnelleingabe","Beruf","Verpflegung Frühstück",{"$f":"IF(SUM(G12:AQ12)<>0,SUM(G12:AQ12),\"\")","v":-74},{"$f":"IF(SUM(D12:D14)<>0,SUM(D12:D14),\"\")","v":-222},null,-2,-2,-2,-2,-2,-2,-2,-2,-2,-2,-2,-2,-2,-2,-2,-2,-2,-2,-2,-2,-2,-2,-2,-2,-2,-2,-2,-2,-2,-2,-2,-2,-2,-2,-2,-2,-2]
[null,null,"Verpflegung Mittag",{"$f":"IF(SUM(G13:AQ13)<>0,SUM(G13:AQ13),\"\")","v":-111},null,null,-3,-3,-3,-3,-3,-3,-3,-3,-3,-3,-3,-3,-3,-3,-3,-3,-3,-3,-3,-3,-3,-3,-3,-3,-3,-3,-3,-3,-3,-3,-3,-3,-3,-3,-3,-3,-3]
[null,null,"Platzhalter 1",-37,null,null,-1,-1,-1,-1,-1,-1,-1,-1,-1,-1,-1,-1,-1,-1,-1,-1,-1,-1,-1,-1,-1,-1,-1,-1,-1,-1,-1,-1,-1,-1,-1,-1,-1,-1,-1,-1,-1]
[]
[null,"-- Freizeit --\nAusgehen/Hobby\nSport/Vereine","Bar/Café/Restaurant",-74,{"$f":"IF(SUM(D16:D19)<>0,SUM(D16:D19),\"\")","v":-370},null,-2,-2,-2,-2,-2,-2,-2,-2,-2,-2,-2,-2,-2,-2,-2,-2,-2,-2,-2,-2,-2,-2,-2,-2,-2,-2,-2,-2,-2,-2,-2,-2,-2,-2,-2,-2,-2]
[null,null,"Geschenke",-111,null,null,-3,-3,-3,-3,-3,-3,-3,-3,-3,-3,-3,-3,-3,-3,-3,-3,-3,-3,-3,-3,-3,-3,-3,-3,-3,-3,-3,-3,-3,-3,-3,-3,-3,-3,-3,-3,-3]
[null,null,"Getränke/Eis/Snacks",-148,null,null,-4,-4,-4,-4,-4,-4,-4,-4,-4,-4,-4,-4,-4,-4,-4,-4,-4,-4,-4,-4,-4,-4,-4,-4,-4,-4,-4,-4,-4,-4,-4,-4,-4,-4,-4,-4,-4]
[null,null,"Platzhalter 2",-37,null,null,-1,-1,-1,-1,-1,-1,-1,-1,-1,-1,-1,-1,-1,-1,-1,-1,-1,-1,-1,-1,-1,-1,-1,-1,-1,-1,-1,-1,-1,-1,-1,-1,-1,-1,-1,-1,-1]
[]
[null,"-- Freizeit --\nBücher/Medien\nSpiele","Bücher/Heftromane/Zeitschriften",-74,{"$f":"IF(SUM(D21:D23)<>0,SUM(D21:D23),\"\")","v":-222},null,-2,-2,-2,-2,-2,-2,-2,-2,-2,-2,-2,-2,-2,-2,-2,-2,-2,-2,-2,-2,-2,-2,-2,-2,-2,-2,-2,-2,-2,-2,-2,-2,-2,-2,-2,-2,-2]
[null,null,"PC-Software/PC-Spiele",-111,null,null,-3,-3,-3,-3,-3,-3,-3,-3,-3,-3,-3,-3,-3,-3,-3,-3,-3,-3,-3,-3,-3,-3,-3,-3,-3,-3,-3,-3,-3,-3,-3,-3,-3,-3,-3,-3,-3]
[null,null,"Platzhalter 3",-37,null,null,-1,-1,-1,-1,-1,-1,-1,-1,-1,-1,-1,-1,-1,-1,-1,-1,-1,-1,-1,-1,-1,-1,-1,-1,-1,-1,-1,-1,-1,-1,-1,-1,-1,-1,-1,-1,-1]
[]
[null,"Gesundheit","Arzneimittel/Verbandsmittel (Nicht Rezeptpflichtig)",-74,{"$f":"IF(SUM(D25:D27)<>0,SUM(D25:D27),\"\")","v":-222},null,-2,-2,-2,-2,-2,-2,-2,-2,-2,-2,-2,-2,-2,-2,-2,-2,-2,-2,-2,-2,-2,-2,-2,-2,-2,-2,-2,-2,-2,-2,-2,-2,-2,-2,-2,-2,-2]
[null,null,"Arzneimittel/Verbandsmittel (Rezeptpflichtig)",-111,null,null,-3,-3,-3,-3,-3,-3,-3,-3,-3,-3,-3,-3,-3,-3,-3,-3,-3,-3,-3,-3,-3,-3,-3,-3,-3,-3,-3,-3,-3,-3,-3,-3,-3,-3,-3,-3,-3]
[null,null,"Platzhalter 4",-37,null,null,-1,-1,-1,-1,-1,-1,-1,-1,-1,-1,-1,-1,-1,-1,-1,-1,-1,-1,-1,-1,-1,-1,-1,-1,-1,-1,-1,-1,-1,-1,-1,-1,-1,-1,-1,-1,-1]
[]
[null,"Lebensmittel","Bürobedarf",-74,{"$f":"IF(SUM(D29:D32)<>0,SUM(D29:D32),\"\")","v":-370},null,-2,-2,-2,-2,-2,-2,-2,-2,-2,-2,-2,-2,-2,-2,-2,-2,-2,-2,-2,-2,-2,-2,-2,-2,-2,-2,-2,-2,-2,-2,-2,-2,-2,-2,-2,-2,-2]
[null,null,"Haushaltsartikel (Reinigungsm., Toilettenpap., etc.) ",-111,null,null,-3,-3,-3,-3,-3,-3,-3,-3,-3,-3,-3,-3,-3,-3,-3,-3,-3,-3,-3,-3,-3,-3,-3,-3,-3,-3,-3,-3,-3,-3,-3,-3,-3,-3,-3,-3,-3]
[null,null,"Lebensmittel/Getränke",-148,null,null,-4,-4,-4,-4,-4,-4,-4,-4,-4,-4,-4,-4,-4,-4,-4,-4,-4,-4,-4,-4,-4,-4,-4,-4,-4,-4,-4,-4,-4,-4,-4,-4,-4,-4,-4,-4,-4]
[null,null,"Platzhalter 5",-37,null,null,-1,-1,-1,-1,-1,-1,-1,-1,-1,-1,-1,-1,-1,-1,-1,-1,-1,-1,-1,-1,-1,-1,-1,-1,-1,-1,-1,-1,-1,-1,-1,-1,-1,-1,-1,-1,-1]
[]
[null,"Mobilität","Auto, Pflege",-74,{"$f":"IF(SUM(D34:D38)<>0,SUM(D34:D38),\"\")","v":-555},null,-2,-2,-2,-2,-2,-2,-2,-2,-2,-2,-2,-2,-2,-2,-2,-2,-2,-2,-2,-2,-2,-2,-2,-2,-2,-2,-2,-2,-2,-2,-2,-2,-2,-2,-2,-2,-2]
[null,null,"Auto, Treibstoff",-111,null,null,-3,-3,-3,-3,-3,-3,-3,-3,-3,-3,-3,-3,-3,-3,-3,-3,-3,-3,-3,-3,-3,-3,-3,-3,-3,-3,-3,-3,-3,-3,-3,-3,-3,-3,-3,-3,-3]
[null,null,"Auto, Parkgebühren",-148,null,null,-4,-4,-4,-4,-4,-4,-4,-4,-4,-4,-4,-4,-4,-4,-4,-4,-4,-4,-4,-4,-4,-4,-4,-4,-4,-4,-4,-4,-4,-4,-4,-4,-4,-4,-4,-4,-4]
[null,null,"ÖPNV (Fahrkarten, Wochenticket, etc.)",-185,null,null,-5,-5,-5,-5,-5,-5,-5,-5,-5,-5,-5,-5,-5,-5,-5,-5,-5,-5,-5,-5,-5,-5,-5,-5,-5,-5,-5,-5,-5,-5,-5,-5,-5,-5,-5,-5,-5]
[null,null,"Platzhalter 6",-37,null,null,-1,-1,-1,-1,-1,-1,-1,-1,-1,-1,-1,-1,-1,-1,-1,-1,-1,-1,-1,-1,-1,-1,-1,-1,-1,-1,-1,-1,-1,-1,-1,-1,-1,-1,-1,-1,-1]
[]
[null,"Post","Briefe",-74,{"$f":"IF(SUM(D40:D42)<>0,SUM(D40:D42),\"\")","v":-222},null,-2,-2,-2,-2,-2,-2,-2,-2,-2,-2,-2,-2,-2,-2,-2,-2,-2,-2,-2,-2,-2,-2,-2,-2,-2,-2,-2,-2,-2,-2,-2,-2,-2,-2,-2,-2,-2]
[null,null,"Pakete",-111,null,null,-3,-3,-3,-3,-3,-3,-3,-3,-3,-3,-3,-3,-3,-3,-3,-3,-3,-3,-3,-3,-3,-3,-3,-3,-3,-3,-3,-3,-3,-3,-3,-3,-3,-3,-3,-3,-3]
[null,null,"Platzhalter 7",-37,null,null,-1,-1,-1,-1,-1,-1,-1,-1,-1,-1,-1,-1,-1,-1,-1,-1,-1,-1,-1,-1,-1,-1,-1,-1,-1,-1,-1,-1,-1,-1,-1,-1,-1,-1,-1,-1,-1]
[]
[null,"Wellnes/Körperpflege","Fitnessstudio",-74,{"$f":"IF(SUM(D44:D47)<>0,SUM(D44:D47),\"\")","v":-370},null,-2,-2,-2,-2,-2,-2,-2,-2,-2,-2,-2,-2,-2,-2,-2,-2,-2,-2,-2,-2,-2,-2,-2,-2,-2,-2,-2,-2,-2,-2,-2,-2,-2,-2,-2,-2,-2]
[null,null,"Körperpflege/Kosmetik/ Frisör",-111,null,null,-3,-3,-3,-3,-3,-3,-3,-3,-3,-3,-3,-3,-3,-3,-3,-3,-3,-3,-3,-3,-3,-3,-3,-3,-3,-3,-3,-3,-3,-3,-3,-3,-3,-3,-3,-3,-3]
[null,null,"Wellness (Massage,Sauna, etc.)",-148,null,null,-4,-4,-4,-4,-4,-4,-4,-4,-4,-4,-4,-4,-4,-4,-4,-4,-4,-4,-4,-4,-4,-4,-4,-4,-4,-4,-4,-4,-4,-4,-4,-4,-4,-4,-4,-4,-4]
[null,null,"Platzhalter 8",-37,null,null,-1,-1,-1,-1,-1,-1,-1,-1,-1,-1,-1,-1,-1,-1,-1,-1,-1,-1,-1,-1,-1,-1,-1,-1,-1,-1,-1,-1,-1,-1,-1,-1,-1,-1,-1,-1,-1]
[]
["Eingabe","Bekleidung","Accessoires",-37,{"$f":"IF(SUM(D49:D57)<>0,SUM(D49:D58),\"\")","v":-370},{"$f":"IFERROR(E49/$E$240,\" \")","v":4.6082949308755762E-2},-1,-1,-1,-1,-1,-1,-1,-1,-1,-1,-1,-1,-1,-1,-1,-1,-1,-1,-1,-1,-1,-1,-1,-1,-1,-1,-1,-1,-1,-1,-1,-1,-1,-1,-1,-1,-1]
[null,null,"Besondere Anlässe (Hochzeit, etc.)",-37,null,null,-1,-1,-1,-1,-1,-1,-1,-1,-1,-1,-1,-1,-1,-1,-1,-1,-1,-1,-1,-1,-1,-1,-1,-1,-1,-1,-1,-1,-1,-1,-1,-1,-1,-1,-1,-1,-1]
[null,null,"Oberbekleidung",-37,null,null,-1,-1,-1,-1,-1,-1,-1,-1,-1,-1,-1,-1,-1,-1,-1,-1,-1,-1,-1,-1,-1,-1,-1,-1,-1,-1,-1,-1,-1,-1,-1,-1,-1,-1,-1,-1,-1]
[null,null,"Schuhe",-37,null,null,-1,-1,-1,-1,-1,-1,-1,-1,-1,-1,-1,-1,-1,-1,-1,-1,-1,-1,-1,-1,-1,-1,-1,-1,-1,-1,-1,-1,-1,-1,-1,-1,-1,-1,-1,-1,-1]
[null,null,"Sportbekleidung",-37,null,null,-1,-1,-1,-1,-1,-1,-1,-1,-1,-1,-1,-1,-1,-1,-1,-1,-1,-1,-1,-1,-1,-1,-1,-1,-1,-1,-1,-1,-1,-1,-1,-1,-1,-1,-1,-1,-1]
[null,null,"Unterbekleidung",-37,null,null,-1,-1,-1,-1,-1,-1,-1,-1,-1,-1,-1,-1,-1,-1,-1,-1,-1,-1,-1,-1,-1,-1,-1,-1,-1,-1,-1,-1,-1,-1,-1,-1,-1,-1,-1,-1,-1]
[null,null,"Platzhalter 9",-37,null,null,-1,-1,-1,-1,-1,-1,-1,-1,-1,-1,-1,-1,-1,-1,-1,-1,-1,-1,-1,-1,-1,-1,-1,-1,-1,-1,-1,-1,-1,-1,-1,-1,-1,-1,-1,-1,-1]
[null,null,"Platzhalter 10",-37,null,null,-1,-1,-1,-1,-1,-1,-1,-1,-1,-1,-1,-1,-1,-1,-1,-1,-1,-1,-1,-1,-1,-1,-1,-1,-1,-1,-1,-1,-1,-1,-1,-1,-1,-1,-1,-1,-1]
[null,null,"Platzhalter 11",{"$f":"IF(SUM(G57:AQ57)<>0,SUM(G57:AQ57),\"\")","v":-37},null,null,-1,-1,-1,-1,-1,-1,-1,-1,-1,-1,-1,-1,-1,-1,-1,-1,-1,-1,-1,-1,-1,-1,-1,-1,-1,-1,-1,-1,-1,-1,-1,-1,-1,-1,-1,-1,-1]
[null,null,"Sonstiges",{"$f":"IF(SUM(G58:AQ58)<>0,SUM(G58:AQ58),\"\")","v":-37},null,null,-1,-1,-1,-1,-1,-1,-1,-1,-1,-1,-1,-1,-1,-1,-1,-1,-1,-1,-1,-1,-1,-1,-1,-1,-1,-1,-1,-1,-1,-1,-1,-1,-1,-1,-1,-1,-1]
[]
[null,"Beruf","Arbeitsbekleidung/Reinigung",-37,{"$f":"IF(SUM(D60:D66)<>0,SUM(D60:D67),\"\")","v":-407},{"$f":"IFERROR(E60/$E$240,\" \")","v":5.0691244239631339E-2},-1,-1,-1,-1,-1,-1,-1,-1,-1,-1,-1,-1,-1,-1,-1,-1,-1,-1,-1,-1,-1,-1,-1,-1,-1,-1,-1,-1,-1,-1,-1,-1,-1,-1,-1,-1,-1]
[null,null,"Fachliteratur",-37,null,null,-1,-1,-1,-1,-1,-1,-1,-1,-1,-1,-1,-1,-1,-1,-1,-1,-1,-1,-1,-1,-1,-1,-1,-1,-1,-1,-1,-1,-1,-1,-1,-1,-1,-1,-1,-1,-1]
[null,null,"Verpflegung Frühstück",-74,null,null,{"$f":"IF(G12=\"\",\"\",G12)","v":-2},-2,-2,-2,-2,-2,-2,-2,-2,-2,-2,-2,-2,-2,-2,-2,-2,-2,-2,-2,-2,-2,-2,-2,-2,-2,-2,-2,-2,-2,-2,-2,-2,-2,-2,-2,-2]
[null,null,"Verpflegung Mittag",-111,null,null,-3,-3,-3,-3,-3,-3,-3,-3,-3,-3,-3,-3,-3,-3,-3,-3,-3,-3,-3,-3,-3,-3,-3,-3,-3,-3,-3,-3,-3,-3,-3,-3,-3,-3,-3,-3,-3]
[null,null,"Platzhalter 12",-37,null,null,-1,-1,-1,-1,-1,-1,-1,-1,-1,-1,-1,-1,-1,-1,-1,-1,-1,-1,-1,-1,-1,-1,-1,-1,-1,-1,-1,-1,-1,-1,-1,-1,-1,-1,-1,-1,-1]
[null,null,"Platzhalter 13",-37,null,null,-1,-1,-1,-1,-1,-1,-1,-1,-1,-1,-1,-1,-1,-1,-1,-1,-1,-1,-1,-1,-1,-1,-1,-1,-1,-1,-1,-1,-1,-1,-1,-1,-1,-1,-1,-1,-1]
[null,null,"Platzhalter 14",{"$f":"IF(SUM(G66:AQ66)<>0,SUM(G66:AQ66),\"\")","v":-37},null,null,-1,-1,-1,-1,-1,-1,-1,-1,-1,-1,-1,-1,-1,-1,-1,-1,-1,-1,-1,-1,-1,-1,-1,-1,-1,-1,-1,-1,-1,-1,-1,-1,-1,-1,-1,-1,-1]
[null,null,"Sonstiges",{"$f":"IF(SUM(G67:AQ67)<>0,SUM(G67:AQ67),\"\")","v":-37},null,null,-1,-1,-1,-1,-1,-1,-1,-1,-1,-1,-1,-1,-1,-1,-1,-1,-1,-1,-1,-1,-1,-1,-1,-1,-1,-1,-1,-1,-1,-1,-1,-1,-1,-1,-1,-1,-1]
[]
[null,"Bildung","Bücher/Materialien",-37,{"$f":"IF(SUM(D69:D75)<>0,SUM(D69:D76),\"\")","v":-296},{"$f":"IFERROR(E69/$E$240,\" \")","v":3.6866359447004608E-2},-1,-1,-1,-1,-1,-1,-1,-1,-1,-1,-1,-1,-1,-1,-1,-1,-1,-1,-1,-1,-1,-1,-1,-1,-1,-1,-1,-1,-1,-1,-1,-1,-1,-1,-1,-1,-1]
[null,null,"Online-Kurse",-37,null,null,-1,-1,-1,-1,-1,-1,-1,-1,-1,-1,-1,-1,-1,-1,-1,-1,-1,-1,-1,-1,-1,-1,-1,-1,-1,-1,-1,-1,-1,-1,-1,-1,-1,-1,-1,-1,-1]
[null,null,"Seminare/Workshops (VHS-Kurs, etc.)",-37,null,null,-1,-1,-1,-1,-1,-1,-1,-1,-1,-1,-1,-1,-1,-1,-1,-1,-1,-1,-1,-1,-1,-1,-1,-1,-1,-1,-1,-1,-1,-1,-1,-1,-1,-1,-1,-1,-1]
[null,null,"Studiengebühren (Fernstudium, etc.)",-37,null,null,-1,-1,-1,-1,-1,-1,-1,-1,-1,-1,-1,-1,-1,-1,-1,-1,-1,-1,-1,-1,-1,-1,-1,-1,-1,-1,-1,-1,-1,-1,-1,-1,-1,-1,-1,-1,-1]
[null,null,"Platzhalter 15",-37,null,null,-1,-1,-1,-1,-1,-1,-1,-1,-1,-1,-1,-1,-1,-1,-1,-1,-1,-1,-1,-1,-1,-1,-1,-1,-1,-1,-1,-1,-1,-1,-1,-1,-1,-1,-1,-1,-1]
[null,null,"Platzhalter 16",-37,null,null,-1,-1,-1,-1,-1,-1,-1,-1,-1,-1,-1,-1,-1,-1,-1,-1,-1,-1,-1,-1,-1,-1,-1,-1,-1,-1,-1,-1,-1,-1,-1,-1,-1,-1,-1,-1,-1]
[null,null,"Platzhalter 17",{"$f":"IF(SUM(G75:AQ75)<>0,SUM(G75:AQ75),\"\")","v":-37},null,null,-1,-1,-1,-1,-1,-1,-1,-1,-1,-1,-1,-1,-1,-1,-1,-1,-1,-1,-1,-1,-1,-1,-1,-1,-1,-1,-1,-1,-1,-1,-1,-1,-1,-1,-1,-1,-1]
[null,null,"Sonstiges",{"$f":"IF(SUM(G76:AQ76)<>0,SUM(G76:AQ76),\"\")","v":-37},null,null,-1,-1,-1,-1,-1,-1,-1,-1,-1,-1,-1,-1,-1,-1,-1,-1,-1,-1,-1,-1,-1,-1,-1,-1,-1,-1,-1,-1,-1,-1,-1,-1,-1,-1,-1,-1,-1]
[]
[null,"Computer\nElektroartikel","Computer",-37,{"$f":"IF(SUM(D78:D84)<>0,SUM(D78:D85),\"\")","v":-296},{"$f":"IFERROR(E78/$E$240,\" \")","v":3.6866359447004608E-2},-1,-1,-1,-1,-1,-1,-1,-1,-1,-1,-1,-1,-1,-1,-1,-1,-1,-1,-1,-1,-1,-1,-1,-1,-1,-1,-1,-1,-1,-1,-1,-1,-1,-1,-1,-1,-1]
[null,null,"Heimelektronik (Batterien, etc.)",-37,null,null,-1,-1,-1,-1,-1,-1,-1,-1,-1,-1,-1,-1,-1,-1,-1,-1,-1,-1,-1,-1,-1,-1,-1,-1,-1,-1,-1,-1,-1,-1,-1,-1,-1,-1,-1,-1,-1]
[null,null,"Smartphone",-37,null,null,-1,-1,-1,-1,-1,-1,-1,-1,-1,-1,-1,-1,-1,-1,-1,-1,-1,-1,-1,-1,-1,-1,-1,-1,-1,-1,-1,-1,-1,-1,-1,-1,-1,-1,-1,-1,-1]
[null,null,"Unterhaltungselektronik",-37,null,null,-1,-1,-1,-1,-1,-1,-1,-1,-1,-1,-1,-1,-1,-1,-1,-1,-1,-1,-1,-1,-1,-1,-1,-1,-1,-1,-1,-1,-1,-1,-1,-1,-1,-1,-1,-1,-1]
[null,null,"Platzhalter 18",-37,null,null,-1,-1,-1,-1,-1,-1,-1,-1,-1,-1,-1,-1,-1,-1,-1,-1,-1,-1,-1,-1,-1,-1,-1,-1,-1,-1,-1,-1,-1,-1,-1,-1,-1,-1,-1,-1,-1]
[null,null,"Platzhalter 19",-37,null,null,-1,-1,-1,-1,-1,-1,-1,-1,-1,-1,-1,-1,-1,-1,-1,-1,-1,-1,-1,-1,-1,-1,-1,-1,-1,-1,-1,-1,-1,-1,-1,-1,-1,-1,-1,-1,-1]
[null,null,"Platzhalter 20",-37,null,null,-1,-1,-1,-1,-1,-1,-1,-1,-1,-1,-1,-1,-1,-1,-1,-1,-1,-1,-1,-1,-1,-1,-1,-1,-1,-1,-1,-1,-1,-1,-1,-1,-1,-1,-1,-1,-1]
[null,null,"Sonstiges",-37,null,null,-1,-1,-1,-1,-1,-1,-1,-1,-1,-1,-1,-1,-1,-1,-1,-1,-1,-1,-1,-1,-1,-1,-1,-1,-1,-1,-1,-1,-1,-1,-1,-1,-1,-1,-1,-1,-1]
[]
["Eingabe","-- Freizeit --\nAusgehen/Sport/\nVereine","Bar/Café/Restaurant",-74,{"$f":"IF(SUM(D87:D99)<>0,SUM(D87:D100),\"\")","v":-740},{"$f":"IFERROR(E87/$E$240,\" \")","v":9.2165898617511524E-2},{"$f":"IF(G16=\"\",\"\",G16)","v":-2},-2,-2,-2,-2,-2,-2,-2,-2,-2,-2,-2,-2,-2,-2,-2,-2,-2,-2,-2,-2,-2,-2,-2,-2,-2,-2,-2,-2,-2,-2,-2,-2,-2,-2,-2,-2]
[null,null,"Disco/Tanzveranstaltungen",-37,null,null,-1,-1,-1,-1,-1,-1,-1,-1,-1,-1,-1,-1,-1,-1,-1,-1,-1,-1,-1,-1,-1,-1,-1,-1,-1,-1,-1,-1,-1,-1,-1,-1,-1,-1,-1,-1,-1]
[null,null,"Garten/Pflanzen",-37,null,null,-1,-1,-1,-1,-1,-1,-1,-1,-1,-1,-1,-1,-1,-1,-1,-1,-1,-1,-1,-1,-1,-1,-1,-1,-1,-1,-1,-1,-1,-1,-1,-1,-1,-1,-1,-1,-1]
[null,null,"Geschenke",-111,null,null,{"$f":"IF(G17=\"\",\"\",G17)","v":-3},-3,-3,-3,-3,-3,-3,-3,-3,-3,-3,-3,-3,-3,-3,-3,-3,-3,-3,-3,-3,-3,-3,-3,-3,-3,-3,-3,-3,-3,-3,-3,-3,-3,-3,-3,-3]
[null,null,"Getränke/Eis/Snacks",-148,null,null,-4,-4,-4,-4,-4,-4,-4,-4,-4,-4,-4,-4,-4,-4,-4,-4,-4,-4,-4,-4,-4,-4,-4,-4,-4,-4,-4,-4,-4,-4,-4,-4,-4,-4,-4,-4,-4]
[null,null,"Glücksspiel (Lotto, Totto, etc.)",{"$f":"IF(SUM(G92:AQ92)<>0,SUM(G92:AQ92),\"\")","v":-37},null,null,-1,-1,-1,-1,-1,-1,-1,-1,-1,-1,-1,-1,-1,-1,-1,-1,-1,-1,-1,-1,-1,-1,-1,-1,-1,-1,-1,-1,-1,-1,-1,-1,-1,-1,-1,-1,-1]
[null,null,"Kino/Konzert/Museum/Theater/Volksfest",-37,null,null,-1,-1,-1,-1,-1,-1,-1,-1,-1,-1,-1,-1,-1,-1,-1,-1,-1,-1,-1,-1,-1,-1,-1,-1,-1,-1,-1,-1,-1,-1,-1,-1,-1,-1,-1,-1,-1]
[null,null,"Sportartikel",-37,null,null,-1,-1,-1,-1,-1,-1,-1,-1,-1,-1,-1,-1,-1,-1,-1,-1,-1,-1,-1,-1,-1,-1,-1,-1,-1,-1,-1,-1,-1,-1,-1,-1,-1,-1,-1,-1,-1]
[null,null,"Vereine (Bekleidung)",-37,null,null,-1,-1,-1,-1,-1,-1,-1,-1,-1,-1,-1,-1,-1,-1,-1,-1,-1,-1,-1,-1,-1,-1,-1,-1,-1,-1,-1,-1,-1,-1,-1,-1,-1,-1,-1,-1,-1]
[null,null,"Vereine (Geräte, etc.)",-37,null,null,-1,-1,-1,-1,-1,-1,-1,-1,-1,-1,-1,-1,-1,-1,-1,-1,-1,-1,-1,-1,-1,-1,-1,-1,-1,-1,-1,-1,-1,-1,-1,-1,-1,-1,-1,-1,-1]
[null,null,"Platzhalter 21",-37,null,null,-1,-1,-1,-1,-1,-1,-1,-1,-1,-1,-1,-1,-1,-1,-1,-1,-1,-1,-1,-1,-1,-1,-1,-1,-1,-1,-1,-1,-1,-1,-1,-1,-1,-1,-1,-1,-1]
[null,null,"Platzhalter 22",-37,null,null,-1,-1,-1,-1,-1,-1,-1,-1,-1,-1,-1,-1,-1,-1,-1,-1,-1,-1,-1,-1,-1,-1,-1,-1,-1,-1,-1,-1,-1,-1,-1,-1,-1,-1,-1,-1,-1]
[null,null,"Platzhalter 23",{"$f":"IF(SUM(G99:AQ99)<>0,SUM(G99:AQ99),\"\")","v":-37},null,null,-1,-1,-1,-1,-1,-1,-1,-1,-1,-1,-1,-1,-1,-1,-1,-1,-1,-1,-1,-1,-1,-1,-1,-1,-1,-1,-1,-1,-1,-1,-1,-1,-1,-1,-1,-1,-1]
[null,null,"Sonstiges",{"$f":"IF(SUM(G100:AQ100)<>0,SUM(G100:AQ100),\"\")","v":-37},null,null,-1,-1,-1,-1,-1,-1,-1,-1,-1,-1,-1,-1,-1,-1,-1,-1,-1,-1,-1,-1,-1,-1,-1,-1,-1,-1,-1,-1,-1,-1,-1,-1,-1,-1,-1,-1,-1]
[]
[null,"-- Freizeit --\nBücher/Medien/\nSpiele","Bücher/Heftromane/Zeitschriften",-74,{"$f":"IF(SUM(D102:D108)<>0,SUM(D102:D109),\"\")","v":-407},{"$f":"IFERROR(E102/$E$240,\" \")","v":5.0691244239631339E-2},{"$f":"IF(G21=\"\",\"\",G21)","v":-2},-2,-2,-2,-2,-2,-2,-2,-2,-2,-2,-2,-2,-2,-2,-2,-2,-2,-2,-2,-2,-2,-2,-2,-2,-2,-2,-2,-2,-2,-2,-2,-2,-2,-2,-2,-2]
[null,null,"CD/DVD/Blue-Ray Disk",-37,null,null,-1,-1,-1,-1,-1,-1,-1,-1,-1,-1,-1,-1,-1,-1,-1,-1,-1,-1,-1,-1,-1,-1,-1,-1,-1,-1,-1,-1,-1,-1,-1,-1,-1,-1,-1,-1,-1]
[null,null,"PC-Software/PC-Spiele/In Game Kaufe",-111,null,null,{"$f":"IF(G22=\"\",\"\",G22)","v":-3},-3,-3,-3,-3,-3,-3,-3,-3,-3,-3,-3,-3,-3,-3,-3,-3,-3,-3,-3,-3,-3,-3,-3,-3,-3,-3,-3,-3,-3,-3,-3,-3,-3,-3,-3,-3]
[null,null,"Gesellschaftsspiele",-37,null,null,-1,-1,-1,-1,-1,-1,-1,-1,-1,-1,-1,-1,-1,-1,-1,-1,-1,-1,-1,-1,-1,-1,-1,-1,-1,-1,-1,-1,-1,-1,-1,-1,-1,-1,-1,-1,-1]
[null,null,"Platzhalter 24",-37,null,null,-1,-1,-1,-1,-1,-1,-1,-1,-1,-1,-1,-1,-1,-1,-1,-1,-1,-1,-1,-1,-1,-1,-1,-1,-1,-1,-1,-1,-1,-1,-1,-1,-1,-1,-1,-1,-1]
[null,null,"Platzhalter 25",-37,null,null,-1,-1,-1,-1,-1,-1,-1,-1,-1,-1,-1,-1,-1,-1,-1,-1,-1,-1,-1,-1,-1,-1,-1,-1,-1,-1,-1,-1,-1,-1,-1,-1,-1,-1,-1,-1,-1]
[null,null,"Platzhalter 26",{"$f":"IF(SUM(G108:AQ108)<>0,SUM(G108:AQ108),\"\")","v":-37},null,null,-1,-1,-1,-1,-1,-1,-1,-1,-1,-1,-1,-1,-1,-1,-1,-1,-1,-1,-1,-1,-1,-1,-1,-1,-1,-1,-1,-1,-1,-1,-1,-1,-1,-1,-1,-1,-1]
[null,null,"Sonstiges",{"$f":"IF(SUM(G109:AQ109)<>0,SUM(G109:AQ109),\"\")","v":-37},null,null,-1,-1,-1,-1,-1,-1,-1,-1,-1,-1,-1,-1,-1,-1,-1,-1,-1,-1,-1,-1,-1,-1,-1,-1,-1,-1,-1,-1,-1,-1,-1,-1,-1,-1,-1,-1,-1]
[]
[null,"Gesundheit","Ambulante Behandlungen (Ärzte, Massagen, Hilfsmittel)",-37,{"$f":"IF(SUM(D111:D119)<>0,SUM(D111:D120),\"\")","v":-481},{"$f":"IFERROR(E111/$E$240,\" \")","v":5.9907834101382486E-2},-1,-1,-1,-1,-1,-1,-1,-1,-1,-1,-1,-1,-1,-1,-1,-1,-1,-1,-1,-1,-1,-1,-1,-1,-1,-1,-1,-1,-1,-1,-1,-1,-1,-1,-1,-1,-1]
[null,null,"Arzneimittel/Verbandsmittel (Nicht Rezeptpflichtig)",-74,null,null,{"$f":"IF(G25=\"\",\"\",G25)","v":-2},-2,-2,-2,-2,-2,-2,-2,-2,-2,-2,-2,-2,-2,-2,-2,-2,-2,-2,-2,-2,-2,-2,-2,-2,-2,-2,-2,-2,-2,-2,-2,-2,-2,-2,-2,-2]
[null,null,"Arzneimittel/Verbandsmittel (Rezeptpflichtig)",-111,null,null,-3,-3,-3,-3,-3,-3,-3,-3,-3,-3,-3,-3,-3,-3,-3,-3,-3,-3,-3,-3,-3,-3,-3,-3,-3,-3,-3,-3,-3,-3,-3,-3,-3,-3,-3,-3,-3]
[null,null,"Sonstige Behandlungen (Kuren, Reha, Tagegelder)",-37,null,null,-1,-1,-1,-1,-1,-1,-1,-1,-1,-1,-1,-1,-1,-1,-1,-1,-1,-1,-1,-1,-1,-1,-1,-1,-1,-1,-1,-1,-1,-1,-1,-1,-1,-1,-1,-1,-1]
[null,null,"Stationäre Behandlung inkl. Arzt und Transportkosten",-37,null,null,-1,-1,-1,-1,-1,-1,-1,-1,-1,-1,-1,-1,-1,-1,-1,-1,-1,-1,-1,-1,-1,-1,-1,-1,-1,-1,-1,-1,-1,-1,-1,-1,-1,-1,-1,-1,-1]
[null,null,"Zahnärztliche Behandlungen inkl. Kieferorthopädie)",-37,null,null,-1,-1,-1,-1,-1,-1,-1,-1,-1,-1,-1,-1,-1,-1,-1,-1,-1,-1,-1,-1,-1,-1,-1,-1,-1,-1,-1,-1,-1,-1,-1,-1,-1,-1,-1,-1,-1]
[null,null,"Platzhalter 27",-37,null,null,-1,-1,-1,-1,-1,-1,-1,-1,-1,-1,-1,-1,-1,-1,-1,-1,-1,-1,-1,-1,-1,-1,-1,-1,-1,-1,-1,-1,-1,-1,-1,-1,-1,-1,-1,-1,-1]
[null,null,"Platzhalter 28",-37,null,null,-1,-1,-1,-1,-1,-1,-1,-1,-1,-1,-1,-1,-1,-1,-1,-1,-1,-1,-1,-1,-1,-1,-1,-1,-1,-1,-1,-1,-1,-1,-1,-1,-1,-1,-1,-1,-1]
[null,null,"Platzhalter 29",{"$f":"IF(SUM(G119:AQ119)<>0,SUM(G119:AQ119),\"\")","v":-37},null,null,-1,-1,-1,-1,-1,-1,-1,-1,-1,-1,-1,-1,-1,-1,-1,-1,-1,-1,-1,-1,-1,-1,-1,-1,-1,-1,-1,-1,-1,-1,-1,-1,-1,-1,-1,-1,-1]
[null,null,"Sonstiges",{"$f":"IF(SUM(G120:AQ120)<>0,SUM(G120:AQ120),\"\")","v":-37},null,null,-1,-1,-1,-1,-1,-1,-1,-1,-1,-1,-1,-1,-1,-1,-1,-1,-1,-1,-1,-1,-1,-1,-1,-1,-1,-1,-1,-1,-1,-1,-1,-1,-1,-1,-1,-1,-1]
[]
[null," -- Hobby --\nGarten","Arbeitsbekleidung",-37,{"$f":"IF(SUM(D122:D128)<>0,SUM(D122:D129),\"\")","v":-296},{"$f":"IFERROR(E122/$E$240,\" \")","v":3.6866359447004608E-2},-1,-1,-1,-1,-1,-1,-1,-1,-1,-1,-1,-1,-1,-1,-1,-1,-1,-1,-1,-1,-1,-1,-1,-1,-1,-1,-1,-1,-1,-1,-1,-1,-1,-1,-1,-1,-1]
[null,null,"Dünger/Pflanzenschutzmittel",-37,null,null,-1,-1,-1,-1,-1,-1,-1,-1,-1,-1,-1,-1,-1,-1,-1,-1,-1,-1,-1,-1,-1,-1,-1,-1,-1,-1,-1,-1,-1,-1,-1,-1,-1,-1,-1,-1,-1]
[null,null,"Geräte",-37,null,null,-1,-1,-1,-1,-1,-1,-1,-1,-1,-1,-1,-1,-1,-1,-1,-1,-1,-1,-1,-1,-1,-1,-1,-1,-1,-1,-1,-1,-1,-1,-1,-1,-1,-1,-1,-1,-1]
["Eingabe",null,"Pflanzen/Samen",-37,null,null,-1,-1,-1,-1,-1,-1,-1,-1,-1,-1,-1,-1,-1,-1,-1,-1,-1,-1,-1,-1,-1,-1,-1,-1,-1,-1,-1,-1,-1,-1,-1,-1,-1,-1,-1,-1,-1]
[null,null,"Platzhalter 30",-37,null,null,-1,-1,-1,-1,-1,-1,-1,-1,-1,-1,-1,-1,-1,-1,-1,-1,-1,-1,-1,-1,-1,-1,-1,-1,-1,-1,-1,-1,-1,-1,-1,-1,-1,-1,-1,-1,-1]
[null,null,"Platzhalter 31",-37,null,null,-1,-1,-1,-1,-1,-1,-1,-1,-1,-1,-1,-1,-1,-1,-1,-1,-1,-1,-1,-1,-1,-1,-1,-1,-1,-1,-1,-1,-1,-1,-1,-1,-1,-1,-1,-1,-1]
[null,null,"Platzhalter 32",{"$f":"IF(SUM(G128:AQ128)<>0,SUM(G128:AQ128),\"\")","v":-37},null,null,-1,-1,-1,-1,-1,-1,-1,-1,-1,-1,-1,-1,-1,-1,-1,-1,-1,-1,-1,-1,-1,-1,-1,-1,-1,-1,-1,-1,-1,-1,-1,-1,-1,-1,-1,-1,-1]
[null,null,"Sonstiges",{"$f":"IF(SUM(G129:AQ129)<>0,SUM(G129:AQ129),\"\")","v":-37},null,null,-1,-1,-1,-1,-1,-1,-1,-1,-1,-1,-1,-1,-1,-1,-1,-1,-1,-1,-1,-1,-1,-1,-1,-1,-1,-1,-1,-1,-1,-1,-1,-1,-1,-1,-1,-1,-1]
[]
[null,"-- Hobby --\nHaustier","Haustier",-37,{"$f":"IF(SUM(D131:D137)<>0,SUM(D131:D138),\"\")","v":-296},{"$f":"IFERROR(E131/$E$240,\" \")","v":3.6866359447004608E-2},-1,-1,-1,-1,-1,-1,-1,-1,-1,-1,-1,-1,-1,-1,-1,-1,-1,-1,-1,-1,-1,-1,-1,-1,-1,-1,-1,-1,-1,-1,-1,-1,-1,-1,-1,-1,-1]
[null,null,"Futter",-37,null,null,-1,-1,-1,-1,-1,-1,-1,-1,-1,-1,-1,-1,-1,-1,-1,-1,-1,-1,-1,-1,-1,-1,-1,-1,-1,-1,-1,-1,-1,-1,-1,-1,-1,-1,-1,-1,-1]
[null,null,"Spielsachen/Sonstiges",-37,null,null,-1,-1,-1,-1,-1,-1,-1,-1,-1,-1,-1,-1,-1,-1,-1,-1,-1,-1,-1,-1,-1,-1,-1,-1,-1,-1,-1,-1,-1,-1,-1,-1,-1,-1,-1,-1,-1]
[null,null,"Tierarzt/Medikamente",-37,null,null,-1,-1,-1,-1,-1,-1,-1,-1,-1,-1,-1,-1,-1,-1,-1,-1,-1,-1,-1,-1,-1,-1,-1,-1,-1,-1,-1,-1,-1,-1,-1,-1,-1,-1,-1,-1,-1]
[null,null,"Platzhalter 33",-37,null,null,-1,-1,-1,-1,-1,-1,-1,-1,-1,-1,-1,-1,-1,-1,-1,-1,-1,-1,-1,-1,-1,-1,-1,-1,-1,-1,-1,-1,-1,-1,-1,-1,-1,-1,-1,-1,-1]
[null,null,"Platzhalter 34",-37,null,null,-1,-1,-1,-1,-1,-1,-1,-1,-1,-1,-1,-1,-1,-1,-1,-1,-1,-1,-1,-1,-1,-1,-1,-1,-1,-1,-1,-1,-1,-1,-1,-1,-1,-1,-1,-1,-1]
[null,null,"Platzhalter 35",{"$f":"IF(SUM(G137:AQ137)<>0,SUM(G137:AQ137),\"\")","v":-37},null,null,-1,-1,-1,-1,-1,-1,-1,-1,-1,-1,-1,-1,-1,-1,-1,-1,-1,-1,-1,-1,-1,-1,-1,-1,-1,-1,-1,-1,-1,-1,-1,-1,-1,-1,-1,-1,-1]
[null,null,"Sonstiges",{"$f":"IF(SUM(G138:AQ138)<>0,SUM(G138:AQ138),\"\")","v":-37},null,null,-1,-1,-1,-1,-1,-1,-1,-1,-1,-1,-1,-1,-1,-1,-1,-1,-1,-1,-1,-1,-1,-1,-1,-1,-1,-1,-1,-1,-1,-1,-1,-1,-1,-1,-1,-1,-1]
[]
[null,"-- Hobby --\nHandwerken","Bekleidung",-37,{"$f":"IF(SUM(D140:D147)<>0,SUM(D140:D147),\"\")","v":-296},{"$f":"IFERROR(E140/$E$240,\" \")","v":3.6866359447004608E-2},-1,-1,-1,-1,-1,-1,-1,-1,-1,-1,-1,-1,-1,-1,-1,-1,-1,-1,-1,-1,-1,-1,-1,-1,-1,-1,-1,-1,-1,-1,-1,-1,-1,-1,-1,-1,-1]
[null,null,"Werkstatteinrichtung",-37,null,null,-1,-1,-1,-1,-1,-1,-1,-1,-1,-1,-1,-1,-1,-1,-1,-1,-1,-1,-1,-1,-1,-1,-1,-1,-1,-1,-1,-1,-1,-1,-1,-1,-1,-1,-1,-1,-1]
[null,null,"Geräte",-37,null,null,-1,-1,-1,-1,-1,-1,-1,-1,-1,-1,-1,-1,-1,-1,-1,-1,-1,-1,-1,-1,-1,-1,-1,-1,-1,-1,-1,-1,-1,-1,-1,-1,-1,-1,-1,-1,-1]
[null,null,"Material",-37,null,null,-1,-1,-1,-1,-1,-1,-1,-1,-1,-1,-1,-1,-1,-1,-1,-1,-1,-1,-1,-1,-1,-1,-1,-1,-1,-1,-1,-1,-1,-1,-1,-1,-1,-1,-1,-1,-1]
[null,null,"Platzhalter 36",-37,null,null,-1,-1,-1,-1,-1,-1,-1,-1,-1,-1,-1,-1,-1,-1,-1,-1,-1,-1,-1,-1,-1,-1,-1,-1,-1,-1,-1,-1,-1,-1,-1,-1,-1,-1,-1,-1,-1]
[null,null,"Platzhalter 37",-37,null,null,-1,-1,-1,-1,-1,-1,-1,-1,-1,-1,-1,-1,-1,-1,-1,-1,-1,-1,-1,-1,-1,-1,-1,-1,-1,-1,-1,-1,-1,-1,-1,-1,-1,-1,-1,-1,-1]
[null,null,"Platzhalter 38",{"$f":"IF(SUM(G146:AQ146)<>0,SUM(G146:AQ146),\"\")","v":-37},null,null,-1,-1,-1,-1,-1,-1,-1,-1,-1,-1,-1,-1,-1,-1,-1,-1,-1,-1,-1,-1,-1,-1,-1,-1,-1,-1,-1,-1,-1,-1,-1,-1,-1,-1,-1,-1,-1]
[null,null,"Sonstiges",-37,null,null,-1,-1,-1,-1,-1,-1,-1,-1,-1,-1,-1,-1,-1,-1,-1,-1,-1,-1,-1,-1,-1,-1,-1,-1,-1,-1,-1,-1,-1,-1,-1,-1,-1,-1,-1,-1,-1]
[]
[null,"Lebensmittel","Büroabedarf",-74,{"$f":"IF(SUM(D149:D155)<>0,SUM(D149:D156),\"\")","v":-518},{"$f":"IFERROR(E149/$E$240,\" \")","v":6.4516129032258063E-2},{"$f":"IF(G29=\"\",\"\",G29)","v":-2},-2,-2,-2,-2,-2,-2,-2,-2,-2,-2,-2,-2,-2,-2,-2,-2,-2,-2,-2,-2,-2,-2,-2,-2,-2,-2,-2,-2,-2,-2,-2,-2,-2,-2,-2,-2]
[null,null,"Genussmittel",-37,null,null,-1,-1,-1,-1,-1,-1,-1,-1,-1,-1,-1,-1,-1,-1,-1,-1,-1,-1,-1,-1,-1,-1,-1,-1,-1,-1,-1,-1,-1,-1,-1,-1,-1,-1,-1,-1,-1]
[null,null,"Haushaltsartikel (Reinigungsm., Toilettenpap., etc.) ",-111,null,null,{"$f":"IF(G30=\"\",\"\",G30)","v":-3},-3,-3,-3,-3,-3,-3,-3,-3,-3,-3,-3,-3,-3,-3,-3,-3,-3,-3,-3,-3,-3,-3,-3,-3,-3,-3,-3,-3,-3,-3,-3,-3,-3,-3,-3,-3]
[null,null,"Lebensmittel/Getränke",-148,null,null,-4,-4,-4,-4,-4,-4,-4,-4,-4,-4,-4,-4,-4,-4,-4,-4,-4,-4,-4,-4,-4,-4,-4,-4,-4,-4,-4,-4,-4,-4,-4,-4,-4,-4,-4,-4,-4]
[null,null,"Platzhalter 39",-37,null,null,-1,-1,-1,-1,-1,-1,-1,-1,-1,-1,-1,-1,-1,-1,-1,-1,-1,-1,-1,-1,-1,-1,-1,-1,-1,-1,-1,-1,-1,-1,-1,-1,-1,-1,-1,-1,-1]
[null,null,"Platzhalter 40",-37,null,null,-1,-1,-1,-1,-1,-1,-1,-1,-1,-1,-1,-1,-1,-1,-1,-1,-1,-1,-1,-1,-1,-1,-1,-1,-1,-1,-1,-1,-1,-1,-1,-1,-1,-1,-1,-1,-1]
[null,null,"Platzhalter 41",{"$f":"IF(SUM(G155:AQ155)<>0,SUM(G155:AQ155),\"\")","v":-37},null,null,-1,-1,-1,-1,-1,-1,-1,-1,-1,-1,-1,-1,-1,-1,-1,-1,-1,-1,-1,-1,-1,-1,-1,-1,-1,-1,-1,-1,-1,-1,-1,-1,-1,-1,-1,-1,-1]
[null,null,"Sonstiges",{"$f":"IF(SUM(G156:AQ156)<>0,SUM(G156:AQ156),\"\")","v":-37},null,null,-1,-1,-1,-1,-1,-1,-1,-1,-1,-1,-1,-1,-1,-1,-1,-1,-1,-1,-1,-1,-1,-1,-1,-1,-1,-1,-1,-1,-1,-1,-1,-1,-1,-1,-1,-1,-1]
[]
[null,"Mobilität","Auto, Inspektion, Reparatur",-37,{"$f":"IF(SUM(D158:D167)<>0,SUM(D158:D168),\"\")","v":-629},{"$f":"IFERROR(E158/$E$240,\" \")","v":7.8341013824884786E-2},-1,-1,-1,-1,-1,-1,-1,-1,-1,-1,-1,-1,-1,-1,-1,-1,-1,-1,-1,-1,-1,-1,-1,-1,-1,-1,-1,-1,-1,-1,-1,-1,-1,-1,-1,-1,-1]
[null,null,"Auto, Pflege",-74,null,null,{"$f":"IF(G34=\"\",\"\",G34)","v":-2},-2,-2,-2,-2,-2,-2,-2,-2,-2,-2,-2,-2,-2,-2,-2,-2,-2,-2,-2,-2,-2,-2,-2,-2,-2,-2,-2,-2,-2,-2,-2,-2,-2,-2,-2,-2]
[null,null,"Auto, Treibstoff",-111,null,null,-3,-3,-3,-3,-3,-3,-3,-3,-3,-3,-3,-3,-3,-3,-3,-3,-3,-3,-3,-3,-3,-3,-3,-3,-3,-3,-3,-3,-3,-3,-3,-3,-3,-3,-3,-3,-3]
[null,null,"Auto, Parkgebühren",-148,null,null,-4,-4,-4,-4,-4,-4,-4,-4,-4,-4,-4,-4,-4,-4,-4,-4,-4,-4,-4,-4,-4,-4,-4,-4,-4,-4,-4,-4,-4,-4,-4,-4,-4,-4,-4,-4,-4]
[null,null,"Carsharing/E-Scooter/Mietwagen/Taxi",-37,null,null,-1,-1,-1,-1,-1,-1,-1,-1,-1,-1,-1,-1,-1,-1,-1,-1,-1,-1,-1,-1,-1,-1,-1,-1,-1,-1,-1,-1,-1,-1,-1,-1,-1,-1,-1,-1,-1]
["Eingabe",null,"Fahrrad",-37,null,null,-1,-1,-1,-1,-1,-1,-1,-1,-1,-1,-1,-1,-1,-1,-1,-1,-1,-1,-1,-1,-1,-1,-1,-1,-1,-1,-1,-1,-1,-1,-1,-1,-1,-1,-1,-1,-1]
[null,null,"ÖPNV (Fahrkarten, Wochenticket, etc.)",-37,null,null,-1,-1,-1,-1,-1,-1,-1,-1,-1,-1,-1,-1,-1,-1,-1,-1,-1,-1,-1,-1,-1,-1,-1,-1,-1,-1,-1,-1,-1,-1,-1,-1,-1,-1,-1,-1,-1]
[null,null,"Platzhalter 42",-37,null,null,-1,-1,-1,-1,-1,-1,-1,-1,-1,-1,-1,-1,-1,-1,-1,-1,-1,-1,-1,-1,-1,-1,-1,-1,-1,-1,-1,-1,-1,-1,-1,-1,-1,-1,-1,-1,-1]
[null,null,"Platzhalter 43",-37,null,null,-1,-1,-1,-1,-1,-1,-1,-1,-1,-1,-1,-1,-1,-1,-1,-1,-1,-1,-1,-1,-1,-1,-1,-1,-1,-1,-1,-1,-1,-1,-1,-1,-1,-1,-1,-1,-1]
[null,null,"Platzhalter 44",{"$f":"IF(SUM(G167:AQ167)<>0,SUM(G167:AQ167),\"\")","v":-37},null,null,-1,-1,-1,-1,-1,-1,-1,-1,-1,-1,-1,-1,-1,-1,-1,-1,-1,-1,-1,-1,-1,-1,-1,-1,-1,-1,-1,-1,-1,-1,-1,-1,-1,-1,-1,-1,-1]
[null,null,"Sonstiges",{"$f":"IF(SUM(G168:AQ168)<>0,SUM(G168:AQ168),\"\")","v":-37},null,null,-1,-1,-1,-1,-1,-1,-1,-1,-1,-1,-1,-1,-1,-1,-1,-1,-1,-1,-1,-1,-1,-1,-1,-1,-1,-1,-1,-1,-1,-1,-1,-1,-1,-1,-1,-1,-1]
[]
[null,"Post/Telekomunikation","Briefe",-74,{"$f":"IF(SUM(D170:D176)<>0,SUM(D170:D176),\"\")","v":-370},{"$f":"IFERROR(E170/$E$240,\" \")","v":4.6082949308755762E-2},{"$f":"IF(G40=\"\",\"\",G40)","v":-2},-2,-2,-2,-2,-2,-2,-2,-2,-2,-2,-2,-2,-2,-2,-2,-2,-2,-2,-2,-2,-2,-2,-2,-2,-2,-2,-2,-2,-2,-2,-2,-2,-2,-2,-2,-2]
[null,null,"Pakete",-111,null,null,-3,-3,-3,-3,-3,-3,-3,-3,-3,-3,-3,-3,-3,-3,-3,-3,-3,-3,-3,-3,-3,-3,-3,-3,-3,-3,-3,-3,-3,-3,-3,-3,-3,-3,-3,-3,-3]
[null,null,"Telefonkarten",-37,null,null,-1,-1,-1,-1,-1,-1,-1,-1,-1,-1,-1,-1,-1,-1,-1,-1,-1,-1,-1,-1,-1,-1,-1,-1,-1,-1,-1,-1,-1,-1,-1,-1,-1,-1,-1,-1,-1]
[null,null,"Platzhalter 45",{"$f":"IF(SUM(G173:AQ173)<>0,SUM(G173:AQ173),\"\")","v":-37},null,null,-1,-1,-1,-1,-1,-1,-1,-1,-1,-1,-1,-1,-1,-1,-1,-1,-1,-1,-1,-1,-1,-1,-1,-1,-1,-1,-1,-1,-1,-1,-1,-1,-1,-1,-1,-1,-1]
[null,null,"Platzhalter 46",{"$f":"IF(SUM(G174:AQ174)<>0,SUM(G174:AQ174),\"\")","v":-37},null,null,-1,-1,-1,-1,-1,-1,-1,-1,-1,-1,-1,-1,-1,-1,-1,-1,-1,-1,-1,-1,-1,-1,-1,-1,-1,-1,-1,-1,-1,-1,-1,-1,-1,-1,-1,-1,-1]
[null,null,"Platzhalter 47",{"$f":"IF(SUM(G175:AQ175)<>0,SUM(G175:AQ175),\"\")","v":-37},null,null,-1,-1,-1,-1,-1,-1,-1,-1,-1,-1,-1,-1,-1,-1,-1,-1,-1,-1,-1,-1,-1,-1,-1,-1,-1,-1,-1,-1,-1,-1,-1,-1,-1,-1,-1,-1,-1]
[null,null,"Sonstiges",-37,null,null,-1,-1,-1,-1,-1,-1,-1,-1,-1,-1,-1,-1,-1,-1,-1,-1,-1,-1,-1,-1,-1,-1,-1,-1,-1,-1,-1,-1,-1,-1,-1,-1,-1,-1,-1,-1,-1]
[]
[null,"Sonstiges Allgemein","Geldstrafen (Strafzettel, etc.)",-37,{"$f":"IF(SUM(D178:D186)<>0,SUM(D178:D186),\"\")","v":-333},{"$f":"IFERROR(E178/$E$240,\" \")","v":4.1474654377880185E-2},-1,-1,-1,-1,-1,-1,-1,-1,-1,-1,-1,-1,-1,-1,-1,-1,-1,-1,-1,-1,-1,-1,-1,-1,-1,-1,-1,-1,-1,-1,-1,-1,-1,-1,-1,-1,-1]
[null,null,"Gerichtskosten",-37,null,null,-1,-1,-1,-1,-1,-1,-1,-1,-1,-1,-1,-1,-1,-1,-1,-1,-1,-1,-1,-1,-1,-1,-1,-1,-1,-1,-1,-1,-1,-1,-1,-1,-1,-1,-1,-1,-1]
[null,null,"Kredite und Finanzierung Einmalzahlung",-37,null,null,-1,-1,-1,-1,-1,-1,-1,-1,-1,-1,-1,-1,-1,-1,-1,-1,-1,-1,-1,-1,-1,-1,-1,-1,-1,-1,-1,-1,-1,-1,-1,-1,-1,-1,-1,-1,-1]
[null,null,"Spenden",-37,null,null,-1,-1,-1,-1,-1,-1,-1,-1,-1,-1,-1,-1,-1,-1,-1,-1,-1,-1,-1,-1,-1,-1,-1,-1,-1,-1,-1,-1,-1,-1,-1,-1,-1,-1,-1,-1,-1]
[null,null,"Versicherung und Steuern Nachzahlung",-37,null,null,-1,-1,-1,-1,-1,-1,-1,-1,-1,-1,-1,-1,-1,-1,-1,-1,-1,-1,-1,-1,-1,-1,-1,-1,-1,-1,-1,-1,-1,-1,-1,-1,-1,-1,-1,-1,-1]
[null,null,"Platzhalter 48",-37,null,null,-1,-1,-1,-1,-1,-1,-1,-1,-1,-1,-1,-1,-1,-1,-1,-1,-1,-1,-1,-1,-1,-1,-1,-1,-1,-1,-1,-1,-1,-1,-1,-1,-1,-1,-1,-1,-1]
[null,null,"Platzhalter 49",-37,null,null,-1,-1,-1,-1,-1,-1,-1,-1,-1,-1,-1,-1,-1,-1,-1,-1,-1,-1,-1,-1,-1,-1,-1,-1,-1,-1,-1,-1,-1,-1,-1,-1,-1,-1,-1,-1,-1]
[null,null,"Platzhalter 50",-37,null,null,-1,-1,-1,-1,-1,-1,-1,-1,-1,-1,-1,-1,-1,-1,-1,-1,-1,-1,-1,-1,-1,-1,-1,-1,-1,-1,-1,-1,-1,-1,-1,-1,-1,-1,-1,-1,-1]
[null,null,"Sonstiges",-37,null,null,-1,-1,-1,-1,-1,-1,-1,-1,-1,-1,-1,-1,-1,-1,-1,-1,-1,-1,-1,-1,-1,-1,-1,-1,-1,-1,-1,-1,-1,-1,-1,-1,-1,-1,-1,-1,-1]
[]
[null,"Urlaub","Pauschalreise",-37,{"$f":"IF(SUM(D188:D196)<>0,SUM(D188:D197),\"\")","v":-370},{"$f":"IFERROR(E188/$E$240,\" \")","v":4.6082949308755762E-2},-1,-1,-1,-1,-1,-1,-1,-1,-1,-1,-1,-1,-1,-1,-1,-1,-1,-1,-1,-1,-1,-1,-1,-1,-1,-1,-1,-1,-1,-1,-1,-1,-1,-1,-1,-1,-1]
[null,null,"Freizeitaktivitäten/Ausflüge",-37,null,null,-1,-1,-1,-1,-1,-1,-1,-1,-1,-1,-1,-1,-1,-1,-1,-1,-1,-1,-1,-1,-1,-1,-1,-1,-1,-1,-1,-1,-1,-1,-1,-1,-1,-1,-1,-1,-1]
[null,null,"Sonstige Kosten",-37,null,null,-1,-1,-1,-1,-1,-1,-1,-1,-1,-1,-1,-1,-1,-1,-1,-1,-1,-1,-1,-1,-1,-1,-1,-1,-1,-1,-1,-1,-1,-1,-1,-1,-1,-1,-1,-1,-1]
[null,null,"Transport (Flug, Bahn, etc.)",-37,null,null,-1,-1,-1,-1,-1,-1,-1,-1,-1,-1,-1,-1,-1,-1,-1,-1,-1,-1,-1,-1,-1,-1,-1,-1,-1,-1,-1,-1,-1,-1,-1,-1,-1,-1,-1,-1,-1]
[null,null,"Unterkunft",-37,null,null,-1,-1,-1,-1,-1,-1,-1,-1,-1,-1,-1,-1,-1,-1,-1,-1,-1,-1,-1,-1,-1,-1,-1,-1,-1,-1,-1,-1,-1,-1,-1,-1,-1,-1,-1,-1,-1]
[null,null,"Verpflegung",-37,null,null,-1,-1,-1,-1,-1,-1,-1,-1,-1,-1,-1,-1,-1,-1,-1,-1,-1,-1,-1,-1,-1,-1,-1,-1,-1,-1,-1,-1,-1,-1,-1,-1,-1,-1,-1,-1,-1]
[null,null,"Platzhalter 51",-37,null,null,-1,-1,-1,-1,-1,-1,-1,-1,-1,-1,-1,-1,-1,-1,-1,-1,-1,-1,-1,-1,-1,-1,-1,-1,-1,-1,-1,-1,-1,-1,-1,-1,-1,-1,-1,-1,-1]
[null,null,"Platzhalter 52",-37,null,null,-1,-1,-1,-1,-1,-1,-1,-1,-1,-1,-1,-1,-1,-1,-1,-1,-1,-1,-1,-1,-1,-1,-1,-1,-1,-1,-1,-1,-1,-1,-1,-1,-1,-1,-1,-1,-1]
[null,null,"Platzhalter 53",{"$f":"IF(SUM(G196:AQ196)<>0,SUM(G196:AQ196),\"\")","v":-37},null,null,-1,-1,-1,-1,-1,-1,-1,-1,-1,-1,-1,-1,-1,-1,-1,-1,-1,-1,-1,-1,-1,-1,-1,-1,-1,-1,-1,-1,-1,-1,-1,-1,-1,-1,-1,-1,-1]
[null,null,"Sonstiges",{"$f":"IF(SUM(G197:AQ197)<>0,SUM(G197:AQ197),\"\")","v":-37},null,null,-1,-1,-1,-1,-1,-1,-1,-1,-1,-1,-1,-1,-1,-1,-1,-1,-1,-1,-1,-1,-1,-1,-1,-1,-1,-1,-1,-1,-1,-1,-1,-1,-1,-1,-1,-1,-1]
[]
[null,"Wellness/Körperpflege","Fitnessstudio",{"$f":"IF(SUM(G199:AQ199)<>0,SUM(G199:AQ199),\"\")","v":-74},{"$f":"IF(SUM(D199:D205)<>0,SUM(D199:D205),\"\")","v":-481},{"$f":"IFERROR(E199/$E$240,\" \")","v":5.9907834101382486E-2},{"$f":"IF(G44=\"\",\"\",G44)","v":-2},-2,-2,-2,-2,-2,-2,-2,-2,-2,-2,-2,-2,-2,-2,-2,-2,-2,-2,-2,-2,-2,-2,-2,-2,-2,-2,-2,-2,-2,-2,-2,-2,-2,-2,-2,-2]
[null,null,"Körperpflege/ Kosmetik,/Frisör",-111,null,null,-3,-3,-3,-3,-3,-3,-3,-3,-3,-3,-3,-3,-3,-3,-3,-3,-3,-3,-3,-3,-3,-3,-3,-3,-3,-3,-3,-3,-3,-3,-3,-3,-3,-3,-3,-3,-3]
["Eingabe",null,"Wellness (Massage,Sauna, etc.)",-148,null,null,-4,-4,-4,-4,-4,-4,-4,-4,-4,-4,-4,-4,-4,-4,-4,-4,-4,-4,-4,-4,-4,-4,-4,-4,-4,-4,-4,-4,-4,-4,-4,-4,-4,-4,-4,-4,-4]
[null,null,"Platzhalter 54",{"$f":"IF(SUM(G202:AQ202)<>0,SUM(G202:AQ202),\"\")","v":-37},null,null,-1,-1,-1,-1,-1,-1,-1,-1,-1,-1,-1,-1,-1,-1,-1,-1,-1,-1,-1,-1,-1,-1,-1,-1,-1,-1,-1,-1,-1,-1,-1,-1,-1,-1,-1,-1,-1]
[null,null,"Platzhalter 55",-37,null,null,-1,-1,-1,-1,-1,-1,-1,-1,-1,-1,-1,-1,-1,-1,-1,-1,-1,-1,-1,-1,-1,-1,-1,-1,-1,-1,-1,-1,-1,-1,-1,-1,-1,-1,-1,-1,-1]
[null,null,"Platzhalter 56",{"$f":"IF(SUM(G204:AQ204)<>0,SUM(G204:AQ204),\"\")","v":-37},null,null,-1,-1,-1,-1,-1,-1,-1,-1,-1,-1,-1,-1,-1,-1,-1,-1,-1,-1,-1,-1,-1,-1,-1,-1,-1,-1,-1,-1,-1,-1,-1,-1,-1,-1,-1,-1,-1]
[null,null,"Sonstiges",-37,null,null,-1,-1,-1,-1,-1,-1,-1,-1,-1,-1,-1,-1,-1,-1,-1,-1,-1,-1,-1,-1,-1,-1,-1,-1,-1,-1,-1,-1,-1,-1,-1,-1,-1,-1,-1,-1,-1]
[]
[null,"Wohnen","Beleuchtung",-37,{"$f":"IF(SUM(D207:D214)<>0,SUM(D207:D215),\"\")","v":-333},{"$f":"IFERROR(E207/$E$240,\" \")","v":4.1474654377880185E-2},-1,-1,-1,-1,-1,-1,-1,-1,-1,-1,-1,-1,-1,-1,-1,-1,-1,-1,-1,-1,-1,-1,-1,-1,-1,-1,-1,-1,-1,-1,-1,-1,-1,-1,-1,-1,-1]
[null,null,"Einrichtungsgegenstände",-37,null,null,-1,-1,-1,-1,-1,-1,-1,-1,-1,-1,-1,-1,-1,-1,-1,-1,-1,-1,-1,-1,-1,-1,-1,-1,-1,-1,-1,-1,-1,-1,-1,-1,-1,-1,-1,-1,-1]
[null,null,"Haushaltsnahe Dienstleistungen",-37,null,null,-1,-1,-1,-1,-1,-1,-1,-1,-1,-1,-1,-1,-1,-1,-1,-1,-1,-1,-1,-1,-1,-1,-1,-1,-1,-1,-1,-1,-1,-1,-1,-1,-1,-1,-1,-1,-1]
[null,null,"Haushalts- und Küchengeräte",-37,null,null,-1,-1,-1,-1,-1,-1,-1,-1,-1,-1,-1,-1,-1,-1,-1,-1,-1,-1,-1,-1,-1,-1,-1,-1,-1,-1,-1,-1,-1,-1,-1,-1,-1,-1,-1,-1,-1]
[null,null,"Möbel",-37,null,null,-1,-1,-1,-1,-1,-1,-1,-1,-1,-1,-1,-1,-1,-1,-1,-1,-1,-1,-1,-1,-1,-1,-1,-1,-1,-1,-1,-1,-1,-1,-1,-1,-1,-1,-1,-1,-1]
[null,null,"Platzhalter 57",-37,null,null,-1,-1,-1,-1,-1,-1,-1,-1,-1,-1,-1,-1,-1,-1,-1,-1,-1,-1,-1,-1,-1,-1,-1,-1,-1,-1,-1,-1,-1,-1,-1,-1,-1,-1,-1,-1,-1]
[null,null,"Platzhalter 58",-37,null,null,-1,-1,-1,-1,-1,-1,-1,-1,-1,-1,-1,-1,-1,-1,-1,-1,-1,-1,-1,-1,-1,-1,-1,-1,-1,-1,-1,-1,-1,-1,-1,-1,-1,-1,-1,-1,-1]
[null,null,"Platzhalter 59",{"$f":"IF(SUM(G214:AQ214)<>0,SUM(G214:AQ214),\"\")","v":-37},null,null,-1,-1,-1,-1,-1,-1,-1,-1,-1,-1,-1,-1,-1,-1,-1,-1,-1,-1,-1,-1,-1,-1,-1,-1,-1,-1,-1,-1,-1,-1,-1,-1,-1,-1,-1,-1,-1]
[null,null,"Sonstiges",{"$f":"IF(SUM(G215:AQ215)<>0,SUM(G215:AQ215),\"\")","v":-37},null,null,-1,-1,-1,-1,-1,-1,-1,-1,-1,-1,-1,-1,-1,-1,-1,-1,-1,-1,-1,-1,-1,-1,-1,-1,-1,-1,-1,-1,-1,-1,-1,-1,-1,-1,-1,-1,-1]
[]
[null,"Platzhalter 60","Platzhalter 61",-37,{"$f":"IF(SUM(D217:D221)<>0,SUM(D217:D2207),\"\")","v":-666},{"$f":"IFERROR(E217/$E$240,\" \")","v":8.294930875576037E-2},-1,-1,-1,-1,-1,-1,-1,-1,-1,-1,-1,-1,-1,-1,-1,-1,-1,-1,-1,-1,-1,-1,-1,-1,-1,-1,-1,-1,-1,-1,-1,-1,-1,-1,-1,-1,-1]
[null,null,"Platzhalter 62",-37,null,null,-1,-1,-1,-1,-1,-1,-1,-1,-1,-1,-1,-1,-1,-1,-1,-1,-1,-1,-1,-1,-1,-1,-1,-1,-1,-1,-1,-1,-1,-1,-1,-1,-1,-1,-1,-1,-1]
[null,null,"Platzhalter 63",-37,null,null,-1,-1,-1,-1,-1,-1,-1,-1,-1,-1,-1,-1,-1,-1,-1,-1,-1,-1,-1,-1,-1,-1,-1,-1,-1,-1,-1,-1,-1,-1,-1,-1,-1,-1,-1,-1,-1]
[null,null,"Platzhalter 64",-37,null,null,-1,-1,-1,-1,-1,-1,-1,-1,-1,-1,-1,-1,-1,-1,-1,-1,-1,-1,-1,-1,-1,-1,-1,-1,-1,-1,-1,-1,-1,-1,-1,-1,-1,-1,-1,-1,-1]
[null,null,"Platzhalter 65",{"$f":"IF(SUM(G221:AQ221)<>0,SUM(G221:AQ221),\"\")","v":-37},null,null,-1,-1,-1,-1,-1,-1,-1,-1,-1,-1,-1,-1,-1,-1,-1,-1,-1,-1,-1,-1,-1,-1,-1,-1,-1,-1,-1,-1,-1,-1,-1,-1,-1,-1,-1,-1,-1]
[null,null,"Sonstiges",{"$f":"IF(SUM(G222:AQ222)<>0,SUM(G222:AQ222),\"\")","v":-37},null,null,-1,-1,-1,-1,-1,-1,-1,-1,-1,-1,-1,-1,-1,-1,-1,-1,-1,-1,-1,-1,-1,-1,-1,-1,-1,-1,-1,-1,-1,-1,-1,-1,-1,-1,-1,-1,-1]
[]
[null,"Platzhalter 66","Platzhalter 67",-37,{"$f":"IF(SUM(D224:D228)<>0,SUM(D224:D229),\"\")","v":-222},{"$f":"IFERROR(E224/$E$240,\" \")","v":2.7649769585253458E-2},-1,-1,-1,-1,-1,-1,-1,-1,-1,-1,-1,-1,-1,-1,-1,-1,-1,-1,-1,-1,-1,-1,-1,-1,-1,-1,-1,-1,-1,-1,-1,-1,-1,-1,-1,-1,-1]
[null,null,"Platzhalter 68",-37,null,null,-1,-1,-1,-1,-1,-1,-1,-1,-1,-1,-1,-1,-1,-1,-1,-1,-1,-1,-1,-1,-1,-1,-1,-1,-1,-1,-1,-1,-1,-1,-1,-1,-1,-1,-1,-1,-1]
[null,null,"Platzhalter 69",-37,null,null,-1,-1,-1,-1,-1,-1,-1,-1,-1,-1,-1,-1,-1,-1,-1,-1,-1,-1,-1,-1,-1,-1,-1,-1,-1,-1,-1,-1,-1,-1,-1,-1,-1,-1,-1,-1,-1]
[null,null,"Platzhalter 70",-37,null,null,-1,-1,-1,-1,-1,-1,-1,-1,-1,-1,-1,-1,-1,-1,-1,-1,-1,-1,-1,-1,-1,-1,-1,-1,-1,-1,-1,-1,-1,-1,-1,-1,-1,-1,-1,-1,-1]
[null,null,"Platzhalter 71",{"$f":"IF(SUM(G228:AQ228)<>0,SUM(G228:AQ228),\"\")","v":-37},null,null,-1,-1,-1,-1,-1,-1,-1,-1,-1,-1,-1,-1,-1,-1,-1,-1,-1,-1,-1,-1,-1,-1,-1,-1,-1,-1,-1,-1,-1,-1,-1,-1,-1,-1,-1,-1,-1]
[null,null,"Sonstiges",{"$f":"IF(SUM(G229:AQ229)<>0,SUM(G229:AQ229),\"\")","v":-37},null,null,-1,-1,-1,-1,-1,-1,-1,-1,-1,-1,-1,-1,-1,-1,-1,-1,-1,-1,-1,-1,-1,-1,-1,-1,-1,-1,-1,-1,-1,-1,-1,-1,-1,-1,-1,-1,-1]
[]
[null,"Platzhalter 72","Platzhalter 73",-37,{"$f":"IF(SUM(D231:D235)<>0,SUM(D231:D236),\"\")","v":-222},{"$f":"IFERROR(E231/$E$240,\" \")","v":2.7649769585253458E-2},-1,-1,-1,-1,-1,-1,-1,-1,-1,-1,-1,-1,-1,-1,-1,-1,-1,-1,-1,-1,-1,-1,-1,-1,-1,-1,-1,-1,-1,-1,-1,-1,-1,-1,-1,-1,-1]
[null,null,"Platzhalter 74",-37,null,null,-1,-1,-1,-1,-1,-1,-1,-1,-1,-1,-1,-1,-1,-1,-1,-1,-1,-1,-1,-1,-1,-1,-1,-1,-1,-1,-1,-1,-1,-1,-1,-1,-1,-1,-1,-1,-1]
[null,null,"Platzhalter 75",-37,null,null,-1,-1,-1,-1,-1,-1,-1,-1,-1,-1,-1,-1,-1,-1,-1,-1,-1,-1,-1,-1,-1,-1,-1,-1,-1,-1,-1,-1,-1,-1,-1,-1,-1,-1,-1,-1,-1]
[null,null,"Platzhalter 76",-37,null,null,-1,-1,-1,-1,-1,-1,-1,-1,-1,-1,-1,-1,-1,-1,-1,-1,-1,-1,-1,-1,-1,-1,-1,-1,-1,-1,-1,-1,-1,-1,-1,-1,-1,-1,-1,-1,-1]
[null,null,"Platzhalter 77",{"$f":"IF(SUM(G235:AQ235)<>0,SUM(G235:AQ235),\"\")","v":-37},null,null,-1,-1,-1,-1,-1,-1,-1,-1,-1,-1,-1,-1,-1,-1,-1,-1,-1,-1,-1,-1,-1,-1,-1,-1,-1,-1,-1,-1,-1,-1,-1,-1,-1,-1,-1,-1,-1]
[null,null,"Sonstiges",{"$f":"IF(SUM(G236:AQ236)<>0,SUM(G236:AQ236),\"\")","v":-37},null,null,-1,-1,-1,-1,-1,-1,-1,-1,-1,-1,-1,-1,-1,-1,-1,-1,-1,-1,-1,-1,-1,-1,-1,-1,-1,-1,-1,-1,-1,-1,-1,-1,-1,-1,-1,-1,-1]
[]
["Summe Monat (Hauptkateg. - Freizeit -)",null,null,null,{"$f":"IF(SUM(E87,E102)<>0,SUM(E87,E102),\"\")","v":-1147},{"$f":"IF(SUM(F87,F102)<>0,SUM(F87,F102),\"\")","v":0.14285714285714285}]
["Summe Monat (Hauptkateg. - Hobby -)",null,null,null,{"$f":"IF(SUM(E122,E131,E140)<>0,SUM(E122,E131,E140),\"\")","v":-888},{"$f":"IF(SUM(F122,F131,F140)<>0,SUM(F122,F131,F140),\"\")","v":0.11059907834101382},null,"Betrag kleiner als: ",null,-250,null,null,"Prozentsatz größer gleich: 25%"]
["Summe Monat (Hauptkateg. - Gesamt -)",null,null,null,{"$f":"IF(SUM(E49,E60,,E69,E78,E87,E102,E111,E122,E131,E140,E149,E158,E170,E178,E188,E199,E207,E217,E224,E231)<>0,SUM(E49,E60,,E69,E78,E87,E102,E111,E122,E131,E140,E149,E158,E170,E178,E188,E199,E207,E217,E224,E231),\"\")","v":-8029},{"$f":"IF(SUM(F49,F60,F69,F78,F87,F102,F111,F122,F131,F140,F149,F158,F170,F178,F188,F199,F207,F217,F224,F231)<>0,SUM(F49,F60,F69,F78,F87,F102,F111,F122,F131,F140,F149,F158,F170,F178,F188,F199,F207,F217,F224,F231),\"\")","v":1.0000000000000002}]
[null,null,null,null,null,null,null,"Betrag kleiner als: ",null,{"$f":"IF(J239=-100,-250,IF(J239=-250,-500,IF(J239=-500,-750,IF(J239=-750,-1000,IF(J239=-1000,-1250,IF(J239=-1250,-1500,-2000))))))","v":-500},null,null,"Prozentsatz größer gleich: 50%"]
["Summe Monat (Hauptkateg. - Gesamt  nur Werte gößer als -)",null,null,">-2500,00 €",{"$f":"SUMIF(G49:AQ235,D242,G49:AQ235)","v":-7548}]
[null,null,null,null,null,null,null,"Betrag kleiner als: ",null,{"$f":"IF(J239=-100,-500,IF(J239=-250,-750,IF(J239=-500,-1000,IF(J239=-750,-1250,IF(J239=-1000,-1500,IF(J239=-1250,-2000,-2500))))))","v":-750},null,null,"Prozentsatz größer gleich: 75%"]
["Sum. Mon. (Hauptkateg. - Gesamt ohne Gesundh. aber mit Rezepte nicht rezeptpfl. -)",null,null,null,{"$f":"IF(SUM(E49,E60,E69,E78,E87,E102,E122,E131,E140,E149,E158,E170,E178,E188,E199,E207,E217,E224,E231)<>0,SUM(E49,E60,,E69,E78,E87,E102,D112,E122,E131,E140,E149,E158,E170,E178,E188,E199,E207,E217,E224,E231),\"\")","v":-7622}]
[null,null,null,null,null,null,null,"Kennz. Dropdownliste: "]
[]
[null,null,null,null,null,null,null,"Kennz. Schulferien: "]
[]
[null,null,null,null,null,null,null,"Kennz. Urlaub: ",null,"U"]
[]
[null,null,null,null,null,null,null,"Summe letzte KW: ",null,{"$f":"IF(LOOKUP(9,1/(AG2:AQ2<>\"-\"),AG2:AQ2)=\"So\",0,SUMIF(7:7,LOOKUP(9,1/(AG2:AQ2<>\"-\"),AG7:AQ7),8:8))","v":0}]
[]
[null,null,null,null,null,null,null,"Auswahl (Aktuelles Jahr)"]
[]
[null,null,null,null,null,null,null,"Monat:","März",{"$f":"IF(I255=\"Januar\",1,IF(I255=\"Februar\",2,IF(I255=\"März\",3,IF(I255=\"April\",4,IF(I255=\"Mai\",5,IF(I255=\"Juni\",6,IF(I255=\"Juli\",7,IF(I255=\"August\",8,IF(I255=\"September\",9,IF(I255=\"Oktober\",10,IF(I255=\"November\",11,12)))))))))))","v":3}]
[null,null,null,null,null,null,null,"Jahr:",2024,{"$f":"I256","v":2024}]
[null,null,null,null,null,null,null,"Datum:",{"$f":"DATE(J256,J255,1)","v":"2024-03-01"},{"$f":"I257","v":"2024-03-01"}]
[]
[null,null,null,null,null,null,null,{"$f":"I259-1","v":"2024-02-27"},"2024-02-28",{"$f":"K259-1","v":"2024-02-29"},{"$f":"I257","v":"2024-03-01"},{"$f":"K259+1","v":"2024-03-02"},{"$f":"L259+1","v":"2024-03-03"},"2024-03-04","2024-03-05","2024-03-06","2024-03-07","2024-03-08","2024-03-09","2024-03-10","2024-03-11","2024-03-12","2024-03-13","2024-03-14","2024-03-15","2024-03-16","2024-03-17","2024-03-18","2024-03-19","2024-03-20","2024-03-21","2024-03-22","2024-03-23","2024-03-24","2024-03-25","2024-03-26","2024-03-27","2024-03-28","2024-03-29","2024-03-30","2024-03-31","2024-04-01","2024-04-02","2024-04-03"]
[]
[null,null,null,null,null,null,null,"Feiertage",null,null,null,"Geburtstage",null,null,"Ferien"]
[null,null,null,null,null,null,null,"Name","Termintyp","Datum",null,"Name","Datum",null,"Name","Beginn","Ende"]
[null,null,null,null,null,null,null,"Neujahr","fest",{"$f":"DATE(J256,1,1)","v":"2024-01-01"},null,"Ilse\nReinecke","2024-01-14",null,"Weih-\nnachtsfer.","2023-12-27","2024-01-13"]
[null,null,null,null,null,null,null,"Heilige Drei\nKönge","fest",{"$f":"DATE(J256,1,6)","v":"2024-01-06"},null,"Sabina\nKuntze","2024-01-17",null,"Winter-\nferien"]
[null,null,null,null,null,null,null,"Valentins-\ntag","fest",{"$f":"DATE(J256,2,14)","v":"2024-02-14"},null,"Thorsten\nMogge","2024-01-27",null,"Oster-\nferien","2024-03-25","2024-04-13"]
[null,null,null,null,null,null,null,"Tag der\nArbeit","fest",{"$f":"DATE(J256,5,1)","v":"2024-05-01"},null,"Martina\nKilian","2024-01-30",null,"Pfings-\nferien"]
[null,null,null,null,null,null,null,"Reforma-\ntionstag","fest",{"$f":"DATE(J256,10,31)","v":"2024-10-31"},null,"Rudolf\nMogge","2024-02-04",null,"Sommer-\nferien","2024-07-15","2024-08-23"]
[null,null,null,null,null,null,null,"Aller-\nheiligen","fest",{"$f":"DATE(J256,11,1)","v":"2024-11-01"},null,"Jasmin\nHöchst","2024-02-05",null,"Herbst-\nferien","2024-10-14","2024-10-25"]
[null,null,null,null,null,null,null,"Nikolaus","fest",{"$f":"DATE(J256,12,6)","v":"2024-12-06"},null,"Frank\nIsensee","2024-02-12",null,"Weih-\nnachtsfer.","2024-12-23","2025-01-10"]
[null,null,null,null,null,null,null,"Sylvester","fest",{"$f":"DATE(J256,12,31)","v":"2024-12-31"},null,"Karl-Heinz","2024-03-12"]
[null,null,null,null,null,null,null,"Rosen-\nmontag","Osterso.-48",{"$f":"J275-48","v":"2024-02-12"},null,"Ingrid\nWehlitz","2024-03-16"]
[null,null,null,null,null,null,null,"Faschings-\nDienstag","Osterso.-47",{"$f":"J275-47","v":"2024-02-13"},null,"Gunhild\nLohm.-Elias","2024-03-30"]
[null,null,null,null,null,null,null,"Ascher-\nMittwoch","Osterso.-46",{"$f":"J275-46","v":"2024-02-14"},null,"Gabriele\nNolte","2024-04-02"]
[null,null,null,null,null,null,null,"Karfreitag","Osterso.-2",{"$f":"J275-2","v":"2024-03-29"},null,"Doris\nLübeck","2024-04-22"]
[null,null,null,null,null,null,null,"Oster-\nSonntag","Formel",{"$f":"DOLLAR((DAY(MINUTE(J$256/38)/2+55)&\".4.\"&J$256)/7,)*7-6","v":"2024-03-31"},null,"Oliver\nClark","2024-04-24"]
[null,null,null,null,null,null,null,"Oster-\nMontag","Osterso.+1",{"$f":"J275+1","v":"2024-04-01"},null,"Ulrike\nErlenkötter","2024-04-25"]
[null,null,null,null,null,null,null,"Himmel-\nfahrt","Osterso.+39",{"$f":"J275+39","v":"2024-05-09"},null,"Regina\nSander","2024-04-27"]
[null,null,null,null,null,null,null,"Pfingst-\nsonntag","Osterso.+49",{"$f":"J275+49","v":"2024-05-19"},null,"Anja\nIsensee","2024-04-30"]
[null,null,null,null,null,null,null,"Pfings-\nmontag","Osterso.+50",{"$f":"J275+50","v":"2024-05-20"},null,"Horst\nWinkelbach","2024-05-21"]
[null,null,null,null,null,null,null,"Fronleich-\nnam","Osterso.+60",{"$f":"J275+60","v":"2024-05-30"},null,"Marco\nKilian","2024-05-31"]
[null,null,null,null,null,null,null,"Volks-\ntrauertag","4. Advent-35",{"$f":"J287-35","v":"2024-11-17"},null,"Jana\nNolte","2024-07-01"]
[null,null,null,null,null,null,null,"Buß und\nBettag","4. Advent-32",{"$f":"J287-32","v":"2024-11-20"},null,"Doris\nEckert","2024-08-13"]
[null,null,null,null,null,null,null,"Toten-\nSonntag","4. Advent-28",{"$f":"J287-28","v":"2024-11-24"},null,"Birgitt I.\nMalte W.","2024-08-18"]
[null,null,null,null,null,null,null,"1. Advent","4. Advent-21",{"$f":"J287-21","v":"2024-12-01"},null,"Carmen\nOhnesorge","2024-09-02"]
[null,null,null,null,null,null,null,"2. Advent","4. Advent-14",{"$f":"J287-14","v":"2024-12-08"},null,"Ilsemarie\nWiesner","2024-09-24"]
[null,null,null,null,null,null,null,"3. Advent","4. Advent-7",{"$f":"J287-7","v":"2024-12-15"},null,"Kai\nIsensee","2024-11-08"]
[null,null,null,null,null,null,null,"4. Advent","Formel",{"$f":"J289-WEEKDAY(J289,2)","v":"2024-12-22"},null,"Selina\nKilian","2024-12-11"]
[null,null,null,null,null,null,null,"Heilig\nAbend","Fest",{"$f":"DATE(J256,12,24)","v":"2024-12-24"},null,"Heidi\nSiebert","2024-12-29"]
[null,null,null,null,null,null,null,"1. Weih-\nnachtsfeiert.","Heilig Ab.+1",{"$f":"J288+1","v":"2024-12-25"}]
[null,null,null,null,null,null,null,"2. Weih-\nnachtsfeiert.","Heilig Ab.+2",{"$f":"J288+2","v":"2024-12-26"}]
[null,null,null,null,null,null,null,"Muttertag","Formel",{"$f":"DATE(J256,5,1)+15-WEEKDAY(DATE(J256,5,1))-(WEEKDAY(DATE(J256,5,1),1)=1) *7-IF((DOLLAR((DAY(MINUTE(J256/38)/2+55)&\".4.\"&J256)/7,)*7-6)+49=DATE(J256,5,1)+15-WEEKDAY(DATE(J256,5,1)) -(WEEKDAY(DATE(J256,5,1),1)=1)*7,7,0)","v":"2024-05-12"}]
[null,null,null,null,null,null,null,"Ernte-\ndankfest","Formel",{"$f":"DATE(J256,10,1)+7-WEEKDAY(DATE(J256,10,1),2)","v":"2024-10-06"}]

{"sheet":"Ausgabe Jan","index":1,"n_rows":113,"n_cols":42,"rows_kept":113,"cut":false,"hidden":true,"merged":[[20,0,21,0],[38,0,39,0],[0,5,0,41],[3,13,3,14],[3,23,3,24],[3,33,3,34],[5,13,5,14],[5,23,5,24],[5,33,5,34],[0,0,7,0],[0,1,7,1],[0,2,7,2],[0,3,7,3],[0,4,7,4],[50,0,51,0],[106,8,106,10],[70,8,70,10],[70,13,70,15],[72,8,72,10],[72,13,72,15],[90,8,90,10],[98,8,98,10],[68,8,68,10],[68,13,68,15]]}
["Hauptkategorie","Unterkategorie","Monatliche \nSumme\nUnter-\nkategorie","Monatliche\nSumme\nHaupt-\nkategorie","Prozentuale Verteilung\nHaupt-\nkategorie",{"$f":"\"Monatliche Ausgaben \"&J101&\" \"&J102&\"\"","v":"Monatliche Ausgaben Januar 2024"}]
[null,null,null,null,null,{"$f":"IF(WEEKNUM(AK97,21)>=52,\"-----\",(TEXT(AM97,\"TTT\"))&\" \"&(TEXT(AM97,\"TT\"))&\".\"&$J93)","v":"-----"},{"$f":"IF(WEEKNUM(AL97,21)>=52,\"-----\",(TEXT(AL97,\"TTT\"))&\" \"&(TEXT(AL97,\"TT\"))&\".\"&$J93)","v":"-----"},{"$f":"IF(WEEKNUM(AM97,21)>=52,\"-----\",(TEXT(AM97,\"TTT\"))&\" \"&(TEXT(AM97,\"TT\"))&\".\"&$J93)","v":"-----"},{"$f":"IF(WEEKNUM(I105,21)>=52,\"-----\",(TEXT(I105,\"TTT\"))&\" \"&(TEXT(I105,\"TT\"))&\".\"&$K101)","v":"Mo 01.1"},{"$f":"IF(WEEKNUM(J105,21)>=52,\"-----\",(TEXT(J105,\"TTT\"))&\" \"&(TEXT(J105,\"TT\"))&\".\"&$K101)","v":"Di 02.1"},{"$f":"IF(WEEKNUM(K105,21)>=52,\"-----\",(TEXT(K105,\"TTT\"))&\" \"&(TEXT(K105,\"TT\"))&\".\"&$K101)","v":"Mi 03.1"},{"$f":"(TEXT(L105,\"TTT\"))&\" \"&(TEXT(L105,\"TT\"))&\".\"&$K101","v":"Do 04.1"},"Fr 05.1","Sa 06.1","So 07.1","Mo 08.1","Di 09.1","Mi 10.1","Do 11.1","Fr 12.1","Sa 13.1","So 14.1","Mo 15.1","Di 16.1","Mi 17.1","Do 18.1","Fr 19.1","Sa 20.1","So 21.1","Mo 22.1","Di 23.1","Mi 24.1","Do 25.1",{"$f":"IF(WEEKNUM(AH105,21)<=1,\"-----\",(TEXT(AH105,\"TTT\"))&\" \"&(TEXT(AH105,\"TT\"))&\".\"&$K101)","v":"Fr 26.1"},{"$f":"IF(WEEKNUM(AI105,21)<=1,\"-----\",(TEXT(AI105,\"TTT\"))&\" \"&(TEXT(AI105,\"TT\"))&\".\"&$K101)","v":"Sa 27.1"},{"$f":"IF(WEEKNUM(AJ105,21)<=1,\"-----\",(TEXT(AJ105,\"TTT\"))&\" \"&(TEXT(AJ105,\"TT\"))&\".\"&$K101)","v":"So 28.1"},{"$f":"IF(WEEKNUM(AK105,21)=1,\"-----\",IF(AND(DAY(DATE(J102,3,0))=29,J101=\"Februar\"),(TEXT(AK105,\"TTT\"))&\" \"&(TEXT(AK105,\"TT\"))&\".\"&$K101,IF(J101=\"Februar\",\"-------\",(TEXT(AK105,\"TTT\"))&\" \"&(TEXT(AK105,\"TT\"))&\".\"&$K101)))","v":"Mo 29.1"},{"$f":"IF(WEEKNUM(AL105,21)=1,\"-----\",IF(J101=\"Februar\",\"-------\",(TEXT(AL105,\"TTT\"))&\" \"&(TEXT(AL105,\"TT\"))&\".\"&$K101))","v":"Di 30.1"},{"$f":"IF(WEEKNUM(AM105,21)=1,\"-----\",IF(OR(J101=\"Februar\",J101=\"April\",J101=\"Juni\",J101=\"September\",J101=\"November\"),\"-------\",(TEXT(AM105,\"TTT\"))&\" \"&(TEXT(AM105,\"TT\"))&\".\"&$K101))","v":"Mi 31.1"},{"$f":"IF(OR(K101<>12,WEEKNUM(I113,21)=1),\"-----\",(TEXT(I113,\"TTT\"))&\" \"&(TEXT(I113,\"TT\"))&\".\"&$K109)","v":"-----"},{"$f":"IF(OR(K101<>12,WEEKNUM(I113,21)=1),\"-----\",(TEXT(J113,\"TTT\"))&\" \"&(TEXT(J113,\"TT\"))&\".\"&$K109)","v":"-----"},{"$f":"IF(OR(K101<>12,WEEKNUM(I113,21)=1),\"-----\",(TEXT(K113,\"TTT\"))&\" \"&(TEXT(K113,\"TT\"))&\".\"&$K109)","v":"-----"}]
[null,null,null,null,null,{"$f":"IF(WEEKNUM(AK97,21)>=52,\"-----\",\"Wo \"&WEEKNUM(AK97,21))","v":"-----"},{"$f":"IF(WEEKNUM(AL97,21)>=52,\"-----\",\"Wo \"&WEEKNUM(AL97,21))","v":"-----"},{"$f":"IF(WEEKNUM(AM97,21)>=52,\"-----\",\"Wo \"&WEEKNUM(AM97,21))","v":"-----"},{"$f":"IF(WEEKNUM(I105,21)>=52,\"-----\",\"Wo \"&WEEKNUM(I105,21))","v":"Wo 1"},{"$f":"IF(WEEKNUM(J105,21)>=52,\"-----\",\"Wo \"&WEEKNUM(J105,21))","v":"Wo 1"},{"$f":"IF(WEEKNUM(K105,21)>=52,\"-----\",\"Wo \"&WEEKNUM(K105,21))","v":"Wo 1"},{"$f":"\"Wo \"&WEEKNUM(L105,21)","v":"Wo 1"},"Wo 1","Wo 1","Wo 1","Wo 2","Wo 2","Wo 2","Wo 2","Wo 2","Wo 2","Wo 2","Wo 3","Wo 3","Wo 3","Wo 3","Wo 3","Wo 3","Wo 3","Wo 4","Wo 4","Wo 4","Wo 4",{"$f":"IF(WEEKNUM(AH105,21)<=1,\"-----\",\"Wo \"&WEEKNUM(AH105,21))","v":"Wo 4"},{"$f":"IF(WEEKNUM(AI105,21)<=1,\"-----\",\"Wo \"&WEEKNUM(AI105,21))","v":"Wo 4"},{"$f":"IF(WEEKNUM(AJ105,21)<=1,\"-----\",\"Wo \"&WEEKNUM(AJ105,21))","v":"Wo 4"},{"$f":"IF(WEEKNUM(AK105,21)=1,\"-----\",IF(AND(DAY(DATE(J102,3,0))=29,J101=\"Februar\"),\"Wo \"&WEEKNUM(AK105,21),IF(J101=\"Februar\",\"-----\",\"Wo \"&WEEKNUM(AK105,21))))","v":"Wo 5"},{"$f":"IF(WEEKNUM(AL105,21)=1,\"-----\",IF(J101=\"Februar\",\"-----\",\"Wo \"&WEEKNUM(AL105,21)))","v":"Wo 5"},{"$f":"IF(WEEKNUM(AM105,21)=1,\"-----\",IF(OR(J101=\"Februar\",J101=\"April\",J101=\"Juni\",J101=\"September\",J101=\"November\"),\"------\",\"Wo \"&WEEKNUM(AM105,21)))","v":"Wo 5"},{"$f":"IF(OR(K101<>12,WEEKNUM(I113,21)=1),\"-----\",\"Wo \"&WEEKNUM(I113,21))","v":"-----"},{"$f":"IF(OR(K101<>12,WEEKNUM(I113,21)=1),\"-----\",\"Wo \"&WEEKNUM(J113,21))","v":"-----"},{"$f":"IF(OR(K101<>12,WEEKNUM(I113,21)=1),\"-----\",\"Wo \"&WEEKNUM(K113,21))","v":"-----"}]
[null,null,null,null,null,null,null,null,null,null,null,null,null,"Tagessumme",null,null,null,null,null,null,null,null,null,"Tagessumme",null,null,null,null,null,null,null,null,null,"Tagessumme"]
[null,null,null,null,null,{"$f":"IF(WEEKNUM(AK97,21)>=52,\"-----\",IF(SUM(F10:F66)<>0,SUM(F10:F66),\"\"))","v":"-----"},{"$f":"IF(WEEKNUM(AL97,21)>=52,\"-----\",IF(SUM(G10:G66)<>0,SUM(G10:G66),\"\"))","v":"-----"},{"$f":"IF(WEEKNUM(AM97,21)>=52,\"-----\",IF(SUM(H10:H66)<>0,SUM(H10:H66),\"\"))","v":"-----"},{"$f":"IF(WEEKNUM(I105,21)>=52,\"-----\",IF(SUM(I10:I66)<>0,SUM(I10:I66),\"\"))","v":-295},{"$f":"IF(WEEKNUM(J105,21)>=52,\"-----\",IF(J10<>0,SUM(J10:J66),\"\"))","v":-46},{"$f":"IF(WEEKNUM(K105,21)>52,\"-----\",IF(K10<>0,SUM(K10:K66),\"\"))","v":-545},{"$f":"IF(L10<>0,SUM(L10:L66),\"\")","v":-46},-46,-46,-46,-46,-46,-46,-46,-46,-46,-46,-46,-46,-46,-46,-46,-46,-46,-46,-46,-46,-46,{"$f":"IF(WEEKNUM(AH105,21)<=1,\"-----\",IF(AH10<>0,SUM(AH10:AH66),\"\"))","v":-46},{"$f":"IF(WEEKNUM(AI105,21)<=1,\"-----\",IF(AI10<>0,SUM(AI10:AI66),\"\"))","v":-46},{"$f":"IF(WEEKNUM(AJ105,21)<=1,\"-----\",IF(AJ10<>0,SUM(AJ10:AJ66),\"\"))","v":-46},{"$f":"IF(WEEKNUM(AK105,21)=1,\"-----\",IF(AND(DAY(DATE(J102,3,0))=29,J101=\"Februar\"),IF(AK10<>0,SUM(AK10:AK66),\"\"),IF(J101=\"Februar\",\"------\",IF(AK10<>0,SUM(AK10:AK66),\"\"))))","v":-46},{"$f":"IF(WEEKNUM(AL105,21)=1,\"-----\",IF(J101=\"Februar\",\"------\",IF(AL10<>0,SUM(AL10:AL66),\"\")))","v":-46},{"$f":"IF(WEEKNUM(AM105,21)=1,\"-----\",IF(OR(J101=\"Februar\",J101=\"April\",J101=\"Juni\",J101=\"September\",J101=\"November\"),\"------\",(IF(AM10<>0,SUM(AM10:AM66),\"\"))))","v":-46},{"$f":"IF(OR(K101<>12,WEEKNUM(I113,21)=1),\"-----\",IF(AN10<>0,SUM(AN10:AN66),\"\"))","v":"-----"},{"$f":"IF(OR(K101<>12,WEEKNUM(I113,21)=1),\"-----\",IF(AO10<>0,SUM(AO10:AO66),\"\"))","v":"-----"},{"$f":"IF(OR(K101<>12,WEEKNUM(I113,21)=1),\"-----\",IF(AP10<>0,SUM(AP10:AP66),\"\"))","v":"-----"}]
[null,null,null,null,null,null,null,null,null,null,null,null,null,"Wochensumme",null,null,null,null,null,null,null,null,null,"Wochensumme",null,null,null,null,null,null,null,null,null,"Wochensumme"]
[]
[null,null,null,null,null,{"$f":"IF(WEEKNUM(AK97,21)>=52,\"-----\",\"Betrag\")","v":"-----"},{"$f":"IF(WEEKNUM(AL97,21)>=52,\"-----\",\"Betrag\")","v":"-----"},{"$f":"IF(WEEKNUM(AM97,21)>=52,\"-----\",\"Betrag\")","v":"-----"},{"$f":"IF(WEEKNUM(I105,21)>=52,\"-----\",\"Betrag\")","v":"Betrag"},{"$f":"IF(WEEKNUM(J105,21)>=52,\"-----\",\"Betrag\")","v":"Betrag"},{"$f":"IF(WEEKNUM(K105,21)>=52,\"-----\",\"Betrag\")","v":"Betrag"},"Betrag","Betrag","Betrag","Betrag","Betrag","Betrag","Betrag","Betrag","Betrag","Betrag","Betrag","Betrag","Betrag","Betrag","Betrag","Betrag","Betrag","Betrag","Betrag","Betrag","Betrag","Betrag",{"$f":"IF(WEEKNUM(AH105,21)<=1,\"-----\",\"Betrag\")","v":"Betrag"},{"$f":"IF(WEEKNUM(AI105,21)<=1,\"-----\",\"Betrag\")","v":"Betrag"},{"$f":"IF(WEEKNUM(AJ105,21)<=1,\"-----\",\"Betrag\")","v":"Betrag"},{"$f":"IF(WEEKNUM(AK105,21)=1,\"-----\",IF(AND(DAY(DATE(J102,3,0))=29,J101=\"Februar\"),\"Betrag\",IF(J101=\"Februar\",\"------\",\"Betrag\")))","v":"Betrag"},{"$f":"IF(WEEKNUM(AL105,21)=1,\"-----\",IF(J101=\"Februar\",\"------\",\"Betrag\"))","v":"Betrag"},{"$f":"IF(WEEKNUM(AM105,21)=1,\"-----\",IF(OR(J101=\"Februar\",J101=\"April\",J101=\"Juni\",J101=\"September\",J101=\"November\"),\"------\",\"Betrag\"))","v":"Betrag"},{"$f":"IF(OR(K101<>12,WEEKNUM(I113,21)=1),\"-----\",\"Betrag\")","v":"-----"},{"$f":"IF(OR(K101<>12,WEEKNUM(I113,21)=1),\"-----\",\"Betrag\")","v":"-----"},{"$f":"IF(OR(K101<>12,WEEKNUM(I113,21)=1),\"-----\",\"Betrag\")","v":"-----"}]
["Arbeit"]
[null,"Arbeitskleidung/Reinigung",{"$f":"IF(SUM(F10:AP10)<>0,SUM(F10:AP10),\"\")","v":-37},null,null,-1,-1,-1,-1,-1,-1,-1,-1,-1,-1,-1,-1,-1,-1,-1,-1,-1,-1,-1,-1,-1,-1,-1,-1,-1,-1,-1,-1,-1,-1,-1,-1,-1,-1,-1,-1,-1]
[null,"Verpflegung Frühstück",{"$f":"IF(SUM(F11:AP11)<>0,SUM(F11:AP11),\"\")","v":-37},null,null,-1,-1,-1,-1,-1,-1,-1,-1,-1,-1,-1,-1,-1,-1,-1,-1,-1,-1,-1,-1,-1,-1,-1,-1,-1,-1,-1,-1,-1,-1,-1,-1,-1,-1,-1,-1,-1]
[null,"Verpflegung Mittag",-37,{"$f":"IF(SUM(C10:C12)<>0,SUM(C10:C12),\"\")","v":-111},{"$f":"IFERROR(D12/D67,\" \")","v":4.5306122448979594E-2},-1,-1,-1,-1,-1,-1,-1,-1,-1,-1,-1,-1,-1,-1,-1,-1,-1,-1,-1,-1,-1,-1,-1,-1,-1,-1,-1,-1,-1,-1,-1,-1,-1,-1,-1,-1,-1]
["Freizeit",null,{"$f":"IF(SUM(I13:AM13)<>0,SUM(I13:AM13),\"\")","v":""}]
[null,"Bar/Cafe/Disco",{"$f":"IF(SUM(F14:AP14)<>0,SUM(F14:AP14),\"\")","v":-37},null,null,-1,-1,-1,-1,-1,-1,-1,-1,-1,-1,-1,-1,-1,-1,-1,-1,-1,-1,-1,-1,-1,-1,-1,-1,-1,-1,-1,-1,-1,-1,-1,-1,-1,-1,-1,-1,-1]
[null,"Geschenke",{"$f":"IF(SUM(F15:AP15)<>0,SUM(F15:AP15),\"\")","v":-37},null,null,-1,-1,-1,-1,-1,-1,-1,-1,-1,-1,-1,-1,-1,-1,-1,-1,-1,-1,-1,-1,-1,-1,-1,-1,-1,-1,-1,-1,-1,-1,-1,-1,-1,-1,-1,-1,-1]
[null,"Getränke/Eis/Snacks",-37,null,null,-1,-1,-1,-1,-1,-1,-1,-1,-1,-1,-1,-1,-1,-1,-1,-1,-1,-1,-1,-1,-1,-1,-1,-1,-1,-1,-1,-1,-1,-1,-1,-1,-1,-1,-1,-1,-1]
[null,"Kino/Konzert/Museum/Theater",-37,null,null,-1,-1,-1,-1,-1,-1,-1,-1,-1,-1,-1,-1,-1,-1,-1,-1,-1,-1,-1,-1,-1,-1,-1,-1,-1,-1,-1,-1,-1,-1,-1,-1,-1,-1,-1,-1,-1]
[null,"Restaurantbesuch",-37,null,null,-1,-1,-1,-1,-1,-1,-1,-1,-1,-1,-1,-1,-1,-1,-1,-1,-1,-1,-1,-1,-1,-1,-1,-1,-1,-1,-1,-1,-1,-1,-1,-1,-1,-1,-1,-1,-1]
[null,"Sportartikel",-37,null,null,-1,-1,-1,-1,-1,-1,-1,-1,-1,-1,-1,-1,-1,-1,-1,-1,-1,-1,-1,-1,-1,-1,-1,-1,-1,-1,-1,-1,-1,-1,-1,-1,-1,-1,-1,-1,-1]
[null,"Volksfest",-37,{"$f":"IF(SUM(C14:C20)<>0,SUM(C14:C20),\"\")","v":-259},{"$f":"IFERROR(D20/D67,\" \")","v":0.10571428571428572},-1,-1,-1,-1,-1,-1,-1,-1,-1,-1,-1,-1,-1,-1,-1,-1,-1,-1,-1,-1,-1,-1,-1,-1,-1,-1,-1,-1,-1,-1,-1,-1,-1,-1,-1,-1,-1]
["Lebenshaltung/\nDrogerie/Apothke",null,""]
[null,"Büroartikel",{"$f":"IF(SUM(F22:AP22)<>0,SUM(F22:AP22),\"\")","v":-37},null,null,-1,-1,-1,-1,-1,-1,-1,-1,-1,-1,-1,-1,-1,-1,-1,-1,-1,-1,-1,-1,-1,-1,-1,-1,-1,-1,-1,-1,-1,-1,-1,-1,-1,-1,-1,-1,-1]
[null,"Drogerieartikel",{"$f":"IF(SUM(F23:AP23)<>0,SUM(F23:AP23),\"\")","v":-37},null,null,-1,-1,-1,-1,-1,-1,-1,-1,-1,-1,-1,-1,-1,-1,-1,-1,-1,-1,-1,-1,-1,-1,-1,-1,-1,-1,-1,-1,-1,-1,-1,-1,-1,-1,-1,-1,-1]
[null,"Lebensmittel, Getränke",-37,null,null,-1,-1,-1,-1,-1,-1,-1,-1,-1,-1,-1,-1,-1,-1,-1,-1,-1,-1,-1,-1,-1,-1,-1,-1,-1,-1,-1,-1,-1,-1,-1,-1,-1,-1,-1,-1,-1]
[null,"Medikamente",-37,null,null,-1,-1,-1,-1,-1,-1,-1,-1,-1,-1,-1,-1,-1,-1,-1,-1,-1,-1,-1,-1,-1,-1,-1,-1,-1,-1,-1,-1,-1,-1,-1,-1,-1,-1,-1,-1,-1]
[null,"Post (Briefe, Pakete)",-37,{"$f":"IF(SUM(C22:C26)<>0,SUM(C22:C26),\"\")","v":-185},{"$f":"IFERROR(D26/D67,\" \")","v":7.5510204081632656E-2},-1,-1,-1,-1,-1,-1,-1,-1,-1,-1,-1,-1,-1,-1,-1,-1,-1,-1,-1,-1,-1,-1,-1,-1,-1,-1,-1,-1,-1,-1,-1,-1,-1,-1,-1,-1,-1]
["Literatur/Medien/Spiele",null,""]
[null,"Bücher",{"$f":"IF(SUM(F28:AP28)<>0,SUM(F28:AP28),\"\")","v":-37},null,null,-1,-1,-1,-1,-1,-1,-1,-1,-1,-1,-1,-1,-1,-1,-1,-1,-1,-1,-1,-1,-1,-1,-1,-1,-1,-1,-1,-1,-1,-1,-1,-1,-1,-1,-1,-1,-1]
[null,"PC-Software",{"$f":"IF(SUM(F29:AP29)<>0,SUM(F29:AP29),\"\")","v":-37},null,null,-1,-1,-1,-1,-1,-1,-1,-1,-1,-1,-1,-1,-1,-1,-1,-1,-1,-1,-1,-1,-1,-1,-1,-1,-1,-1,-1,-1,-1,-1,-1,-1,-1,-1,-1,-1,-1]
[null,"PC-Spiele/Gesellschaftspiele",-37,null,null,-1,-1,-1,-1,-1,-1,-1,-1,-1,-1,-1,-1,-1,-1,-1,-1,-1,-1,-1,-1,-1,-1,-1,-1,-1,-1,-1,-1,-1,-1,-1,-1,-1,-1,-1,-1,-1]
[null,"Zeitschriften/Heftromane",-37,{"$f":"IF(SUM(C28:C31)<>0,SUM(C28:C31),\"\")","v":-148},{"$f":"IFERROR(D31/D67,\" \")","v":6.0408163265306125E-2},-1,-1,-1,-1,-1,-1,-1,-1,-1,-1,-1,-1,-1,-1,-1,-1,-1,-1,-1,-1,-1,-1,-1,-1,-1,-1,-1,-1,-1,-1,-1,-1,-1,-1,-1,-1,-1]
["Mobilität",null,""]
[null,"Auto, Inspektion, Reparatur",{"$f":"IF(SUM(F33:AP33)<>0,SUM(F33:AP33),\"\")","v":-37},null,null,-1,-1,-1,-1,-1,-1,-1,-1,-1,-1,-1,-1,-1,-1,-1,-1,-1,-1,-1,-1,-1,-1,-1,-1,-1,-1,-1,-1,-1,-1,-1,-1,-1,-1,-1,-1,-1]
[null,"Auto, Pflege",{"$f":"IF(SUM(F34:AP34)<>0,SUM(F34:AP34),\"\")","v":-37},null,null,-1,-1,-1,-1,-1,-1,-1,-1,-1,-1,-1,-1,-1,-1,-1,-1,-1,-1,-1,-1,-1,-1,-1,-1,-1,-1,-1,-1,-1,-1,-1,-1,-1,-1,-1,-1,-1]
[null,"Auto, Treibstoff",-37,null,null,-1,-1,-1,-1,-1,-1,-1,-1,-1,-1,-1,-1,-1,-1,-1,-1,-1,-1,-1,-1,-1,-1,-1,-1,-1,-1,-1,-1,-1,-1,-1,-1,-1,-1,-1,-1,-1]
[null,"Auto, Pargebühren",-37,null,null,-1,-1,-1,-1,-1,-1,-1,-1,-1,-1,-1,-1,-1,-1,-1,-1,-1,-1,-1,-1,-1,-1,-1,-1,-1,-1,-1,-1,-1,-1,-1,-1,-1,-1,-1,-1,-1]
[null,"Carsharing/E-Scooter/Taxi",-286,null,null,-1,-1,-1,-250,-1,-1,-1,-1,-1,-1,-1,-1,-1,-1,-1,-1,-1,-1,-1,-1,-1,-1,-1,-1,-1,-1,-1,-1,-1,-1,-1,-1,-1,-1,-1,-1,-1]
[null,"Monats-/Wochenticket",-37,{"$f":"IF(SUM(C33:C38)<>0,SUM(C33:C38),\"\")","v":-471},{"$f":"IFERROR(D38/D67,\" \")","v":0.19224489795918367},-1,-1,-1,-1,-1,-1,-1,-1,-1,-1,-1,-1,-1,-1,-1,-1,-1,-1,-1,-1,-1,-1,-1,-1,-1,-1,-1,-1,-1,-1,-1,-1,-1,-1,-1,-1,-1]
["Ausbildung/\nFortbildung",null,""]
[null,"Fernstudium",{"$f":"IF(SUM(F40:AP40)<>0,SUM(F40:AP40),\"\")","v":-37},null,null,-1,-1,-1,-1,-1,-1,-1,-1,-1,-1,-1,-1,-1,-1,-1,-1,-1,-1,-1,-1,-1,-1,-1,-1,-1,-1,-1,-1,-1,-1,-1,-1,-1,-1,-1,-1,-1]
[null,"Gewerkschaft",{"$f":"IF(SUM(F41:AP41)<>0,SUM(F41:AP41),\"\")","v":-37},null,null,-1,-1,-1,-1,-1,-1,-1,-1,-1,-1,-1,-1,-1,-1,-1,-1,-1,-1,-1,-1,-1,-1,-1,-1,-1,-1,-1,-1,-1,-1,-1,-1,-1,-1,-1,-1,-1]
[null,"VHS-Kurs",-37,{"$f":"IF(SUM(C40:C42)<>0,SUM(C40:C42),\"\")","v":-111},{"$f":"IFERROR(D42/D67,\" \")","v":4.5306122448979594E-2},-1,-1,-1,-1,-1,-1,-1,-1,-1,-1,-1,-1,-1,-1,-1,-1,-1,-1,-1,-1,-1,-1,-1,-1,-1,-1,-1,-1,-1,-1,-1,-1,-1,-1,-1,-1,-1]
["Bekleidung",null,""]
[null,"Hemden",{"$f":"IF(SUM(F44:AP44)<>0,SUM(F44:AP44),\"\")","v":-37},null,null,-1,-1,-1,-1,-1,-1,-1,-1,-1,-1,-1,-1,-1,-1,-1,-1,-1,-1,-1,-1,-1,-1,-1,-1,-1,-1,-1,-1,-1,-1,-1,-1,-1,-1,-1,-1,-1]
[null,"Hosen",{"$f":"IF(SUM(F45:AP45)<>0,SUM(F45:AP45),\"\")","v":-37},null,null,-1,-1,-1,-1,-1,-1,-1,-1,-1,-1,-1,-1,-1,-1,-1,-1,-1,-1,-1,-1,-1,-1,-1,-1,-1,-1,-1,-1,-1,-1,-1,-1,-1,-1,-1,-1,-1]
[null,"Oberbekleidung",-536,null,null,-1,-1,-1,-1,-1,-500,-1,-1,-1,-1,-1,-1,-1,-1,-1,-1,-1,-1,-1,-1,-1,-1,-1,-1,-1,-1,-1,-1,-1,-1,-1,-1,-1,-1,-1,-1,-1]
[null,"Unterwäsche",-37,{"$f":"IF(SUM(C44:C47)<>0,SUM(C44:C47),\"\")","v":-647},{"$f":"IFERROR(D47/D67,\"\")","v":0.26408163265306123},-1,-1,-1,-1,-1,-1,-1,-1,-1,-1,-1,-1,-1,-1,-1,-1,-1,-1,-1,-1,-1,-1,-1,-1,-1,-1,-1,-1,-1,-1,-1,-1,-1,-1,-1,-1,-1]
["Elektro Artikel",null,""]
[null,"PC/Notebook",{"$f":"IF(SUM(F49:AP49)<>0,SUM(F49:AP49),\"\")","v":-37},null,null,-1,-1,-1,-1,-1,-1,-1,-1,-1,-1,-1,-1,-1,-1,-1,-1,-1,-1,-1,-1,-1,-1,-1,-1,-1,-1,-1,-1,-1,-1,-1,-1,-1,-1,-1,-1,-1]
[null,"Unterhaltungselektronik/Batterien",{"$f":"IF(SUM(F50:AP50)<>0,SUM(F50:AP50),\"\")","v":-37},{"$f":"IF(SUM(C49:C50)<>0,SUM(C49:C50),\"\")","v":-74},{"$f":"IFERROR(D50/D67,\" \")","v":3.0204081632653063E-2},-1,-1,-1,-1,-1,-1,-1,-1,-1,-1,-1,-1,-1,-1,-1,-1,-1,-1,-1,-1,-1,-1,-1,-1,-1,-1,-1,-1,-1,-1,-1,-1,-1,-1,-1,-1,-1]
["Wohnung/Möbel/\nHausrat",null,""]
[null,"Haushaltsnahe Dienstleistungen",{"$f":"IF(SUM(F52:AP52)<>0,SUM(F52:AP52),\"\")","v":-37},null,null,-1,-1,-1,-1,-1,-1,-1,-1,-1,-1,-1,-1,-1,-1,-1,-1,-1,-1,-1,-1,-1,-1,-1,-1,-1,-1,-1,-1,-1,-1,-1,-1,-1,-1,-1,-1,-1]
[null,"Haushaltsartikel",{"$f":"IF(SUM(F53:AP53)<>0,SUM(F53:AP53),\"\")","v":-37},null,null,-1,-1,-1,-1,-1,-1,-1,-1,-1,-1,-1,-1,-1,-1,-1,-1,-1,-1,-1,-1,-1,-1,-1,-1,-1,-1,-1,-1,-1,-1,-1,-1,-1,-1,-1,-1,-1]
[null,"Küchengeräte",-37,null,null,-1,-1,-1,-1,-1,-1,-1,-1,-1,-1,-1,-1,-1,-1,-1,-1,-1,-1,-1,-1,-1,-1,-1,-1,-1,-1,-1,-1,-1,-1,-1,-1,-1,-1,-1,-1,-1]
[null,"Möbel",-37,{"$f":"IF(SUM(C52:C55)<>0,SUM(C52:C55),\"\")","v":-148},{"$f":"IFERROR(D55/D67,\" \")","v":6.0408163265306125E-2},-1,-1,-1,-1,-1,-1,-1,-1,-1,-1,-1,-1,-1,-1,-1,-1,-1,-1,-1,-1,-1,-1,-1,-1,-1,-1,-1,-1,-1,-1,-1,-1,-1,-1,-1,-1,-1]
["Hobbys/Vereine",null,""]
[null,"Bekleidung",{"$f":"IF(SUM(F57:AP57)<>0,SUM(F57:AP57),\"\")","v":-37},{"$f":"IF(SUM(C57:C57)<>0,SUM(C57:C57),\"\")","v":-37},{"$f":"IFERROR(D57/D67,\" \")","v":1.5102040816326531E-2},-1,-1,-1,-1,-1,-1,-1,-1,-1,-1,-1,-1,-1,-1,-1,-1,-1,-1,-1,-1,-1,-1,-1,-1,-1,-1,-1,-1,-1,-1,-1,-1,-1,-1,-1,-1,-1]
["Hygiene",null,""]
[null,"Haare schneiden",{"$f":"IF(SUM(F59:AP59)<>0,SUM(F59:AP59),\"\")","v":-37},null,null,-1,-1,-1,-1,-1,-1,-1,-1,-1,-1,-1,-1,-1,-1,-1,-1,-1,-1,-1,-1,-1,-1,-1,-1,-1,-1,-1,-1,-1,-1,-1,-1,-1,-1,-1,-1,-1]
[null,"Sauna",{"$f":"IF(SUM(F60:AP60)<>0,SUM(F60:AP60),\"\")","v":-37},{"$f":"IF(SUM(C59:C60)<>0,SUM(C59:C60),\"\")","v":-74},{"$f":"IFERROR(D60/D67,\" \")","v":3.0204081632653063E-2},-1,-1,-1,-1,-1,-1,-1,-1,-1,-1,-1,-1,-1,-1,-1,-1,-1,-1,-1,-1,-1,-1,-1,-1,-1,-1,-1,-1,-1,-1,-1,-1,-1,-1,-1,-1,-1]
["Urlaub",null,""]
[null,"Pauschalreise",{"$f":"IF(SUM(F62:AP62)<>0,SUM(F62:AP62),\"\")","v":-37},null,null,-1,-1,-1,-1,-1,-1,-1,-1,-1,-1,-1,-1,-1,-1,-1,-1,-1,-1,-1,-1,-1,-1,-1,-1,-1,-1,-1,-1,-1,-1,-1,-1,-1,-1,-1,-1,-1]
[null,"Flug",{"$f":"IF(SUM(F63:AP63)<>0,SUM(F63:AP63),\"\")","v":-37},null,null,-1,-1,-1,-1,-1,-1,-1,-1,-1,-1,-1,-1,-1,-1,-1,-1,-1,-1,-1,-1,-1,-1,-1,-1,-1,-1,-1,-1,-1,-1,-1,-1,-1,-1,-1,-1,-1]
[null,"Unterkunft",-37,null,null,-1,-1,-1,-1,-1,-1,-1,-1,-1,-1,-1,-1,-1,-1,-1,-1,-1,-1,-1,-1,-1,-1,-1,-1,-1,-1,-1,-1,-1,-1,-1,-1,-1,-1,-1,-1,-1]
[null,"Verpflegung",-37,null,null,-1,-1,-1,-1,-1,-1,-1,-1,-1,-1,-1,-1,-1,-1,-1,-1,-1,-1,-1,-1,-1,-1,-1,-1,-1,-1,-1,-1,-1,-1,-1,-1,-1,-1,-1,-1,-1]
[null,"Sonstige Kosten",-37,{"$f":"IF(SUM(C62:C66)<>0,SUM(C62:C66),\"\")","v":-185},{"$f":"IFERROR(D66/D67,\" \")","v":7.5510204081632656E-2},-1,-1,-1,-1,-1,-1,-1,-1,-1,-1,-1,-1,-1,-1,-1,-1,-1,-1,-1,-1,-1,-1,-1,-1,-1,-1,-1,-1,-1,-1,-1,-1,-1,-1,-1,-1,-1]
[null,"Summe Monat",null,{"$f":"SUM(D12,D20,D26,D31,D38,D42,D47,D50,D55,D57,D60,D66)","v":-2450},{"$f":"SUM(E12,E20,E26,E31,E38,E42,E47,E50,E55,E57,E60,E66)","v":0.99999999999999989}]
[]
[null,null,null,null,null,null,null,null,"Betrag größer als -100,00 €",null,null,null,null,"Prozentsatz größer gleich 25%"]
[]
[null,null,null,null,null,null,null,null,"Betrag größer als -250,00 €",null,null,null,null,"Prozentsatz größer gleich 50%"]
[]
[null,null,null,null,null,null,null,null,"Betrag größer als -500,00 €",null,null,null,null,"Prozentsatz größer gleich 75%"]
[]
[]
[]
[]
[]
[]
[]
[]
[]
[]
[]
[]
[]
[]
[]
[]
[]
[null,null,null,null,null,null,null,null,"Auswahl (Vorjahr)"]
[]
[null,null,null,null,null,null,null,null,"Monat:","Dezember",12]
[null,null,null,null,null,null,null,null,"Jahr:",2037,{"$f":"J94","v":2037}]
[null,null,null,null,null,null,null,null,"Datum:",{"$f":"DATE(K94,K93,1)","v":"2037-12-01"},{"$f":"J95","v":"2037-12-01"}]
[]
[null,null,null,null,null,null,null,null,{"$f":"K95","v":"2037-12-01"},{"$f":"I97+1","v":"2037-12-02"},{"$f":"J97+1","v":"2037-12-03"},{"$f":"K97+1","v":"2037-12-04"},"2037-12-05","2037-12-06","2037-12-07","2037-12-08","2037-12-09","2037-12-10","2037-12-11","2037-12-12","2037-12-13","2037-12-14","2037-12-15","2037-12-16","2037-12-17","2037-12-18","2037-12-19","2037-12-20","2037-12-21","2037-12-22","2037-12-23","2037-12-24","2037-12-25","2037-12-26","2037-12-27","2037-12-28","2037-12-29","2037-12-30","2037-12-31"]
[]
[null,null,null,null,null,null,null,null,"Auswahl (Aktuelles Jahr)"]
[]
[null,null,null,null,null,null,null,null,"Monat:","Januar",{"$f":"IF(J101=\"Januar\",1,IF(J101=\"Februar\",2,IF(J101=\"März\",3,IF(J101=\"April\",4,IF(J101=\"Mai\",5,IF(J101=\"Juni\",6,IF(J101=\"Juli\",7,IF(J101=\"August\",8,IF(J101=\"September\",9,IF(J101=\"Oktober\",10,IF(J101=\"November\",11,12)))))))))))","v":1}]
[null,null,null,null,null,null,null,null,"Jahr:",2024,{"$f":"J102","v":2024}]
[null,null,null,null,null,null,null,null,"Datum:",{"$f":"DATE(K102,K101,1)","v":"2024-01-01"},{"$f":"J103","v":"2024-01-01"}]
[]
[null,null,null,null,null,null,null,null,{"$f":"J103","v":"2024-01-01"},{"$f":"I105+1","v":"2024-01-02"},{"$f":"J105+1","v":"2024-01-03"},{"$f":"K105+1","v":"2024-01-04"},"2024-01-05","2024-01-06","2024-01-07","2024-01-08","2024-01-09","2024-01-10","2024-01-11","2024-01-12","2024-01-13","2024-01-14","2024-01-15","2024-01-16","2024-01-17","2024-01-18","2024-01-19","2024-01-20","2024-01-21","2024-01-22","2024-01-23","2024-01-24","2024-01-25","2024-01-26","2024-01-27","2024-01-28","2024-01-29","2024-01-30","2024-01-31"]
[]
[null,null,null,null,null,null,null,null,"Auswahl (Folgendes Jahr)"]
[]
[null,null,null,null,null,null,null,null,"Monat:","Januar",1]
[null,null,null,null,null,null,null,null,"Jahr:",2039,{"$f":"J110","v":2039}]
[null,null,null,null,null,null,null,null,"Datum:",{"$f":"DATE(K110,K109,1)","v":"2039-01-01"},{"$f":"J111","v":"2039-01-01"}]
[]
[null,null,null,null,null,null,null,null,{"$f":"J111","v":"2039-01-01"},{"$f":"I113+1","v":"2039-01-02"},{"$f":"J113+1","v":"2039-01-03"},"2039-01-04","2039-01-05","2039-01-06","2039-01-07","2039-01-08","2039-01-09","2039-01-10","2039-01-11","2039-01-12","2039-01-13","2039-01-14","2039-01-15","2039-01-16","2039-01-17","2039-01-18","2039-01-19","2039-01-20","2039-01-21","2039-01-22","2039-01-23","2039-01-24","2039-01-25","2039-01-26","2039-01-27","2039-01-28","2039-01-29","2039-01-30","2039-01-31"]

{"sheet":"Einn Ausg Jahr","index":2,"n_rows":4,"n_cols":17,"rows_kept":4,"cut":false,"hidden":false,"merged":[[0,5,1,16],[0,0,2,1],[0,2,1,4],[2,2,2,4]]}
[]
[]
[null,null,"Monat",null,null,"Januar","Februar","März","April","Mai","Juni","Juli","August","September","Oktober","November","Dezember"]
[null,"Sparen",null,null,{"$f":"IFERROR(C4/#REF!,\" \")","v":" "},-33,-33,-33,-33,-33,-33,-33,-33,-33,-33,-33,-33]

{"sheet":"Test","index":3,"n_rows":3,"n_cols":13,"rows_kept":3,"cut":false,"hidden":false,"merged":[[0,3,0,4],[0,5,0,6],[0,7,0,8],[0,9,0,10],[0,11,0,12]]}
[null,"Kapital\nzum","Kapital\nzum","Entnahme",null,"Entnahme",null,"Entnahme",null,"Entnahme",null,"Entnahme"]
[null,null,{"$f":"EOMONTH(TODAY(),-1)+1","v":"2025-01-01"},"Datum","Betrag","Datum","Betrag","Datum","Betrag","Datum","Betrag","Datum","Betrag"]
["Sparen",1,{"$f":"B3-SUMIF('Einn Ausg Jahr'!$F$3,TEXT(MONTH(TODAY()),\"MMMM\"),'Einn Ausg Jahr'!$F$4:$Q$4)-SUMIF('Einn Ausg Jahr'!$G$3,TEXT(MONTH(TODAY()),\"MMMM\"),'Einn Ausg Jahr'!$F$4:$Q$4)-SUMIF('Einn Ausg Jahr'!$H$3,TEXT(MONTH(TODAY()),\"MMMM\"),'Einn Ausg Jahr'!$F$4:$Q$4)-SUMIF('Einn Ausg Jahr'!$I$3,TEXT(MONTH(TODAY()),\"MMMM\"),'Einn Ausg Jahr'!$F$4:$Q$4)-SUMIF('Einn Ausg Jahr'!$J$3,TEXT(MONTH(TODAY()),\"MMMM\"),'Einn Ausg Jahr'!$F$4:$Q$4)-SUMIF('Einn Ausg Jahr'!$K$3,TEXT(MONTH(TODAY()),\"MMMM\"),'Einn Ausg Jahr'!$F$4:$Q$4)-SUMIF('Einn Ausg Jahr'!$L$3,TEXT(MONTH(TODAY()),\"MMMM\"),'Einn Ausg Jahr'!$F$4:$Q$4)-SUMIF('Einn Ausg Jahr'!$M$3,TEXT(MONTH(TODAY()),\"MMMM\"),'Einn Ausg Jahr'!$F$4:$Q$4)-SUMIF('Einn Ausg Jahr'!$N$3,TEXT(MONTH(TODAY()),\"MMMM\"),'Einn Ausg Jahr'!$F$4:$Q$4)-(SUMIF('Einn Ausg Jahr'!$O$3,TEXT(MONTH(TODAY()),\"MMMM\"),'Einn Ausg Jahr'!$F$4:$Q$4)-SUMIF('Einn Ausg Jahr'!$P$3,TEXT(MONTH(TODAY()),\"MMMM\"),'Einn Ausg Jahr'!$F$4:$Q$4)-SUMIF('Einn Ausg Jahr'!$Q$3,TEXT(MONTH(TODAY()),\"MMMM\"),'Einn Ausg Jahr'!$F$4:$Q$4))+SUM(E3,G3,I3,K3,M3)","v":29},"2025-01-01",-1,"2025-02-01",-1,"2025-03-01",-1,"2025-03-01",-1,"2025-05-01",-1]