{"text_format":"1","workbook":"xlsx","n_sheets":5,"sheets":["Start","Start (2)","Tabellen","Tabelle 7er","null"],"not_rendered":{"charts":0,"images":0,"macros":1,"external_links":0,"defined_names":0,"comments":0,"pivot_tables":0},"unopened":[],"bounds":{"document_bytes":16777216,"sheet_cells":100000,"rows_first":2000,"rows_last":500,"rows_between":2000,"halvings":0,"cell_chars":16384,"cell_head_chars":4096},"cells_cut":0,"cells_raw":0,"read":"whole","date_system":"1900"}

{"sheet":"Start","index":0,"n_rows":26,"n_cols":15,"rows_kept":26,"cut":false,"hidden":false,"merged":[[0,9,0,11]]}
[null,null,null,{"$f":"RAND()","v":0.45608958670785427},null,"Startgeld",5,"Sielgeld - kalkuliert",4,"       Zu zahlen    ",null,null,null,0,0]
["Robert","SP 1","Achim",{"$f":"RAND()","v":0.28507200337841299},null,{"$f":"C2","v":"Achim"},0,{"$f":"Tabellen!Q59","v":0},0,{"$f":"F2","v":"Achim"},{"$f":"ROUNDUP(H2,0)-I2","v":0},0,null,4,5]
["Volker","SP 2","Rene",{"$f":"RAND()","v":0.22879496118087839},null,{"$f":"C3","v":"Rene"},0,{"$f":"Tabellen!Q60","v":0},0,{"$f":"F3","v":"Rene"},{"$f":"ROUNDUP(H3,0)-I3","v":0},0,null,5,8]
["Siggi","SP 3","Rosi P.",{"$f":"RAND()","v":0.67337099120752875},null,"Rosi P.",0,{"$f":"Tabellen!Q61","v":0},0,"Rosi P.",0,0,null,6,10]
["Anja","SP 4","Christian",{"$f":"RAND()","v":0.64131458161059174},null,"Christian",0,{"$f":"Tabellen!Q62","v":0},0,"Christian",0,0,null,7]
["Vincent","SP 5","Kerstin",{"$f":"RAND()","v":0.49538039961659042},null,"Kerstin",0,{"$f":"Tabellen!Q63","v":0},0,"Kerstin",0,0]
["Ralf","SP 6","Stefan",{"$f":"RAND()","v":0.10068587194750389},null,"Stefan",0,{"$f":"Tabellen!Q64","v":0},0,"Stefan",0,0]
["Erich","SP 7","Aline",{"$f":"RAND()","v":0.49890769261332424},null,"Aline",0,{"$f":"Tabellen!Q65","v":0},0,"Aline",0,0]
["Rene","SP 8","Manuel",{"$f":"RAND()","v":3.4724840209447994E-3},null,"Manuel",0,{"$f":"Tabellen!Q66","v":0},0,"Manuel",0,0]
["Nicole","SP 9","Otto",{"$f":"RAND()","v":0.44844938718404437},null,"Otto",0,{"$f":"Tabellen!Q67","v":0},0,"Otto",0,0]
["Frank","SP 10","Rosi N.",{"$f":"RAND()","v":0.96133310367676827},null,"Rosi N.",0,{"$f":"Tabellen!Q68","v":0},0,"Rosi N.",0,0]
["Sasha","SP 11","Ralf",{"$f":"RAND()","v":0.38635391940725095},null,"Ralf",0,{"$f":"Tabellen!Q69","v":0},0,"Ralf",0,0]
["Klaus","SP 12","Werner",{"$f":"RAND()","v":0.78863749144818751},null,"Werner",0,{"$f":"Tabellen!Q70","v":0},0,"Werner",0,0]
["Manuel","SP 13","Erich",{"$f":"RAND()","v":9.6153878345333399E-2},null,"Erich",0,{"$f":"Tabellen!Q71","v":0},0,"Erich",0,0]
["Christian","SP 14","Anja",{"$f":"RAND()","v":0.26912804182816374},null,"Anja",0,{"$f":"Tabellen!Q72","v":0},0,"Anja",0,0]
["Kerstin","SP 15","Siggi",{"$f":"RAND()","v":0.80931388543481375},null,"Siggi",0,{"$f":"Tabellen!Q73","v":0},0,"Siggi",0,0]
["Dirk","SP 16","Robert",{"$f":"RAND()","v":0.42576989160765988},null,"Robert",0,{"$f":"Tabellen!Q74","v":0},0,"Robert",0,0]
["Kevin","SP 17","Dirk",{"$f":"RAND()","v":0.9838464620028079},null,"Dirk",0,{"$f":"Tabellen!Q75","v":0},0,"Dirk",0,0]
["Aline","SP 18","Volker",{"$f":"RAND()","v":0.50815374667683966},null,"Volker",0,{"$f":"Tabellen!Q76","v":0},0,"Volker",0,0]
["Rosi N.","SP 19","Klaus",{"$f":"RAND()","v":0.88074852147359983},null,"Klaus",0,{"$f":"Tabellen!Q77","v":0},0,"Klaus",0,0]
["Rosi P.","SP 20","Nicole",{"$f":"RAND()","v":0.91524766788824541},null,"Nicole",0,{"$f":"Tabellen!Q78","v":0},0,"Nicole",0,0]
["Stefan","SP 21","Kevin",{"$f":"RAND()","v":0.21716697483063951},null,"Kevin",0,{"$f":"Tabellen!Q79","v":0},0,"Kevin",0,0]
["Werner","SP 22","Frank",{"$f":"RAND()","v":0.92688073023644624},null,"Frank",0,{"$f":"Tabellen!Q80","v":0},0,"Frank",0,0]
["Achim","SP 23","Vincent",{"$f":"RAND()","v":0.57766293280962477},null,"Vincent",0,{"$f":"Tabellen!Q81","v":0},0,"Vincent",0,0]
["Otto","SP 24","Sasha",{"$f":"RAND()","v":0.32217597960357491},null,"Sasha",0,{"$f":"Tabellen!Q82","v":0},0,"Sasha",0,0]
[null,null,null,null,null,null,{"$f":"SUM(G2:G25)","v":0},{"$f":"Tabellen!Q83","v":0},null,null,{"$f":"SUM(K2:K25)","v":0}]

{"sheet":"Start (2)","index":1,"n_rows":29,"n_cols":15,"rows_kept":29,"cut":false,"hidden":false,"merged":[[0,9,0,11]]}
[null,null,null,{"$f":"RAND()","v":0.73639573344728282},null,"Startgeld",5,"Sielgeld - kalkuliert",4,"       Zu zahlen    ",null,null,null,0,0]
["Robert","SP 1","Achim",{"$f":"RAND()","v":0.13987355151607306},null,{"$f":"C2","v":"Achim"},0,{"$f":"Tabellen!Q59","v":0},0,{"$f":"F2","v":"Achim"},{"$f":"ROUNDUP(H2,0)-I2","v":0},0,null,4,5]
["Volker","SP 2","Frank",{"$f":"RAND()","v":6.0807623228196772E-2},null,{"$f":"C3","v":"Frank"},0,{"$f":"Tabellen!Q60","v":0},0,{"$f":"F3","v":"Frank"},{"$f":"ROUNDUP(H3,0)-I3","v":0},0,null,5,8]
["Siggi","SP 3","Fritz",{"$f":"RAND()","v":0.73864851484600691},null,"Fritz",0,{"$f":"Tabellen!Q61","v":0},0,"Fritz",0,0,null,6,10]
["Anja","SP 4","Dirk",{"$f":"RAND()","v":0.27264264715839159},null,"Dirk",0,{"$f":"Tabellen!Q62","v":0},0,"Dirk",0,0,null,7]
["Vincent","SP 5","Vincent",{"$f":"RAND()","v":0.46662571990455437},null,"Vincent",0,{"$f":"Tabellen!Q63","v":0},0,"Vincent",0,0]
["Ralf","SP 6","Rosi N.",{"$f":"RAND()","v":0.66450597894770447},null,"Rosi N.",0,{"$f":"Tabellen!Q64","v":0},0,"Rosi N.",0,0]
["Erich","SP 7","Siggi",{"$f":"RAND()","v":0.56875131339200491},null,"Siggi",0,{"$f":"Tabellen!Q65","v":0},0,"Siggi",0,0]
["Rene","SP 8","Christian",{"$f":"RAND()","v":0.9594918306884046},null,"Christian",0,{"$f":"Tabellen!Q66","v":0},0,"Christian",0,0]
["Nicole","SP 9","Klaus",{"$f":"RAND()","v":0.33319908843385448},null,"Klaus",0,{"$f":"Tabellen!Q67","v":0},0,"Klaus",0,0]
["Frank","SP 10","Stefan",{"$f":"RAND()","v":0.9590241108964439},null,"Stefan",0,{"$f":"Tabellen!Q68","v":0},0,"Stefan",0,0]
["Sasha","SP 11","Kerstin",{"$f":"RAND()","v":0.71849835833122477},null,"Kerstin",0,{"$f":"Tabellen!Q69","v":0},0,"Kerstin",0,0]
["Klaus","SP 12","Rosi P.",{"$f":"RAND()","v":0.52831919100185654},null,"Rosi P.",0,{"$f":"Tabellen!Q70","v":0},0,"Rosi P.",0,0]
["Manuel","SP 13","Volker",{"$f":"RAND()","v":6.7690771842515041E-2},null,"Volker",0,{"$f":"Tabellen!Q71","v":0},0,"Volker",0,0]
["Christian","SP 14","Anja",{"$f":"RAND()","v":0.62840516883730879},null,"Anja",0,{"$f":"Tabellen!Q72","v":0},0,"Anja",0,0]
["Kerstin","SP 15","Ralf",{"$f":"RAND()","v":0.37620958598823406},null,"Ralf",0,{"$f":"Tabellen!Q73","v":0},0,"Ralf",0,0]
["Dirk","SP 16","Paul",{"$f":"RAND()","v":0.13545891913354435},null,"Paul",0,{"$f":"Tabellen!Q74","v":0},0,"Paul",0,0]
["Kevin","SP 17","Aline",{"$f":"RAND()","v":0.65921974260283012},null,"Aline",0,{"$f":"Tabellen!Q75","v":0},0,"Aline",0,0]
["Aline","SP 18","Manuel",{"$f":"RAND()","v":0.19957112504778973},null,"Manuel",0,{"$f":"Tabellen!Q76","v":0},0,"Manuel",0,0]
["Rosi N.","SP 19","Manni",{"$f":"RAND()","v":0.47208450023967297},null,"Manni",0,{"$f":"Tabellen!Q77","v":0},0,"Manni",0,0]
["Rosi P.","SP 20","Sasha",{"$f":"RAND()","v":0.53504464888018599},null,"Sasha",0,{"$f":"Tabellen!Q78","v":0},0,"Sasha",0,0]
["Stefan","SP 21","Robert",{"$f":"RAND()","v":0.23452406138853299},null,"Robert",0,{"$f":"Tabellen!Q79","v":0},0,"Robert",0,0]
["Werner","SP 22","Rene",{"$f":"RAND()","v":0.5581838693762442},null,"Rene",0,{"$f":"Tabellen!Q80","v":0},0,"Rene",0,0]
["Achim","SP 23","Otto",{"$f":"RAND()","v":0.12659720196719126},null,"Otto",0,{"$f":"Tabellen!Q81","v":0},0,"Otto",0,0]
["Otto","SP 24","Erich",{"$f":"RAND()","v":0.23608911613810268},null,"Erich",0,{"$f":"Tabellen!Q82","v":0},0,"Erich",0,0]
["Paul","SP 25","Nicole",{"$f":"RAND()","v":0.94381954030646709},null,"Nicole",0,{"$f":"Tabellen!Q83","v":0},0,"Nicole",{"$f":"ROUNDUP(H26,0)-I26","v":0},0]
["Fritz","SP 26","Werner",{"$f":"RAND()","v":0.32254611014687218},null,"Werner",0,null,0,"Werner",0,0]
["Hein","SP 27","Hein",{"$f":"RAND()","v":0.14001328074351072},null,"Hein",0,null,0,"Hein",0,0]
["Manni","SP 28","Kevin",{"$f":"RAND()","v":0.81415383052834067},null,"Kevin",0,null,0,"Kevin",0,0]

{"sheet":"Tabellen","index":2,"n_rows":83,"n_cols":23,"rows_kept":83,"cut":false,"hidden":false,"merged":[[32,12,32,13],[30,18,30,22],[31,18,31,19],[32,18,32,19],[33,6,33,10],[23,20,23,21],[24,20,24,21],[30,0,30,4],[31,0,31,1],[32,0,32,1],[30,6,30,10],[31,6,31,7],[32,6,32,7],[30,12,30,16],[31,12,31,13],[23,2,23,3],[24,2,24,3],[23,8,23,9],[24,8,24,9],[23,14,23,15],[24,14,24,15],[37,0,37,10],[37,12,37,22],[38,1,38,2],[39,1,39,2],[38,13,38,14],[39,13,39,14],[38,16,38,17],[39,16,39,17],[33,0,33,4],[34,0,34,4],[33,12,33,16],[33,18,33,22],[34,18,34,22],[34,6,34,10],[34,12,34,16],[51,7,51,8],[51,10,51,11],[51,13,51,14],[57,6,57,7],[57,8,57,9],[57,10,57,11],[44,13,44,14],[41,7,42,14],[48,7,49,14],[50,7,50,8],[50,10,50,11],[50,13,50,14],[43,7,43,8],[44,7,44,8],[43,10,43,11],[44,10,44,11],[43,13,43,14],[64,6,64,7],[65,6,65,7],[66,6,66,7],[67,6,67,7],[68,6,68,7],[69,6,69,7],[58,6,58,7],[59,6,59,7],[60,6,60,7],[61,6,61,7],[62,6,62,7],[63,6,63,7],[76,6,76,7],[77,6,77,7],[78,6,78,7],[79,6,79,7],[80,6,80,7],[81,6,81,7],[70,6,70,7],[71,6,71,7],[72,6,72,7],[73,6,73,7],[74,6,74,7],[75,6,75,7],[64,8,64,9],[65,8,65,9],[66,8,66,9],[67,8,67,9],[68,8,68,9],[69,8,69,9],[58,8,58,9],[59,8,59,9],[60,8,60,9],[61,8,61,9],[62,8,62,9],[63,8,63,9],[76,8,76,9],[77,8,77,9],[78,8,78,9],[79,8,79,9],[80,8,80,9],[81,8,81,9],[70,8,70,9],[71,8,71,9],[72,8,72,9],[73,8,73,9],[74,8,74,9],[75,8,75,9],[64,10,64,11],[65,10,65,11],[66,10,66,11],[67,10,67,11],[68,10,68,11],[69,10,69,11],[58,10,58,11],[59,10,59,11],[60,10,60,11],[61,10,61,11],[62,10,62,11],[63,10,63,11],[78,10,78,11],[79,10,79,11],[80,10,80,11],[81,10,81,11],[70,10,70,11],[71,10,71,11],[72,10,72,11],[73,10,73,11],[74,10,74,11],[75,10,75,11],[65,2,65,3],[66,2,66,3],[67,2,67,3],[68,2,68,3],[57,2,57,3],[58,2,58,3],[59,2,59,3],[60,2,60,3],[61,2,61,3],[62,2,62,3],[81,2,81,3],[57,4,57,5],[58,4,58,5],[59,4,59,5],[60,4,60,5],[61,4,61,5],[62,4,62,5],[63,4,63,5],[64,4,64,5],[65,4,65,5],[75,2,75,3],[76,2,76,3],[77,2,77,3],[78,2,78,3],[79,2,79,3],[80,2,80,3],[69,2,69,3],[70,2,70,3],[71,2,71,3],[72,2,72,3],[73,2,73,3],[74,2,74,3],[63,2,63,3],[64,2,64,3],[78,4,78,5],[79,4,79,5],[80,4,80,5],[81,4,81,5],[57,13,57,14],[58,13,58,14],[59,13,59,14],[60,13,60,14],[61,13,61,14],[62,13,62,14],[72,4,72,5],[73,4,73,5],[74,4,74,5],[75,4,75,5],[76,4,76,5],[77,4,77,5],[66,4,66,5],[67,4,67,5],[68,4,68,5],[69,4,69,5],[70,4,70,5],[71,4,71,5],[76,10,76,11],[77,10,77,11],[81,13,81,14],[57,15,57,16],[75,13,75,14],[76,13,76,14],[77,13,77,14],[78,13,78,14],[79,13,79,14],[80,13,80,14],[69,13,69,14],[70,13,70,14],[71,13,71,14],[72,13,72,14],[73,13,73,14],[74,13,74,14],[63,13,63,14],[64,13,64,14],[65,13,65,14],[66,13,66,14],[67,13,67,14],[68,13,68,14]]}
[{"$f":"Start!C2","v":"Achim"},null,null,null,null,null,{"$f":"Start!C8","v":"Aline"},null,null,null,null,null,{"$f":"Start!C14","v":"Erich"},null,null,null,null,null,{"$f":"Start!C20","v":"Klaus"}]
[{"$f":"Start!C3","v":"Rene"},null,null,null,null,null,{"$f":"Start!C9","v":"Manuel"},null,null,null,null,null,{"$f":"Start!C15","v":"Anja"},null,null,null,null,null,{"$f":"Start!C21","v":"Nicole"}]
[{"$f":"Start!C4","v":"Rosi P."},null,null,null,null,null,{"$f":"Start!C10","v":"Otto"},null,null,null,null,null,{"$f":"Start!C16","v":"Siggi"},null,null,null,null,null,{"$f":"Start!C22","v":"Kevin"}]
[{"$f":"Start!C5","v":"Christian"},null,null,null,null,null,{"$f":"Start!C11","v":"Rosi N."},null,null,null,null,null,{"$f":"Start!C17","v":"Robert"},null,null,null,null,null,{"$f":"Start!C23","v":"Frank"}]
[{"$f":"Start!C6","v":"Kerstin"},null,null,null,null,null,{"$f":"Start!C12","v":"Ralf"},null,null,null,null,null,{"$f":"Start!C18","v":"Dirk"},null,null,null,null,null,{"$f":"Start!C24","v":"Vincent"}]
[{"$f":"Start!C7","v":"Stefan"},null,null,null,null,null,{"$f":"Start!C13","v":"Werner"},null,null,null,null,null,{"$f":"Start!C19","v":"Volker"},null,null,null,null,null,{"$f":"Start!C25","v":"Sasha"}]
[]
[{"$f":"A1","v":"Achim"},{"$f":"A4","v":"Christian"},null,null,null,null,{"$f":"G1","v":"Aline"},{"$f":"G4","v":"Rosi N."},null,null,null,null,{"$f":"M1","v":"Erich"},{"$f":"M4","v":"Robert"},null,null,null,null,{"$f":"S1","v":"Klaus"},{"$f":"S4","v":"Frank"}]
[{"$f":"A2","v":"Rene"},{"$f":"A5","v":"Kerstin"},null,null,null,null,{"$f":"G2","v":"Manuel"},{"$f":"G5","v":"Ralf"},null,null,null,null,{"$f":"M2","v":"Anja"},{"$f":"M5","v":"Dirk"},null,null,null,null,{"$f":"S2","v":"Nicole"},{"$f":"S5","v":"Vincent"}]
["Rosi P.","Stefan",null,null,null,null,"Otto","Werner",null,null,null,null,"Siggi","Volker",null,null,null,null,"Kevin","Sasha"]
["Christian",{"$f":"A9","v":"Rene"},null,null,null,null,"Rosi N.",{"$f":"G2","v":"Manuel"},null,null,null,null,"Robert",{"$f":"M2","v":"Anja"},null,null,null,null,{"$f":"S4","v":"Frank"},{"$f":"S2","v":"Nicole"}]
["Kerstin",{"$f":"A10","v":"Rosi P."},null,null,null,null,"Ralf",{"$f":"G3","v":"Otto"},null,null,null,null,"Dirk",{"$f":"M3","v":"Siggi"},null,null,null,null,{"$f":"S5","v":"Vincent"},{"$f":"S3","v":"Kevin"}]
["Stefan","Christian",null,null,null,null,"Werner","Rosi N.",null,null,null,null,"Volker",{"$f":"M4","v":"Robert"},null,null,null,null,{"$f":"S6","v":"Sasha"},{"$f":"S4","v":"Frank"}]
[{"$f":"A8","v":"Achim"},"Kerstin",null,null,null,null,{"$f":"G1","v":"Aline"},{"$f":"G5","v":"Ralf"},null,null,null,null,{"$f":"M1","v":"Erich"},{"$f":"M5","v":"Dirk"},null,null,null,null,{"$f":"S1","v":"Klaus"},{"$f":"S5","v":"Vincent"}]
[{"$f":"A9","v":"Rene"},{"$f":"A3","v":"Rosi P."},null,null,null,null,{"$f":"G2","v":"Manuel"},{"$f":"G3","v":"Otto"},null,null,null,null,{"$f":"M2","v":"Anja"},{"$f":"M3","v":"Siggi"},null,null,null,null,{"$f":"S2","v":"Nicole"},{"$f":"S3","v":"Kevin"}]
[{"$f":"A6","v":"Stefan"},{"$f":"A1","v":"Achim"},null,null,null,null,{"$f":"G6","v":"Werner"},{"$f":"G1","v":"Aline"},null,null,null,null,{"$f":"M6","v":"Volker"},{"$f":"M1","v":"Erich"},null,null,null,null,{"$f":"S6","v":"Sasha"},{"$f":"S1","v":"Klaus"}]
["Christian",{"$f":"A5","v":"Kerstin"},null,null,null,null,{"$f":"G4","v":"Rosi N."},{"$f":"G5","v":"Ralf"},null,null,null,null,{"$f":"M4","v":"Robert"},{"$f":"M5","v":"Dirk"},null,null,null,null,{"$f":"S4","v":"Frank"},{"$f":"S5","v":"Vincent"}]
[{"$f":"A1","v":"Achim"},{"$f":"A3","v":"Rosi P."},null,null,null,null,{"$f":"G1","v":"Aline"},{"$f":"G3","v":"Otto"},null,null,null,null,{"$f":"M1","v":"Erich"},{"$f":"M3","v":"Siggi"},null,null,null,null,{"$f":"S1","v":"Klaus"},{"$f":"S3","v":"Kevin"}]
[{"$f":"A2","v":"Rene"},{"$f":"A6","v":"Stefan"},null,null,null,null,{"$f":"G2","v":"Manuel"},{"$f":"G6","v":"Werner"},null,null,null,null,{"$f":"M2","v":"Anja"},{"$f":"M6","v":"Volker"},null,null,null,null,{"$f":"S2","v":"Nicole"},{"$f":"S6","v":"Sasha"}]
["Rosi P.",{"$f":"A4","v":"Christian"},null,null,null,null,"Otto",{"$f":"G4","v":"Rosi N."},null,null,null,null,"Siggi",{"$f":"M4","v":"Robert"},null,null,null,null,{"$f":"S3","v":"Kevin"},{"$f":"S4","v":"Frank"}]
[{"$f":"A1","v":"Achim"},{"$f":"A2","v":"Rene"},null,null,null,null,{"$f":"G1","v":"Aline"},{"$f":"G2","v":"Manuel"},null,null,null,null,{"$f":"M1","v":"Erich"},{"$f":"M2","v":"Anja"},null,null,null,null,{"$f":"S1","v":"Klaus"},{"$f":"S2","v":"Nicole"}]
[{"$f":"A5","v":"Kerstin"},{"$f":"A6","v":"Stefan"},null,null,null,null,{"$f":"G5","v":"Ralf"},{"$f":"G6","v":"Werner"},null,null,null,null,{"$f":"M5","v":"Dirk"},{"$f":"M6","v":"Volker"},null,null,null,null,{"$f":"S5","v":"Vincent"},{"$f":"S6","v":"Sasha"}]
[]
[{"$f":"A1","v":"Achim"},{"$f":"SUM(C8,C14,D16,C18,C21)","v":0},"Sieger",null,{"$f":"INDEX(A24:A29,MATCH(LARGE(B24:B29,1),B24:B29,0))","v":"Achim"},null,{"$f":"G1","v":"Aline"},{"$f":"SUM(I8,I14,J16,I18,I21)","v":0},"Sieger",null,{"$f":"INDEX(G24:G29,MATCH(LARGE(H24:H29,1),H24:H29,0))","v":"Aline"},null,{"$f":"M1","v":"Erich"},{"$f":"SUM(O8,O14,P16,O18,O21)","v":0},"Sieger",null,{"$f":"INDEX(M24:M29,MATCH(LARGE(N24:N29,1),N24:N29,0))","v":"Erich"},null,{"$f":"S1","v":"Klaus"},{"$f":"SUM(U8,U14,V16,U18,U21)","v":0},"Sieger",null,{"$f":"INDEX(S24:S29,MATCH(LARGE(T24:T29,1),T24:T29,0))","v":"Klaus"}]
[{"$f":"A2","v":"Rene"},{"$f":"SUM(C9,D11,C15,C19,D21)","v":0},"Zweiter",null,{"$f":"INDEX(A24:A29,MATCH(LARGE(B24:B29,2),B24:B29,0))","v":"Achim"},null,{"$f":"G2","v":"Manuel"},{"$f":"SUM(I9,J11,I15,I19,J21)","v":0},"Zweiter",null,{"$f":"INDEX(G24:G29,MATCH(LARGE(H24:H29,2),H24:H29,0))","v":"Aline"},null,{"$f":"M2","v":"Anja"},{"$f":"SUM(O9,P11,O15,O19,P21)","v":0},"Zweiter",null,{"$f":"INDEX(M24:M29,MATCH(LARGE(N24:N29,2),N24:N29,0))","v":"Erich"},null,{"$f":"S2","v":"Nicole"},{"$f":"SUM(U9,V11,U15,U19,V21)","v":0},"Zweiter",null,{"$f":"INDEX(S24:S29,MATCH(LARGE(T24:T29,2),T24:T29,0))","v":"Klaus"}]
["Rosi P.",{"$f":"SUM(C10,D12,D15,D18,C20)","v":0},null,null,{"$f":"INDEX(A24:A29,MATCH(LARGE(B24:B29,3),B24:B29,0))","v":"Achim"},null,"Otto",{"$f":"SUM(I10,J12,J15,J18,I20)","v":0},null,null,{"$f":"INDEX(G24:G29,MATCH(LARGE(H24:H29,3),H24:H29,0))","v":"Aline"},null,"Siggi",{"$f":"SUM(O10,P12,P15,P18,O20)","v":0},null,null,{"$f":"INDEX(M24:M29,MATCH(LARGE(N24:N29,3),N24:N29,0))","v":"Erich"},null,"Kevin",{"$f":"SUM(U10,V12,V15,V18,U20)","v":0},null,null,{"$f":"INDEX(S24:S29,MATCH(LARGE(T24:T29,3),T24:T29,0))","v":"Klaus"}]
["Christian",{"$f":"SUM(D8,C11,D13,C17,D20)","v":0},null,null,{"$f":"INDEX(A24:A29,MATCH(LARGE(B24:B29,4),B24:B29,0))","v":"Achim"},null,"Rosi N.",{"$f":"SUM(J8,I11,J13,I17,J20)","v":0},null,null,{"$f":"INDEX(G24:G29,MATCH(LARGE(H24:H29,4),H24:H29,0))","v":"Aline"},null,"Robert",{"$f":"SUM(P8,O11,P13,O17,P20)","v":0},null,null,{"$f":"INDEX(M24:M29,MATCH(LARGE(N24:N29,4),N24:N29,0))","v":"Erich"},null,"Frank",{"$f":"SUM(V8,U11,V13,U17,V20)","v":0},null,null,{"$f":"INDEX(S24:S29,MATCH(LARGE(T24:T29,4),T24:T29,0))","v":"Klaus"}]
["Kerstin",{"$f":"SUM(,D9,C12,D14,D17,C22)","v":0},null,null,{"$f":"INDEX(A24:A29,MATCH(LARGE(B24:B29,5),B24:B29,0))","v":"Achim"},null,"Ralf",{"$f":"SUM(,J9,I12,J14,J17,I22)","v":0},null,null,{"$f":"INDEX(G24:G29,MATCH(LARGE(H24:H29,5),H24:H29,0))","v":"Aline"},null,"Dirk",{"$f":"SUM(,P9,O12,P14,P17,O22)","v":0},null,null,{"$f":"INDEX(M24:M29,MATCH(LARGE(N24:N29,5),N24:N29,0))","v":"Erich"},null,"Vincent",{"$f":"SUM(,V9,U12,V14,V17,U22)","v":0},null,null,{"$f":"INDEX(S24:S29,MATCH(LARGE(T24:T29,5),T24:T29,0))","v":"Klaus"}]
["Stefan",{"$f":"SUM(D10,C13,C16,D19,D22)","v":0},null,null,{"$f":"INDEX(A24:A29,MATCH(LARGE(B24:B29,6),B24:B29,0))","v":"Achim"},null,"Werner",{"$f":"SUM(J10,I13,I16,J19,J22)","v":0},null,null,{"$f":"INDEX(G24:G29,MATCH(LARGE(H24:H29,6),H24:H29,0))","v":"Aline"},null,"Volker",{"$f":"SUM(P10,O13,O16,P19,P22)","v":0},null,null,{"$f":"INDEX(M24:M29,MATCH(LARGE(N24:N29,6),N24:N29,0))","v":"Erich"},null,"Sasha",{"$f":"SUM(V10,U13,U16,V19,V22)","v":0},null,null,{"$f":"INDEX(S24:S29,MATCH(LARGE(T24:T29,6),T24:T29,0))","v":"Klaus"}]
[null,{"$f":"SUM(B24:B29)","v":0},null,null,null,null,null,{"$f":"SUM(H24:H29)","v":0},null,null,null,null,null,{"$f":"SUM(N24:N29)","v":0},null,null,null,null,null,{"$f":"SUM(T24:T29)","v":0}]
["Viertelfinale 1",null,null,null,null,null,"Viertelfinale 2",null,null,null,null,null,"Viertelfinale 3",null,null,null,null,null,"Viertelfinale 3"]
["Sieger Gruppe 1",null,{"$f":"E24","v":"Achim"},0,{"$f":"INDEX(C32:C33,MATCH(LARGE(D32:D33,1),D32:D33,0))","v":"Achim"},null,"Sieger Gruppe 3",null,{"$f":"Q24","v":"Erich"},0,{"$f":"INDEX(I32:I33,MATCH(LARGE(J32:J33,1),J32:J33,0))","v":"Erich"},null,"Sieger Gruppe 2",null,{"$f":"K24","v":"Aline"},0,{"$f":"INDEX(O32:O33,MATCH(LARGE(P32:P33,1),P32:P33,0))","v":"Aline"},null,"Sieger Gruppe 4",null,{"$f":"W24","v":"Klaus"},0,{"$f":"INDEX(U32:U33,MATCH(LARGE(V32:V33,1),V32:V33,0))","v":"Klaus"}]
["Zweiter Gruppe 3",null,{"$f":"Q25","v":"Erich"},0,{"$f":"INDEX(C32:C33,MATCH(LARGE(D32:D33,2),D32:D33,0))","v":"Achim"},null,"Zweiter Gruppe 1",null,{"$f":"E25","v":"Achim"},0,{"$f":"INDEX(I32:I33,MATCH(LARGE(J32:J33,2),J32:J33,0))","v":"Erich"},null,"Zweiter Gruppe 4",null,{"$f":"W25","v":"Klaus"},0,{"$f":"INDEX(O32:O33,MATCH(LARGE(P32:P33,2),P32:P33,0))","v":"Aline"},null,"Zweiter Gruppe 2",null,{"$f":"K25","v":"Aline"},0,{"$f":"INDEX(U32:U33,MATCH(LARGE(V32:V33,2),V32:V33,0))","v":"Klaus"}]
["Sieger",null,null,null,null,null,"Sieger",null,null,null,null,null,"Sieger",null,null,null,null,null,"Sieger"]
[{"$f":"E32","v":"Achim"},null,null,null,null,null,{"$f":"K32","v":"Erich"},null,null,null,null,null,{"$f":"O32","v":"Aline"},null,null,null,null,null,{"$f":"U32","v":"Klaus"}]
[null,null,null,{"$f":"SUM(D32:D33)","v":0},{"$f":"SUM(D36)/2*0.5","v":0},null,null,null,null,{"$f":"SUM(J32:J33)","v":0},{"$f":"SUM(J36)/2*0.5","v":0},null,null,null,null,{"$f":"SUM(P32:P33)","v":0},{"$f":"SUM(P36)/2*0.5","v":0},null,null,null,null,{"$f":"SUM(V32:V33)","v":0},{"$f":"SUM(V36)/2*0.5","v":0}]
[null,null,null,3,{"$f":"SUM(D37)/2*0.5","v":0.75},null,null,null,null,{"$f":"SUM(J32:J33)","v":0},{"$f":"SUM(J37)/2*0.5","v":0},null,null,null,null,{"$f":"SUM(P32:P33)","v":0},{"$f":"SUM(P37)/2*0.5","v":0},null,null,null,null,{"$f":"SUM(V32:V33)","v":0},{"$f":"SUM(V37)/2*0.5","v":0}]
["Halbfinale 1",null,null,null,null,null,null,null,null,null,null,null,"Halbfinale 2"]
[null,{"$f":"A35","v":"Achim"},null,0,"Sieger:",null,{"$f":"INDEX(B39:B40,MATCH(LARGE(D39:D40,1),D39:D40,0))","v":"Achim"},null,null,null,null,null,null,{"$f":"M35","v":"Aline"},null,0,"Sieger:",null,{"$f":"INDEX(N39:N40,MATCH(LARGE(P39:P40,1),P39:P40,0))","v":"Aline"}]
[null,{"$f":"G35","v":"Erich"},null,0,"Zweiter:",null,{"$f":"INDEX(B39:B40,MATCH(LARGE(D39:D40,2),D39:D40,0))","v":"Achim"},null,null,null,null,null,null,{"$f":"S35","v":"Klaus"},null,0,"Zweiter:",null,{"$f":"INDEX(N39:N40,MATCH(LARGE(P39:P40,2),P39:P40,0))","v":"Aline"}]
[null,null,null,{"$f":"SUM(D39:D40)","v":0},{"$f":"SUM(D41)/2*0.5","v":0},null,null,null,null,null,null,null,null,null,null,null,{"$f":"SUM(P39:P40)","v":0},null,{"$f":"SUM(Q41)/2*0.5","v":0}]
[null,null,null,{"$f":"SUM(D39:D40)","v":0},{"$f":"SUM(D42)/2*0.5","v":0},null,null,"Spiel um Platz 3",null,null,null,null,null,null,null,null,{"$f":"SUM(P39:P40)","v":0},null,{"$f":"SUM(S41)","v":0}]
[]
[null,null,null,null,null,null,null,{"$f":"G40","v":"Achim"},null,0,null,null,{"$f":"INDEX(H44:H45,MATCH(LARGE(J44:J45,1),J44:J45,0))","v":"Achim"},"Dritter"]
[null,null,null,null,null,null,null,{"$f":"S40","v":"Aline"},null,0,null,null,{"$f":"INDEX(H44:H45,MATCH(LARGE(J44:J45,2),J44:J45,0))","v":"Achim"},"Vierter"]
[null,null,null,null,null,null,null,null,null,{"$f":"SUM(J44:J45)","v":0},{"$f":"SUM(J46)/2*0.5","v":0}]
[null,null,null,null,null,null,null,null,null,null,{"$f":"K46","v":0}]
[]
[null,null,null,null,null,null,null,"Finale"]
[]
[null,null,null,null,null,null,null,{"$f":"G39","v":"Achim"},null,null,null,null,{"$f":"INDEX(H51:H52,MATCH(LARGE(J51:J52,1),J51:J52,0))","v":{"$error":"#NUM!"}},"Sieger"]
[null,null,null,null,null,null,null,{"$f":"S39","v":"Aline"},null,null,null,null,{"$f":"INDEX(H51:H52,MATCH(LARGE(J51:J52,2),J51:J52,0))","v":{"$error":"#NUM!"}},"Zweiter"]
[null,null,null,null,null,null,null,null,null,{"$f":"SUM(J51:J52)","v":0},{"$f":"SUM(J53)/2*0.5","v":0}]
[null,null,null,null,null,null,null,null,null,null,{"$f":"K53","v":0}]
[]
[]
[]
[null,"Vorunde","Viertelfinale 1",null,"Viertelfinale 2",null,"Viertelfinale 3",null,"Viertelfinale 4",null,"Halbfinale 1",null,"Halbfinale 2","Spiel um Platz 3",null,"Finale"]
[{"$f":"A1","v":"Achim"},{"$f":"SUM(B30)/6*0.5","v":0},{"$f":"SUMIF(C32:C33,A59,E36)","v":0},null,{"$f":"SUMIF(I32:I33,A59,K36)","v":0},null,{"$f":"SUMIF(O32:O33,A59,Q36)","v":0},null,{"$f":"SUMIF(U32:U33,A59,W36)","v":0},null,{"$f":"SUMIF(B39:B40,A59,E41)","v":0},null,{"$f":"SUMIF(N39:N40,A59,S41)","v":0},{"$f":"SUMIF(H44:H45,A59,K46)","v":0},null,{"$f":"SUMIF(H51:H52,A59,K53)","v":0},{"$f":"SUM(B59:P59)","v":0},null,{"$f":"ROUNDUP(Q59,0)","v":0}]
[{"$f":"A2","v":"Rene"},{"$f":"SUM(B30)/6*0.5","v":0},{"$f":"SUMIF(C32:C33,A60,E36)","v":0},null,{"$f":"SUMIF(I32:I33,A60,K36)","v":0},null,{"$f":"SUMIF(O32:O33,A60,Q36)","v":0},null,{"$f":"SUMIF(U32:U33,A60,W36)","v":0},null,{"$f":"SUMIF(B39:B40,A60,E41)","v":0},null,{"$f":"SUMIF(N39:N40,A60,S41)","v":0},{"$f":"SUMIF(H44:H45,A60,K46)","v":0},null,{"$f":"SUMIF(H51:H52,A60,K53)","v":0},{"$f":"SUM(B60:P60)","v":0},null,{"$f":"ROUNDUP(Q60,0)","v":0}]
["Rosi P.",{"$f":"SUM(B30)/6*0.5","v":0},{"$f":"SUMIF(C32:C33,A61,E36)","v":0},null,{"$f":"SUMIF(I32:I33,A61,K36)","v":0},null,{"$f":"SUMIF(O32:O33,A61,Q36)","v":0},null,{"$f":"SUMIF(U32:U33,A61,W36)","v":0},null,{"$f":"SUMIF(B39:B40,A61,E41)","v":0},null,{"$f":"SUMIF(N39:N40,A61,S41)","v":0},{"$f":"SUMIF(H44:H45,A61,K46)","v":0},null,{"$f":"SUMIF(H51:H52,A61,K53)","v":0},0,null,0]
["Christian",{"$f":"SUM(B30)/6*0.5","v":0},{"$f":"SUMIF(C32:C33,A62,E36)","v":0},null,{"$f":"SUMIF(I32:I33,A62,K36)","v":0},null,{"$f":"SUMIF(O32:O33,A62,Q36)","v":0},null,{"$f":"SUMIF(U32:U33,A62,W36)","v":0},null,{"$f":"SUMIF(B39:B40,A62,E41)","v":0},null,{"$f":"SUMIF(N39:N40,A62,S41)","v":0},{"$f":"SUMIF(H44:H45,A62,K46)","v":0},null,{"$f":"SUMIF(H51:H52,A62,K53)","v":0},0,null,0]
["Kerstin",{"$f":"SUM(B30)/6*0.5","v":0},{"$f":"SUMIF(C32:C33,A63,E36)","v":0},null,{"$f":"SUMIF(I32:I33,A63,K36)","v":0},null,{"$f":"SUMIF(O32:O33,A63,Q36)","v":0},null,{"$f":"SUMIF(U32:U33,A63,W36)","v":0},null,{"$f":"SUMIF(B39:B40,A63,E41)","v":0},null,{"$f":"SUMIF(N39:N40,A63,S41)","v":0},{"$f":"SUMIF(H44:H45,A63,K46)","v":0},null,{"$f":"SUMIF(H51:H52,A63,K53)","v":0},0,null,0]
["Stefan",{"$f":"SUM(B30)/6*0.5","v":0},{"$f":"SUMIF(C32:C33,A64,E36)","v":0},null,{"$f":"SUMIF(I32:I33,A64,K36)","v":0},null,{"$f":"SUMIF(O32:O33,A64,Q36)","v":0},null,{"$f":"SUMIF(U32:U33,A64,W36)","v":0},null,{"$f":"SUMIF(B39:B40,A64,E41)","v":0},null,{"$f":"SUMIF(N39:N40,A64,S41)","v":0},{"$f":"SUMIF(H44:H45,A64,K46)","v":0},null,{"$f":"SUMIF(H51:H52,A64,K53)","v":0},0,null,0]
[{"$f":"G1","v":"Aline"},{"$f":"SUM(H30)/6*0.5","v":0},{"$f":"SUMIF(C32:C33,A65,E36)","v":0},null,{"$f":"SUMIF(I32:I33,A65,K36)","v":0},null,{"$f":"SUMIF(O32:O33,A65,Q36)","v":0},null,{"$f":"SUMIF(U32:U33,A65,W36)","v":0},null,{"$f":"SUMIF(B39:B40,A65,E41)","v":0},null,{"$f":"SUMIF(N39:N40,A65,S41)","v":0},{"$f":"SUMIF(H44:H45,A65,K46)","v":0},null,{"$f":"SUMIF(H51:H52,A65,K53)","v":0},0,null,0]
[{"$f":"G2","v":"Manuel"},{"$f":"SUM(H30)/6*0.5","v":0},{"$f":"SUMIF(C32:C33,A66,E36)","v":0},null,{"$f":"SUMIF(I32:I33,A66,K36)","v":0},null,{"$f":"SUMIF(O32:O33,A66,Q36)","v":0},null,{"$f":"SUMIF(U32:U33,A66,W36)","v":0},null,{"$f":"SUMIF(B39:B40,A66,E41)","v":0},null,{"$f":"SUMIF(N39:N40,A66,S41)","v":0},{"$f":"SUMIF(H44:H45,A66,K46)","v":0},null,{"$f":"SUMIF(H51:H52,A66,K53)","v":0},0,null,0]
["Otto",{"$f":"SUM(H30)/6*0.5","v":0},{"$f":"SUMIF(C32:C33,A67,E36)","v":0},null,{"$f":"SUMIF(I32:I33,A67,K36)","v":0},null,{"$f":"SUMIF(O32:O33,A67,Q36)","v":0},null,{"$f":"SUMIF(U32:U33,A67,W36)","v":0},null,{"$f":"SUMIF(B39:B40,A67,E41)","v":0},null,{"$f":"SUMIF(N39:N40,A67,S41)","v":0},{"$f":"SUMIF(H44:H45,A67,K46)","v":0},null,{"$f":"SUMIF(H51:H52,A67,K53)","v":0},0,null,0]
["Rosi N.",{"$f":"SUM(H30)/6*0.5","v":0},{"$f":"SUMIF(C32:C33,A68,E36)","v":0},null,{"$f":"SUMIF(I32:I33,A68,K36)","v":0},null,{"$f":"SUMIF(O32:O33,A68,Q36)","v":0},null,{"$f":"SUMIF(U32:U33,A68,W36)","v":0},null,{"$f":"SUMIF(B39:B40,A68,E41)","v":0},null,{"$f":"SUMIF(N39:N40,A68,S41)","v":0},{"$f":"SUMIF(H44:H45,A68,K46)","v":0},null,{"$f":"SUMIF(H51:H52,A68,K53)","v":0},0,null,0]
["Ralf",{"$f":"SUM(H30)/6*0.5","v":0},{"$f":"SUMIF(C32:C33,A69,E36)","v":0},null,{"$f":"SUMIF(I32:I33,A69,K36)","v":0},null,{"$f":"SUMIF(O32:O33,A69,Q36)","v":0},null,{"$f":"SUMIF(U32:U33,A69,W36)","v":0},null,{"$f":"SUMIF(B39:B40,A69,E41)","v":0},null,{"$f":"SUMIF(N39:N40,A69,S41)","v":0},{"$f":"SUMIF(H44:H45,A69,K46)","v":0},null,{"$f":"SUMIF(H51:H52,A69,K53)","v":0},0,null,0]
["Werner",{"$f":"SUM(H30)/6*0.5","v":0},{"$f":"SUMIF(C32:C33,A70,E36)","v":0},null,{"$f":"SUMIF(I32:I33,A70,K36)","v":0},null,{"$f":"SUMIF(O32:O33,A70,Q36)","v":0},null,{"$f":"SUMIF(U32:U33,A70,W36)","v":0},null,{"$f":"SUMIF(B39:B40,A70,E41)","v":0},null,{"$f":"SUMIF(N39:N40,A70,S41)","v":0},{"$f":"SUMIF(H44:H45,A70,K46)","v":0},null,{"$f":"SUMIF(H51:H52,A70,K53)","v":0},0,null,0]
[{"$f":"M1","v":"Erich"},{"$f":"SUM(N30)/6*0.5","v":0},{"$f":"SUMIF(C32:C33,A59,E36)","v":0},null,{"$f":"SUMIF(I32:I33,A71,K36)","v":0},null,{"$f":"SUMIF(O32:O33,A71,Q36)","v":0},null,{"$f":"SUMIF(U32:U33,A71,W36)","v":0},null,{"$f":"SUMIF(B39:B40,A71,E41)","v":0},null,{"$f":"SUMIF(N39:N40,A71,S41)","v":0},{"$f":"SUMIF(H44:H45,A71,K46)","v":0},null,{"$f":"SUMIF(H51:H52,A71,K53)","v":0},0,null,0]
[{"$f":"M2","v":"Anja"},{"$f":"SUM(N30)/6*0.5","v":0},{"$f":"SUMIF(C32:C33,A72,E36)","v":0},null,{"$f":"SUMIF(I32:I33,A72,K36)","v":0},null,{"$f":"SUMIF(O32:O33,A72,Q36)","v":0},null,{"$f":"SUMIF(U32:U33,A72,W36)","v":0},null,{"$f":"SUMIF(B39:B40,A72,E41)","v":0},null,{"$f":"SUMIF(N39:N40,A72,S41)","v":0},{"$f":"SUMIF(H44:H45,A72,K46)","v":0},null,{"$f":"SUMIF(H51:H52,A72,K53)","v":0},0,null,0]
["Siggi",{"$f":"SUM(N30)/6*0.5","v":0},{"$f":"SUMIF(C32:C33,A73,E36)","v":0},null,{"$f":"SUMIF(I32:I33,A73,K36)","v":0},null,{"$f":"SUMIF(O32:O33,A73,Q36)","v":0},null,{"$f":"SUMIF(U32:U33,A73,W36)","v":0},null,{"$f":"SUMIF(B39:B40,A73,E41)","v":0},null,{"$f":"SUMIF(N39:N40,A73,S41)","v":0},{"$f":"SUMIF(H44:H45,A73,K46)","v":0},null,{"$f":"SUMIF(H51:H52,A73,K53)","v":0},0,null,0]
["Robert",{"$f":"SUM(N30)/6*0.5","v":0},{"$f":"SUMIF(C32:C33,A74,E36)","v":0},null,{"$f":"SUMIF(I32:I33,A74,K36)","v":0},null,{"$f":"SUMIF(O32:O33,A74,Q36)","v":0},null,{"$f":"SUMIF(U32:U33,A74,W36)","v":0},null,{"$f":"SUMIF(B39:B40,A74,E41)","v":0},null,{"$f":"SUMIF(N39:N40,A74,S41)","v":0},{"$f":"SUMIF(H44:H45,A74,K46)","v":0},null,{"$f":"SUMIF(H51:H52,A74,K53)","v":0},0,null,0]
["Dirk",{"$f":"SUM(N30)/6*0.5","v":0},{"$f":"SUMIF(C32:C33,A75,E36)","v":0},null,{"$f":"SUMIF(I32:I33,A75,K36)","v":0},null,{"$f":"SUMIF(O32:O33,A75,Q36)","v":0},null,{"$f":"SUMIF(U32:U33,A75,W36)","v":0},null,{"$f":"SUMIF(B39:B40,A75,E41)","v":0},null,{"$f":"SUMIF(N39:N40,A75,S41)","v":0},{"$f":"SUMIF(H44:H45,A75,K46)","v":0},null,{"$f":"SUMIF(H51:H52,A75,K53)","v":0},0,null,0]
["Volker",{"$f":"SUM(N30)/6*0.5","v":0},{"$f":"SUMIF(C32:C33,A76,E36)","v":0},null,{"$f":"SUMIF(I32:I33,A76,K36)","v":0},null,{"$f":"SUMIF(O32:O33,A76,Q36)","v":0},null,{"$f":"SUMIF(U32:U33,A76,W36)","v":0},null,{"$f":"SUMIF(B39:B40,A76,E41)","v":0},null,{"$f":"SUMIF(N39:N40,A76,S41)","v":0},{"$f":"SUMIF(H44:H45,A76,K46)","v":0},null,{"$f":"SUMIF(H51:H52,A76,K53)","v":0},0,null,0]
[{"$f":"S1","v":"Klaus"},{"$f":"SUM(T30)/6*0.5","v":0},{"$f":"SUMIF(C32:C33,A77,E36)","v":0},null,{"$f":"SUMIF(I32:I33,A77,K36)","v":0},null,{"$f":"SUMIF(O32:O33,A77,Q36)","v":0},null,{"$f":"SUMIF(U32:U33,A77,W36)","v":0},null,{"$f":"SUMIF(B39:B40,A77,E41)","v":0},null,{"$f":"SUMIF(N39:N40,A77,S41)","v":0},{"$f":"SUMIF(H44:H45,A77,K46)","v":0},null,{"$f":"SUMIF(H51:H52,A77,K53)","v":0},0,null,0]
[{"$f":"S2","v":"Nicole"},{"$f":"SUM(T30)/6*0.5","v":0},{"$f":"SUMIF(C32:C33,A78,E36)","v":0},null,{"$f":"SUMIF(I32:I33,A78,K36)","v":0},null,{"$f":"SUMIF(O32:O33,A78,Q36)","v":0},null,{"$f":"SUMIF(U32:U33,A78,W36)","v":0},null,{"$f":"SUMIF(B39:B40,A78,E41)","v":0},null,{"$f":"SUMIF(N39:N40,A78,S41)","v":0},{"$f":"SUMIF(H44:H45,A78,K46)","v":0},null,{"$f":"SUMIF(H51:H52,A78,K53)","v":0},0,null,0]
["Kevin",{"$f":"SUM(T30)/6*0.5","v":0},{"$f":"SUMIF(C32:C33,A79,E36)","v":0},null,{"$f":"SUMIF(I32:I33,A79,K36)","v":0},null,{"$f":"SUMIF(O32:O33,A79,Q36)","v":0},null,{"$f":"SUMIF(U32:U33,A79,W36)","v":0},null,{"$f":"SUMIF(B39:B40,A79,E41)","v":0},null,{"$f":"SUMIF(N39:N40,A79,S41)","v":0},{"$f":"SUMIF(H44:H45,A79,K46)","v":0},null,{"$f":"SUMIF(H51:H52,A79,K53)","v":0},0,null,0]
["Frank",{"$f":"SUM(T30)/6*0.5","v":0},{"$f":"SUMIF(C32:C33,A80,E36)","v":0},null,{"$f":"SUMIF(I32:I33,A80,K36)","v":0},null,{"$f":"SUMIF(O32:O33,A80,Q36)","v":0},null,{"$f":"SUMIF(U32:U33,A80,W36)","v":0},null,{"$f":"SUMIF(B39:B40,A80,E41)","v":0},null,{"$f":"SUMIF(N39:N40,A80,S41)","v":0},{"$f":"SUMIF(H44:H45,A80,K46)","v":0},null,{"$f":"SUMIF(H51:H52,A80,K53)","v":0},0,null,0]
["Vincent",{"$f":"SUM(T30)/6*0.5","v":0},{"$f":"SUMIF(C32:C33,A81,E36)","v":0},null,{"$f":"SUMIF(I32:I33,A81,K36)","v":0},null,{"$f":"SUMIF(O32:O33,A81,Q36)","v":0},null,{"$f":"SUMIF(U32:U33,A81,W36)","v":0},null,{"$f":"SUMIF(B39:B40,A81,E41)","v":0},null,{"$f":"SUMIF(N39:N40,A81,S41)","v":0},{"$f":"SUMIF(H44:H45,A81,K46)","v":0},null,{"$f":"SUMIF(H51:H52,A81,K53)","v":0},0,null,0]
["Sasha",{"$f":"SUM(T30)/6*0.5","v":0},{"$f":"SUMIF(C32:C33,A82,E36)","v":0},null,{"$f":"SUMIF(I32:I33,A82,K36)","v":0},null,{"$f":"SUMIF(O32:O33,A82,Q36)","v":0},null,{"$f":"SUMIF(U32:U33,A82,W36)","v":0},null,{"$f":"SUMIF(B39:B40,A82,E41)","v":0},null,{"$f":"SUMIF(N39:N40,A82,S41)","v":0},{"$f":"SUMIF(H44:H45,A82,K46)","v":0},null,{"$f":"SUMIF(H51:H52,A82,K53)","v":0},0,null,0]
[null,null,null,null,null,null,null,null,null,null,null,null,null,null,null,null,{"$f":"SUM(Q59:Q82)","v":0},null,{"$f":"SUM(S59:S82)","v":0}]

{"sheet":"Tabelle 7er","index":3,"n_rows":96,"n_cols":23,"rows_kept":96,"cut":false,"hidden":false,"merged":[[93,2,93,3],[93,4,93,5],[93,6,93,7],[93,8,93,9],[93,10,93,11],[93,13,93,14],[92,2,92,3],[92,4,92,5],[92,6,92,7],[92,8,92,9],[92,10,92,11],[92,13,92,14],[91,2,91,3],[91,4,91,5],[91,6,91,7],[91,8,91,9],[91,10,91,11],[91,13,91,14],[90,2,90,3],[90,4,90,5],[90,6,90,7],[90,8,90,9],[90,10,90,11],[90,13,90,14],[89,2,89,3],[89,4,89,5],[89,6,89,7],[89,8,89,9],[89,10,89,11],[89,13,89,14],[88,2,88,3],[88,4,88,5],[88,6,88,7],[88,8,88,9],[88,10,88,11],[88,13,88,14],[86,2,86,3],[86,4,86,5],[86,6,86,7],[86,8,86,9],[86,10,86,11],[86,13,86,14],[85,2,85,3],[85,4,85,5],[85,6,85,7],[85,8,85,9],[85,10,85,11],[85,13,85,14],[84,2,84,3],[84,4,84,5],[84,6,84,7],[84,8,84,9],[84,10,84,11],[84,13,84,14],[83,2,83,3],[83,4,83,5],[83,6,83,7],[83,8,83,9],[83,10,83,11],[83,13,83,14],[82,2,82,3],[82,4,82,5],[82,6,82,7],[82,8,82,9],[82,10,82,11],[82,13,82,14],[81,2,81,3],[81,4,81,5],[81,6,81,7],[81,8,81,9],[81,10,81,11],[81,13,81,14],[79,2,79,3],[79,4,79,5],[79,6,79,7],[79,8,79,9],[79,10,79,11],[79,13,79,14],[78,2,78,3],[78,4,78,5],[78,6,78,7],[78,8,78,9],[78,10,78,11],[78,13,78,14],[77,2,77,3],[77,4,77,5],[77,6,77,7],[77,8,77,9],[77,10,77,11],[77,13,77,14],[76,2,76,3],[76,4,76,5],[76,6,76,7],[76,8,76,9],[76,10,76,11],[76,13,76,14],[75,4,75,5],[75,6,75,7],[75,8,75,9],[75,10,75,11],[75,13,75,14],[74,2,74,3],[74,4,74,5],[74,6,74,7],[74,8,74,9],[74,10,74,11],[74,13,74,14],[72,2,72,3],[72,4,72,5],[72,6,72,7],[72,8,72,9],[72,10,72,11],[72,13,72,14],[71,2,71,3],[71,4,71,5],[71,6,71,7],[71,8,71,9],[71,10,71,11],[71,13,71,14],[70,2,70,3],[70,4,70,5],[70,6,70,7],[70,8,70,9],[70,10,70,11],[70,13,70,14],[69,2,69,3],[69,4,69,5],[69,6,69,7],[69,8,69,9],[69,10,69,11],[69,13,69,14],[68,2,68,3],[68,4,68,5],[68,6,68,7],[68,8,68,9],[68,10,68,11],[68,13,68,14],[66,15,66,16],[67,2,67,3],[67,4,67,5],[67,6,67,7],[67,8,67,9],[67,10,67,11],[67,13,67,14],[66,2,66,3],[66,4,66,5],[66,6,66,7],[66,8,66,9],[66,10,66,11],[66,13,66,14],[57,7,58,14],[59,7,59,8],[59,10,59,11],[59,13,59,14],[60,7,60,8],[60,10,60,11],[60,13,60,14],[50,7,51,14],[52,7,52,8],[52,10,52,11],[52,13,52,14],[53,7,53,8],[53,10,53,11],[53,13,53,14],[47,1,47,2],[47,13,47,14],[47,16,47,17],[48,1,48,2],[48,13,48,14],[48,16,48,17],[43,0,43,4],[43,6,43,10],[43,12,43,16],[43,18,43,22],[46,0,46,10],[46,12,46,22],[41,0,41,1],[41,6,41,7],[41,12,41,13],[41,18,41,19],[42,0,42,4],[42,6,42,10],[42,12,42,16],[42,18,42,22],[39,0,39,4],[39,6,39,10],[39,12,39,16],[39,18,39,22],[40,0,40,1],[40,6,40,7],[40,12,40,13],[40,18,40,19],[30,2,30,3],[30,8,30,9],[30,14,30,15],[30,20,30,21],[31,2,31,3],[31,8,31,9],[31,14,31,15],[31,20,31,21],[73,2,73,3],[73,4,73,5],[73,6,73,7],[73,8,73,9],[73,10,73,11],[73,13,73,14],[94,2,94,3],[94,6,94,7],[94,8,94,9],[94,10,94,11],[94,13,94,14],[87,2,87,3],[87,4,87,5],[87,6,87,7],[87,8,87,9],[87,10,87,11],[87,13,87,14],[80,4,80,5],[80,2,80,3],[80,6,80,7],[80,8,80,9],[80,10,80,11],[80,13,80,14],[75,2,75,3]]}
[{"$f":"'Start (2)'!C2","v":"Achim"},null,null,null,null,null,{"$f":"'Start (2)'!C9","v":"Christian"},null,null,null,null,null,{"$f":"'Start (2)'!C16","v":"Ralf"},null,null,null,null,null,{"$f":"'Start (2)'!C23","v":"Rene"}]
[{"$f":"'Start (2)'!C3","v":"Frank"},null,null,null,null,null,{"$f":"'Start (2)'!C10","v":"Klaus"},null,null,null,null,null,{"$f":"'Start (2)'!C17","v":"Paul"},null,null,null,null,null,{"$f":"'Start (2)'!C24","v":"Otto"}]
[{"$f":"'Start (2)'!C4","v":"Fritz"},null,null,null,null,null,{"$f":"'Start (2)'!C11","v":"Stefan"},null,null,null,null,null,{"$f":"'Start (2)'!C18","v":"Aline"},null,null,null,null,null,{"$f":"'Start (2)'!C25","v":"Erich"}]
[{"$f":"'Start (2)'!C5","v":"Dirk"},null,null,null,null,null,{"$f":"'Start (2)'!C12","v":"Kerstin"},null,null,null,null,null,{"$f":"'Start (2)'!C19","v":"Manuel"},null,null,null,null,null,{"$f":"'Start (2)'!C26","v":"Nicole"}]
[{"$f":"'Start (2)'!C6","v":"Vincent"},null,null,null,null,null,{"$f":"'Start (2)'!C13","v":"Rosi P."},null,null,null,null,null,{"$f":"'Start (2)'!C20","v":"Manni"},null,null,null,null,null,{"$f":"'Start (2)'!C27","v":"Werner"}]
[{"$f":"'Start (2)'!C7","v":"Rosi N."},null,null,null,null,null,{"$f":"'Start (2)'!C14","v":"Volker"},null,null,null,null,null,{"$f":"'Start (2)'!C21","v":"Sasha"},null,null,null,null,null,{"$f":"'Start (2)'!C28","v":"Hein"}]
[{"$f":"'Start (2)'!C8","v":"Siggi"},null,null,null,null,null,{"$f":"'Start (2)'!C15","v":"Anja"},null,null,null,null,null,{"$f":"'Start (2)'!C22","v":"Robert"},null,null,null,null,null,{"$f":"'Start (2)'!C29","v":"Kevin"}]
[]
[{"$f":"A7","v":"Siggi"},{"$f":"A5","v":"Vincent"},null,null,null,null,{"$f":"G1","v":"Christian"},{"$f":"G2","v":"Klaus"},null,null,null,null,{"$f":"M1","v":"Ralf"},{"$f":"M2","v":"Paul"},null,null,null,null,{"$f":"S1","v":"Rene"},{"$f":"S2","v":"Otto"}]
[{"$f":"A4","v":"Dirk"},{"$f":"A6","v":"Rosi N."},null,null,null,null,{"$f":"G3","v":"Stefan"},{"$f":"G4","v":"Kerstin"},null,null,null,null,{"$f":"M3","v":"Aline"},{"$f":"M4","v":"Manuel"},null,null,null,null,{"$f":"S3","v":"Erich"},{"$f":"S4","v":"Nicole"}]
[{"$f":"A3","v":"Fritz"},{"$f":"A2","v":"Frank"},null,null,null,null,{"$f":"G5","v":"Rosi P."},{"$f":"G6","v":"Volker"},null,null,null,null,{"$f":"M5","v":"Manni"},{"$f":"M6","v":"Sasha"},null,null,null,null,{"$f":"S5","v":"Werner"},{"$f":"S6","v":"Hein"}]
[{"$f":"A1","v":"Achim"},{"$f":"A5","v":"Vincent"},null,null,null,null,{"$f":"G7","v":"Anja"},{"$f":"H9","v":"Klaus"},null,null,null,null,{"$f":"M7","v":"Robert"},{"$f":"M2","v":"Paul"},null,null,null,null,{"$f":"S7","v":"Kevin"},{"$f":"T9","v":"Otto"}]
[{"$f":"A7","v":"Siggi"},{"$f":"A4","v":"Dirk"},null,null,null,null,{"$f":"G1","v":"Christian"},{"$f":"G10","v":"Stefan"},null,null,null,null,{"$f":"M1","v":"Ralf"},{"$f":"M3","v":"Aline"},null,null,null,null,{"$f":"S1","v":"Rene"},{"$f":"S3","v":"Erich"}]
[{"$f":"A6","v":"Rosi N."},{"$f":"A3","v":"Fritz"},null,null,null,null,{"$f":"H10","v":"Kerstin"},{"$f":"G11","v":"Rosi P."},null,null,null,null,{"$f":"M4","v":"Manuel"},{"$f":"M5","v":"Manni"},null,null,null,null,{"$f":"S4","v":"Nicole"},{"$f":"S5","v":"Werner"}]
[{"$f":"A2","v":"Frank"},{"$f":"A1","v":"Achim"},null,null,null,null,{"$f":"G6","v":"Volker"},{"$f":"G12","v":"Anja"},null,null,null,null,{"$f":"M6","v":"Sasha"},{"$f":"M7","v":"Robert"},null,null,null,null,{"$f":"S6","v":"Hein"},{"$f":"S7","v":"Kevin"}]
[{"$f":"A5","v":"Vincent"},{"$f":"A4","v":"Dirk"},null,null,null,null,{"$f":"H12","v":"Klaus"},{"$f":"H13","v":"Stefan"},null,null,null,null,{"$f":"M2","v":"Paul"},{"$f":"M3","v":"Aline"},null,null,null,null,{"$f":"T12","v":"Otto"},{"$f":"S3","v":"Erich"}]
[{"$f":"A7","v":"Siggi"},{"$f":"A3","v":"Fritz"},null,null,null,null,{"$f":"G1","v":"Christian"},{"$f":"H14","v":"Rosi P."},null,null,null,null,{"$f":"M1","v":"Ralf"},{"$f":"M5","v":"Manni"},null,null,null,null,{"$f":"S1","v":"Rene"},{"$f":"S5","v":"Werner"}]
[{"$f":"A6","v":"Rosi N."},{"$f":"A1","v":"Achim"},null,null,null,null,{"$f":"G14","v":"Kerstin"},{"$f":"H15","v":"Anja"},null,null,null,null,{"$f":"M4","v":"Manuel"},{"$f":"M7","v":"Robert"},null,null,null,null,{"$f":"S4","v":"Nicole"},{"$f":"S7","v":"Kevin"}]
[{"$f":"A2","v":"Frank"},{"$f":"A4","v":"Dirk"},null,null,null,null,{"$f":"G15","v":"Volker"},{"$f":"H16","v":"Stefan"},null,null,null,null,{"$f":"M6","v":"Sasha"},{"$f":"M3","v":"Aline"},null,null,null,null,{"$f":"S6","v":"Hein"},{"$f":"S3","v":"Erich"}]
[{"$f":"A5","v":"Vincent"},{"$f":"A3","v":"Fritz"},null,null,null,null,{"$f":"G16","v":"Klaus"},{"$f":"H17","v":"Rosi P."},null,null,null,null,{"$f":"M2","v":"Paul"},{"$f":"M5","v":"Manni"},null,null,null,null,{"$f":"S16","v":"Otto"},{"$f":"S5","v":"Werner"}]
[{"$f":"A1","v":"Achim"},{"$f":"A7","v":"Siggi"},null,null,null,null,{"$f":"H18","v":"Anja"},{"$f":"G17","v":"Christian"},null,null,null,null,{"$f":"M7","v":"Robert"},{"$f":"M1","v":"Ralf"},null,null,null,null,{"$f":"S7","v":"Kevin"},{"$f":"S1","v":"Rene"}]
[{"$f":"A6","v":"Rosi N."},{"$f":"A2","v":"Frank"},null,null,null,null,{"$f":"G18","v":"Kerstin"},{"$f":"G19","v":"Volker"},null,null,null,null,{"$f":"M4","v":"Manuel"},{"$f":"M6","v":"Sasha"},null,null,null,null,{"$f":"S4","v":"Nicole"},{"$f":"S6","v":"Hein"}]
[{"$f":"A4","v":"Dirk"},{"$f":"A1","v":"Achim"},null,null,null,null,{"$f":"H19","v":"Stefan"},{"$f":"G21","v":"Anja"},null,null,null,null,{"$f":"M3","v":"Aline"},{"$f":"M7","v":"Robert"},null,null,null,null,{"$f":"S3","v":"Erich"},{"$f":"S21","v":"Kevin"}]
[{"$f":"A5","v":"Vincent"},{"$f":"A6","v":"Rosi N."},null,null,null,null,{"$f":"G20","v":"Klaus"},{"$f":"G22","v":"Kerstin"},null,null,null,null,{"$f":"M2","v":"Paul"},{"$f":"M4","v":"Manuel"},null,null,null,null,{"$f":"S20","v":"Otto"},{"$f":"S3","v":"Erich"}]
[{"$f":"A2","v":"Frank"},{"$f":"A7","v":"Siggi"},null,null,null,null,{"$f":"H22","v":"Volker"},{"$f":"H21","v":"Christian"},null,null,null,null,{"$f":"M6","v":"Sasha"},{"$f":"M1","v":"Ralf"},null,null,null,null,{"$f":"S6","v":"Hein"},{"$f":"S1","v":"Rene"}]
[{"$f":"A3","v":"Fritz"},{"$f":"A1","v":"Achim"},null,null,null,null,{"$f":"H20","v":"Rosi P."},{"$f":"G21","v":"Anja"},null,null,null,null,{"$f":"M5","v":"Manni"},{"$f":"M7","v":"Robert"},null,null,null,null,{"$f":"S5","v":"Werner"},{"$f":"S7","v":"Kevin"}]
[{"$f":"A5","v":"Vincent"},{"$f":"A2","v":"Frank"},null,null,null,null,{"$f":"G24","v":"Klaus"},{"$f":"G25","v":"Volker"},null,null,null,null,{"$f":"M2","v":"Paul"},{"$f":"M6","v":"Sasha"},null,null,null,null,{"$f":"S24","v":"Otto"},{"$f":"S6","v":"Hein"}]
[{"$f":"A7","v":"Siggi"},{"$f":"A6","v":"Rosi N."},null,null,null,null,{"$f":"H25","v":"Christian"},{"$f":"H24","v":"Kerstin"},null,null,null,null,{"$f":"M1","v":"Ralf"},{"$f":"M4","v":"Manuel"},null,null,null,null,{"$f":"S1","v":"Rene"},{"$f":"S4","v":"Nicole"}]
[{"$f":"A4","v":"Dirk"},{"$f":"A3","v":"Fritz"},null,null,null,null,{"$f":"G23","v":"Stefan"},{"$f":"G26","v":"Rosi P."},null,null,null,null,{"$f":"M3","v":"Aline"},{"$f":"M5","v":"Manni"},null,null,null,null,{"$f":"S3","v":"Erich"},{"$f":"S5","v":"Werner"}]
[]
[{"$f":"A1","v":"Achim"},{"$f":"SUM(C9,C15,D17,C19,C22)","v":0},"Sieger",null,{"$f":"INDEX(A31:A37,MATCH(LARGE(B31:B37,1),B31:B37,0))","v":"Achim"},null,{"$f":"G1","v":"Christian"},{"$f":"SUM(I9,I15,J17,I19,I22)","v":0},"Sieger",null,{"$f":"INDEX(G31:G37,MATCH(LARGE(H31:H37,1),H31:H37,0))","v":"Christian"},null,{"$f":"M1","v":"Ralf"},{"$f":"SUM(O9,O15,P17,O19,O22)","v":0},"Sieger",null,{"$f":"INDEX(M31:M37,MATCH(LARGE(N31:N37,1),N31:N37,0))","v":"Ralf"},null,{"$f":"S1","v":"Rene"},{"$f":"SUM(U9,U15,V17,U19,U22)","v":0},"Sieger",null,{"$f":"INDEX(S31:S37,MATCH(LARGE(T31:T37,1),T31:T37,0))","v":"Rene"}]
["Frank",{"$f":"SUM(C10,D12,C16,C20,D22)","v":0},"Zweiter",null,{"$f":"INDEX(A31:A37,MATCH(LARGE(B31:B37,2),B31:B37,0))","v":"Achim"},null,"Klaus",{"$f":"SUM(I10,J12,I16,I20,J22)","v":0},"Zweiter",null,{"$f":"INDEX(G31:G37,MATCH(LARGE(H31:H37,2),H31:H37,0))","v":"Christian"},null,"Paul",{"$f":"SUM(O10,P12,O16,O20,P22)","v":0},"Zweiter",null,{"$f":"INDEX(M31:M37,MATCH(LARGE(N31:N37,2),N31:N37,0))","v":"Ralf"},null,"Otto",{"$f":"SUM(U10,V12,U16,U20,V22)","v":0},"Zweiter",null,{"$f":"INDEX(S31:S37,MATCH(LARGE(T31:T37,2),T31:T37,0))","v":"Rene"}]
["Fritz",{"$f":"SUM(C11,D13,D16,D19,C21)","v":0},null,null,{"$f":"INDEX(A31:A37,MATCH(LARGE(B31:B37,3),B31:B37,0))","v":"Achim"},null,"Stefan",{"$f":"SUM(I11,J13,J16,J19,I21)","v":0},null,null,{"$f":"INDEX(G31:G37,MATCH(LARGE(H31:H37,3),H31:H37,0))","v":"Christian"},null,"Aline",{"$f":"SUM(O11,P13,P16,P19,O21)","v":0},null,null,{"$f":"INDEX(M31:M37,MATCH(LARGE(N31:N37,3),N31:N37,0))","v":"Ralf"},null,"Erich",{"$f":"SUM(U11,V13,V16,V19,U21)","v":0},null,null,{"$f":"INDEX(S31:S37,MATCH(LARGE(T31:T37,3),T31:T37,0))","v":"Rene"}]
["Dirk",{"$f":"SUM(D9,C12,D14,C18,D21)","v":0},null,null,{"$f":"INDEX(A31:A37,MATCH(LARGE(B31:B37,4),B31:B37,0))","v":"Achim"},null,"Kerstin",{"$f":"SUM(J9,I12,J14,I18,J21)","v":0},null,null,{"$f":"INDEX(G31:G37,MATCH(LARGE(H31:H37,4),H31:H37,0))","v":"Christian"},null,"Manuel",{"$f":"SUM(P9,O12,P14,O18,P21)","v":0},null,null,{"$f":"INDEX(M31:M37,MATCH(LARGE(N31:N37,4),N31:N37,0))","v":"Ralf"},null,"Nicole",{"$f":"SUM(V9,U12,V14,U18,V21)","v":0},null,null,{"$f":"INDEX(S31:S37,MATCH(LARGE(T31:T37,4),T31:T37,0))","v":"Rene"}]
["Vincent",{"$f":"SUM(,D10,C13,D15,D18,C23)","v":0},null,null,{"$f":"INDEX(A31:A37,MATCH(LARGE(B31:B37,5),B31:B37,0))","v":"Achim"},null,"Rosi P.",{"$f":"SUM(,J10,I13,J15,J18,I23)","v":0},null,null,{"$f":"INDEX(G31:G37,MATCH(LARGE(H31:H37,5),H31:H37,0))","v":"Christian"},null,"Manni",{"$f":"SUM(,P10,O13,P15,P18,O23)","v":0},null,null,{"$f":"INDEX(M31:M37,MATCH(LARGE(N31:N37,5),N31:N37,0))","v":"Ralf"},null,"Werner",{"$f":"SUM(,V10,U13,V15,V18,U23)","v":0},null,null,{"$f":"INDEX(S31:S37,MATCH(LARGE(T31:T37,5),T31:T37,0))","v":"Rene"}]
["Rosi N.",{"$f":"SUM(D11,C14,C17,D20,D23)","v":0},null,null,{"$f":"INDEX(A31:A37,MATCH(LARGE(B31:B37,6),B31:B37,0))","v":"Achim"},null,"Volker",{"$f":"SUM(J11,I14,I17,J20,J23)","v":0},null,null,{"$f":"INDEX(G31:G37,MATCH(LARGE(H31:H37,6),H31:H37,0))","v":"Christian"},null,"Sasha",{"$f":"SUM(P11,O14,O17,P20,P23)","v":0},null,null,{"$f":"INDEX(M31:M37,MATCH(LARGE(N31:N37,6),N31:N37,0))","v":"Ralf"},null,"Hein",{"$f":"SUM(V11,U14,U17,V20,V23)","v":0},null,null,{"$f":"INDEX(S31:S37,MATCH(LARGE(T31:T37,6),T31:T37,0))","v":"Rene"}]
["Siggi",{"$f":"SUM(D12,C15,C18,D21,D24)","v":0},null,null,{"$f":"INDEX(A31:A37,MATCH(LARGE(B31:B37,7),B31:B37,0))","v":"Achim"},null,"Anja",{"$f":"SUM(J12,I15,I18,J21,J24)","v":0},null,null,{"$f":"INDEX(G31:G37,MATCH(LARGE(H31:H37,7),H31:H37,0))","v":"Christian"},null,"Robert",{"$f":"SUM(P12,O15,O18,P21,P24)","v":0},null,null,{"$f":"INDEX(M31:M37,MATCH(LARGE(N31:N37,7),N31:N37,0))","v":"Ralf"},null,"Kevin",{"$f":"SUM(V12,U15,U18,V21,V24)","v":0},null,null,{"$f":"INDEX(S31:S37,MATCH(LARGE(T31:T37,7),T31:T37,0))","v":"Rene"}]
[]
[null,{"$f":"SUM(B31:B37)","v":0},null,null,null,null,null,{"$f":"SUM(H31:H38)","v":0},null,null,null,null,null,{"$f":"SUM(N31:N36)","v":0},null,null,null,null,null,{"$f":"SUM(T31:T36)","v":0}]
["Viertelfinale 1",null,null,null,null,null,"Viertelfinale 2",null,null,null,null,null,"Viertelfinale 3",null,null,null,null,null,"Viertelfinale 3"]
["Sieger Gruppe 1",null,{"$f":"E31","v":"Achim"},0,{"$f":"INDEX(C41:C42,MATCH(LARGE(D41:D42,1),D41:D42,0))","v":"Achim"},null,"Sieger Gruppe 3",null,{"$f":"Q31","v":"Ralf"},0,{"$f":"INDEX(I41:I42,MATCH(LARGE(J41:J42,1),J41:J42,0))","v":"Ralf"},null,"Sieger Gruppe 2",null,{"$f":"K31","v":"Christian"},0,{"$f":"INDEX(O41:O42,MATCH(LARGE(P41:P42,1),P41:P42,0))","v":"Christian"},null,"Sieger Gruppe 4",null,{"$f":"W31","v":"Rene"},0,{"$f":"INDEX(U41:U42,MATCH(LARGE(V41:V42,1),V41:V42,0))","v":"Rene"}]
["Zweiter Gruppe 3",null,{"$f":"Q32","v":"Ralf"},0,{"$f":"INDEX(C41:C42,MATCH(LARGE(D41:D42,2),D41:D42,0))","v":"Achim"},null,"Zweiter Gruppe 1",null,{"$f":"E32","v":"Achim"},0,{"$f":"INDEX(I41:I42,MATCH(LARGE(J41:J42,2),J41:J42,0))","v":"Ralf"},null,"Zweiter Gruppe 4",null,{"$f":"W32","v":"Rene"},0,{"$f":"INDEX(O41:O42,MATCH(LARGE(P41:P42,2),P41:P42,0))","v":"Christian"},null,"Zweiter Gruppe 2",null,{"$f":"K32","v":"Christian"},0,{"$f":"INDEX(U41:U42,MATCH(LARGE(V41:V42,2),V41:V42,0))","v":"Rene"}]
["Sieger",null,null,null,null,null,"Sieger",null,null,null,null,null,"Sieger",null,null,null,null,null,"Sieger"]
[{"$f":"E41","v":"Achim"},null,null,null,null,null,{"$f":"K41","v":"Ralf"},null,null,null,null,null,{"$f":"O41","v":"Christian"},null,null,null,null,null,{"$f":"U41","v":"Rene"}]
[null,null,null,{"$f":"SUM(D41:D42)","v":0},{"$f":"SUM(D45)/2*0.5","v":0},null,null,null,null,{"$f":"SUM(J41:J42)","v":0},{"$f":"SUM(J45)/2*0.5","v":0},null,null,null,null,{"$f":"SUM(P41:P42)","v":0},{"$f":"SUM(P45)/2*0.5","v":0},null,null,null,null,{"$f":"SUM(V41:V42)","v":0},{"$f":"SUM(V45)/2*0.5","v":0}]
[null,null,null,3,{"$f":"SUM(D46)/2*0.5","v":0.75},null,null,null,null,{"$f":"SUM(J41:J42)","v":0},{"$f":"SUM(J46)/2*0.5","v":0},null,null,null,null,{"$f":"SUM(P41:P42)","v":0},{"$f":"SUM(P46)/2*0.5","v":0},null,null,null,null,{"$f":"SUM(V41:V42)","v":0},{"$f":"SUM(V46)/2*0.5","v":0}]
["Halbfinale 1",null,null,null,null,null,null,null,null,null,null,null,"Halbfinale 2"]
[null,{"$f":"A44","v":"Achim"},null,0,"Sieger:",null,{"$f":"INDEX(B48:B49,MATCH(LARGE(D48:D49,1),D48:D49,0))","v":"Achim"},null,null,null,null,null,null,{"$f":"M44","v":"Christian"},null,0,"Sieger:",null,{"$f":"INDEX(N48:N49,MATCH(LARGE(P48:P49,1),P48:P49,0))","v":"Christian"}]
[null,{"$f":"G44","v":"Ralf"},null,0,"Zweiter:",null,{"$f":"INDEX(B48:B49,MATCH(LARGE(D48:D49,2),D48:D49,0))","v":"Achim"},null,null,null,null,null,null,{"$f":"S44","v":"Rene"},null,0,"Zweiter:",null,{"$f":"INDEX(N48:N49,MATCH(LARGE(P48:P49,2),P48:P49,0))","v":"Christian"}]
[null,null,null,{"$f":"SUM(D48:D49)","v":0},{"$f":"SUM(D50)/2*0.5","v":0},null,null,null,null,null,null,null,null,null,null,null,{"$f":"SUM(P48:P49)","v":0},null,{"$f":"SUM(Q50)/2*0.5","v":0}]
[null,null,null,{"$f":"SUM(D48:D49)","v":0},{"$f":"SUM(D51)/2*0.5","v":0},null,null,"Spiel um Platz 3",null,null,null,null,null,null,null,null,{"$f":"SUM(P48:P49)","v":0},null,{"$f":"SUM(S50)","v":0}]
[]
[null,null,null,null,null,null,null,{"$f":"G49","v":"Achim"},null,0,null,null,{"$f":"INDEX(H53:H54,MATCH(LARGE(J53:J54,1),J53:J54,0))","v":"Achim"},"Dritter"]
[null,null,null,null,null,null,null,{"$f":"S49","v":"Christian"},null,0,null,null,{"$f":"INDEX(H53:H54,MATCH(LARGE(J53:J54,2),J53:J54,0))","v":"Achim"},"Vierter"]
[null,null,null,null,null,null,null,null,null,{"$f":"SUM(J53:J54)","v":0},{"$f":"SUM(J55)/2*0.5","v":0}]
[null,null,null,null,null,null,null,null,null,null,{"$f":"K55","v":0}]
[]
[null,null,null,null,null,null,null,"Finale"]
[]
[null,null,null,null,null,null,null,{"$f":"G48","v":"Achim"},null,null,null,null,{"$f":"INDEX(H60:H61,MATCH(LARGE(J60:J61,1),J60:J61,0))","v":{"$error":"#NUM!"}},"Sieger"]
[null,null,null,null,null,null,null,{"$f":"S48","v":"Christian"},null,null,null,null,{"$f":"INDEX(H60:H61,MATCH(LARGE(J60:J61,2),J60:J61,0))","v":{"$error":"#NUM!"}},"Zweiter"]
[null,null,null,null,null,null,null,null,null,{"$f":"SUM(J60:J61)","v":0},{"$f":"SUM(J62)/2*0.5","v":0}]
[null,null,null,null,null,null,null,null,null,null,{"$f":"K62","v":0}]
[]
[]
[]
[null,"Vorunde","Viertelfinale 1",null,"Viertelfinale 2",null,"Viertelfinale 3",null,"Viertelfinale 4",null,"Halbfinale 1",null,"Halbfinale 2","Spiel um Platz 3",null,"Finale"]
[{"$f":"A1","v":"Achim"},{"$f":"SUM(B39)/7*0.5","v":0},{"$f":"SUMIF(C41:C42,A68,E45)","v":0},null,{"$f":"SUMIF(I41:I42,A68,K45)","v":0},null,{"$f":"SUMIF(O41:O42,A68,Q45)","v":0},null,{"$f":"SUMIF(U41:U42,A68,W45)","v":0},null,{"$f":"SUMIF(B48:B49,A68,E50)","v":0},null,{"$f":"SUMIF(N48:N49,A68,S50)","v":0},{"$f":"SUMIF(H53:H54,A68,K55)","v":0},null,{"$f":"SUMIF(H60:H61,A68,K62)","v":0},{"$f":"SUM(B68:P68)","v":0},null,{"$f":"ROUNDUP(Q68,0)","v":0}]
["Frank",{"$f":"SUM(B39)/7*0.5","v":0},{"$f":"SUMIF(C41:C42,A69,E45)","v":0},null,{"$f":"SUMIF(I41:I42,A69,K45)","v":0},null,{"$f":"SUMIF(O41:O42,A69,Q45)","v":0},null,{"$f":"SUMIF(U41:U42,A69,W45)","v":0},null,{"$f":"SUMIF(B48:B49,A69,E50)","v":0},null,{"$f":"SUMIF(N48:N49,A69,S50)","v":0},{"$f":"SUMIF(H53:H54,A69,K55)","v":0},null,{"$f":"SUMIF(H60:H61,A69,K62)","v":0},{"$f":"SUM(B69:P69)","v":0},null,{"$f":"ROUNDUP(Q69,0)","v":0}]
["Fritz",{"$f":"SUM(B39)/7*0.5","v":0},{"$f":"SUMIF(C41:C42,A70,E45)","v":0},null,{"$f":"SUMIF(I41:I42,A70,K45)","v":0},null,{"$f":"SUMIF(O41:O42,A70,Q45)","v":0},null,{"$f":"SUMIF(U41:U42,A70,W45)","v":0},null,{"$f":"SUMIF(B48:B49,A70,E50)","v":0},null,{"$f":"SUMIF(N48:N49,A70,S50)","v":0},{"$f":"SUMIF(H53:H54,A70,K55)","v":0},null,{"$f":"SUMIF(H60:H61,A70,K62)","v":0},0,null,0]
["Dirk",{"$f":"SUM(B39)/7*0.5","v":0},{"$f":"SUMIF(C41:C42,A71,E45)","v":0},null,{"$f":"SUMIF(I41:I42,A71,K45)","v":0},null,{"$f":"SUMIF(O41:O42,A71,Q45)","v":0},null,{"$f":"SUMIF(U41:U42,A71,W45)","v":0},null,{"$f":"SUMIF(B48:B49,A71,E50)","v":0},null,{"$f":"SUMIF(N48:N49,A71,S50)","v":0},{"$f":"SUMIF(H53:H54,A71,K55)","v":0},null,{"$f":"SUMIF(H60:H61,A71,K62)","v":0},0,null,0]
["Vincent",{"$f":"SUM(B39)/7*0.5","v":0},{"$f":"SUMIF(C41:C42,A72,E45)","v":0},null,{"$f":"SUMIF(I41:I42,A72,K45)","v":0},null,{"$f":"SUMIF(O41:O42,A72,Q45)","v":0},null,{"$f":"SUMIF(U41:U42,A72,W45)","v":0},null,{"$f":"SUMIF(B48:B49,A72,E50)","v":0},null,{"$f":"SUMIF(N48:N49,A72,S50)","v":0},{"$f":"SUMIF(H53:H54,A72,K55)","v":0},null,{"$f":"SUMIF(H60:H61,A72,K62)","v":0},0,null,0]
["Rosi N.",{"$f":"SUM(B39)/7*0.5","v":0},{"$f":"SUMIF(C41:C42,A73,E45)","v":0},null,{"$f":"SUMIF(I41:I42,A73,K45)","v":0},null,{"$f":"SUMIF(O41:O42,A73,Q45)","v":0},null,{"$f":"SUMIF(U41:U42,A73,W45)","v":0},null,{"$f":"SUMIF(B48:B49,A73,E50)","v":0},null,{"$f":"SUMIF(N48:N49,A73,S50)","v":0},{"$f":"SUMIF(H53:H54,A73,K55)","v":0},null,{"$f":"SUMIF(H60:H61,A73,K62)","v":0},0,null,0]
["Siggi",{"$f":"SUM(B39)/7*0.5","v":0},{"$f":"SUMIF(C41:C42,A74,E45)","v":0},null,{"$f":"SUMIF(I41:I42,A74,K45)","v":0},null,{"$f":"SUMIF(O41:O42,A74,Q45)","v":0},null,{"$f":"SUMIF(U41:U42,A74,W45)","v":0},null,{"$f":"SUMIF(B48:B49,A74,E50)","v":0},null,{"$f":"SUMIF(N48:N49,A74,S50)","v":0},{"$f":"SUMIF(H53:H54,A74,K55)","v":0},null,{"$f":"SUMIF(H60:H61,A74,K62)","v":0},0,null,0]
[{"$f":"G1","v":"Christian"},{"$f":"SUM(H39)/7*0.5","v":0},{"$f":"SUMIF(C41:C42,A75,E45)","v":0},null,{"$f":"SUMIF(I41:I42,A75,K45)","v":0},null,{"$f":"SUMIF(O41:O42,A75,Q45)","v":0},null,{"$f":"SUMIF(U41:U42,A75,W45)","v":0},null,{"$f":"SUMIF(B48:B49,A75,E50)","v":0},null,{"$f":"SUMIF(N48:N49,A75,S50)","v":0},{"$f":"SUMIF(H53:H54,A75,K55)","v":0},null,{"$f":"SUMIF(H60:H61,A75,K62)","v":0},0,null,0]
[{"$f":"G2","v":"Klaus"},{"$f":"SUM(H39)/7*0.5","v":0},{"$f":"SUMIF(C41:C42,A76,E45)","v":0},null,{"$f":"SUMIF(I41:I42,A76,K45)","v":0},null,{"$f":"SUMIF(O41:O42,A76,Q45)","v":0},null,{"$f":"SUMIF(U41:U42,A76,W45)","v":0},null,{"$f":"SUMIF(B48:B49,A76,E50)","v":0},null,{"$f":"SUMIF(N48:N49,A76,S50)","v":0},{"$f":"SUMIF(H53:H54,A76,K55)","v":0},null,{"$f":"SUMIF(H60:H61,A76,K62)","v":0},0,null,0]
["Stefan",{"$f":"SUM(H39)/7*0.5","v":0},{"$f":"SUMIF(C41:C42,A77,E45)","v":0},null,{"$f":"SUMIF(I41:I42,A77,K45)","v":0},null,{"$f":"SUMIF(O41:O42,A77,Q45)","v":0},null,{"$f":"SUMIF(U41:U42,A77,W45)","v":0},null,{"$f":"SUMIF(B48:B49,A77,E50)","v":0},null,{"$f":"SUMIF(N48:N49,A77,S50)","v":0},{"$f":"SUMIF(H53:H54,A77,K55)","v":0},null,{"$f":"SUMIF(H60:H61,A77,K62)","v":0},0,null,0]
["Kerstin",{"$f":"SUM(H39)/7*0.5","v":0},{"$f":"SUMIF(C41:C42,A78,E45)","v":0},null,{"$f":"SUMIF(I41:I42,A78,K45)","v":0},null,{"$f":"SUMIF(O41:O42,A78,Q45)","v":0},null,{"$f":"SUMIF(U41:U42,A78,W45)","v":0},null,{"$f":"SUMIF(B48:B49,A78,E50)","v":0},null,{"$f":"SUMIF(N48:N49,A78,S50)","v":0},{"$f":"SUMIF(H53:H54,A78,K55)","v":0},null,{"$f":"SUMIF(H60:H61,A78,K62)","v":0},0,null,0]
["Rosi P.",{"$f":"SUM(H39)/7*0.5","v":0},{"$f":"SUMIF(C41:C42,A79,E45)","v":0},null,{"$f":"SUMIF(I41:I42,A79,K45)","v":0},null,{"$f":"SUMIF(O41:O42,A79,Q45)","v":0},null,{"$f":"SUMIF(U41:U42,A79,W45)","v":0},null,{"$f":"SUMIF(B48:B49,A79,E50)","v":0},null,{"$f":"SUMIF(N48:N49,A79,S50)","v":0},{"$f":"SUMIF(H53:H54,A79,K55)","v":0},null,{"$f":"SUMIF(H60:H61,A79,K62)","v":0},0,null,0]
["Volker",{"$f":"SUM(H39)/7*0.5","v":0},{"$f":"SUMIF(C41:C42,A80,E45)","v":0},null,{"$f":"SUMIF(I41:I42,A80,K45)","v":0},null,{"$f":"SUMIF(O41:O42,A80,Q45)","v":0},null,{"$f":"SUMIF(U41:U42,A80,W45)","v":0},null,{"$f":"SUMIF(B48:B49,A80,E50)","v":0},null,{"$f":"SUMIF(N48:N49,A80,S50)","v":0},{"$f":"SUMIF(H53:H54,A80,K55)","v":0},null,{"$f":"SUMIF(H60:H61,A80,K62)","v":0},0,null,0]
["Anja",{"$f":"SUM(H39)/7*0.5","v":0},{"$f":"SUMIF(C41:C42,A81,E45)","v":0},null,{"$f":"SUMIF(I41:I42,A81,K45)","v":0},null,{"$f":"SUMIF(O41:O42,A81,Q45)","v":0},null,{"$f":"SUMIF(U41:U42,A81,W45)","v":0},null,{"$f":"SUMIF(B48:B49,A81,E50)","v":0},null,{"$f":"SUMIF(N48:N49,A81,S50)","v":0},{"$f":"SUMIF(H53:H54,A81,K55)","v":0},null,{"$f":"SUMIF(H60:H61,A81,K62)","v":0},0,null,0]
[{"$f":"M1","v":"Ralf"},{"$f":"SUM(N39)/7*0.5","v":0},{"$f":"SUMIF(C41:C42,A68,E45)","v":0},null,{"$f":"SUMIF(I41:I42,A82,K45)","v":0},null,{"$f":"SUMIF(O41:O42,A82,Q45)","v":0},null,{"$f":"SUMIF(U41:U42,A82,W45)","v":0},null,{"$f":"SUMIF(B48:B49,A82,E50)","v":0},null,{"$f":"SUMIF(N48:N49,A82,S50)","v":0},{"$f":"SUMIF(H53:H54,A82,K55)","v":0},null,{"$f":"SUMIF(H60:H61,A82,K62)","v":0},0,null,0]
[{"$f":"M2","v":"Paul"},{"$f":"SUM(N39)/7*0.5","v":0},{"$f":"SUMIF(C41:C42,A83,E45)","v":0},null,{"$f":"SUMIF(I41:I42,A83,K45)","v":0},null,{"$f":"SUMIF(O41:O42,A83,Q45)","v":0},null,{"$f":"SUMIF(U41:U42,A83,W45)","v":0},null,{"$f":"SUMIF(B48:B49,A83,E50)","v":0},null,{"$f":"SUMIF(N48:N49,A83,S50)","v":0},{"$f":"SUMIF(H53:H54,A83,K55)","v":0},null,{"$f":"SUMIF(H60:H61,A83,K62)","v":0},0,null,0]
["Aline",{"$f":"SUM(N39)/7*0.5","v":0},{"$f":"SUMIF(C41:C42,A84,E45)","v":0},null,{"$f":"SUMIF(I41:I42,A84,K45)","v":0},null,{"$f":"SUMIF(O41:O42,A84,Q45)","v":0},null,{"$f":"SUMIF(U41:U42,A84,W45)","v":0},null,{"$f":"SUMIF(B48:B49,A84,E50)","v":0},null,{"$f":"SUMIF(N48:N49,A84,S50)","v":0},{"$f":"SUMIF(H53:H54,A84,K55)","v":0},null,{"$f":"SUMIF(H60:H61,A84,K62)","v":0},0,null,0]
["Manuel",{"$f":"SUM(N39)/7*0.5","v":0},{"$f":"SUMIF(C41:C42,A85,E45)","v":0},null,{"$f":"SUMIF(I41:I42,A85,K45)","v":0},null,{"$f":"SUMIF(O41:O42,A85,Q45)","v":0},null,{"$f":"SUMIF(U41:U42,A85,W45)","v":0},null,{"$f":"SUMIF(B48:B49,A85,E50)","v":0},null,{"$f":"SUMIF(N48:N49,A85,S50)","v":0},{"$f":"SUMIF(H53:H54,A85,K55)","v":0},null,{"$f":"SUMIF(H60:H61,A85,K62)","v":0},0,null,0]
["Manni",{"$f":"SUM(N39)/7*0.5","v":0},{"$f":"SUMIF(C41:C42,A86,E45)","v":0},null,{"$f":"SUMIF(I41:I42,A86,K45)","v":0},null,{"$f":"SUMIF(O41:O42,A86,Q45)","v":0},null,{"$f":"SUMIF(U41:U42,A86,W45)","v":0},null,{"$f":"SUMIF(B48:B49,A86,E50)","v":0},null,{"$f":"SUMIF(N48:N49,A86,S50)","v":0},{"$f":"SUMIF(H53:H54,A86,K55)","v":0},null,{"$f":"SUMIF(H60:H61,A86,K62)","v":0},0,null,0]
["Sasha",{"$f":"SUM(N39)/7*0.5","v":0},{"$f":"SUMIF(C41:C42,A87,E45)","v":0},null,{"$f":"SUMIF(I41:I42,A87,K45)","v":0},null,{"$f":"SUMIF(O41:O42,A87,Q45)","v":0},null,{"$f":"SUMIF(U41:U42,A87,W45)","v":0},null,{"$f":"SUMIF(B48:B49,A87,E50)","v":0},null,{"$f":"SUMIF(N48:N49,A87,S50)","v":0},{"$f":"SUMIF(H53:H54,A87,K55)","v":0},null,{"$f":"SUMIF(H60:H61,A87,K62)","v":0},0,null,0]
["Robert",{"$f":"SUM(N39)/7*0.5","v":0},{"$f":"SUMIF(C41:C42,A88,E45)","v":0},null,{"$f":"SUMIF(I41:I42,A88,K45)","v":0},null,{"$f":"SUMIF(O41:O42,A88,Q45)","v":0},null,{"$f":"SUMIF(U41:U42,A88,W45)","v":0},null,{"$f":"SUMIF(B48:B49,A88,E50)","v":0},null,{"$f":"SUMIF(N48:N49,A88,S50)","v":0},{"$f":"SUMIF(H53:H54,A88,K55)","v":0},null,{"$f":"SUMIF(H60:H61,A88,K62)","v":0},{"$f":"SUM(B88:P88)","v":0},null,{"$f":"ROUNDUP(Q88,0)","v":0}]
[{"$f":"S1","v":"Rene"},{"$f":"SUM(T39)/7*0.5","v":0},{"$f":"SUMIF(C41:C42,A89,E45)","v":0},null,{"$f":"SUMIF(I41:I42,A89,K45)","v":0},null,{"$f":"SUMIF(O41:O42,A89,Q45)","v":0},null,{"$f":"SUMIF(U41:U42,A89,W45)","v":0},null,{"$f":"SUMIF(B48:B49,A89,E50)","v":0},null,{"$f":"SUMIF(N48:N49,A89,S50)","v":0},{"$f":"SUMIF(H53:H54,A89,K55)","v":0},null,{"$f":"SUMIF(H60:H61,A89,K62)","v":0},0,null,0]
[{"$f":"S2","v":"Otto"},{"$f":"SUM(T39)/7*0.5","v":0},{"$f":"SUMIF(C41:C42,A90,E45)","v":0},null,{"$f":"SUMIF(I41:I42,A90,K45)","v":0},null,{"$f":"SUMIF(O41:O42,A90,Q45)","v":0},null,{"$f":"SUMIF(U41:U42,A90,W45)","v":0},null,{"$f":"SUMIF(B48:B49,A90,E50)","v":0},null,{"$f":"SUMIF(N48:N49,A90,S50)","v":0},{"$f":"SUMIF(H53:H54,A90,K55)","v":0},null,{"$f":"SUMIF(H60:H61,A90,K62)","v":0},0,null,0]
["Erich",{"$f":"SUM(T39)/7*0.5","v":0},{"$f":"SUMIF(C41:C42,A91,E45)","v":0},null,{"$f":"SUMIF(I41:I42,A91,K45)","v":0},null,{"$f":"SUMIF(O41:O42,A91,Q45)","v":0},null,{"$f":"SUMIF(U41:U42,A91,W45)","v":0},null,{"$f":"SUMIF(B48:B49,A91,E50)","v":0},null,{"$f":"SUMIF(N48:N49,A91,S50)","v":0},{"$f":"SUMIF(H53:H54,A91,K55)","v":0},null,{"$f":"SUMIF(H60:H61,A91,K62)","v":0},0,null,0]
["Nicole",{"$f":"SUM(T39)/7*0.5","v":0},{"$f":"SUMIF(C41:C42,A92,E45)","v":0},null,{"$f":"SUMIF(I41:I42,A92,K45)","v":0},null,{"$f":"SUMIF(O41:O42,A92,Q45)","v":0},null,{"$f":"SUMIF(U41:U42,A92,W45)","v":0},null,{"$f":"SUMIF(B48:B49,A92,E50)","v":0},null,{"$f":"SUMIF(N48:N49,A92,S50)","v":0},{"$f":"SUMIF(H53:H54,A92,K55)","v":0},null,{"$f":"SUMIF(H60:H61,A92,K62)","v":0},0,null,0]
["Werner",{"$f":"SUM(T39)/7*0.5","v":0},{"$f":"SUMIF(C41:C42,A93,E45)","v":0},null,{"$f":"SUMIF(I41:I42,A93,K45)","v":0},null,{"$f":"SUMIF(O41:O42,A93,Q45)","v":0},null,{"$f":"SUMIF(U41:U42,A93,W45)","v":0},null,{"$f":"SUMIF(B48:B49,A93,E50)","v":0},null,{"$f":"SUMIF(N48:N49,A93,S50)","v":0},{"$f":"SUMIF(H53:H54,A93,K55)","v":0},null,{"$f":"SUMIF(H60:H61,A93,K62)","v":0},0,null,0]
["Hein",{"$f":"SUM(T39)/7*0.5","v":0},{"$f":"SUMIF(C41:C42,A94,E45)","v":0},null,{"$f":"SUMIF(I41:I42,A94,K45)","v":0},null,{"$f":"SUMIF(O41:O42,A94,Q45)","v":0},null,{"$f":"SUMIF(U41:U42,A94,W45)","v":0},null,{"$f":"SUMIF(B48:B49,A94,E50)","v":0},null,{"$f":"SUMIF(N48:N49,A94,S50)","v":0},{"$f":"SUMIF(H53:H54,A94,K55)","v":0},null,{"$f":"SUMIF(H60:H61,A94,K62)","v":0},0,null,0]
["Kevin",{"$f":"SUM(T39)/7*0.5","v":0},{"$f":"SUMIF(C41:C42,A98,E45)","v":0},null,{"$f":"SUMIF(I41:I42,A95,K45)","v":0},null,{"$f":"SUMIF(O41:O42,A95,Q45)","v":0},null,{"$f":"SUMIF(U41:U42,A95,W45)","v":0},null,{"$f":"SUMIF(B48:B49,A95,E50)","v":0},null,{"$f":"SUMIF(N48:N49,A95,S50)","v":0},{"$f":"SUMIF(H53:H54,A95,K55)","v":0},null,{"$f":"SUMIF(H60:H61,A95,K62)","v":0},0,null,0]
[null,null,null,null,null,null,null,null,null,null,null,null,null,null,null,null,{"$f":"SUM(Q68:Q95)","v":0},null,0]

{"sheet":"null","index":4,"n_rows":21,"n_cols":6,"rows_kept":21,"cut":false,"hidden":false,"merged":[]}
["Sp. 1",{"$f":"'Tabelle 7er'!S1","v":"Rene"},"SP1","SP2",{"$f":"B1","v":"Rene"},{"$f":"B2","v":"Otto"}]
["Sp. 2",{"$f":"'Tabelle 7er'!S2","v":"Otto"},"SP3","SP4",{"$f":"B3","v":"Erich"},{"$f":"B4","v":"Nicole"}]
["Sp. 3",{"$f":"'Tabelle 7er'!S3","v":"Erich"},"SP5","SP6",{"$f":"B5","v":"Werner"},{"$f":"B6","v":"Hein"}]
["Sp. 4",{"$f":"'Tabelle 7er'!S4","v":"Nicole"},"SP7","SP2",{"$f":"B7","v":"Kevin"},{"$f":"F1","v":"Otto"}]
["Sp. 5",{"$f":"'Tabelle 7er'!S5","v":"Werner"},"SP1","SP3",{"$f":"B1","v":"Rene"},{"$f":"E2","v":"Erich"}]
["Sp. 6",{"$f":"'Tabelle 7er'!S6","v":"Hein"},"SP4","SP5",{"$f":"F2","v":"Nicole"},{"$f":"E3","v":"Werner"}]
["Sp. 7",{"$f":"'Tabelle 7er'!S7","v":"Kevin"},"SP6","SP7",{"$f":"F3","v":"Hein"},{"$f":"E4","v":"Kevin"}]
["Sp. 8",{"$f":"'Tabelle 7er'!S4","v":"Nicole"},"SP2","SP3",{"$f":"F4","v":"Otto"},{"$f":"F5","v":"Erich"}]
["Sp. 9",{"$f":"'Tabelle 7er'!S5","v":"Werner"},"SP1","SP5",{"$f":"B1","v":"Rene"},{"$f":"F6","v":"Werner"}]
["Sp. 10",{"$f":"'Tabelle 7er'!S6","v":"Hein"},"SP4","SP7",{"$f":"E6","v":"Nicole"},{"$f":"F7","v":"Kevin"}]
["Sp. 11",{"$f":"'Tabelle 7er'!M6","v":"Sasha"},"SP6","SP3",{"$f":"E7","v":"Hein"},{"$f":"F8","v":"Erich"}]
["Sp. 12",{"$f":"'Tabelle 7er'!S1","v":"Rene"},"SP2","SP5",{"$f":"E8","v":"Otto"},{"$f":"F9","v":"Werner"}]
["Sp. 13",{"$f":"'Tabelle 7er'!S2","v":"Otto"},"SP7","SP1",{"$f":"F10","v":"Kevin"},{"$f":"E9","v":"Rene"}]
["Sp. 14",{"$f":"'Tabelle 7er'!S3","v":"Erich"},"SP4","SP6",{"$f":"E10","v":"Nicole"},{"$f":"E11","v":"Hein"}]
["Sp. 15",{"$f":"'Tabelle 7er'!S4","v":"Nicole"},"SP3","SP7",{"$f":"F11","v":"Erich"},{"$f":"E13","v":"Kevin"}]
["Sp. 16",{"$f":"'Tabelle 7er'!S5","v":"Werner"},"SP2","SP4",{"$f":"E12","v":"Otto"},{"$f":"E14","v":"Nicole"}]
["Sp. 17",{"$f":"'Tabelle 7er'!S6","v":"Hein"},"SP6","SP1",{"$f":"F14","v":"Hein"},{"$f":"F13","v":"Rene"}]
["Sp. 18",null,"SP5","SP7",{"$f":"F12","v":"Werner"},{"$f":"E13","v":"Kevin"}]
["Sp. 19",null,"SP2","SP6",{"$f":"E16","v":"Otto"},{"$f":"E17","v":"Hein"}]
["Sp. 20",null,"SP1","SP4",{"$f":"F17","v":"Rene"},{"$f":"F16","v":"Nicole"}]
["Sp. 21",null,"SP3","SP5",{"$f":"E15","v":"Erich"},{"$f":"E18","v":"Werner"}]