{"text_format":"1","workbook":"xlsx","n_sheets":3,"sheets":["Preissp_Dachsanierung","ALLGEMEINE ANGABEN","-- Auswahllisten --"],"not_rendered":{"charts":0,"images":0,"macros":1,"external_links":0,"defined_names":87,"comments":1,"pivot_tables":0},"unopened":[],"bounds":{"document_bytes":16777216,"sheet_cells":100000,"rows_first":2000,"rows_last":500,"rows_between":2000,"halvings":0,"cell_chars":16384,"cell_head_chars":4096},"cells_cut":0,"cells_raw":0,"read":"whole","date_system":"1900"}

{"sheet":"Preissp_Dachsanierung","index":0,"n_rows":215,"n_cols":63,"rows_kept":215,"cut":false,"hidden":false,"merged":[[3,11,4,11],[2,9,3,10],[4,9,5,10],[147,6,147,7],[40,8,40,10],[63,8,63,10],[77,8,77,10],[182,6,182,7],[194,6,194,7],[161,6,161,7],[0,6,0,7],[104,6,104,7],[77,6,77,7],[63,6,63,7],[40,6,40,7],[24,6,24,7],[12,6,12,7],[0,17,0,18],[1,14,6,14],[1,15,6,15],[1,16,6,16],[9,14,9,16],[7,18,7,19]]}
[null,null,null,null,null,null,"Nr.       ",null,"Text","Positionsarten\n- Bedarfsposition\n-  Position\n- Grundposition\n- Alternativposition\n-  Hinweis\n-  Ausführungsbeschr.","Positionstypen\n[B] edarf\n[G] rundposition\n[A] lternativposition\n[E] Entfällt\n[H] inweis\n[AB] usführungsbeschreibung","Abweichung zum\nMinimalwert [ MIN ]\nMittelwert   [ MIT ]\nMaximalwert [ MAX ]\nLV -Preiskalkulation [ LV ]\n--------\nLV-Menge","Einheit",null,"SUMME MIN\n- Brutto -","SUMME MTTE\n- Brutto -","SUMME MAX\n- Brutto -","SUMME\nMittelwert",null,"SUMME der Mittelwerte aus \nBedarfs- u. Alternativ-positionen",null,"SUMME\nEntfallende bzw. gestrichene Positionen","SUMME\nLV-Preis","Abweichung zum Mittelwert","SUMME \nBedarfs- u. Alternativ-positionen",null,"SUMME\nEntfallende bzw. gestrichene Positionen","Siemers - Dach& Wand GmbH\nPeter Hansen - Dachdecker Fassadenbau GmbH","Bereits ausgeführte Positionen","Summe bereits ausgeführter Arbeiten","Abweichung zum Mittelwert","SUMME \nBedarfs- u. Alternativ-positionen",null,"SUMME\nEntfallende bzw. gestrichene Positionen","Thormälen GmbH","Bereits ausgeführte Positionen","Summe bereits ausgeführter Arbeiten","Abweichung zum Mittelwert","SUMME \nBedarfs- u. Alternativ-positionen",null,"SUMME\nEntfallende bzw. gestrichene Positionen","Westerholt & Jacobs - Holzbau GmbH","Bereits ausgeführte Positionen","Summe bereits ausgeführter Arbeiten","Abweichung zum Mittelwert","SUMME \nBedarfs- u. Alternativ-positionen",null,"SUMME\nEntfallende bzw. gestrichene Positionen","Richard Steckel GmbH","Bereits ausgeführte Positionen","Summe bereits ausgeführter Arbeiten","Abweichung zum Mittelwert","SUMME \nBedarfs- u. Alternativ-positionen",null,"SUMME\nEntfallende bzw. gestrichene Positionen","Dachdeckerei Förster GmbH","Bereits ausgeführte Positionen","Summe bereits ausgeführter Arbeiten","Abweichung zum Mittelwert","SUMME \nBedarfs- u. Alternativ-positionen"]
[null,null,null,null,null,null,null,null,"G E S A M T S U M M E (EUR netto)",null,null,null,null,null,{"$f":"SUMPRODUCT(O14:O230,$L14:$L230)*119%","v":167126.33223999999},{"$f":"SUMPRODUCT(P14:P230,$L14:$L230)*119%","v":277460.96975216659},{"$f":"SUMPRODUCT(Q14:Q230,$L14:$L230)*119%","v":340581.88326749986},{"$f":"R10","v":233160.47878333327},null,null,null,null,{"$f":"W10","v":19309.5},null,null,null,null,{"$f":"AB10","v":272488.58010000002},null,null,null,null,null,null,{"$f":"AI10","v":278151.72824999993},null,null,null,null,null,null,{"$f":"AP10","v":148841.128},null,null,null,null,null,null,{"$f":"AW10","v":0},null,null,null,null,null,null,{"$f":"BD10","v":0}]
[null,null,null,null,null,null,null,null,"N A C H L A S S / Z U S C H L A G",{"$f":"IF(L4=\"MIN\",CONCATENATE(\"Schwellenwert Abweichung vom\",CHAR(10),\"Minimalwert nach oben, größer\"),IF(L4=\"MIT\",CONCATENATE(\"Schwellenwert Abweichung vom\",CHAR(10),\"Mittellwert nach oben, größer\"),\"\"))","v":"Schwellenwert Abweichung vom\nMittellwert nach oben, größer"},null,0.15,null,null,null,null,null,0,{"$f":"R2*R3","v":0},null,null,null,0,{"$f":"W2*W3","v":0},null,null,null,0,null,null,{"$f":"AB2*AB3","v":0},null,null,null,0,null,null,{"$f":"AI2*AI3","v":0},null,null,null,0,null,null,{"$f":"AP2*AP3","v":0},null,null,null,0,null,null,{"$f":"AW2*AW3","v":0},null,null,null,0,null,null,{"$f":"BD2*BD3","v":0}]
[null,null,null,null,null,null,null,null,"G E S A M T S U M M E (EUR netto)",null,null,"MIT",null,null,null,null,null,{"$f":"R2-R2*R3","v":233160.47878333327},null,null,null,null,{"$f":"W2-W2*W3","v":19309.5},null,null,null,null,{"$f":"AB2-AB2*AB3","v":272488.58010000002},null,null,null,null,null,null,{"$f":"AI2-AI2*AI3","v":278151.72824999993},null,null,null,null,null,null,{"$f":"AP2-AP2*AP3","v":148841.128},null,null,null,null,null,null,{"$f":"AW2-AW2*AW3","v":0},null,null,null,null,null,null,{"$f":"BD2-BD2*BD3","v":0}]
[null,null,null,null,null,null,null,null,"S K O N T O",{"$f":"IF(L4=\"MIN\",CONCATENATE(\"Schwellenwert Abweichung vom\",CHAR(10),\"Minimalwert nach unten, größer\"),IF(L4=\"MIT\",CONCATENATE(\"Schwellenwert Abweichung vom\",CHAR(10),\"Mittellwert nach unten, größer\"),\"\"))","v":"Schwellenwert Abweichung vom\nMittellwert nach unten, größer"},null,null,null,null,null,null,null,0,{"$f":"R4*R5","v":0},null,null,null,0,{"$f":"W4*W5","v":0},null,null,null,0,null,null,{"$f":"AB4*AB5","v":0},null,null,null,0,null,null,{"$f":"AI4*AI5","v":0},null,null,null,0,null,null,{"$f":"AP4*AP5","v":0},null,null,null,0,null,null,{"$f":"AW4*AW5","v":0},null,null,null,0,null,null,{"$f":"BD4*BD5","v":0}]
[null,null,null,null,null,null,null,null,"G E S A M T S U M M E (EUR netto)",null,null,-0.15,null,null,null,null,null,{"$f":"R4-R4*R5","v":233160.47878333327},null,null,null,null,{"$f":"W4-W4*W5","v":19309.5},null,null,null,null,{"$f":"AB4-AB4*AB5","v":272488.58010000002},null,null,null,null,null,null,{"$f":"AI4-AI4*AI5","v":278151.72824999993},null,null,null,null,null,null,{"$f":"AP4-AP4*AP5","v":148841.128},null,null,null,null,null,null,{"$f":"AW4-AW4*AW5","v":0},null,null,null,null,null,null,{"$f":"BD4-BD4*BD5","v":0}]
[null,null,null,null,null,null,null,null,"19 % Mehrwertsteuer",null,null,null,null,null,null,null,null,{"$f":"R6*19%","v":44300.490968833321},null,null,null,null,{"$f":"W6*19%","v":3668.8049999999998},null,null,null,null,{"$f":"AB6*19%","v":51772.830219000003},null,null,null,null,null,null,{"$f":"AI6*19%","v":52848.828367499984},null,null,null,null,null,null,{"$f":"AP6*19%","v":28279.814320000001},null,null,null,null,null,null,{"$f":"AW6*19%","v":0},null,null,null,null,null,null,{"$f":"BD6*19%","v":0}]
[null,null,null,null,null,null,null,null,"G E S A M T S U M M E (EUR brutto)",null,null,null,null,null,null,null,null,{"$f":"IF(SUM(R6:R7)=0,\"\",SUM(R6:R7))","v":277460.96975216659},"Bruttosumme Mittelwerte",null,null,null,{"$f":"IF(SUM(W6:W7)=0,\"\",SUM(W6:W7))","v":22978.305},null,{"$f":"IF(W8=\"\",\"\",IF(MIN($W8,$AB8,$AI8,$AP8,$AW8)=W8,1,(W8/MIN($W8,$AB8,$AI8,$AP8,$AW8))))","v":1},null,null,{"$f":"IF(SUM(AB6:AB7)=0,\"\",SUM(AB6:AB7))","v":324261.41031900002},null,null,null,{"$f":"IF(AB8=\"\",\"\",IF(MIN($AB8,$AI8,$AP8,$AW8,$BO8)=AB8,1,(AB8/MIN($AB8,$AI8,$AP8,$AW8,$BO8))))","v":1.8307344465973143},null,null,{"$f":"IF(SUM(AI6:AI7)=0,\"\",SUM(AI6:AI7))","v":331000.55661749991},null,null,null,{"$f":"IF(AI8=\"\",\"\",IF(MIN($AB8,$AI8,$AP8,$AW8,$BO8)=AI8,1,(AI8/MIN($AB8,$AI8,$AP8,$AW8,$BO8))))","v":1.8687827214666091},null,null,{"$f":"IF(SUM(AP6:AP7)=0,\"\",SUM(AP6:AP7))","v":177120.94232},null,null,null,{"$f":"IF(AP8=\"\",\"\",IF(MIN($AB8,$AI8,$AP8,$AW8,$BO8)=AP8,1,(AP8/MIN($AB8,$AI8,$AP8,$AW8,$BO8))))","v":1},null,null,{"$f":"IF(SUM(AW6:AW7)=0,\"\",SUM(AW6:AW7))","v":""},null,null,null,{"$f":"IF(AW8=\"\",\"\",IF(MIN($AB8,$AI8,$AP8,$AW8,$BO8)=AW8,1,(AW8/MIN($AB8,$AI8,$AP8,$AW8,$BO8))))","v":""},null,null,{"$f":"IF(SUM(BD6:BD7)=0,\"\",SUM(BD6:BD7))","v":""},null,null,null,{"$f":"IF(BD8=\"\",\"\",IF(MIN($AB8,$AI8,$AP8,$AW8,$BO8)=BD8,1,(BD8/MIN($AB8,$AI8,$AP8,$AW8,$BO8))))","v":""}]
[null,null,null,null,null,null,null,null,null,null,null,null,null,null,null,null,null,null,"Bedarfspos.",{"$f":"SUMIF($K14:$K230,\"B\",T14:T230)*119%","v":6895.8437333333331},null,null,null,"Bedarfspos.",{"$f":"(SUMPRODUCT($L14:$L230,V14:V230,1*($K14:$K230=\"B\"))*119%)","v":1651.125},null,null,null,null,null,"Bedarfspos.",{"$f":"(SUMPRODUCT($L14:$L230,AA14:AA230,1*($K14:$K230=\"B\"))*119%)","v":7004.8041000000003},null,null,null,null,null,"Bedarfspos.",{"$f":"(SUMPRODUCT($L14:$L230,AH14:AH230,1*($K14:$K230=\"B\"))*119%)","v":7004.8041000000003},null,null,null,null,null,"Bedarfspos.",{"$f":"(SUMPRODUCT($L14:$L230,AO14:AO230,1*($K14:$K230=\"B\"))*119%)","v":4276.8599999999997},null,null,null,null,null,"Bedarfspos.",{"$f":"(SUMPRODUCT($L14:$L230,AV14:AV230,1*($K14:$K230=\"B\"))*119%)","v":0},null,null,null,null,null,"Bedarfspos.",{"$f":"(SUMPRODUCT($L14:$L230,BC14:BC230,1*($K14:$K230=\"B\"))*119%)","v":0}]
[null,null,null,null,null,null,"LV 001","LV 001","196_Dachsanierung\nAuf der Raade 51 - 26180 Rastede","LV",null,null,"-",null,"Nettosumme\nMittelwerte",null,null,{"$f":"SUMPRODUCT(P14:P230,$L14:$L230)","v":233160.47878333327},"Grund-positionen",{"$f":"SUMPRODUCT($L14:$L230,P14:P230,1*($K14:$K230=\"G\"))*119%","v":45284.394866666655},null,"Nettosumme\nLV",{"$f":"SUM(W13,W25,W41,W64,W78,W105,W148,W162,W183,W195)","v":19309.5},"Grund-positionen",{"$f":"SUMPRODUCT($L14:$L230,V14:V230,1*($K14:$K230=\"G\"))*119%","v":0},null,"Nettosumme\ngepr. Angebot",{"$f":"SUM(AB13,AB25,AB41,AB64,AB78,AB105,AB148,AB162,AB183,AB195)","v":272488.58010000002},null,{"$f":"SUM(AD13:AD588)*1.19","v":0},"Grund-positionen",{"$f":"SUMPRODUCT($L14:$L230,AA14:AA230,1*($K14:$K230=\"G\"))*119%","v":49628.902399999999},null,"Nettosumme\ngepr. Angebot",{"$f":"SUM(AI13,AI25,AI41,AI64,AI78,AI105,AI148,AI162,AI183,AI195)","v":278151.72824999993},null,{"$f":"SUM(AK13:AK588)*1.19","v":0},"Grund-positionen",{"$f":"SUMPRODUCT($L14:$L230,AH14:AH230,1*($K14:$K230=\"G\"))*119%","v":50368.987199999996},null,"Nettosumme\ngepr. Angebot",{"$f":"SUM(AP13,AP25,AP41,AP64,AP78,AP105,AP148,AP162,AP183,AP195)","v":148841.128},null,{"$f":"SUM(AR13:AR588)*1.19","v":0},"Grund-positionen",{"$f":"SUMPRODUCT($L14:$L230,AO14:AO230,1*($K14:$K230=\"G\"))*119%","v":35855.294999999998},null,"Nettosumme\ngepr. Angebot",{"$f":"SUM(AW13,AW25,AW41,AW64,AW78,AW105,AW148,AW162,AW183,AW195)","v":0},null,{"$f":"SUM(AY13:AY588)*1.19","v":0},"Grund-positionen",{"$f":"SUMPRODUCT($L14:$L230,AV14:AV230,1*($K14:$K230=\"G\"))*119%","v":0},null,"Nettosumme\ngepr. Angebot",{"$f":"SUM(BD13,BD25,BD41,BD64,BD78,BD105,BD148,BD162,BD183,BD195)","v":0},null,{"$f":"SUM(BF13:BF588)*1.19","v":0},"Grund-positionen",{"$f":"SUMPRODUCT($L14:$L230,BC14:BC230,1*($K14:$K230=\"G\"))*119%","v":0}]
[null,null,null,null,null,null,null,null,null,null,null,null,null,null,null,null,null,null,"Alternativ",{"$f":"SUMIF($K14:$K230,\"A\",T14:T230)*119%","v":56193.811099999992},null,null,null,"Alternativ",{"$f":"(SUMPRODUCT($L14:$L230,V14:V230,1*($K14:$K230=\"A\"))*119%)","v":0},null,null,null,null,null,"Alternativ",{"$f":"(SUMPRODUCT($L14:$L230,AA14:AA230,1*($K14:$K230=\"A\"))*119%)","v":59943.167899999993},null,null,null,null,null,"Alternativ",{"$f":"(SUMPRODUCT($L14:$L230,AH14:AH230,1*($K14:$K230=\"A\"))*119%)","v":59970.299899999998},null,null,null,null,null,"Alternativ",{"$f":"(SUMPRODUCT($L14:$L230,AO14:AO230,1*($K14:$K230=\"A\"))*119%)","v":30064.16},null,null,null,null,null,"Alternativ",{"$f":"(SUMPRODUCT($L14:$L230,AV14:AV230,1*($K14:$K230=\"A\"))*119%)","v":0},null,null,null,null,null,"Alternativ",{"$f":"(SUMPRODUCT($L14:$L230,BC14:BC230,1*($K14:$K230=\"A\"))*119%)","v":0}]
[null,null,null,null,null,null,null,null,null,null,null,null,null,null,null,null,null,{"$f":"IF(OR($K12=\"A\",$K12=\"B\"),\"Nur EP        \",IF($K12=\"E\",\"\",IF(AND($L12<>\"\",P12<>\"\"),$L12*P12,\"\")))","v":""},null,{"$f":"IF($K12=\"Ja\",IF(AND($L12<>\"\",P12<>\"\"),$L12*P12),\"\")","v":""},null,null,{"$f":"IF(OR($K12=\"A\",$K12=\"B\"),\"Nur EP        \",IF($K12=\"E\",\"\",IF(AND($L12<>\"\",V12<>\"\"),$L12*V12,\"\")))","v":""},null,{"$f":"IF($K12=\"Ja\",IF(AND($L12<>\"\",V12<>\"\"),$L12*V12),\"\")","v":""},null,"EP / % Titel","Positions- / Titelsumme",null,{"$f":"IF(AC12=\"\",\"\",IF(AC12=\"X\",AB12,AB12*AC12))","v":""},null,{"$f":"IF($K12=\"Ja\",IF(AND($L12<>\"\",AA12<>\"\"),$L12*AA12),\"\")","v":""},null,"EP / % Titel","Positions- / Titelsumme",null,{"$f":"IF(AJ12=\"\",\"\",IF(AJ12=\"X\",AI12,AI12*AJ12))","v":""},null,{"$f":"IF($K12=\"Ja\",IF(AND($L12<>\"\",AH12<>\"\"),$L12*AH12),\"\")","v":""},null,"EP / % Titel","Positions- / Titelsumme",null,{"$f":"IF(AQ12=\"\",\"\",IF(AQ12=\"X\",AP12,AP12*AQ12))","v":""},null,{"$f":"IF($K12=\"Ja\",IF(AND($L12<>\"\",AO12<>\"\"),$L12*AO12),\"\")","v":""},null,"EP / % Titel","Positions- / Titelsumme",null,{"$f":"IF(AX12=\"\",\"\",IF(AX12=\"X\",AW12,AW12*AX12))","v":""},null,{"$f":"IF($K12=\"Ja\",IF(AND($L12<>\"\",AV12<>\"\"),$L12*AV12),\"\")","v":""},null,"EP / % Titel","Positions- / Titelsumme",null,{"$f":"IF(BE12=\"\",\"\",IF(BE12=\"X\",BD12,BD12*BE12))","v":""},null,{"$f":"IF($K12=\"Ja\",IF(AND($L12<>\"\",BC12<>\"\"),$L12*BC12),\"\")","v":""}]
[null,null,null,null,null,null,1,null,"Baustelleneinrichtung Gerüst",null,null,null,"-",null,{"$f":"CONCATENATE(\"Titelsumme\",CHAR(10),\"MIN\",CHAR(10),TEXT(SUMPRODUCT($L14:$L24,O14:O24),\"##.##0,00\"),\" €\")","v":"Titelsumme\nMIN\n1.500,00 €"},{"$f":"CONCATENATE(\"Titelsumme\",CHAR(10),\"MIT\",CHAR(10),TEXT(SUMPRODUCT($L14:$L24,P14:P24),\"##.##0,00\"),\" €\")","v":"Titelsumme\nMIT\n12.171,95 €"},{"$f":"CONCATENATE(\"Titelsumme\",CHAR(10),\"MAX\",CHAR(10),TEXT(SUMPRODUCT($L14:$L24,Q14:Q24),\"##.##0,00\"),\" €\")","v":"Titelsumme\nMAX\n17.765,85 €"},{"$f":"SUM(R14:R24)","v":12171.949999999999},null,{"$f":"SUM(T14:T24)","v":0},null,null,{"$f":"SUM(W14:W24)","v":2500},null,{"$f":"SUM(Y14:Y24)","v":0},null,{"$f":"IF(AB13=0,\"\",\nIF($L$4=\"MIT\",((AB13/(AVERAGE($AB13,$AI13,$AP13,$AW13,$BD13)))-1)*100,))","v":136.19880134243076},{"$f":"SUM(AB14:AB24)","v":17250},null,null,null,{"$f":"SUM(AF14:AF24)","v":0},null,{"$f":"IF(AI13=0,\"\",\nIF($L$4=\"MIT\",((AI13/(AVERAGE($AB13,$AI13,$AP13,$AW13,$BD13)))-1)*100,))","v":143.26217245387957},{"$f":"SUM(AI14:AI24)","v":17765.849999999999},null,null,null,{"$f":"SUM(AM14:AM24)","v":0},null,{"$f":"IF(AP13=0,\"\",\nIF($L$4=\"MIT\",((AP13/(AVERAGE($AB13,$AI13,$AP13,$AW13,$BD13)))-1)*100,))","v":-79.46097379631037},{"$f":"SUM(AP14:AP24)","v":1500},null,null,null,{"$f":"SUM(AT14:AT24)","v":0},null,{"$f":"IF(AW13=0,\"\",\nIF($L$4=\"MIT\",((AW13/(AVERAGE($AB13,$AI13,$AP13,$AW13,$BD13)))-1)*100,))","v":""},{"$f":"SUM(AW14:AW24)","v":0},null,null,null,{"$f":"SUM(BA14:BA24)","v":0},null,{"$f":"IF(BD13=0,\"\",\nIF($L$4=\"MIT\",((BD13/(AVERAGE($AB13,$AI13,$AP13,$AW13,$BD13)))-1)*100,))","v":""},{"$f":"SUM(BD14:BD24)","v":0},null,null,null,{"$f":"SUM(BH14:BH24)","v":0}]
[null,null,null,null,null,null,{"$f":"G$13","v":1},{"$f":"IF(G$162=\"\",\"\",ROW()-ROW(G$13))","v":1},"Allgemeine Hinweise zur Ausführung","Ausführungsbeschreibung",{"$f":"IF(J14=\"Position\",\"\",IF(J14=\"Grundposition\",\"G\",IF(J14=\"Alternativposition\",\"A\",IF(J14=\"Bedarfsposition\",\"B\",IF(J14=\"Hinweis\",\"H\",IF(J14=\"Ausführungsbeschreibung\",\"AB\",IF(J14=\"Entfällt\",\"E\",IF(AND(I14<>\"\",L14<>\"\"),\"<-- Bitte Positionsart\",\"\"))))))))","v":"AB"},null,null,null,{"$f":"IF(OR($K14=\"B\",$K14=\"A\",$K14=\"H\",$K14=\"AB\",$K14=\"<-- Bitte Positionsart\",SUM(AA14,AH14,AO14,AV14,BC14)=0),\"\",MIN(AA14,AH14,AO14,AV14,BC14))","v":""},{"$f":"IF(OR($K14=\"B\",$K14=\"A\",$K14=\"H\",$K14=\"AB\",$K14=\"<-- Bitte Positionsart\",SUM(AA14,AH14,AO14,AV14,BC14)=0),\"\",SUM(AA14,AH14,AO14,AV14,BC14)/COUNT(AA14,AH14,AO14,AV14,BC14))","v":""},{"$f":"IF(OR($K14=\"B\",$K14=\"A\",$K14=\"H\",$K14=\"AB\",$K14=\"<-- Bitte Positionsart\",SUM(AA14,AH14,AO14,AV14,BC14)=0),\"\",MAX(AA14,AH14,AO14,AV14,BC14))","v":""},{"$f":"IF(OR($K14=\"A\",$K14=\"B\"),\"Nur EP        \",IF($K14=\"E\",\"E                \",IF(AND($L14<>\"\",P14<>\"\"),$L14*P14,\"\")))","v":""},null,{"$f":"IF(OR($K14=\"\",$K14=\"H\",$K14=\"AB\",$K14=\"G\",$K14=\"<-- Bitte Positionsart\"),\"\",IF(OR($K14=\"A\",$K14=\"B\"),$L14*(SUM(AA14,AH14,AO14,AV14,BC14)/COUNT(AA14,AH14,AO14,AV14,BC14)),IF($K14=\"E\",$L14*P14)))","v":""},null,null,{"$f":"IF(OR($K14=\"A\",$K14=\"B\"),\"Nur EP        \",IF($K14=\"E\",\"E                \",IF(AND($L14<>\"\",V14<>\"\"),$L14*V14,\"\")))","v":""},{"$f":"IF(OR($L83=\"\",V14=\"\",$J14=\"Ausführungsbeschreibung\",$J14=\"Hinweis\"),\"\",\nIF(AND($V14,$AA14,$AH14,$AO14,$AV14,$BC14)=\"\",\"\",\n\nIF(OR($W14=\"Nur EP        \",$K14=\"E\"),(Y14/(AVERAGE($Y14,$AF14,$AM14,$AT14,Y14))-1),\nIF(AND($W14,$AB14,$AI14,$AP14,$AW14)=\"\",\"\",(W14/(AVERAGE($W14,$AB14,$AI14,$AP14,$AW14)))-1))))","v":""},{"$f":"IF(OR($K14=\"\",$K14=\"H\",$K14=\"AB\",$K14=\"G\",$J14=\"Position\",$K14=\"<-- Bitte Positionsart\",V14=\"\",$L14=\"\"),\"\",\nIF(OR($K14=\"A\",$K14=\"B\",$K14=\"E\"),$L14*V14))","v":""},null,null,{"$f":"IF(C14=\"Hinweis\",\"\",IF(OR($K14=\"A\",$K14=\"B\"),\"Nur EP        \",IF($K14=\"E\",\"E                \",IF(AND($L14<>\"\",AA14<>\"\"),$L14*AA14,\"\"))))","v":""},null,{"$f":"IF(AC14=\"\",\"\",IF(AC14=\"X\",AB14,AB14*AC14))","v":""},{"$f":"IF(OR($L14=\"\",AA14=\"\",$J14=\"Ausführungsbeschreibung\",$J14=\"Hinweis\"),\"\",\nIF(AND($AA14,$AH14,$AO14,$AV14,$BC14)=\"\",\"\",\nIF($L$4=\"MIT\",\nIF(OR(AB14=\"Nur EP        \",$K14=\"E\"),((AF14/(AVERAGE($AF14,$AM14,$AT14,$BA14,$BH14)))-1),\nIF($L$4=\"MIT\",((AB14/(AVERAGE($AB14,$AI14,$AP14,$AW14,$BD14)))-1),\nIF($L$4=\"MIN\",\nIF(OR(AB14=\"Nur EP        \",$K14=\"E\"),((AF14/(MIN($AF14,$AM14,$AT14,$BA14,$BH14)))-1),\nIF($L$4=\"MIN\",((AB14/(MIN($AB14,$AI14,$AP14,$AW14,$BD14)))-1))\n)))))))","v":""},{"$f":"IF(OR($K14=\"\",$K14=\"H\",$K14=\"AB\",$K14=\"G\",$J14=\"Position\",$K14=\"<-- Bitte Positionsart\",AA14=\"\",$L14=\"\"),\"\",\nIF(OR($K14=\"A\",$K14=\"B\",$K14=\"E\"),$L14*AA14))","v":""},null,null,{"$f":"IF(J14=\"Hinweis\",\"\",IF(OR($K14=\"A\",$K14=\"B\"),\"Nur EP        \",IF($K14=\"E\",\"E                \",IF(AND($L14<>\"\",AH14<>\"\"),$L14*AH14,\"\"))))","v":""},null,{"$f":"IF(AJ14=\"\",\"\",IF(AJ14=\"X\",AI14,AI14*AJ14))","v":""},{"$f":"IF(OR($L14=\"\",AH14=\"\",$J14=\"Ausführungsbeschreibung\",$J14=\"Hinweis\"),\"\",\nIF(AND($AA14,$AH14,$AO14,$AV14,$BC14)=\"\",\"\",\nIF($L$4=\"MIT\",\nIF(OR(AI14=\"Nur EP        \",$K14=\"E\"),((AM14/(AVERAGE($AF14,$AM14,$AT14,$BA14,$BH14)))-1),\nIF($L$4=\"MIT\",((AI14/(AVERAGE($AB14,$AI14,$AP14,$AW14,$BD14)))-1),\nIF($L$4=\"MIN\",\nIF(OR(AI14=\"Nur EP        \",$K14=\"E\"),((AM14/(MIN($AF14,$AM14,$AT14,$BA14,$BH14)))-1),\nIF($L$4=\"MIN\",(AI14/(MIN($AB14,$AI14,$AP14,$AW14,$BD14)))-1)\n)))))))","v":""},{"$f":"IF(OR($K14=\"\",$K14=\"H\",$K14=\"AB\",$K14=\"G\",$J14=\"Position\",$K14=\"<-- Bitte Positionsart\",AH14=\"\",$L14=\"\"),\"\",\nIF(OR($K14=\"A\",$K14=\"B\",$K14=\"E\"),$L14*AH14))","v":""},null,null,{"$f":"IF(P14=\"Hinweis\",\"\",IF(OR($K14=\"A\",$K14=\"B\"),\"Nur EP        \",IF($K14=\"E\",\"E                \",IF(AND($L14<>\"\",AO14<>\"\"),$L14*AO14,\"\"))))","v":""},null,{"$f":"IF(AQ14=\"\",\"\",IF(AQ14=\"X\",AP14,AP14*AQ14))","v":""},{"$f":"IF(OR($L14=\"\",AO14=\"\",$J14=\"Ausführungsbeschreibung\",$J14=\"Hinweis\"),\"\",\nIF(AND($AA14,$AH14,$AO14,$AV14,$BC14)=\"\",\"\",\nIF($L$4=\"MIT\",\nIF(OR(AP14=\"Nur EP        \",$K14=\"E\"),((AT14/(AVERAGE($AF14,$AM14,$AT14,$BA14,$BH14)))-1),\nIF($L$4=\"MIT\",((AP14/(AVERAGE($AB14,$AI14,$AP14,$AW14,$BD14)))-1),\nIF($L$4=\"MIN\",\nIF(OR(AP14=\"Nur EP        \",$K14=\"E\"),((AT14/(MIN($AF14,$AM14,$AT14,$BA14,$BH14)))-1),\nIF($L$4=\"MIN\",(AP14/(MIN($AB14,$AI14,$AP14,$AW14,$BD14)))-1)\n)))))))","v":""},{"$f":"IF(OR($K14=\"\",$K14=\"H\",$K14=\"AB\",$K14=\"G\",$J14=\"Position\",$K14=\"<-- Bitte Positionsart\",AO14=\"\",$L14=\"\"),\"\",\nIF(OR($K14=\"A\",$K14=\"B\",$K14=\"E\"),$L14*AO14))","v":""},null,null,{"$f":"IF(W14=\"Hinweis\",\"\",IF(OR($K14=\"A\",$K14=\"B\"),\"Nur EP        \",IF($K14=\"E\",\"E                \",IF(AND($L14<>\"\",AV14<>\"\"),$L14*AV14,\"\"))))","v":""},null,{"$f":"IF(AX14=\"\",\"\",IF(AX14=\"X\",AW14,AW14*AX14))","v":""},{"$f":"IF(OR($L14=\"\",AV14=\"\",$J14=\"Ausführungsbeschreibung\",$J14=\"Hinweis\"),\"\",\nIF(AND($AA14,$AH14,$AO14,$AV14,$BC14)=\"\",\"\",\nIF($L$4=\"MIT\",\nIF(OR(AW14=\"Nur EP        \",$K14=\"E\"),((BA14/(AVERAGE($AF14,$AM14,$AT14,$BA14,$BH14)))-1),\nIF($L$4=\"MIT\",((AW14/(AVERAGE($AB14,$AI14,$AP14,$AW14,$BD14)))-1),\nIF($L$4=\"MIN\",\nIF(OR(AW14=\"Nur EP        \",$K14=\"E\"),((BA14/(MIN($AF14,$AM14,$AT14,$BA14,$BH14)))-1),\nIF($L$4=\"MIN\",(AW14/(MIN($AB14,$AI14,$AP14,$AW14,$BD14)))-1)\n)))))))","v":""},{"$f":"IF(OR($K14=\"\",$K14=\"H\",$K14=\"AB\",$K14=\"G\",$J14=\"Position\",$K14=\"<-- Bitte Positionsart\",AV14=\"\",$L14=\"\"),\"\",\nIF(OR($K14=\"A\",$K14=\"B\",$K14=\"E\"),$L14*AV14))","v":""},null,null,{"$f":"IF(AD14=\"Hinweis\",\"\",IF(OR($K14=\"A\",$K14=\"B\"),\"Nur EP        \",IF($K14=\"E\",\"E                \",IF(AND($L14<>\"\",BC14<>\"\"),$L14*BC14,\"\"))))","v":""},null,{"$f":"IF(BE14=\"\",\"\",IF(BE14=\"X\",BD14,BD14*BE14))","v":""},{"$f":"IF(OR($L14=\"\",BC14=\"\",$J14=\"Ausführungsbeschreibung\",$J14=\"Hinweis\"),\"\",\nIF(AND($AA14,$AH14,$AO14,$AV14,$BC14)=\"\",\"\",\nIF($L$4=\"MIT\",\nIF(OR(BD14=\"Nur EP        \",$K14=\"E\"),((BH14/(AVERAGE($AF14,$AM14,$AT14,$BA14,$BH14)))-1),\nIF($L$4=\"MIT\",((BD14/(AVERAGE($AB14,$AI14,$AP14,$AW14,$BD14)))-1),\nIF($L$4=\"MIN\",\nIF(OR(BD14=\"Nur EP        \",$K14=\"E\"),((BH14/(MIN($AF14,$AM14,$AT14,$BA14,$BH14)))-1),\nIF($L$4=\"MIN\",(BD14/(MIN($AB14,$AI14,$AP14,$AW14,$BD14)))-1)\n)))))))","v":""},{"$f":"IF(OR($K14=\"\",$K14=\"H\",$K14=\"AB\",$K14=\"G\",$J14=\"Position\",$K14=\"<-- Bitte Positionsart\",BC14=\"\",$L14=\"\"),\"\",\nIF(OR($K14=\"A\",$K14=\"B\",$K14=\"E\"),$L14*BC14))","v":""}]
[null,null,null,null,null,null,{"$f":"G$13","v":1},2,"Baustrom und Wasser","Hinweis","H",null,null,null,{"$f":"IF(OR($K15=\"B\",$K15=\"A\",$K15=\"H\",$K15=\"AB\",$K15=\"<-- Bitte Positionsart\",SUM(AA15,AH15,AO15,AV15,BC15)=0),\"\",MIN(AA15,AH15,AO15,AV15,BC15))","v":""},{"$f":"IF(OR($K15=\"B\",$K15=\"A\",$K15=\"H\",$K15=\"AB\",$K15=\"<-- Bitte Positionsart\",SUM(AA15,AH15,AO15,AV15,BC15)=0),\"\",SUM(AA15,AH15,AO15,AV15,BC15)/COUNT(AA15,AH15,AO15,AV15,BC15))","v":""},{"$f":"IF(OR($K15=\"B\",$K15=\"A\",$K15=\"H\",$K15=\"AB\",$K15=\"<-- Bitte Positionsart\",SUM(AA15,AH15,AO15,AV15,BC15)=0),\"\",MAX(AA15,AH15,AO15,AV15,BC15))","v":""},{"$f":"IF(OR($K15=\"A\",$K15=\"B\"),\"Nur EP        \",IF($K15=\"E\",\"E                \",IF(AND($L15<>\"\",P15<>\"\"),$L15*P15,\"\")))","v":""},null,{"$f":"IF(OR($K15=\"\",$K15=\"H\",$K15=\"AB\",$K15=\"G\",$K15=\"<-- Bitte Positionsart\"),\"\",IF(OR($K15=\"A\",$K15=\"B\"),$L15*(SUM(AA15,AH15,AO15,AV15,BC15)/COUNT(AA15,AH15,AO15,AV15,BC15)),IF($K15=\"E\",$L15*P15)))","v":""},null,null,"",{"$f":"IF(OR($L84=\"\",V15=\"\",$J15=\"Ausführungsbeschreibung\",$J15=\"Hinweis\"),\"\",\nIF(AND($V15,$AA15,$AH15,$AO15,$AV15,$BC15)=\"\",\"\",\n\nIF(OR($W15=\"Nur EP        \",$K15=\"E\"),(Y15/(AVERAGE($Y15,$AF15,$AM15,$AT15,Y15))-1),\nIF(AND($W15,$AB15,$AI15,$AP15,$AW15)=\"\",\"\",(W15/(AVERAGE($W15,$AB15,$AI15,$AP15,$AW15)))-1))))","v":""},{"$f":"IF(OR($K15=\"\",$K15=\"H\",$K15=\"AB\",$K15=\"G\",$J15=\"Position\",$K15=\"<-- Bitte Positionsart\",V15=\"\",$L15=\"\"),\"\",\nIF(OR($K15=\"A\",$K15=\"B\",$K15=\"E\"),$L15*V15))","v":""},null,null,"",null,"","",{"$f":"IF(OR($K15=\"\",$K15=\"H\",$K15=\"AB\",$K15=\"G\",$J15=\"Position\",$K15=\"<-- Bitte Positionsart\",AA15=\"\",$L15=\"\"),\"\",\nIF(OR($K15=\"A\",$K15=\"B\",$K15=\"E\"),$L15*AA15))","v":""},null,null,"",null,"",{"$f":"IF(OR($L15=\"\",AH15=\"\",$J15=\"Ausführungsbeschreibung\",$J15=\"Hinweis\"),\"\",\nIF(AND($AA15,$AH15,$AO15,$AV15,$BC15)=\"\",\"\",\nIF($L$4=\"MIT\",\nIF(OR(AI15=\"Nur EP        \",$K15=\"E\"),((AM15/(AVERAGE($AF15,$AM15,$AT15,$BA15,$BH15)))-1),\nIF($L$4=\"MIT\",((AI15/(AVERAGE($AB15,$AI15,$AP15,$AW15,$BD15)))-1),\nIF($L$4=\"MIN\",\nIF(OR(AI15=\"Nur EP        \",$K15=\"E\"),((AM15/(MIN($AF15,$AM15,$AT15,$BA15,$BH15)))-1),\nIF($L$4=\"MIN\",(AI15/(MIN($AB15,$AI15,$AP15,$AW15,$BD15)))-1)\n)))))))","v":""},"",null,null,"",null,"",{"$f":"IF(OR($L15=\"\",AO15=\"\",$J15=\"Ausführungsbeschreibung\",$J15=\"Hinweis\"),\"\",\nIF(AND($AA15,$AH15,$AO15,$AV15,$BC15)=\"\",\"\",\nIF($L$4=\"MIT\",\nIF(OR(AP15=\"Nur EP        \",$K15=\"E\"),((AT15/(AVERAGE($AF15,$AM15,$AT15,$BA15,$BH15)))-1),\nIF($L$4=\"MIT\",((AP15/(AVERAGE($AB15,$AI15,$AP15,$AW15,$BD15)))-1),\nIF($L$4=\"MIN\",\nIF(OR(AP15=\"Nur EP        \",$K15=\"E\"),((AT15/(MIN($AF15,$AM15,$AT15,$BA15,$BH15)))-1),\nIF($L$4=\"MIN\",(AP15/(MIN($AB15,$AI15,$AP15,$AW15,$BD15)))-1)\n)))))))","v":""},{"$f":"IF(OR($K15=\"\",$K15=\"H\",$K15=\"AB\",$K15=\"G\",$J15=\"Position\",$K15=\"<-- Bitte Positionsart\",AO15=\"\",$L15=\"\"),\"\",\nIF(OR($K15=\"A\",$K15=\"B\",$K15=\"E\"),$L15*AO15))","v":""},null,null,"",null,"",{"$f":"IF(OR($L15=\"\",AV15=\"\",$J15=\"Ausführungsbeschreibung\",$J15=\"Hinweis\"),\"\",\nIF(AND($AA15,$AH15,$AO15,$AV15,$BC15)=\"\",\"\",\nIF($L$4=\"MIT\",\nIF(OR(AW15=\"Nur EP        \",$K15=\"E\"),((BA15/(AVERAGE($AF15,$AM15,$AT15,$BA15,$BH15)))-1),\nIF($L$4=\"MIT\",((AW15/(AVERAGE($AB15,$AI15,$AP15,$AW15,$BD15)))-1),\nIF($L$4=\"MIN\",\nIF(OR(AW15=\"Nur EP        \",$K15=\"E\"),((BA15/(MIN($AF15,$AM15,$AT15,$BA15,$BH15)))-1),\nIF($L$4=\"MIN\",(AW15/(MIN($AB15,$AI15,$AP15,$AW15,$BD15)))-1)\n)))))))","v":""},{"$f":"IF(OR($K15=\"\",$K15=\"H\",$K15=\"AB\",$K15=\"G\",$J15=\"Position\",$K15=\"<-- Bitte Positionsart\",AV15=\"\",$L15=\"\"),\"\",\nIF(OR($K15=\"A\",$K15=\"B\",$K15=\"E\"),$L15*AV15))","v":""},null,null,"",null,"",{"$f":"IF(OR($L15=\"\",BC15=\"\",$J15=\"Ausführungsbeschreibung\",$J15=\"Hinweis\"),\"\",\nIF(AND($AA15,$AH15,$AO15,$AV15,$BC15)=\"\",\"\",\nIF($L$4=\"MIT\",\nIF(OR(BD15=\"Nur EP        \",$K15=\"E\"),((BH15/(AVERAGE($AF15,$AM15,$AT15,$BA15,$BH15)))-1),\nIF($L$4=\"MIT\",((BD15/(AVERAGE($AB15,$AI15,$AP15,$AW15,$BD15)))-1),\nIF($L$4=\"MIN\",\nIF(OR(BD15=\"Nur EP        \",$K15=\"E\"),((BH15/(MIN($AF15,$AM15,$AT15,$BA15,$BH15)))-1),\nIF($L$4=\"MIN\",(BD15/(MIN($AB15,$AI15,$AP15,$AW15,$BD15)))-1)\n)))))))","v":""},{"$f":"IF(OR($K15=\"\",$K15=\"H\",$K15=\"AB\",$K15=\"G\",$J15=\"Position\",$K15=\"<-- Bitte Positionsart\",BC15=\"\",$L15=\"\"),\"\",\nIF(OR($K15=\"A\",$K15=\"B\",$K15=\"E\"),$L15*BC15))","v":""}]
[null,null,null,null,null,null,{"$f":"G$13","v":1},3,"Bauschutt  - Verschnitt - Abfälle aus Abriss","Hinweis","H",null,null,null,"","","","",null,"",null,null,"","","",null,null,"",null,"","",{"$f":"IF(OR($K16=\"\",$K16=\"H\",$K16=\"AB\",$K16=\"G\",$J16=\"Position\",$K16=\"<-- Bitte Positionsart\",AA16=\"\",$L16=\"\"),\"\",\nIF(OR($K16=\"A\",$K16=\"B\",$K16=\"E\"),$L16*AA16))","v":""},null,null,"",null,"","","",null,null,"",null,"","",{"$f":"IF(OR($K16=\"\",$K16=\"H\",$K16=\"AB\",$K16=\"G\",$J16=\"Position\",$K16=\"<-- Bitte Positionsart\",AO16=\"\",$L16=\"\"),\"\",\nIF(OR($K16=\"A\",$K16=\"B\",$K16=\"E\"),$L16*AO16))","v":""},null,null,"",null,"","","",null,null,"",null,"","",""]
[null,null,null,null,null,null,1,4,"Baustellen WC","Hinweis","H",null,null,null,"","","","",null,"",null,null,"","","",null,null,"",null,"","","",null,null,"",null,"","","",null,null,"",null,"","","",null,null,"",null,"","","",null,null,"",null,"","",""]
[null,null,null,null,null,null,1,5,"Arbeitsgerüst","Hinweis","H",null,null,null,"","","","",null,"",null,null,"","","",null,null,"",null,"","","",null,null,"",null,"","","",null,null,"",null,"","","",null,null,"",null,"","","",null,null,"",null,"","",""]
[null,null,null,null,null,null,1,6,"Baustelleneinrichtung allgemein","Position","",1,"pausch.",null,1500,12171.949999999999,17765.849999999999,12171.949999999999,null,"",null,2500,2500,-0.74369390901390076,"",null,17250,{"$f":"IF(C19=\"Hinweis\",\"\",IF(OR($K19=\"A\",$K19=\"B\"),\"Nur EP        \",IF($K19=\"E\",\"E                \",IF(AND($L19<>\"\",AA19<>\"\"),$L19*AA19,\"\"))))","v":17250},null,{"$f":"IF(AC19=\"\",\"\",IF(AC19=\"X\",AB19,AB19*AC19))","v":""},0.41719280805458459,{"$f":"IF(OR($K19=\"\",$K19=\"H\",$K19=\"AB\",$K19=\"G\",$J19=\"Position\",$K19=\"<-- Bitte Positionsart\",AA19=\"\",$L19=\"\"),\"\",\nIF(OR($K19=\"A\",$K19=\"B\",$K19=\"E\"),$L19*AA19))","v":""},null,17765.849999999999,17765.849999999999,null,{"$f":"IF(AJ19=\"\",\"\",IF(AJ19=\"X\",AI19,AI19*AJ19))","v":""},0.45957303472327782,"",null,1500,{"$f":"IF(P19=\"Hinweis\",\"\",IF(OR($K19=\"A\",$K19=\"B\"),\"Nur EP        \",IF($K19=\"E\",\"E                \",IF(AND($L19<>\"\",AO19<>\"\"),$L19*AO19,\"\"))))","v":1500},null,{"$f":"IF(AQ19=\"\",\"\",IF(AQ19=\"X\",AP19,AP19*AQ19))","v":""},-0.87676584277786218,{"$f":"IF(OR($K19=\"\",$K19=\"H\",$K19=\"AB\",$K19=\"G\",$J19=\"Position\",$K19=\"<-- Bitte Positionsart\",AO19=\"\",$L19=\"\"),\"\",\nIF(OR($K19=\"A\",$K19=\"B\",$K19=\"E\"),$L19*AO19))","v":""},null,null,"",null,"","","",null,null,"",null,"","",""]
[null,null,null,null,null,null,1,7,null,null,"",null,null,null,"","","","",null,"",null,null,"","","",null,null,"",null,"","",{"$f":"IF(OR($K20=\"\",$K20=\"H\",$K20=\"AB\",$K20=\"G\",$J20=\"Position\",$K20=\"<-- Bitte Positionsart\",AA20=\"\",$L20=\"\"),\"\",\nIF(OR($K20=\"A\",$K20=\"B\",$K20=\"E\"),$L20*AA20))","v":""},null,null,"",null,"","","",null,null,"",null,"","",{"$f":"IF(OR($K20=\"\",$K20=\"H\",$K20=\"AB\",$K20=\"G\",$J20=\"Position\",$K20=\"<-- Bitte Positionsart\",AO20=\"\",$L20=\"\"),\"\",\nIF(OR($K20=\"A\",$K20=\"B\",$K20=\"E\"),$L20*AO20))","v":""},null,null,"",null,"","","",null,null,"",null,"","",""]
[null,null,null,null,null,null,1,8,null,null,"",null,null,null,"","","","",null,"",null,null,"","","",null,null,"",null,"","",{"$f":"IF(OR($K21=\"\",$K21=\"H\",$K21=\"AB\",$K21=\"G\",$J21=\"Position\",$K21=\"<-- Bitte Positionsart\",AA21=\"\",$L21=\"\"),\"\",\nIF(OR($K21=\"A\",$K21=\"B\",$K21=\"E\"),$L21*AA21))","v":""},null,null,"",null,"","","",null,null,"",null,"","",{"$f":"IF(OR($K21=\"\",$K21=\"H\",$K21=\"AB\",$K21=\"G\",$J21=\"Position\",$K21=\"<-- Bitte Positionsart\",AO21=\"\",$L21=\"\"),\"\",\nIF(OR($K21=\"A\",$K21=\"B\",$K21=\"E\"),$L21*AO21))","v":""},null,null,"",null,"","","",null,null,"",null,"","",""]
[null,null,null,null,null,null,1,9,null,null,"",null,null,null,"","","","",null,"",null,null,"","","",null,null,"",null,"","","",null,null,"",null,"","","",null,null,"",null,"","","",null,null,"",null,"","","",null,null,"",null,"","",""]
[null,null,null,null,null,null,1,10,null,null,"",null,null,null,"","","","",null,"",null,null,"","","",null,null,"",null,"","","",null,null,"",null,"","","",null,null,"",null,"","","",null,null,"",null,"","","",null,null,"",null,"","",""]
[null,null,null,null,null,null,null,null,null,null,null,null,null,null,null,null,null,null,null,null,null,null,{"$f":"IF(OR($K24=\"A\",$K24=\"B\"),\"Nur EP        \",IF($K24=\"E\",\"\",IF(AND($L24<>\"\",V24<>\"\"),$L24*V24,\"\")))","v":""},null,{"$f":"IF($K24=\"Ja\",IF(AND($L24<>\"\",V24<>\"\"),$L24*V24),\"\")","v":""},null,"EP / % Titel","Positions- / Titelsumme",null,"",null,{"$f":"IF($K24=\"Ja\",IF(AND($L24<>\"\",AA24<>\"\"),$L24*AA24),\"\")","v":""},null,"EP / % Titel","Positions- / Titelsumme",null,"",null,{"$f":"IF($K24=\"Ja\",IF(AND($L24<>\"\",AH24<>\"\"),$L24*AH24),\"\")","v":""},null,"EP / % Titel","Positions- / Titelsumme",null,"",null,{"$f":"IF($K24=\"Ja\",IF(AND($L24<>\"\",AO24<>\"\"),$L24*AO24),\"\")","v":""},null,"EP / % Titel","Positions- / Titelsumme",null,"",null,{"$f":"IF($K24=\"Ja\",IF(AND($L24<>\"\",AV24<>\"\"),$L24*AV24),\"\")","v":""},null,"EP / % Titel","Positions- / Titelsumme",null,"",null,{"$f":"IF($K24=\"Ja\",IF(AND($L24<>\"\",BC24<>\"\"),$L24*BC24),\"\")","v":""}]
[null,null,null,null,null,null,2,null,"Abriss / Rückbau im Bereich des vorhandenen Pfannendachs",null,null,null,null,null,{"$f":"CONCATENATE(\"Titelsumme\",CHAR(10),\"MIN\",CHAR(10),TEXT(SUMPRODUCT($L26:$L40,O26:O40),\"##.##0,00\"),\" €\")","v":"Titelsumme\nMIN\n6.469,69 €"},{"$f":"CONCATENATE(\"Titelsumme\",CHAR(10),\"MIT\",CHAR(10),TEXT(SUMPRODUCT($L26:$L39,P26:P39),\"##.##0,00\"),\" €\")","v":"Titelsumme\nMIT\n8.495,37 €"},{"$f":"CONCATENATE(\"Titelsumme\",CHAR(10),\"MAX\",CHAR(10),TEXT(SUMPRODUCT($L26:$L39,Q26:Q39),\"##.##0,00\"),\" €\")","v":"Titelsumme\nMAX\n9.790,80 €"},{"$f":"SUM(R26:R40)","v":8495.3666666666668},null,{"$f":"SUM(T26:T40)","v":748.80000000000007},null,null,{"$f":"SUM(W26:W40)","v":8762.5},null,{"$f":"SUM(Y26:Y40)","v":1137.5},null,{"$f":"IF(AB25=0,\"\",\nIF($L$4=\"MIT\",((AB25/(AVERAGE($AB25,$AI25,$AP25,$AW25,$BD25)))-1)*100,))","v":80.992089805815766},{"$f":"SUM(AB26:AB40)","v":9225.5650000000005},null,null,null,{"$f":"SUM(AF26:AF40)","v":911.94999999999993},null,{"$f":"IF(AI25=0,\"\",\nIF($L$4=\"MIT\",((AI25/(AVERAGE($AB25,$AI25,$AP25,$AW25,$BD25)))-1)*100,))","v":82.773845350995231},{"$f":"SUM(AI26:AI40)","v":9316.3849999999984},null,null,null,{"$f":"SUM(AM26:AM40)","v":911.94999999999993},null,{"$f":"IF(AP25=0,\"\",\nIF($L$4=\"MIT\",((AP25/(AVERAGE($AB25,$AI25,$AP25,$AW25,$BD25)))-1)*100,))","v":36.234064843189053},{"$f":"SUM(AP26:AP40)","v":6944.15},null,null,null,{"$f":"SUM(AT26:AT40)","v":422.5},null,{"$f":"IF(AW25=0,\"\",\nIF($L$4=\"MIT\",((AW25/(AVERAGE($AB25,$AI25,$AP25,$AW25,$BD25)))-1)*100,))","v":""},{"$f":"SUM(AW26:AW40)","v":0},null,null,null,{"$f":"SUM(BA26:BA40)","v":0},null,{"$f":"IF(BD25=0,\"\",\nIF($L$4=\"MIT\",((BD25/(AVERAGE($AB25,$AI25,$AP25,$AW25,$BD25)))-1)*100,))","v":""},{"$f":"SUM(BD26:BD40)","v":0},null,null,null,{"$f":"SUM(BH26:BH40)","v":0}]
[null,null,null,null,null,null,{"$f":"G$25","v":2},{"$f":"IF($G26=\"\",\"\",ROW()-ROW(G$25))","v":1},"Hinweis zu vorhandener Mineralwolldämmung","Hinweis",{"$f":"IF(J26=\"Position\",\"\",IF(J26=\"Grundposition\",\"G\",IF(J26=\"Alternativposition\",\"A\",IF(J26=\"Bedarfsposition\",\"B\",IF(J26=\"Hinweis\",\"H\",IF(J26=\"Ausführungsbeschreibung\",\"AB\",IF(J26=\"Entfällt\",\"E\",IF(AND(I26<>\"\",L26<>\"\"),\"<-- Bitte Positionsart\",\"\"))))))))","v":"H"},null,null,null,{"$f":"IF(OR($K26=\"B\",$K26=\"A\",$K26=\"H\",$K26=\"AB\",$K26=\"<-- Bitte Positionsart\",SUM(AA26,AH26,AO26,AV26,BC26)=0),\"\",MIN(AA26,AH26,AO26,AV26,BC26))","v":""},{"$f":"IF(OR($K26=\"B\",$K26=\"A\",$K26=\"H\",$K26=\"AB\",$K26=\"<-- Bitte Positionsart\",SUM(AA26,AH26,AO26,AV26,BC26)=0),\"\",SUM(AA26,AH26,AO26,AV26,BC26)/COUNT(AA26,AH26,AO26,AV26,BC26))","v":""},{"$f":"IF(OR($K26=\"B\",$K26=\"A\",$K26=\"H\",$K26=\"AB\",$K26=\"<-- Bitte Positionsart\",SUM(AA26,AH26,AO26,AV26,BC26)=0),\"\",MAX(AA26,AH26,AO26,AV26,BC26))","v":""},{"$f":"IF(OR($K26=\"A\",$K26=\"B\"),\"Nur EP        \",IF($K26=\"E\",\"E                \",IF(AND($L26<>\"\",P26<>\"\"),$L26*P26,\"\")))","v":""},null,{"$f":"IF(OR($K26=\"\",$K26=\"H\",$K26=\"AB\",$K26=\"G\",$K26=\"<-- Bitte Positionsart\"),\"\",IF(OR($K26=\"A\",$K26=\"B\"),$L26*(SUM(AA26,AH26,AO26,AV26,BC26)/COUNT(AA26,AH26,AO26,AV26,BC26)),IF($K26=\"E\",$L26*P26)))","v":""},null,null,{"$f":"IF($C26=\"Hinweis\",\"\",IF(OR($K26=\"A\",$K26=\"B\"),\"Nur EP        \",IF($K26=\"E\",\"E                \",IF(AND($L26<>\"\",V26<>\"\"),$L26*V26,\"\"))))","v":""},{"$f":"IF(OR($L95=\"\",V26=\"\",$J26=\"Ausführungsbeschreibung\",$J26=\"Hinweis\"),\"\",\nIF(AND($V26,$AA26,$AH26,$AO26,$AV26,$BC26)=\"\",\"\",\n\nIF(OR($W26=\"Nur EP        \",$K26=\"E\"),(Y26/(AVERAGE($Y26,$AF26,$AM26,$AT26,Y26))-1),\nIF(AND($W26,$AB26,$AI26,$AP26,$AW26)=\"\",\"\",(W26/(AVERAGE($W26,$AB26,$AI26,$AP26,$AW26)))-1))))","v":""},{"$f":"IF(OR($K26=\"\",$K26=\"H\",$K26=\"AB\",$K26=\"G\",$J26=\"Position\",$K26=\"<-- Bitte Positionsart\",V26=\"\",$L26=\"\"),\"\",\nIF(OR($K26=\"A\",$K26=\"B\",$K26=\"E\"),$L26*V26))","v":""},null,null,{"$f":"IF(C26=\"Hinweis\",\"\",IF(OR($K26=\"A\",$K26=\"B\"),\"Nur EP        \",IF($K26=\"E\",\"E                \",IF(AND($L26<>\"\",AA26<>\"\"),$L26*AA26,\"\"))))","v":""},null,{"$f":"IF(AC26=\"\",\"\",IF(AC26=\"X\",AB26,AB26*AC26))","v":""},{"$f":"IF(OR($L26=\"\",AA26=\"\",$J26=\"Ausführungsbeschreibung\",$J26=\"Hinweis\"),\"\",\nIF(AND($AA26,$AH26,$AO26,$AV26,$BC26)=\"\",\"\",\nIF($L$4=\"MIT\",\nIF(OR(AB26=\"Nur EP        \",$K26=\"E\"),((AF26/(AVERAGE($AF26,$AM26,$AT26,$BA26,$BH26)))-1),\nIF($L$4=\"MIT\",((AB26/(AVERAGE($AB26,$AI26,$AP26,$AW26,$BD26)))-1),\nIF($L$4=\"MIN\",\nIF(OR(AB26=\"Nur EP        \",$K26=\"E\"),((AF26/(MIN($AF26,$AM26,$AT26,$BA26,$BH26)))-1),\nIF($L$4=\"MIN\",((AB26/(MIN($AB26,$AI26,$AP26,$AW26,$BD26)))-1))\n)))))))","v":""},{"$f":"IF(OR($K26=\"\",$K26=\"H\",$K26=\"AB\",$K26=\"G\",$J26=\"Position\",$K26=\"<-- Bitte Positionsart\",AA26=\"\",$L26=\"\"),\"\",\nIF(OR($K26=\"A\",$K26=\"B\",$K26=\"E\"),$L26*AA26))","v":""},null,null,{"$f":"IF(J26=\"Hinweis\",\"\",IF(OR($K26=\"A\",$K26=\"B\"),\"Nur EP        \",IF($K26=\"E\",\"E                \",IF(AND($L26<>\"\",AH26<>\"\"),$L26*AH26,\"\"))))","v":""},null,{"$f":"IF(AJ26=\"\",\"\",IF(AJ26=\"X\",AI26,AI26*AJ26))","v":""},{"$f":"IF(OR($L26=\"\",AH26=\"\",$J26=\"Ausführungsbeschreibung\",$J26=\"Hinweis\"),\"\",\nIF(AND($AA26,$AH26,$AO26,$AV26,$BC26)=\"\",\"\",\nIF($L$4=\"MIT\",\nIF(OR(AI26=\"Nur EP        \",$K26=\"E\"),((AM26/(AVERAGE($AF26,$AM26,$AT26,$BA26,$BH26)))-1),\nIF($L$4=\"MIT\",((AI26/(AVERAGE($AB26,$AI26,$AP26,$AW26,$BD26)))-1),\nIF($L$4=\"MIN\",\nIF(OR(AI26=\"Nur EP        \",$K26=\"E\"),((AM26/(MIN($AF26,$AM26,$AT26,$BA26,$BH26)))-1),\nIF($L$4=\"MIN\",(AI26/(MIN($AB26,$AI26,$AP26,$AW26,$BD26)))-1)\n)))))))","v":""},{"$f":"IF(OR($K26=\"\",$K26=\"H\",$K26=\"AB\",$K26=\"G\",$J26=\"Position\",$K26=\"<-- Bitte Positionsart\",AH26=\"\",$L26=\"\"),\"\",\nIF(OR($K26=\"A\",$K26=\"B\",$K26=\"E\"),$L26*AH26))","v":""},null,null,{"$f":"IF(P26=\"Hinweis\",\"\",IF(OR($K26=\"A\",$K26=\"B\"),\"Nur EP        \",IF($K26=\"E\",\"E                \",IF(AND($L26<>\"\",AO26<>\"\"),$L26*AO26,\"\"))))","v":""},null,{"$f":"IF(AQ26=\"\",\"\",IF(AQ26=\"X\",AP26,AP26*AQ26))","v":""},{"$f":"IF(OR($L26=\"\",AO26=\"\",$J26=\"Ausführungsbeschreibung\",$J26=\"Hinweis\"),\"\",\nIF(AND($AA26,$AH26,$AO26,$AV26,$BC26)=\"\",\"\",\nIF($L$4=\"MIT\",\nIF(OR(AP26=\"Nur EP        \",$K26=\"E\"),((AT26/(AVERAGE($AF26,$AM26,$AT26,$BA26,$BH26)))-1),\nIF($L$4=\"MIT\",((AP26/(AVERAGE($AB26,$AI26,$AP26,$AW26,$BD26)))-1),\nIF($L$4=\"MIN\",\nIF(OR(AP26=\"Nur EP        \",$K26=\"E\"),((AT26/(MIN($AF26,$AM26,$AT26,$BA26,$BH26)))-1),\nIF($L$4=\"MIN\",(AP26/(MIN($AB26,$AI26,$AP26,$AW26,$BD26)))-1)\n)))))))","v":""},{"$f":"IF(OR($K26=\"\",$K26=\"H\",$K26=\"AB\",$K26=\"G\",$J26=\"Position\",$K26=\"<-- Bitte Positionsart\",AO26=\"\",$L26=\"\"),\"\",\nIF(OR($K26=\"A\",$K26=\"B\",$K26=\"E\"),$L26*AO26))","v":""},null,null,{"$f":"IF(W26=\"Hinweis\",\"\",IF(OR($K26=\"A\",$K26=\"B\"),\"Nur EP        \",IF($K26=\"E\",\"E                \",IF(AND($L26<>\"\",AV26<>\"\"),$L26*AV26,\"\"))))","v":""},null,{"$f":"IF(AX26=\"\",\"\",IF(AX26=\"X\",AW26,AW26*AX26))","v":""},{"$f":"IF(OR($L26=\"\",AV26=\"\",$J26=\"Ausführungsbeschreibung\",$J26=\"Hinweis\"),\"\",\nIF(AND($AA26,$AH26,$AO26,$AV26,$BC26)=\"\",\"\",\nIF($L$4=\"MIT\",\nIF(OR(AW26=\"Nur EP        \",$K26=\"E\"),((BA26/(AVERAGE($AF26,$AM26,$AT26,$BA26,$BH26)))-1),\nIF($L$4=\"MIT\",((AW26/(AVERAGE($AB26,$AI26,$AP26,$AW26,$BD26)))-1),\nIF($L$4=\"MIN\",\nIF(OR(AW26=\"Nur EP        \",$K26=\"E\"),((BA26/(MIN($AF26,$AM26,$AT26,$BA26,$BH26)))-1),\nIF($L$4=\"MIN\",(AW26/(MIN($AB26,$AI26,$AP26,$AW26,$BD26)))-1)\n)))))))","v":""},{"$f":"IF(OR($K26=\"\",$K26=\"H\",$K26=\"AB\",$K26=\"G\",$J26=\"Position\",$K26=\"<-- Bitte Positionsart\",AV26=\"\",$L26=\"\"),\"\",\nIF(OR($K26=\"A\",$K26=\"B\",$K26=\"E\"),$L26*AV26))","v":""},null,null,{"$f":"IF(AD26=\"Hinweis\",\"\",IF(OR($K26=\"A\",$K26=\"B\"),\"Nur EP        \",IF($K26=\"E\",\"E                \",IF(AND($L26<>\"\",BC26<>\"\"),$L26*BC26,\"\"))))","v":""},null,{"$f":"IF(BE26=\"\",\"\",IF(BE26=\"X\",BD26,BD26*BE26))","v":""},{"$f":"IF(OR($L26=\"\",BC26=\"\",$J26=\"Ausführungsbeschreibung\",$J26=\"Hinweis\"),\"\",\nIF(AND($AA26,$AH26,$AO26,$AV26,$BC26)=\"\",\"\",\nIF($L$4=\"MIT\",\nIF(OR(BD26=\"Nur EP        \",$K26=\"E\"),((BH26/(AVERAGE($AF26,$AM26,$AT26,$BA26,$BH26)))-1),\nIF($L$4=\"MIT\",((BD26/(AVERAGE($AB26,$AI26,$AP26,$AW26,$BD26)))-1),\nIF($L$4=\"MIN\",\nIF(OR(BD26=\"Nur EP        \",$K26=\"E\"),((BH26/(MIN($AF26,$AM26,$AT26,$BA26,$BH26)))-1),\nIF($L$4=\"MIN\",(BD26/(MIN($AB26,$AI26,$AP26,$AW26,$BD26)))-1)\n)))))))","v":""},{"$f":"IF(OR($K26=\"\",$K26=\"H\",$K26=\"AB\",$K26=\"G\",$J26=\"Position\",$K26=\"<-- Bitte Positionsart\",BC26=\"\",$L26=\"\"),\"\",\nIF(OR($K26=\"A\",$K26=\"B\",$K26=\"E\"),$L26*BC26))","v":""}]
[null,null,null,null,null,null,{"$f":"G$25","v":2},{"$f":"IF($G27=\"\",\"\",ROW()-ROW(G$25))","v":2},"Absicherung des geöffneten Dachs gegen Witterungseinflüsse","Position","",1,"pausch.",null,{"$f":"IF(OR($K27=\"B\",$K27=\"A\",$K27=\"H\",$K27=\"AB\",$K27=\"<-- Bitte Positionsart\",SUM(AA27,AH27,AO27,AV27,BC27)=0),\"\",MIN(AA27,AH27,AO27,AV27,BC27))","v":2000},{"$f":"IF(OR($K27=\"B\",$K27=\"A\",$K27=\"H\",$K27=\"AB\",$K27=\"<-- Bitte Positionsart\",SUM(AA27,AH27,AO27,AV27,BC27)=0),\"\",SUM(AA27,AH27,AO27,AV27,BC27)/COUNT(AA27,AH27,AO27,AV27,BC27))","v":2603.6833333333334},{"$f":"IF(OR($K27=\"B\",$K27=\"A\",$K27=\"H\",$K27=\"AB\",$K27=\"<-- Bitte Positionsart\",SUM(AA27,AH27,AO27,AV27,BC27)=0),\"\",MAX(AA27,AH27,AO27,AV27,BC27))","v":2936.05},{"$f":"IF(OR($K27=\"A\",$K27=\"B\"),\"Nur EP        \",IF($K27=\"E\",\"E                \",IF(AND($L27<>\"\",P27<>\"\"),$L27*P27,\"\")))","v":2603.6833333333334},null,{"$f":"IF(OR($K27=\"\",$K27=\"H\",$K27=\"AB\",$K27=\"G\",$K27=\"<-- Bitte Positionsart\"),\"\",IF(OR($K27=\"A\",$K27=\"B\"),$L27*(SUM(AA27,AH27,AO27,AV27,BC27)/COUNT(AA27,AH27,AO27,AV27,BC27)),IF($K27=\"E\",$L27*P27)))","v":""},null,1250,{"$f":"IF($C27=\"Hinweis\",\"\",IF(OR($K27=\"A\",$K27=\"B\"),\"Nur EP        \",IF($K27=\"E\",\"E                \",IF(AND($L27<>\"\",V27<>\"\"),$L27*V27,\"\"))))","v":1250},{"$f":"IF(OR($L96=\"\",V27=\"\",$J27=\"Ausführungsbeschreibung\",$J27=\"Hinweis\"),\"\",\nIF(AND($V27,$AA27,$AH27,$AO27,$AV27,$BC27)=\"\",\"\",\n\nIF(OR($W27=\"Nur EP        \",$K27=\"E\"),(Y27/(AVERAGE($Y27,$AF27,$AM27,$AT27,Y27))-1),\nIF(AND($W27,$AB27,$AI27,$AP27,$AW27)=\"\",\"\",(W27/(AVERAGE($W27,$AB27,$AI27,$AP27,$AW27)))-1))))","v":-0.44818757208049831},{"$f":"IF(OR($K27=\"\",$K27=\"H\",$K27=\"AB\",$K27=\"G\",$J27=\"Position\",$K27=\"<-- Bitte Positionsart\",V27=\"\",$L27=\"\"),\"\",\nIF(OR($K27=\"A\",$K27=\"B\",$K27=\"E\"),$L27*V27))","v":""},null,2875,2875,null,"",0.10420494043694517,{"$f":"IF(OR($K27=\"\",$K27=\"H\",$K27=\"AB\",$K27=\"G\",$J27=\"Position\",$K27=\"<-- Bitte Positionsart\",AA27=\"\",$L27=\"\"),\"\",\nIF(OR($K27=\"A\",$K27=\"B\",$K27=\"E\"),$L27*AA27))","v":""},null,2936.05,2936.05,null,"",{"$f":"IF(OR($L27=\"\",AH27=\"\",$J27=\"Ausführungsbeschreibung\",$J27=\"Hinweis\"),\"\",\nIF(AND($AA27,$AH27,$AO27,$AV27,$BC27)=\"\",\"\",\nIF($L$4=\"MIT\",\nIF(OR(AI27=\"Nur EP        \",$K27=\"E\"),((AM27/(AVERAGE($AF27,$AM27,$AT27,$BA27,$BH27)))-1),\nIF($L$4=\"MIT\",((AI27/(AVERAGE($AB27,$AI27,$AP27,$AW27,$BD27)))-1),\nIF($L$4=\"MIN\",\nIF(OR(AI27=\"Nur EP        \",$K27=\"E\"),((AM27/(MIN($AF27,$AM27,$AT27,$BA27,$BH27)))-1),\nIF($L$4=\"MIN\",(AI27/(MIN($AB27,$AI27,$AP27,$AW27,$BD27)))-1)\n)))))))","v":0.12765249230257147},"",null,2000,2000,null,"",{"$f":"IF(OR($L27=\"\",AO27=\"\",$J27=\"Ausführungsbeschreibung\",$J27=\"Hinweis\"),\"\",\nIF(AND($AA27,$AH27,$AO27,$AV27,$BC27)=\"\",\"\",\nIF($L$4=\"MIT\",\nIF(OR(AP27=\"Nur EP        \",$K27=\"E\"),((AT27/(AVERAGE($AF27,$AM27,$AT27,$BA27,$BH27)))-1),\nIF($L$4=\"MIT\",((AP27/(AVERAGE($AB27,$AI27,$AP27,$AW27,$BD27)))-1),\nIF($L$4=\"MIN\",\nIF(OR(AP27=\"Nur EP        \",$K27=\"E\"),((AT27/(MIN($AF27,$AM27,$AT27,$BA27,$BH27)))-1),\nIF($L$4=\"MIN\",(AP27/(MIN($AB27,$AI27,$AP27,$AW27,$BD27)))-1)\n)))))))","v":-0.23185743273951642},{"$f":"IF(OR($K27=\"\",$K27=\"H\",$K27=\"AB\",$K27=\"G\",$J27=\"Position\",$K27=\"<-- Bitte Positionsart\",AO27=\"\",$L27=\"\"),\"\",\nIF(OR($K27=\"A\",$K27=\"B\",$K27=\"E\"),$L27*AO27))","v":""},null,null,{"$f":"IF(W27=\"Hinweis\",\"\",IF(OR($K27=\"A\",$K27=\"B\"),\"Nur EP        \",IF($K27=\"E\",\"E                \",IF(AND($L27<>\"\",AV27<>\"\"),$L27*AV27,\"\"))))","v":""},null,{"$f":"IF(AX27=\"\",\"\",IF(AX27=\"X\",AW27,AW27*AX27))","v":""},{"$f":"IF(OR($L27=\"\",AV27=\"\",$J27=\"Ausführungsbeschreibung\",$J27=\"Hinweis\"),\"\",\nIF(AND($AA27,$AH27,$AO27,$AV27,$BC27)=\"\",\"\",\nIF($L$4=\"MIT\",\nIF(OR(AW27=\"Nur EP        \",$K27=\"E\"),((BA27/(AVERAGE($AF27,$AM27,$AT27,$BA27,$BH27)))-1),\nIF($L$4=\"MIT\",((AW27/(AVERAGE($AB27,$AI27,$AP27,$AW27,$BD27)))-1),\nIF($L$4=\"MIN\",\nIF(OR(AW27=\"Nur EP        \",$K27=\"E\"),((BA27/(MIN($AF27,$AM27,$AT27,$BA27,$BH27)))-1),\nIF($L$4=\"MIN\",(AW27/(MIN($AB27,$AI27,$AP27,$AW27,$BD27)))-1)\n)))))))","v":""},{"$f":"IF(OR($K27=\"\",$K27=\"H\",$K27=\"AB\",$K27=\"G\",$J27=\"Position\",$K27=\"<-- Bitte Positionsart\",AV27=\"\",$L27=\"\"),\"\",\nIF(OR($K27=\"A\",$K27=\"B\",$K27=\"E\"),$L27*AV27))","v":""},null,null,"",null,"",{"$f":"IF(OR($L27=\"\",BC27=\"\",$J27=\"Ausführungsbeschreibung\",$J27=\"Hinweis\"),\"\",\nIF(AND($AA27,$AH27,$AO27,$AV27,$BC27)=\"\",\"\",\nIF($L$4=\"MIT\",\nIF(OR(BD27=\"Nur EP        \",$K27=\"E\"),((BH27/(AVERAGE($AF27,$AM27,$AT27,$BA27,$BH27)))-1),\nIF($L$4=\"MIT\",((BD27/(AVERAGE($AB27,$AI27,$AP27,$AW27,$BD27)))-1),\nIF($L$4=\"MIN\",\nIF(OR(BD27=\"Nur EP        \",$K27=\"E\"),((BH27/(MIN($AF27,$AM27,$AT27,$BA27,$BH27)))-1),\nIF($L$4=\"MIN\",(BD27/(MIN($AB27,$AI27,$AP27,$AW27,$BD27)))-1)\n)))))))","v":""},{"$f":"IF(OR($K27=\"\",$K27=\"H\",$K27=\"AB\",$K27=\"G\",$J27=\"Position\",$K27=\"<-- Bitte Positionsart\",BC27=\"\",$L27=\"\"),\"\",\nIF(OR($K27=\"A\",$K27=\"B\",$K27=\"E\"),$L27*BC27))","v":""}]
[null,null,null,null,null,null,{"$f":"G$25","v":2},3,"Abschnittweiser Abriss der Pfannendeckung auf den geneigten Dachflächen ","Position","",200,"qm",null,18.100000000000001,23.97,26.92,4794,null,"",null,30,{"$f":"IF($C28=\"Hinweis\",\"\",IF(OR($K28=\"A\",$K28=\"B\"),\"Nur EP        \",IF($K28=\"E\",\"E                \",IF(AND($L28<>\"\",V28<>\"\"),$L28*V28,\"\"))))","v":6000},0.17750956726523404,"",null,26.92,5384,null,"",0.12307050479766368,{"$f":"IF(OR($K28=\"\",$K28=\"H\",$K28=\"AB\",$K28=\"G\",$J28=\"Position\",$K28=\"<-- Bitte Positionsart\",AA28=\"\",$L28=\"\"),\"\",\nIF(OR($K28=\"A\",$K28=\"B\",$K28=\"E\"),$L28*AA28))","v":""},null,26.89,5378,null,"",0.1218189403420944,"",null,18.100000000000001,3620.0000000000005,null,"",-0.24488944513975797,{"$f":"IF(OR($K28=\"\",$K28=\"H\",$K28=\"AB\",$K28=\"G\",$J28=\"Position\",$K28=\"<-- Bitte Positionsart\",AO28=\"\",$L28=\"\"),\"\",\nIF(OR($K28=\"A\",$K28=\"B\",$K28=\"E\"),$L28*AO28))","v":""},null,null,"",null,"","","",null,null,"",null,"","",""]
[null,null,null,null,null,null,2,4,"Abriss u. Entsorgung der Dachrinnen","Position","",60.5,"m",null,6.45,8.4333333333333336,12.3,510.2166666666667,null,"",null,15,907.5,0.48883374689826287,"",null,6.45,390.22500000000002,null,"",-0.2351778656126482,"",null,6.55,396.27499999999998,null,"",-0.22332015810276684,"",null,12.3,{"$f":"IF(P29=\"Hinweis\",\"\",IF(OR($K29=\"A\",$K29=\"B\"),\"Nur EP        \",IF($K29=\"E\",\"E                \",IF(AND($L29<>\"\",AO29<>\"\"),$L29*AO29,\"\"))))","v":744.15000000000009},null,{"$f":"IF(AQ29=\"\",\"\",IF(AQ29=\"X\",AP29,AP29*AQ29))","v":""},0.45849802371541504,"",null,null,"",null,"","","",null,null,"",null,"","",""]
[null,null,null,null,null,null,2,5,"Rückbau der Fallrohranschlüsse","Position","",7,"Stck.",null,2.78,8.6533333333333342,20,60.573333333333338,null,"",null,15,105,0.46484374999999978,"",null,3.18,22.26,null,"",-0.63251155624036981,"",null,2.78,19.459999999999997,null,{"$f":"IF(AJ30=\"\",\"\",IF(AJ30=\"X\",AI30,AI30*AJ30))","v":""},-0.67873651771956856,"",null,20,140,null,"",1.3112480739599386,"",null,null,"",null,"","","",null,null,"",null,"","",""]
[null,null,null,null,null,null,2,6,"Sicherstellung von Belichtung u. Belüftung über die Dachflächenfenster","Hinweis","H",null,null,null,"","","","",null,"",null,null,"","","",null,null,{"$f":"IF(C31=\"Hinweis\",\"\",IF(OR($K31=\"A\",$K31=\"B\"),\"Nur EP        \",IF($K31=\"E\",\"E                \",IF(AND($L31<>\"\",AA31<>\"\"),$L31*AA31,\"\"))))","v":""},null,{"$f":"IF(AC31=\"\",\"\",IF(AC31=\"X\",AB31,AB31*AC31))","v":""},"","",null,null,"",null,"","","",null,null,"",null,"","",{"$f":"IF(OR($K31=\"\",$K31=\"H\",$K31=\"AB\",$K31=\"G\",$J31=\"Position\",$K31=\"<-- Bitte Positionsart\",AO31=\"\",$L31=\"\"),\"\",\nIF(OR($K31=\"A\",$K31=\"B\",$K31=\"E\"),$L31*AO31))","v":""},null,null,"",null,"","","",null,null,{"$f":"IF(AD31=\"Hinweis\",\"\",IF(OR($K31=\"A\",$K31=\"B\"),\"Nur EP        \",IF($K31=\"E\",\"E                \",IF(AND($L31<>\"\",BC31<>\"\"),$L31*BC31,\"\"))))","v":""},null,{"$f":"IF(BE31=\"\",\"\",IF(BE31=\"X\",BD31,BD31*BE31))","v":""},"",""]
[null,null,null,null,null,null,2,7,"Ausbau und Entsorgung Dachflächenfenster","Position","",4,"Stck.",null,110,131.72333333333333,146.65,526.89333333333332,null,"",null,125,500,"","",null,138.52000000000001,554.08000000000004,null,"",5.1598046410405773E-2,"",null,146.65,586.6,null,"",0.11331831869828179,"",null,110,440,null,"",-0.16491636510868735,"",null,null,"",null,"","","",null,null,"",null,"","",{"$f":"IF(OR($K32=\"\",$K32=\"H\",$K32=\"AB\",$K32=\"G\",$J32=\"Position\",$K32=\"<-- Bitte Positionsart\",BC32=\"\",$L32=\"\"),\"\",\nIF(OR($K32=\"A\",$K32=\"B\",$K32=\"E\"),$L32*BC32))","v":""}]
[null,null,null,null,null,null,2,8,"Ausbau und Entsorgung alter Mineralwolldämmung","Bedarfsposition","B",65,"qm",null,"","","","Nur EP        ",null,748.80000000000007,null,17.5,"Nur EP        ","",1137.5,null,14.03,"Nur EP        ",null,"",0.21788194444444464,{"$f":"IF(OR($K33=\"\",$K33=\"H\",$K33=\"AB\",$K33=\"G\",$J33=\"Position\",$K33=\"<-- Bitte Positionsart\",AA33=\"\",$L33=\"\"),\"\",\nIF(OR($K33=\"A\",$K33=\"B\",$K33=\"E\"),$L33*AA33))","v":911.94999999999993},null,14.03,"Nur EP        ",null,"",0.21788194444444464,911.94999999999993,null,6.5,"Nur EP        ",null,"",-0.43576388888888873,422.5,null,null,"Nur EP        ",null,"","","",null,null,"Nur EP        ",null,"","","",null,null,{"$f":"AP43/(MIN($AB43,$AI43,$AP43,$AW43,$BD43))","v":1}]
[null,null,null,null,null,null,2,9,null,null,"",null,null,null,"","","","",null,"",null,null,"","","",null,null,"",null,"","","",null,null,"",null,"","","",null,null,"",null,"","","",null,null,"",null,"","","",null,null,"",null,"","","",null,null,{"$f":"MIN($AB43,$AI43,$AP43,$AW43,$BD43)","v":4050}]
[null,null,null,null,null,null,2,10,null,null,{"$f":"IF(J35=\"Position\",\"\",IF(J35=\"Grundposition\",\"G\",IF(J35=\"Alternativposition\",\"A\",IF(J35=\"Bedarfsposition\",\"B\",IF(J35=\"Hinweis\",\"H\",IF(J35=\"Ausführungsbeschreibung\",\"AB\",IF(J35=\"Entfällt\",\"E\",IF(AND(I35<>\"\",L35<>\"\"),\"<-- Bitte Positionsart\",\"\"))))))))","v":""},null,null,null,"","","","",null,"",null,null,"","","",null,null,"",null,"","","",null,null,"",null,"","","",null,null,"",null,"","","",null,null,"",null,"","","",null,null,"",null,"","",""]
[null,null,null,null,null,null,2,{"$f":"IF($G36=\"\",\"\",ROW()-ROW(G$25))","v":11},null,null,{"$f":"IF(J36=\"Position\",\"\",IF(J36=\"Grundposition\",\"G\",IF(J36=\"Alternativposition\",\"A\",IF(J36=\"Bedarfsposition\",\"B\",IF(J36=\"Hinweis\",\"H\",IF(J36=\"Ausführungsbeschreibung\",\"AB\",IF(J36=\"Entfällt\",\"E\",IF(AND(I36<>\"\",L36<>\"\"),\"<-- Bitte Positionsart\",\"\"))))))))","v":""},null,null,null,"","","","",null,"",null,null,"",{"$f":"IF(OR($L105=\"\",V36=\"\",$J36=\"Ausführungsbeschreibung\",$J36=\"Hinweis\"),\"\",\nIF(AND($V36,$AA36,$AH36,$AO36,$AV36,$BC36)=\"\",\"\",\n\nIF(OR($W36=\"Nur EP        \",$K36=\"E\"),(Y36/(AVERAGE($Y36,$AF36,$AM36,$AT36,Y36))-1),\nIF(AND($W36,$AB36,$AI36,$AP36,$AW36)=\"\",\"\",(W36/(AVERAGE($W36,$AB36,$AI36,$AP36,$AW36)))-1))))","v":""},{"$f":"IF(OR($K36=\"\",$K36=\"H\",$K36=\"AB\",$K36=\"G\",$J36=\"Position\",$K36=\"<-- Bitte Positionsart\",V36=\"\",$L36=\"\"),\"\",\nIF(OR($K36=\"A\",$K36=\"B\",$K36=\"E\"),$L36*V36))","v":""},null,null,{"$f":"IF(C36=\"Hinweis\",\"\",IF(OR($K36=\"A\",$K36=\"B\"),\"Nur EP        \",IF($K36=\"E\",\"E                \",IF(AND($L36<>\"\",AA36<>\"\"),$L36*AA36,\"\"))))","v":""},null,{"$f":"IF(AC36=\"\",\"\",IF(AC36=\"X\",AB36,AB36*AC36))","v":""},"",{"$f":"IF(OR($K36=\"\",$K36=\"H\",$K36=\"AB\",$K36=\"G\",$J36=\"Position\",$K36=\"<-- Bitte Positionsart\",AA36=\"\",$L36=\"\"),\"\",\nIF(OR($K36=\"A\",$K36=\"B\",$K36=\"E\"),$L36*AA36))","v":""},null,null,"",null,{"$f":"IF(AJ36=\"\",\"\",IF(AJ36=\"X\",AI36,AI36*AJ36))","v":""},{"$f":"IF(OR($L36=\"\",AH36=\"\",$J36=\"Ausführungsbeschreibung\",$J36=\"Hinweis\"),\"\",\nIF(AND($AA36,$AH36,$AO36,$AV36,$BC36)=\"\",\"\",\nIF($L$4=\"MIT\",\nIF(OR(AI36=\"Nur EP        \",$K36=\"E\"),((AM36/(AVERAGE($AF36,$AM36,$AT36,$BA36,$BH36)))-1),\nIF($L$4=\"MIT\",((AI36/(AVERAGE($AB36,$AI36,$AP36,$AW36,$BD36)))-1),\nIF($L$4=\"MIN\",\nIF(OR(AI36=\"Nur EP        \",$K36=\"E\"),((AM36/(MIN($AF36,$AM36,$AT36,$BA36,$BH36)))-1),\nIF($L$4=\"MIN\",(AI36/(MIN($AB36,$AI36,$AP36,$AW36,$BD36)))-1)\n)))))))","v":""},"",null,null,{"$f":"IF(P36=\"Hinweis\",\"\",IF(OR($K36=\"A\",$K36=\"B\"),\"Nur EP        \",IF($K36=\"E\",\"E                \",IF(AND($L36<>\"\",AO36<>\"\"),$L36*AO36,\"\"))))","v":""},null,{"$f":"IF(AQ36=\"\",\"\",IF(AQ36=\"X\",AP36,AP36*AQ36))","v":""},"",{"$f":"IF(OR($K36=\"\",$K36=\"H\",$K36=\"AB\",$K36=\"G\",$J36=\"Position\",$K36=\"<-- Bitte Positionsart\",AO36=\"\",$L36=\"\"),\"\",\nIF(OR($K36=\"A\",$K36=\"B\",$K36=\"E\"),$L36*AO36))","v":""},null,null,"",null,"","","",null,null,{"$f":"IF(AD36=\"Hinweis\",\"\",IF(OR($K36=\"A\",$K36=\"B\"),\"Nur EP        \",IF($K36=\"E\",\"E                \",IF(AND($L36<>\"\",BC36<>\"\"),$L36*BC36,\"\"))))","v":""},null,{"$f":"IF(BE36=\"\",\"\",IF(BE36=\"X\",BD36,BD36*BE36))","v":""},"",{"$f":"IF(OR($K36=\"\",$K36=\"H\",$K36=\"AB\",$K36=\"G\",$J36=\"Position\",$K36=\"<-- Bitte Positionsart\",BC36=\"\",$L36=\"\"),\"\",\nIF(OR($K36=\"A\",$K36=\"B\",$K36=\"E\"),$L36*BC36))","v":""}]
[null,null,null,null,null,null,2,12,null,null,{"$f":"IF(J37=\"Position\",\"\",IF(J37=\"Grundposition\",\"G\",IF(J37=\"Alternativposition\",\"A\",IF(J37=\"Bedarfsposition\",\"B\",IF(J37=\"Hinweis\",\"H\",IF(J37=\"Ausführungsbeschreibung\",\"AB\",IF(J37=\"Entfällt\",\"E\",IF(AND(I37<>\"\",L37<>\"\"),\"<-- Bitte Positionsart\",\"\"))))))))","v":""},null,null,null,"","","","",null,"",null,null,"","","",null,null,"",null,"","","",null,null,"",null,"","","",null,null,"",null,"","","",null,null,"",null,"","","",null,null,"",null,"","",""]
[null,null,null,null,null,null,2,13,null,null,{"$f":"IF(J38=\"Position\",\"\",IF(J38=\"Grundposition\",\"G\",IF(J38=\"Alternativposition\",\"A\",IF(J38=\"Bedarfsposition\",\"B\",IF(J38=\"Hinweis\",\"H\",IF(J38=\"Ausführungsbeschreibung\",\"AB\",IF(J38=\"Entfällt\",\"E\",IF(AND(I38<>\"\",L38<>\"\"),\"<-- Bitte Positionsart\",\"\"))))))))","v":""},null,null,null,"","","","",null,"",null,null,"","","",null,null,"",null,"","","",null,null,"",null,"","","",null,null,"",null,"","","",null,null,"",null,"","","",null,null,"",null,"","",""]
[null,null,null,null,null,null,2,14,null,null,"",null,null,null,"","","","",null,"",null,null,{"$f":"IF($C39=\"Hinweis\",\"\",IF(OR($K39=\"A\",$K39=\"B\"),\"Nur EP        \",IF($K39=\"E\",\"E                \",IF(AND($L39<>\"\",V39<>\"\"),$L39*V39,\"\"))))","v":""},"","",null,null,"",null,"","","",null,null,{"$f":"IF(J39=\"Hinweis\",\"\",IF(OR($K39=\"A\",$K39=\"B\"),\"Nur EP        \",IF($K39=\"E\",\"E                \",IF(AND($L39<>\"\",AH39<>\"\"),$L39*AH39,\"\"))))","v":""},null,"","",{"$f":"IF(OR($K39=\"\",$K39=\"H\",$K39=\"AB\",$K39=\"G\",$J39=\"Position\",$K39=\"<-- Bitte Positionsart\",AH39=\"\",$L39=\"\"),\"\",\nIF(OR($K39=\"A\",$K39=\"B\",$K39=\"E\"),$L39*AH39))","v":""},null,null,"",null,"","","",null,null,"",null,"","","",null,null,"",null,"","",""]
[null,null,null,null,null,null,null,null,null,null,null,null,null,null,null,null,null,null,null,null,null,null,{"$f":"IF(OR($K40=\"A\",$K40=\"B\"),\"Nur EP        \",IF($K40=\"E\",\"\",IF(AND($L40<>\"\",V40<>\"\"),$L40*V40,\"\")))","v":""},null,{"$f":"IF($K40=\"Ja\",IF(AND($L40<>\"\",V40<>\"\"),$L40*V40),\"\")","v":""},null,"EP / % Titel","Positions- / Titelsumme",null,{"$f":"IF(AC40=\"\",\"\",IF(AC40=\"X\",AB40,AB40*AC40))","v":""},null,{"$f":"IF($K40=\"Ja\",IF(AND($L40<>\"\",AA40<>\"\"),$L40*AA40),\"\")","v":""},null,"EP / % Titel","Positions- / Titelsumme",null,{"$f":"IF(AJ40=\"\",\"\",IF(AJ40=\"X\",AI40,AI40*AJ40))","v":""},null,{"$f":"IF($K40=\"Ja\",IF(AND($L40<>\"\",AH40<>\"\"),$L40*AH40),\"\")","v":""},null,"EP / % Titel","Positions- / Titelsumme",null,{"$f":"IF(AQ40=\"\",\"\",IF(AQ40=\"X\",AP40,AP40*AQ40))","v":""},null,{"$f":"IF($K40=\"Ja\",IF(AND($L40<>\"\",AO40<>\"\"),$L40*AO40),\"\")","v":""},null,"EP / % Titel","Positions- / Titelsumme",null,{"$f":"IF(AX40=\"\",\"\",IF(AX40=\"X\",AW40,AW40*AX40))","v":""},null,{"$f":"IF($K40=\"Ja\",IF(AND($L40<>\"\",AV40<>\"\"),$L40*AV40),\"\")","v":""},null,"EP / % Titel","Positions- / Titelsumme",null,{"$f":"IF(BE40=\"\",\"\",IF(BE40=\"X\",BD40,BD40*BE40))","v":""},null,{"$f":"IF($K40=\"Ja\",IF(AND($L40<>\"\",BC40<>\"\"),$L40*BC40),\"\")","v":""}]
[null,null,null,null,null,null,3,null,"Abriss /Rückbau /Neueinbau im Bereich des Flachdachs mit Folienabdichtung",null,null,null,null,null,{"$f":"CONCATENATE(\"Titelsumme\",CHAR(10),\"MIN\",CHAR(10),TEXT(SUMPRODUCT($L42:$L63,O42:O63),\"##.##0,00\"),\" €\")","v":"Titelsumme\nMIN\n5.205,00 €"},{"$f":"CONCATENATE(\"Titelsumme\",CHAR(10),\"MIT\",CHAR(10),TEXT(SUMPRODUCT($L42:$L63,P42:P63),\"##.##0,00\"),\" €\")","v":"Titelsumme\nMIT\n9.224,19 €"},{"$f":"CONCATENATE(\"Titelsumme\",CHAR(10),\"MAX\",CHAR(10),TEXT(SUMPRODUCT($L42:$L63,Q42:Q63),\"##.##0,00\"),\" €\")","v":"Titelsumme\nMAX\n11.446,60 €"},{"$f":"SUM(R42:R63)","v":9224.1933333333345},null,{"$f":"SUM(T42:T63)","v":244.36},null,null,{"$f":"SUM(W42:W63)","v":4975},null,{"$f":"SUM(Y42:Y63)","v":250},null,{"$f":"IF(AB41=0,\"\",\nIF($L$4=\"MIT\",((AB41/(AVERAGE($AB41,$AI41,$AP41,$AW41,$BD41)))-1)*100,))","v":99.131775931264812},{"$f":"SUM(AB42:AB63)","v":11020.980000000001},null,"",null,{"$f":"SUM(AF42:AF63)","v":311.54000000000002},null,{"$f":"IF(AI41=0,\"\",\nIF($L$4=\"MIT\",((AI41/(AVERAGE($AB41,$AI41,$AP41,$AW41,$BD41)))-1)*100,))","v":106.82205995971464},{"$f":"SUM(AI42:AI63)","v":11446.6},null,"",null,{"$f":"SUM(AM42:AM63)","v":311.54000000000002},null,{"$f":"IF(AP41=0,\"\",\nIF($L$4=\"MIT\",((AP41/(AVERAGE($AB41,$AI41,$AP41,$AW41,$BD41)))-1)*100,))","v":-5.9538358909794535},{"$f":"SUM(AP42:AP63)","v":5205},null,"",null,{"$f":"SUM(AT42:AT63)","v":110},null,{"$f":"IF(AW41=0,\"\",\nIF($L$4=\"MIT\",((AW41/(AVERAGE($AB41,$AI41,$AP41,$AW41,$BD41)))-1)*100,))","v":""},{"$f":"SUM(AW42:AW63)","v":0},null,"",null,{"$f":"SUM(BA42:BA63)","v":0},null,{"$f":"IF(BD41=0,\"\",\nIF($L$4=\"MIT\",((BD41/(AVERAGE($AB41,$AI41,$AP41,$AW41,$BD41)))-1)*100,))","v":""},{"$f":"SUM(BD42:BD63)","v":0},null,"",null,{"$f":"SUM(BH42:BH63)","v":0}]
[null,null,null,null,null,null,{"$f":"G$41","v":3},{"$f":"IF($G42=\"\",\"\",ROW()-ROW(G$41))","v":1},"Hinweis zu vorhandener Mineralwolldämmung","Hinweis",{"$f":"IF(J42=\"Position\",\"\",IF(J42=\"Grundposition\",\"G\",IF(J42=\"Alternativposition\",\"A\",IF(J42=\"Bedarfsposition\",\"B\",IF(J42=\"Hinweis\",\"H\",IF(J42=\"Ausführungsbeschreibung\",\"AB\",IF(J42=\"Entfällt\",\"E\",IF(AND(I42<>\"\",L42<>\"\"),\"<-- Bitte Positionsart\",\"\"))))))))","v":"H"},null,null,null,{"$f":"IF(OR($K42=\"B\",$K42=\"A\",$K42=\"H\",$K42=\"AB\",$K42=\"<-- Bitte Positionsart\",SUM(AA42,AH42,AO42,AV42,BC42)=0),\"\",MIN(AA42,AH42,AO42,AV42,BC42))","v":""},{"$f":"IF(OR($K42=\"B\",$K42=\"A\",$K42=\"H\",$K42=\"AB\",$K42=\"<-- Bitte Positionsart\",SUM(AA42,AH42,AO42,AV42,BC42)=0),\"\",SUM(AA42,AH42,AO42,AV42,BC42)/COUNT(AA42,AH42,AO42,AV42,BC42))","v":""},{"$f":"IF(OR($K42=\"B\",$K42=\"A\",$K42=\"H\",$K42=\"AB\",$K42=\"<-- Bitte Positionsart\",SUM(AA42,AH42,AO42,AV42,BC42)=0),\"\",MAX(AA42,AH42,AO42,AV42,BC42))","v":""},{"$f":"IF(OR($K42=\"A\",$K42=\"B\"),\"Nur EP        \",IF($K42=\"E\",\"E                \",IF(AND($L42<>\"\",P42<>\"\"),$L42*P42,\"\")))","v":""},null,{"$f":"IF(OR($K42=\"\",$K42=\"H\",$K42=\"AB\",$K42=\"G\",$K42=\"<-- Bitte Positionsart\"),\"\",IF(OR($K42=\"A\",$K42=\"B\"),$L42*(SUM(AA42,AH42,AO42,AV42,BC42)/COUNT(AA42,AH42,AO42,AV42,BC42)),IF($K42=\"E\",$L42*P42)))","v":""},null,null,{"$f":"IF(OR($K42=\"A\",$K42=\"B\"),\"Nur EP        \",IF($K42=\"E\",\"E                \",IF(AND($L42<>\"\",V42<>\"\"),$L42*V42,\"\")))","v":""},{"$f":"IF(OR($L111=\"\",V42=\"\",$J42=\"Ausführungsbeschreibung\",$J42=\"Hinweis\"),\"\",\nIF(AND($V42,$AA42,$AH42,$AO42,$AV42,$BC42)=\"\",\"\",\n\nIF(OR($W42=\"Nur EP        \",$K42=\"E\"),(Y42/(AVERAGE($Y42,$AF42,$AM42,$AT42,Y42))-1),\nIF(AND($W42,$AB42,$AI42,$AP42,$AW42)=\"\",\"\",(W42/(AVERAGE($W42,$AB42,$AI42,$AP42,$AW42)))-1))))","v":""},{"$f":"IF(OR($K42=\"\",$K42=\"H\",$K42=\"AB\",$K42=\"G\",$J42=\"Position\",$K42=\"<-- Bitte Positionsart\",V42=\"\",$L42=\"\"),\"\",\nIF(OR($K42=\"A\",$K42=\"B\",$K42=\"E\"),$L42*V42))","v":""},null,null,{"$f":"IF(C42=\"Hinweis\",\"\",IF(OR($K42=\"A\",$K42=\"B\"),\"Nur EP        \",IF($K42=\"E\",\"E                \",IF(AND($L42<>\"\",AA42<>\"\"),$L42*AA42,\"\"))))","v":""},null,{"$f":"IF(AC42=\"\",\"\",IF(AC42=\"X\",AB42,AB42*AC42))","v":""},{"$f":"IF(OR($L42=\"\",AA42=\"\",$J42=\"Ausführungsbeschreibung\",$J42=\"Hinweis\"),\"\",\nIF(AND($AA42,$AH42,$AO42,$AV42,$BC42)=\"\",\"\",\nIF($L$4=\"MIT\",\nIF(OR(AB42=\"Nur EP        \",$K42=\"E\"),((AF42/(AVERAGE($AF42,$AM42,$AT42,$BA42,$BH42)))-1),\nIF($L$4=\"MIT\",((AB42/(AVERAGE($AB42,$AI42,$AP42,$AW42,$BD42)))-1),\nIF($L$4=\"MIN\",\nIF(OR(AB42=\"Nur EP        \",$K42=\"E\"),((AF42/(MIN($AF42,$AM42,$AT42,$BA42,$BH42)))-1),\nIF($L$4=\"MIN\",((AB42/(MIN($AB42,$AI42,$AP42,$AW42,$BD42)))-1))\n)))))))","v":""},{"$f":"IF(OR($K42=\"\",$K42=\"H\",$K42=\"AB\",$K42=\"G\",$J42=\"Position\",$K42=\"<-- Bitte Positionsart\",AA42=\"\",$L42=\"\"),\"\",\nIF(OR($K42=\"A\",$K42=\"B\",$K42=\"E\"),$L42*AA42))","v":""},null,null,{"$f":"IF(J42=\"Hinweis\",\"\",IF(OR($K42=\"A\",$K42=\"B\"),\"Nur EP        \",IF($K42=\"E\",\"E                \",IF(AND($L42<>\"\",AH42<>\"\"),$L42*AH42,\"\"))))","v":""},null,{"$f":"IF(AJ42=\"\",\"\",IF(AJ42=\"X\",AI42,AI42*AJ42))","v":""},{"$f":"IF(OR($L42=\"\",AH42=\"\",$J42=\"Ausführungsbeschreibung\",$J42=\"Hinweis\"),\"\",\nIF(AND($AA42,$AH42,$AO42,$AV42,$BC42)=\"\",\"\",\nIF($L$4=\"MIT\",\nIF(OR(AI42=\"Nur EP        \",$K42=\"E\"),((AM42/(AVERAGE($AF42,$AM42,$AT42,$BA42,$BH42)))-1)*100,\nIF($L$4=\"MIT\",((AI42/(AVERAGE($AB42,$AI42,$AP42,$AW42,$BD42)))-1)*100,\nIF($L$4=\"MIN\",\nIF(OR(AI42=\"Nur EP        \",$K42=\"E\"),((AM42/(MIN($AF42,$AM42,$AT42,$BA42,$BH42)))-1)*100,\nIF($L$4=\"MIN\",(AI42/(MIN($AB42,$AI42,$AP42,$AW42,$BD42)))-1)*100\n)))))))","v":""},{"$f":"IF(OR($K42=\"\",$K42=\"H\",$K42=\"AB\",$K42=\"G\",$J42=\"Position\",$K42=\"<-- Bitte Positionsart\",AH42=\"\",$L42=\"\"),\"\",\nIF(OR($K42=\"A\",$K42=\"B\",$K42=\"E\"),$L42*AH42))","v":""},null,null,{"$f":"IF(P42=\"Hinweis\",\"\",IF(OR($K42=\"A\",$K42=\"B\"),\"Nur EP        \",IF($K42=\"E\",\"E                \",IF(AND($L42<>\"\",AO42<>\"\"),$L42*AO42,\"\"))))","v":""},null,{"$f":"IF(AQ42=\"\",\"\",IF(AQ42=\"X\",AP42,AP42*AQ42))","v":""},{"$f":"IF(OR($L42=\"\",AO42=\"\",$J42=\"Ausführungsbeschreibung\",$J42=\"Hinweis\"),\"\",\nIF(AND($AA42,$AH42,$AO42,$AV42,$BC42)=\"\",\"\",\nIF($L$4=\"MIT\",\nIF(OR(AP42=\"Nur EP        \",$K42=\"E\"),((AT42/(AVERAGE($AF42,$AM42,$AT42,$BA42,$BH42)))-1),\nIF($L$4=\"MIT\",((AP42/(AVERAGE($AB42,$AI42,$AP42,$AW42,$BD42)))-1),\nIF($L$4=\"MIN\",\nIF(OR(AP42=\"Nur EP        \",$K42=\"E\"),((AT42/(MIN($AF42,$AM42,$AT42,$BA42,$BH42)))-1),\nIF($L$4=\"MIN\",(AP42/(MIN($AB42,$AI42,$AP42,$AW42,$BD42)))-1)\n)))))))","v":""},{"$f":"IF(OR($K42=\"\",$K42=\"H\",$K42=\"AB\",$K42=\"G\",$J42=\"Position\",$K42=\"<-- Bitte Positionsart\",AO42=\"\",$L42=\"\"),\"\",\nIF(OR($K42=\"A\",$K42=\"B\",$K42=\"E\"),$L42*AO42))","v":""},null,null,{"$f":"IF(W42=\"Hinweis\",\"\",IF(OR($K42=\"A\",$K42=\"B\"),\"Nur EP        \",IF($K42=\"E\",\"E                \",IF(AND($L42<>\"\",AV42<>\"\"),$L42*AV42,\"\"))))","v":""},null,"",{"$f":"IF(OR($L42=\"\",AV42=\"\",$J42=\"Ausführungsbeschreibung\",$J42=\"Hinweis\"),\"\",\nIF(AND($AA42,$AH42,$AO42,$AV42,$BC42)=\"\",\"\",\nIF($L$4=\"MIT\",\nIF(OR(AW42=\"Nur EP        \",$K42=\"E\"),((BA42/(AVERAGE($AF42,$AM42,$AT42,$BA42,$BH42)))-1),\nIF($L$4=\"MIT\",((AW42/(AVERAGE($AB42,$AI42,$AP42,$AW42,$BD42)))-1),\nIF($L$4=\"MIN\",\nIF(OR(AW42=\"Nur EP        \",$K42=\"E\"),((BA42/(MIN($AF42,$AM42,$AT42,$BA42,$BH42)))-1),\nIF($L$4=\"MIN\",(AW42/(MIN($AB42,$AI42,$AP42,$AW42,$BD42)))-1)\n)))))))","v":""},{"$f":"IF(OR($K42=\"\",$K42=\"H\",$K42=\"AB\",$K42=\"G\",$J42=\"Position\",$K42=\"<-- Bitte Positionsart\",AV42=\"\",$L42=\"\"),\"\",\nIF(OR($K42=\"A\",$K42=\"B\",$K42=\"E\"),$L42*AV42))","v":""},null,null,{"$f":"IF(AD42=\"Hinweis\",\"\",IF(OR($K42=\"A\",$K42=\"B\"),\"Nur EP        \",IF($K42=\"E\",\"E                \",IF(AND($L42<>\"\",BC42<>\"\"),$L42*BC42,\"\"))))","v":""},null,"",{"$f":"IF(OR($L42=\"\",BC42=\"\",$J42=\"Ausführungsbeschreibung\",$J42=\"Hinweis\"),\"\",\nIF(AND($AA42,$AH42,$AO42,$AV42,$BC42)=\"\",\"\",\nIF($L$4=\"MIT\",\nIF(OR(BD42=\"Nur EP        \",$K42=\"E\"),((BH42/(AVERAGE($AF42,$AM42,$AT42,$BA42,$BH42)))-1),\nIF($L$4=\"MIT\",((BD42/(AVERAGE($AB42,$AI42,$AP42,$AW42,$BD42)))-1),\nIF($L$4=\"MIN\",\nIF(OR(BD42=\"Nur EP        \",$K42=\"E\"),((BH42/(MIN($AF42,$AM42,$AT42,$BA42,$BH42)))-1),\nIF($L$4=\"MIN\",((BD42/(MIN($AB42,$AI42,$AP42,$AW42,$BD42)))-1))\n)))))))","v":""},{"$f":"IF(OR($K42=\"\",$K42=\"H\",$K42=\"AB\",$K42=\"G\",$J42=\"Position\",$K42=\"<-- Bitte Positionsart\",BC42=\"\",$L42=\"\"),\"\",\nIF(OR($K42=\"A\",$K42=\"B\",$K42=\"E\"),$L42*BC42))","v":""}]
[null,null,null,null,null,null,3,{"$f":"IF($G43=\"\",\"\",ROW()-ROW(G$41))","v":2},"Abschnittweiser Abriss /Rückbau der PVC Folienabdichtung Flachdach samt Flies ","Position","",150,"qm",null,27,41.550000000000004,49.1,6232.5000000000009,null,"",null,25,3750,{"$f":"IF(OR($L112=\"\",V43=\"\",$J43=\"Ausführungsbeschreibung\",$J43=\"Hinweis\"),\"\",\nIF(AND($V43,$AA43,$AH43,$AO43,$AV43,$BC43)=\"\",\"\",\n\nIF(OR($W43=\"Nur EP        \",$K43=\"E\"),(Y43/(AVERAGE($Y43,$AF43,$AM43,$AT43,Y43))-1),\nIF(AND($W43,$AB43,$AI43,$AP43,$AW43)=\"\",\"\",(W43/(AVERAGE($W43,$AB43,$AI43,$AP43,$AW43)))-1))))","v":-0.33177413965920477},{"$f":"IF(OR($K43=\"\",$K43=\"H\",$K43=\"AB\",$K43=\"G\",$J43=\"Position\",$K43=\"<-- Bitte Positionsart\",V43=\"\",$L43=\"\"),\"\",\nIF(OR($K43=\"A\",$K43=\"B\",$K43=\"E\"),$L43*V43))","v":""},null,48.55,7282.5,null,"",{"$f":"IF(OR($L43=\"\",AA43=\"\",$J43=\"Ausführungsbeschreibung\",$J43=\"Hinweis\"),\"\",\nIF(AND($AA43,$AH43,$AO43,$AV43,$BC43)=\"\",\"\",\nIF($L$4=\"MIT\",\nIF(OR(AB43=\"Nur EP        \",$K43=\"E\"),(AF43/(AVERAGE($AF43,$AM43,$AT43,$BA43,$BH43)))-1,\nIF($L$4=\"MIT\",(AB43/(AVERAGE($AB43,$AI43,$AP43,$AW43,$BD43)))-1,\nIF($L$4=\"MIN\",\nIF(OR(AB43=\"Nur EP        \",$K43=\"E\"),(AF43/(MIN($AF43,$AM43,$AT43,$BA43,$BH43)))-1,\nIF($L$4=\"MIN\",AB43/(MIN($AB43,$AI43,$AP43,$AW43,$BD43))-1)\n)))))))","v":0.16847172081829132},{"$f":"IF(OR($K43=\"\",$K43=\"H\",$K43=\"AB\",$K43=\"G\",$J43=\"Position\",$K43=\"<-- Bitte Positionsart\",AA43=\"\",$L43=\"\"),\"\",\nIF(OR($K43=\"A\",$K43=\"B\",$K43=\"E\"),$L43*AA43))","v":""},null,49.1,7365,null,"",{"$f":"IF(OR($L43=\"\",AH43=\"\",$J43=\"Ausführungsbeschreibung\",$J43=\"Hinweis\"),\"\",\nIF(AND($AA43,$AH43,$AO43,$AV43,$BC43)=\"\",\"\",\nIF($L$4=\"MIT\",\nIF(OR(AI43=\"Nur EP        \",$K43=\"E\"),((AM43/(AVERAGE($AF43,$AM43,$AT43,$BA43,$BH43)))-1),\nIF($L$4=\"MIT\",((AI43/(AVERAGE($AB43,$AI43,$AP43,$AW43,$BD43)))-1),\nIF($L$4=\"MIN\",\nIF(OR(AI43=\"Nur EP        \",$K43=\"E\"),((AM43/(MIN($AF43,$AM43,$AT43,$BA43,$BH43)))-1),\nIF($L$4=\"MIN\",(AI43/(MIN($AB43,$AI43,$AP43,$AW43,$BD43)))-1)\n)))))))","v":0.18170878459687123},{"$f":"IF(OR($K43=\"\",$K43=\"H\",$K43=\"AB\",$K43=\"G\",$J43=\"Position\",$K43=\"<-- Bitte Positionsart\",AH43=\"\",$L43=\"\"),\"\",\nIF(OR($K43=\"A\",$K43=\"B\",$K43=\"E\"),$L43*AH43))","v":""},null,27,4050,null,"",{"$f":"IF(OR($L43=\"\",AO43=\"\",$J43=\"Ausführungsbeschreibung\",$J43=\"Hinweis\"),\"\",\nIF(AND($AA43,$AH43,$AO43,$AV43,$BC43)=\"\",\"\",\nIF($L$4=\"MIT\",\nIF(OR(AP43=\"Nur EP        \",$K43=\"E\"),((AT43/(AVERAGE($AF43,$AM43,$AT43,$BA43,$BH43)))-1),\nIF($L$4=\"MIT\",((AP43/(AVERAGE($AB43,$AI43,$AP43,$AW43,$BD43)))-1),\nIF($L$4=\"MIN\",\nIF(OR(AP43=\"Nur EP        \",$K43=\"E\"),((AT43/(MIN($AF43,$AM43,$AT43,$BA43,$BH43)))-1),\nIF($L$4=\"MIN\",(AP43/(MIN($AB43,$AI43,$AP43,$AW43,$BD43)))-1)\n)))))))","v":-0.35018050541516244},{"$f":"IF(OR($K43=\"\",$K43=\"H\",$K43=\"AB\",$K43=\"G\",$J43=\"Position\",$K43=\"<-- Bitte Positionsart\",AO43=\"\",$L43=\"\"),\"\",\nIF(OR($K43=\"A\",$K43=\"B\",$K43=\"E\"),$L43*AO43))","v":""},null,null,"",null,"",{"$f":"IF(OR($L43=\"\",AV43=\"\",$J43=\"Ausführungsbeschreibung\",$J43=\"Hinweis\"),\"\",\nIF(AND($AA43,$AH43,$AO43,$AV43,$BC43)=\"\",\"\",\nIF($L$4=\"MIT\",\nIF(OR(AW43=\"Nur EP        \",$K43=\"E\"),((BA43/(AVERAGE($AF43,$AM43,$AT43,$BA43,$BH43)))-1),\nIF($L$4=\"MIT\",((AW43/(AVERAGE($AB43,$AI43,$AP43,$AW43,$BD43)))-1),\nIF($L$4=\"MIN\",\nIF(OR(AW43=\"Nur EP        \",$K43=\"E\"),((BA43/(MIN($AF43,$AM43,$AT43,$BA43,$BH43)))-1),\nIF($L$4=\"MIN\",(AW43/(MIN($AB43,$AI43,$AP43,$AW43,$BD43)))-1)\n)))))))","v":""},{"$f":"IF(OR($K43=\"\",$K43=\"H\",$K43=\"AB\",$K43=\"G\",$J43=\"Position\",$K43=\"<-- Bitte Positionsart\",AV43=\"\",$L43=\"\"),\"\",\nIF(OR($K43=\"A\",$K43=\"B\",$K43=\"E\"),$L43*AV43))","v":""},null,null,"",null,"",{"$f":"IF(OR($L43=\"\",BC43=\"\",$J43=\"Ausführungsbeschreibung\",$J43=\"Hinweis\"),\"\",\nIF(AND($AA43,$AH43,$AO43,$AV43,$BC43)=\"\",\"\",\nIF($L$4=\"MIT\",\nIF(OR(BD43=\"Nur EP        \",$K43=\"E\"),((BH43/(AVERAGE($AF43,$AM43,$AT43,$BA43,$BH43)))-1),\nIF($L$4=\"MIT\",((BD43/(AVERAGE($AB43,$AI43,$AP43,$AW43,$BD43)))-1),\nIF($L$4=\"MIN\",\nIF(OR(BD43=\"Nur EP        \",$K43=\"E\"),((BH43/(MIN($AF43,$AM43,$AT43,$BA43,$BH43)))-1),\nIF($L$4=\"MIN\",((BD43/(MIN($AB43,$AI43,$AP43,$AW43,$BD43)))-1))\n)))))))","v":""},{"$f":"IF(OR($K43=\"\",$K43=\"H\",$K43=\"AB\",$K43=\"G\",$J43=\"Position\",$K43=\"<-- Bitte Positionsart\",BC43=\"\",$L43=\"\"),\"\",\nIF(OR($K43=\"A\",$K43=\"B\",$K43=\"E\"),$L43*BC43))","v":""}]
[null,null,null,null,null,null,3,3,"Ausbau /Entsorgung /Neueinbau von Strangentlüftungen","Position","",5,"Stck.",null,175,277.79000000000002,346.83,1388.95,null,"",null,175,875,-0.30581036722631572,"",null,311.54000000000002,1557.7,null,"",0.12149465423521355,{"$f":"IF(OR($K44=\"\",$K44=\"H\",$K44=\"AB\",$K44=\"G\",$J44=\"Position\",$K44=\"<-- Bitte Positionsart\",AA44=\"\",$L44=\"\"),\"\",\nIF(OR($K44=\"A\",$K44=\"B\",$K44=\"E\"),$L44*AA44))","v":""},null,346.83,1734.1499999999999,null,"",{"$f":"IF(OR($L44=\"\",AH44=\"\",$J44=\"Ausführungsbeschreibung\",$J44=\"Hinweis\"),\"\",\nIF(AND($AA44,$AH44,$AO44,$AV44,$BC44)=\"\",\"\",\nIF($L$4=\"MIT\",\nIF(OR(AI44=\"Nur EP        \",$K44=\"E\"),((AM44/(AVERAGE($AF44,$AM44,$AT44,$BA44,$BH44)))-1),\nIF($L$4=\"MIT\",((AI44/(AVERAGE($AB44,$AI44,$AP44,$AW44,$BD44)))-1),\nIF($L$4=\"MIN\",\nIF(OR(AI44=\"Nur EP        \",$K44=\"E\"),((AM44/(MIN($AF44,$AM44,$AT44,$BA44,$BH44)))-1),\nIF($L$4=\"MIN\",(AI44/(MIN($AB44,$AI44,$AP44,$AW44,$BD44)))-1)\n)))))))","v":0.24853306454515978},{"$f":"IF(OR($K44=\"\",$K44=\"H\",$K44=\"AB\",$K44=\"G\",$J44=\"Position\",$K44=\"<-- Bitte Positionsart\",AH44=\"\",$L44=\"\"),\"\",\nIF(OR($K44=\"A\",$K44=\"B\",$K44=\"E\"),$L44*AH44))","v":""},null,175,875,null,"",{"$f":"IF(OR($L44=\"\",AO44=\"\",$J44=\"Ausführungsbeschreibung\",$J44=\"Hinweis\"),\"\",\nIF(AND($AA44,$AH44,$AO44,$AV44,$BC44)=\"\",\"\",\nIF($L$4=\"MIT\",\nIF(OR(AP44=\"Nur EP        \",$K44=\"E\"),((AT44/(AVERAGE($AF44,$AM44,$AT44,$BA44,$BH44)))-1),\nIF($L$4=\"MIT\",((AP44/(AVERAGE($AB44,$AI44,$AP44,$AW44,$BD44)))-1),\nIF($L$4=\"MIN\",\nIF(OR(AP44=\"Nur EP        \",$K44=\"E\"),((AT44/(MIN($AF44,$AM44,$AT44,$BA44,$BH44)))-1),\nIF($L$4=\"MIN\",(AP44/(MIN($AB44,$AI44,$AP44,$AW44,$BD44)))-1)\n)))))))","v":-0.37002771878037366},{"$f":"IF(OR($K44=\"\",$K44=\"H\",$K44=\"AB\",$K44=\"G\",$J44=\"Position\",$K44=\"<-- Bitte Positionsart\",AO44=\"\",$L44=\"\"),\"\",\nIF(OR($K44=\"A\",$K44=\"B\",$K44=\"E\"),$L44*AO44))","v":""},null,null,"",null,"","","",null,null,"",null,"","",{"$f":"IF(OR($K44=\"\",$K44=\"H\",$K44=\"AB\",$K44=\"G\",$J44=\"Position\",$K44=\"<-- Bitte Positionsart\",BC44=\"\",$L44=\"\"),\"\",\nIF(OR($K44=\"A\",$K44=\"B\",$K44=\"E\"),$L44*BC44))","v":""}]
[null,null,null,null,null,null,3,4,"Anschluss vorhandener /verbleibender Strangentlüftunger","Position","",7,"Stck.",null,40,228.96333333333337,335.35,1602.7433333333336,null,"",null,50,350,-0.72858907028186026,"",null,311.54000000000002,2180.7800000000002,null,"",0.36065454439575473,"",null,335.35,2347.4500000000003,null,"",0.46464499410385929,"",null,40,280,null,"",-0.82529953849961424,"",null,null,"",null,"","","",null,null,"",null,"","",""]
[null,null,null,null,null,null,3,5,"Ausbau /Entsorgung von Oberlichtern","Bedarfsposition","B",1,"Stck.",null,"","","","Nur EP        ",null,244.36,null,250,"Nur EP        ",1.3721737437960346E-2,250,null,311.54000000000002,"Nur EP        ",null,"",0.27492224586675396,311.54000000000002,null,311.54000000000002,"Nur EP        ",null,"",0.27492224586675396,311.54000000000002,null,110,"Nur EP        ",null,"",-0.54984449173350791,110,null,null,"Nur EP        ",null,"","","",null,null,"Nur EP        ",null,"","",""]
[null,null,null,null,null,null,3,6,null,null,"",null,null,null,"","","","",null,"",null,null,"","","",null,null,"",null,"","","",null,null,"",null,"","","",null,null,"",null,"","","",null,null,"",null,"","","",null,null,"",null,"","",""]
[null,null,null,null,null,null,3,7,null,null,"",null,null,null,"","","","",null,"",null,null,"","","",null,null,"",null,"","","",null,null,"",null,"","","",null,null,"",null,"","","",null,null,"",null,"","","",null,null,"",null,"","",""]
[null,null,null,null,null,null,3,8,null,null,"",null,null,null,"","","","",null,"",null,null,{"$f":"IF($C49=\"Hinweis\",\"\",IF(OR($K49=\"A\",$K49=\"B\"),\"Nur EP        \",IF($K49=\"E\",\"E                \",IF(AND($L49<>\"\",V49<>\"\"),$L49*V49,\"\"))))","v":""},"","",null,null,{"$f":"IF($C49=\"Hinweis\",\"\",IF(OR($K49=\"A\",$K49=\"B\"),\"Nur EP        \",IF($K49=\"E\",\"E                \",IF(AND($L49<>\"\",AA49<>\"\"),$L49*AA49,\"\"))))","v":""},null,"","","",null,null,{"$f":"IF($C49=\"Hinweis\",\"\",IF(OR($K49=\"A\",$K49=\"B\"),\"Nur EP        \",IF($K49=\"E\",\"E                \",IF(AND($L49<>\"\",AH49<>\"\"),$L49*AH49,\"\"))))","v":""},null,"","","",null,null,{"$f":"IF($C49=\"Hinweis\",\"\",IF(OR($K49=\"A\",$K49=\"B\"),\"Nur EP        \",IF($K49=\"E\",\"E                \",IF(AND($L49<>\"\",AO49<>\"\"),$L49*AO49,\"\"))))","v":""},null,"","","",null,null,"",null,"","","",null,null,{"$f":"IF($C49=\"Hinweis\",\"\",IF(OR($K49=\"A\",$K49=\"B\"),\"Nur EP        \",IF($K49=\"E\",\"E                \",IF(AND($L49<>\"\",BC49<>\"\"),$L49*BC49,\"\"))))","v":""},null,"","",""]
[null,null,null,null,null,null,3,9,null,null,"",null,null,null,"","","","",null,"",null,null,{"$f":"IF($C50=\"Hinweis\",\"\",IF(OR($K50=\"A\",$K50=\"B\"),\"Nur EP        \",IF($K50=\"E\",\"E                \",IF(AND($L50<>\"\",V50<>\"\"),$L50*V50,\"\"))))","v":""},"","",null,null,{"$f":"IF($C50=\"Hinweis\",\"\",IF(OR($K50=\"A\",$K50=\"B\"),\"Nur EP        \",IF($K50=\"E\",\"E                \",IF(AND($L50<>\"\",AA50<>\"\"),$L50*AA50,\"\"))))","v":""},null,{"$f":"IF(AC50=\"\",\"\",IF(AC50=\"X\",AB50,AB50*AC50))","v":""},"","",null,null,{"$f":"IF($C50=\"Hinweis\",\"\",IF(OR($K50=\"A\",$K50=\"B\"),\"Nur EP        \",IF($K50=\"E\",\"E                \",IF(AND($L50<>\"\",AH50<>\"\"),$L50*AH50,\"\"))))","v":""},null,{"$f":"IF(AJ50=\"\",\"\",IF(AJ50=\"X\",AI50,AI50*AJ50))","v":""},"","",null,null,{"$f":"IF($C50=\"Hinweis\",\"\",IF(OR($K50=\"A\",$K50=\"B\"),\"Nur EP        \",IF($K50=\"E\",\"E                \",IF(AND($L50<>\"\",AO50<>\"\"),$L50*AO50,\"\"))))","v":""},null,{"$f":"IF(AQ50=\"\",\"\",IF(AQ50=\"X\",AP50,AP50*AQ50))","v":""},"","",null,null,"",null,"","","",null,null,{"$f":"IF($C50=\"Hinweis\",\"\",IF(OR($K50=\"A\",$K50=\"B\"),\"Nur EP        \",IF($K50=\"E\",\"E                \",IF(AND($L50<>\"\",BC50<>\"\"),$L50*BC50,\"\"))))","v":""},null,{"$f":"IF(BE50=\"\",\"\",IF(BE50=\"X\",BD50,BD50*BE50))","v":""},"",""]
[null,null,null,null,null,null,{"$f":"G$41","v":3},10,null,null,"",null,null,null,"","","","",null,"",null,null,null,"","",null,null,{"$f":"IF(C51=\"Hinweis\",\"\",IF(OR($K51=\"A\",$K51=\"B\"),\"Nur EP        \",IF($K51=\"E\",\"E                \",IF(AND($L51<>\"\",AA51<>\"\"),$L51*AA51,\"\"))))","v":""},null,"","","",null,null,{"$f":"IF(J51=\"Hinweis\",\"\",IF(OR($K51=\"A\",$K51=\"B\"),\"Nur EP        \",IF($K51=\"E\",\"E                \",IF(AND($L51<>\"\",AH51<>\"\"),$L51*AH51,\"\"))))","v":""},null,"","","",null,null,{"$f":"IF(P51=\"Hinweis\",\"\",IF(OR($K51=\"A\",$K51=\"B\"),\"Nur EP        \",IF($K51=\"E\",\"E                \",IF(AND($L51<>\"\",AO51<>\"\"),$L51*AO51,\"\"))))","v":""},null,"","","",null,null,"",null,"","","",null,null,{"$f":"IF(AD51=\"Hinweis\",\"\",IF(OR($K51=\"A\",$K51=\"B\"),\"Nur EP        \",IF($K51=\"E\",\"E                \",IF(AND($L51<>\"\",BC51<>\"\"),$L51*BC51,\"\"))))","v":""},null,"","",""]
[null,null,null,null,null,null,3,{"$f":"IF(G$162=\"\",\"\",ROW()-37)","v":15},null,null,"",null,null,null,"","","","",null,"",null,null,null,{"$f":"IF(OR($L121=\"\",V52=\"\",$J52=\"Ausführungsbeschreibung\",$J52=\"Hinweis\"),\"\",\nIF(AND($V52,$AA52,$AH52,$AO52,$AV52,$BC52)=\"\",\"\",\n\nIF(OR($W52=\"Nur EP        \",$K52=\"E\"),(Y52/(AVERAGE($Y52,$AF52,$AM52,$AT52,Y52))-1),\nIF(AND($W52,$AB52,$AI52,$AP52,$AW52)=\"\",\"\",(W52/(AVERAGE($W52,$AB52,$AI52,$AP52,$AW52)))-1))))","v":""},{"$f":"IF(OR($K52=\"\",$K52=\"H\",$K52=\"AB\",$K52=\"G\",$J52=\"Position\",$K52=\"<-- Bitte Positionsart\",V52=\"\",$L52=\"\"),\"\",\nIF(OR($K52=\"A\",$K52=\"B\",$K52=\"E\"),$L52*V52))","v":""},null,null,null,null,{"$f":"IF(AC52=\"\",\"\",IF(AC52=\"X\",AB52,AB52*AC52))","v":""},"","",null,null,{"$f":"IF(OR($K52=\"A\",$K52=\"B\"),\"Nur EP        \",IF($K52=\"E\",\"E                \",IF(AND($L52<>\"\",AH52<>\"\"),$L52*AH52,\"\")))","v":""},null,{"$f":"IF(AJ52=\"\",\"\",IF(AJ52=\"X\",AI52,AI52*AJ52))","v":""},"","",null,null,{"$f":"IF(OR($K52=\"A\",$K52=\"B\"),\"Nur EP        \",IF($K52=\"E\",\"E                \",IF(AND($L52<>\"\",AO52<>\"\"),$L52*AO52,\"\")))","v":""},null,"","","",null,null,"",null,"","","",null,null,{"$f":"IF(OR($K52=\"A\",$K52=\"B\"),\"Nur EP        \",IF($K52=\"E\",\"E                \",IF(AND($L52<>\"\",BC52<>\"\"),$L52*BC52,\"\")))","v":""},null,"","",""]
[null,null,null,null,null,null,3,16,null,null,"",null,null,null,"","","","",null,"",null,null,null,"","",null,null,null,null,{"$f":"IF(AC53=\"\",\"\",IF(AC53=\"X\",AB53,AB53*AC53))","v":""},"","",null,null,"",null,{"$f":"IF(AJ53=\"\",\"\",IF(AJ53=\"X\",AI53,AI53*AJ53))","v":""},{"$f":"IF(OR($L53=\"\",AH53=\"\",$J53=\"Ausführungsbeschreibung\",$J53=\"Hinweis\"),\"\",\nIF(AND($AA53,$AH53,$AO53,$AV53,$BC53)=\"\",\"\",\nIF($L$4=\"MIT\",\nIF(OR(AI53=\"Nur EP        \",$K53=\"E\"),((AM53/(AVERAGE($AF53,$AM53,$AT53,$BA53,$BH53)))-1),\nIF($L$4=\"MIT\",((AI53/(AVERAGE($AB53,$AI53,$AP53,$AW53,$BD53)))-1),\nIF($L$4=\"MIN\",\nIF(OR(AI53=\"Nur EP        \",$K53=\"E\"),((AM53/(MIN($AF53,$AM53,$AT53,$BA53,$BH53)))-1),\nIF($L$4=\"MIN\",(AI53/(MIN($AB53,$AI53,$AP53,$AW53,$BD53)))-1)\n)))))))","v":""},"",null,null,"",null,"","","",null,null,"",null,"","","",null,null,"",null,"","",""]
[null,null,null,null,null,null,3,{"$f":"IF($G54=\"\",\"\",ROW()-ROW(G$41))","v":13},null,null,{"$f":"IF(J54=\"Position\",\"\",IF(J54=\"Grundposition\",\"G\",IF(J54=\"Alternativposition\",\"A\",IF(J54=\"Bedarfsposition\",\"B\",IF(J54=\"Hinweis\",\"H\",IF(J54=\"Ausführungsbeschreibung\",\"AB\",IF(J54=\"Entfällt\",\"E\",IF(AND(I54<>\"\",L54<>\"\"),\"<-- Bitte Positionsart\",\"\"))))))))","v":""},null,null,null,{"$f":"IF(OR($K54=\"B\",$K54=\"A\",$K54=\"H\",$K54=\"AB\",$K54=\"<-- Bitte Positionsart\",SUM(AA54,AH54,AO54,AV54,BC54)=0),\"\",MIN(AA54,AH54,AO54,AV54,BC54))","v":""},{"$f":"IF(OR($K54=\"B\",$K54=\"A\",$K54=\"H\",$K54=\"AB\",$K54=\"<-- Bitte Positionsart\",SUM(AA54,AH54,AO54,AV54,BC54)=0),\"\",SUM(AA54,AH54,AO54,AV54,BC54)/COUNT(AA54,AH54,AO54,AV54,BC54))","v":""},{"$f":"IF(OR($K54=\"B\",$K54=\"A\",$K54=\"H\",$K54=\"AB\",$K54=\"<-- Bitte Positionsart\",SUM(AA54,AH54,AO54,AV54,BC54)=0),\"\",MAX(AA54,AH54,AO54,AV54,BC54))","v":""},{"$f":"IF(OR($K54=\"A\",$K54=\"B\"),\"Nur EP        \",IF($K54=\"E\",\"E                \",IF(AND($L54<>\"\",P54<>\"\"),$L54*P54,\"\")))","v":""},null,{"$f":"IF(OR($K54=\"\",$K54=\"H\",$K54=\"AB\",$K54=\"G\",$K54=\"<-- Bitte Positionsart\"),\"\",IF(OR($K54=\"A\",$K54=\"B\"),$L54*(SUM(AA54,AH54,AO54,AV54,BC54)/COUNT(AA54,AH54,AO54,AV54,BC54)),IF($K54=\"E\",$L54*P54)))","v":""},null,null,null,"","",null,null,{"$f":"IF(C54=\"Hinweis\",\"\",IF(OR($K54=\"A\",$K54=\"B\"),\"Nur EP        \",IF($K54=\"E\",\"E                \",IF(AND($L54<>\"\",AA54<>\"\"),$L54*AA54,\"\"))))","v":""},null,"","",{"$f":"IF(OR($K54=\"\",$K54=\"H\",$K54=\"AB\",$K54=\"G\",$J54=\"Position\",$K54=\"<-- Bitte Positionsart\",AA54=\"\",$L54=\"\"),\"\",\nIF(OR($K54=\"A\",$K54=\"B\",$K54=\"E\"),$L54*AA54))","v":""},null,null,{"$f":"IF(J54=\"Hinweis\",\"\",IF(OR($K54=\"A\",$K54=\"B\"),\"Nur EP        \",IF($K54=\"E\",\"E                \",IF(AND($L54<>\"\",AH54<>\"\"),$L54*AH54,\"\"))))","v":""},null,"","",{"$f":"IF(OR($K54=\"\",$K54=\"H\",$K54=\"AB\",$K54=\"G\",$J54=\"Position\",$K54=\"<-- Bitte Positionsart\",AH54=\"\",$L54=\"\"),\"\",\nIF(OR($K54=\"A\",$K54=\"B\",$K54=\"E\"),$L54*AH54))","v":""},null,null,{"$f":"IF(P54=\"Hinweis\",\"\",IF(OR($K54=\"A\",$K54=\"B\"),\"Nur EP        \",IF($K54=\"E\",\"E                \",IF(AND($L54<>\"\",AO54<>\"\"),$L54*AO54,\"\"))))","v":""},null,"","",{"$f":"IF(OR($K54=\"\",$K54=\"H\",$K54=\"AB\",$K54=\"G\",$J54=\"Position\",$K54=\"<-- Bitte Positionsart\",AO54=\"\",$L54=\"\"),\"\",\nIF(OR($K54=\"A\",$K54=\"B\",$K54=\"E\"),$L54*AO54))","v":""},null,null,"",null,"","","",null,null,{"$f":"IF(AD54=\"Hinweis\",\"\",IF(OR($K54=\"A\",$K54=\"B\"),\"Nur EP        \",IF($K54=\"E\",\"E                \",IF(AND($L54<>\"\",BC54<>\"\"),$L54*BC54,\"\"))))","v":""},null,{"$f":"IF(BE54=\"\",\"\",IF(BE54=\"X\",BD54,BD54*BE54))","v":""},"",{"$f":"IF(OR($K54=\"\",$K54=\"H\",$K54=\"AB\",$K54=\"G\",$J54=\"Position\",$K54=\"<-- Bitte Positionsart\",BC54=\"\",$L54=\"\"),\"\",\nIF(OR($K54=\"A\",$K54=\"B\",$K54=\"E\"),$L54*BC54))","v":""}]
[null,null,null,null,null,null,3,{"$f":"IF(G$162=\"\",\"\",ROW()-37)","v":18},null,null,"",null,null,null,"","","","",null,"",null,null,null,"","",null,null,null,null,"","","",null,null,{"$f":"IF(OR($K55=\"A\",$K55=\"B\"),\"Nur EP        \",IF($K55=\"E\",\"E                \",IF(AND($L55<>\"\",AH55<>\"\"),$L55*AH55,\"\")))","v":""},null,"","","",null,null,{"$f":"IF(OR($K55=\"A\",$K55=\"B\"),\"Nur EP        \",IF($K55=\"E\",\"E                \",IF(AND($L55<>\"\",AO55<>\"\"),$L55*AO55,\"\")))","v":""},null,{"$f":"IF(AQ55=\"\",\"\",IF(AQ55=\"X\",AP55,AP55*AQ55))","v":""},"","",null,null,"",null,"","","",null,null,{"$f":"IF(OR($K55=\"A\",$K55=\"B\"),\"Nur EP        \",IF($K55=\"E\",\"E                \",IF(AND($L55<>\"\",BC55<>\"\"),$L55*BC55,\"\")))","v":""},null,"","",""]
[null,null,null,null,null,null,3,19,null,null,"",null,null,null,"","","","",null,"",null,null,null,{"$f":"IF(OR($L125=\"\",V56=\"\",$J56=\"Ausführungsbeschreibung\",$J56=\"Hinweis\"),\"\",\nIF(AND($V56,$AA56,$AH56,$AO56,$AV56,$BC56)=\"\",\"\",\n\nIF(OR($W56=\"Nur EP        \",$K56=\"E\"),(Y56/(AVERAGE($Y56,$AF56,$AM56,$AT56,Y56))-1),\nIF(AND($W56,$AB56,$AI56,$AP56,$AW56)=\"\",\"\",(W56/(AVERAGE($W56,$AB56,$AI56,$AP56,$AW56)))-1))))","v":""},{"$f":"IF(OR($K56=\"\",$K56=\"H\",$K56=\"AB\",$K56=\"G\",$J56=\"Position\",$K56=\"<-- Bitte Positionsart\",V56=\"\",$L56=\"\"),\"\",\nIF(OR($K56=\"A\",$K56=\"B\",$K56=\"E\"),$L56*V56))","v":""},null,null,null,null,{"$f":"IF(AC56=\"\",\"\",IF(AC56=\"X\",AB56,AB56*AC56))","v":""},"","",null,null,"",null,{"$f":"IF(AJ56=\"\",\"\",IF(AJ56=\"X\",AI56,AI56*AJ56))","v":""},"","",null,null,"",null,"",{"$f":"IF(OR($L56=\"\",AO56=\"\",$J56=\"Ausführungsbeschreibung\",$J56=\"Hinweis\"),\"\",\nIF(AND($AA56,$AH56,$AO56,$AV56,$BC56)=\"\",\"\",\nIF($L$4=\"MIT\",\nIF(OR(AP56=\"Nur EP        \",$K56=\"E\"),((AT56/(AVERAGE($AF56,$AM56,$AT56,$BA56,$BH56)))-1),\nIF($L$4=\"MIT\",((AP56/(AVERAGE($AB56,$AI56,$AP56,$AW56,$BD56)))-1),\nIF($L$4=\"MIN\",\nIF(OR(AP56=\"Nur EP        \",$K56=\"E\"),((AT56/(MIN($AF56,$AM56,$AT56,$BA56,$BH56)))-1),\nIF($L$4=\"MIN\",(AP56/(MIN($AB56,$AI56,$AP56,$AW56,$BD56)))-1)\n)))))))","v":""},"",null,null,{"$f":"IF(W56=\"Hinweis\",\"\",IF(OR($K56=\"A\",$K56=\"B\"),\"Nur EP        \",IF($K56=\"E\",\"E                \",IF(AND($L56<>\"\",AV56<>\"\"),$L56*AV56,\"\"))))","v":""},null,{"$f":"IF(AX56=\"\",\"\",IF(AX56=\"X\",AW56,AW56*AX56))","v":""},{"$f":"IF(OR($L56=\"\",AV56=\"\",$J56=\"Ausführungsbeschreibung\",$J56=\"Hinweis\"),\"\",\nIF(AND($AA56,$AH56,$AO56,$AV56,$BC56)=\"\",\"\",\nIF($L$4=\"MIT\",\nIF(OR(AW56=\"Nur EP        \",$K56=\"E\"),((BA56/(AVERAGE($AF56,$AM56,$AT56,$BA56,$BH56)))-1),\nIF($L$4=\"MIT\",((AW56/(AVERAGE($AB56,$AI56,$AP56,$AW56,$BD56)))-1),\nIF($L$4=\"MIN\",\nIF(OR(AW56=\"Nur EP        \",$K56=\"E\"),((BA56/(MIN($AF56,$AM56,$AT56,$BA56,$BH56)))-1),\nIF($L$4=\"MIN\",(AW56/(MIN($AB56,$AI56,$AP56,$AW56,$BD56)))-1)\n)))))))","v":""},{"$f":"IF(OR($K56=\"\",$K56=\"H\",$K56=\"AB\",$K56=\"G\",$J56=\"Position\",$K56=\"<-- Bitte Positionsart\",AV56=\"\",$L56=\"\"),\"\",\nIF(OR($K56=\"A\",$K56=\"B\",$K56=\"E\"),$L56*AV56))","v":""},null,null,"",null,"","",""]
[null,null,null,null,null,null,3,20,null,null,"",null,null,null,"","","","",null,"",null,null,null,"","",null,null,null,null,"","","",null,null,"",null,"",{"$f":"IF(OR($L57=\"\",AH57=\"\",$J57=\"Ausführungsbeschreibung\",$J57=\"Hinweis\"),\"\",\nIF(AND($AA57,$AH57,$AO57,$AV57,$BC57)=\"\",\"\",\nIF($L$4=\"MIT\",\nIF(OR(AI57=\"Nur EP        \",$K57=\"E\"),((AM57/(AVERAGE($AF57,$AM57,$AT57,$BA57,$BH57)))-1),\nIF($L$4=\"MIT\",((AI57/(AVERAGE($AB57,$AI57,$AP57,$AW57,$BD57)))-1),\nIF($L$4=\"MIN\",\nIF(OR(AI57=\"Nur EP        \",$K57=\"E\"),((AM57/(MIN($AF57,$AM57,$AT57,$BA57,$BH57)))-1),\nIF($L$4=\"MIN\",(AI57/(MIN($AB57,$AI57,$AP57,$AW57,$BD57)))-1)\n)))))))","v":""},"",null,null,"",null,"","","",null,null,"",null,"",{"$f":"IF(OR($L57=\"\",AV57=\"\",$J57=\"Ausführungsbeschreibung\",$J57=\"Hinweis\"),\"\",\nIF(AND($AA57,$AH57,$AO57,$AV57,$BC57)=\"\",\"\",\nIF($L$4=\"MIT\",\nIF(OR(AW57=\"Nur EP        \",$K57=\"E\"),((BA57/(AVERAGE($AF57,$AM57,$AT57,$BA57,$BH57)))-1),\nIF($L$4=\"MIT\",((AW57/(AVERAGE($AB57,$AI57,$AP57,$AW57,$BD57)))-1),\nIF($L$4=\"MIN\",\nIF(OR(AW57=\"Nur EP        \",$K57=\"E\"),((BA57/(MIN($AF57,$AM57,$AT57,$BA57,$BH57)))-1),\nIF($L$4=\"MIN\",(AW57/(MIN($AB57,$AI57,$AP57,$AW57,$BD57)))-1)\n)))))))","v":""},{"$f":"IF(OR($K57=\"\",$K57=\"H\",$K57=\"AB\",$K57=\"G\",$J57=\"Position\",$K57=\"<-- Bitte Positionsart\",AV57=\"\",$L57=\"\"),\"\",\nIF(OR($K57=\"A\",$K57=\"B\",$K57=\"E\"),$L57*AV57))","v":""},null,null,"",null,"","",""]
[null,null,null,null,null,null,3,21,null,null,"",null,null,null,"","","","",null,"",null,null,null,"","",null,null,null,null,"","","",null,null,"",null,"","","",null,null,"",null,"","","",null,null,"",null,"","","",null,null,"",null,"","",""]
[null,null,null,null,null,null,3,22,null,null,"",null,null,null,"","","","",null,"",null,null,null,"","",null,null,null,null,"","","",null,null,"",null,"","","",null,null,"",null,"","","",null,null,"",null,"","","",null,null,"",null,"","",""]
[null,null,null,null,null,null,3,23,null,null,"",null,null,null,"","","","",null,"",null,null,null,"","",null,null,null,null,"","","",null,null,"",null,"","","",null,null,"",null,"","","",null,null,"",null,"","","",null,null,"",null,"","",""]
[null,null,null,null,null,null,3,24,null,null,"",null,null,null,"","","","",null,"",null,null,null,"","",null,null,null,null,{"$f":"IF(AC61=\"\",\"\",IF(AC61=\"X\",AB61,AB61*AC61))","v":""},"","",null,null,"",null,{"$f":"IF(AJ61=\"\",\"\",IF(AJ61=\"X\",AI61,AI61*AJ61))","v":""},"","",null,null,"",null,"","","",null,null,"",null,"","","",null,null,"",null,"","",""]
[null,null,null,null,null,null,3,25,null,null,"",null,null,null,"","","","",null,"",null,null,{"$f":"IF(OR($K62=\"A\",$K62=\"B\"),\"Nur EP        \",IF($K62=\"E\",\"E                \",IF(AND($L62<>\"\",V62<>\"\"),$L62*V62,\"\")))","v":""},"","",null,null,{"$f":"IF(OR($K62=\"A\",$K62=\"B\"),\"Nur EP        \",IF($K62=\"E\",\"E                \",IF(AND($L62<>\"\",AA62<>\"\"),$L62*AA62,\"\")))","v":""},null,"","",{"$f":"IF(OR($K62=\"\",$K62=\"H\",$K62=\"AB\",$K62=\"G\",$J62=\"Position\",$K62=\"<-- Bitte Positionsart\",AA62=\"\",$L62=\"\"),\"\",\nIF(OR($K62=\"A\",$K62=\"B\",$K62=\"E\"),$L62*AA62))","v":""},null,null,"",null,"","",{"$f":"IF(OR($K62=\"\",$K62=\"H\",$K62=\"AB\",$K62=\"G\",$J62=\"Position\",$K62=\"<-- Bitte Positionsart\",AH62=\"\",$L62=\"\"),\"\",\nIF(OR($K62=\"A\",$K62=\"B\",$K62=\"E\"),$L62*AH62))","v":""},null,null,"",null,"","",{"$f":"IF(OR($K62=\"\",$K62=\"H\",$K62=\"AB\",$K62=\"G\",$J62=\"Position\",$K62=\"<-- Bitte Positionsart\",AO62=\"\",$L62=\"\"),\"\",\nIF(OR($K62=\"A\",$K62=\"B\",$K62=\"E\"),$L62*AO62))","v":""},null,null,"",null,"","","",null,null,"",null,"","",{"$f":"IF(OR($K62=\"\",$K62=\"H\",$K62=\"AB\",$K62=\"G\",$J62=\"Position\",$K62=\"<-- Bitte Positionsart\",BC62=\"\",$L62=\"\"),\"\",\nIF(OR($K62=\"A\",$K62=\"B\",$K62=\"E\"),$L62*BC62))","v":""}]
[null,null,null,null,null,null,null,null,null,null,null,null,null,null,null,null,null,null,null,null,null,null,{"$f":"IF(OR($K63=\"A\",$K63=\"B\"),\"Nur EP        \",IF($K63=\"E\",\"\",IF(AND($L63<>\"\",V63<>\"\"),$L63*V63,\"\")))","v":""},null,{"$f":"IF($K63=\"Ja\",IF(AND($L63<>\"\",V63<>\"\"),$L63*V63),\"\")","v":""},null,"EP / % Titel","Positions- / Titelsumme",null,{"$f":"IF(AC63=\"\",\"\",IF(AC63=\"X\",AB63,AB63*AC63))","v":""},null,{"$f":"IF($K63=\"Ja\",IF(AND($L63<>\"\",AA63<>\"\"),$L63*AA63),\"\")","v":""},null,"EP / % Titel","Positions- / Titelsumme",null,{"$f":"IF(AJ63=\"\",\"\",IF(AJ63=\"X\",AI63,AI63*AJ63))","v":""},null,{"$f":"IF($K63=\"Ja\",IF(AND($L63<>\"\",AH63<>\"\"),$L63*AH63),\"\")","v":""},null,"EP / % Titel","Positions- / Titelsumme",null,{"$f":"IF(AQ63=\"\",\"\",IF(AQ63=\"X\",AP63,AP63*AQ63))","v":""},null,{"$f":"IF($K63=\"Ja\",IF(AND($L63<>\"\",AO63<>\"\"),$L63*AO63),\"\")","v":""},null,"EP / % Titel","Positions- / Titelsumme",null,{"$f":"IF(AX63=\"\",\"\",IF(AX63=\"X\",AW63,AW63*AX63))","v":""},null,{"$f":"IF($K63=\"Ja\",IF(AND($L63<>\"\",AV63<>\"\"),$L63*AV63),\"\")","v":""},null,"EP / % Titel","Positions- / Titelsumme",null,{"$f":"IF(BE63=\"\",\"\",IF(BE63=\"X\",BD63,BD63*BE63))","v":""},null,{"$f":"IF($K63=\"Ja\",IF(AND($L63<>\"\",BC63<>\"\"),$L63*BC63),\"\")","v":""}]
[null,null,null,null,null,null,4,null,"Abriss Rückbau im Bereich der Gauben mit Balkon bzw.Gauben mit Erker",null,null,null,null,null,{"$f":"CONCATENATE(\"Titelsumme\",CHAR(10),\"MIN\",CHAR(10),TEXT(SUMPRODUCT($L65:$L77,O65:O77),\"##.##0,00\"),\" €\")","v":"Titelsumme\nMIN\n4.128,32 €"},{"$f":"CONCATENATE(\"Titelsumme\",CHAR(10),\"MIT\",CHAR(10),TEXT(SUMPRODUCT($L65:$L77,P65:P77),\"##.##0,00\"),\" €\")","v":"Titelsumme\nMIT\n6.760,06 €"},{"$f":"CONCATENATE(\"Titelsumme\",CHAR(10),\"MAX\",CHAR(10),TEXT(SUMPRODUCT($L65:$L75,Q65:Q75),\"##.##0,00\"),\" €\")","v":"Titelsumme\nMAX\n9.156,81 €"},{"$f":"SUM(R65:R77)","v":6760.0640000000003},null,{"$f":"SUM(T65:T77)","v":0},null,null,{"$f":"SUM(W65:W77)","v":3072},null,{"$f":"SUM(Y65:Y77)","v":0},null,{"$f":"IF(AB64=0,\"\",\nIF($L$4=\"MIT\",((AB64/(AVERAGE($AB64,$AI64,$AP64,$AW64,$BD64)))-1)*100,))","v":70.055934381686313},{"$f":"SUM(AB65:AB76)","v":6897.5339999999997},null,"",null,{"$f":"SUM(AF65:AF77)","v":0},null,{"$f":"IF(AI64=0,\"\",\nIF($L$4=\"MIT\",((AI64/(AVERAGE($AB64,$AI64,$AP64,$AW64,$BD64)))-1)*100,))","v":81.838958921098978},{"$f":"SUM(AI65:AI77)","v":7375.4580000000005},null,"",null,{"$f":"SUM(AM65:AM77)","v":0},null,{"$f":"IF(AP64=0,\"\",\nIF($L$4=\"MIT\",((AP64/(AVERAGE($AB64,$AI64,$AP64,$AW64,$BD64)))-1)*100,))","v":48.105106697214708},{"$f":"SUM(AP65:AP77)","v":6007.2},null,"",null,{"$f":"SUM(AT65:AT77)","v":0},null,{"$f":"IF(AW64=0,\"\",\nIF($L$4=\"MIT\",((AW64/(AVERAGE($AB64,$AI64,$AP64,$AW64,$BD64)))-1)*100,))","v":""},{"$f":"SUM(AW65:AW77)","v":0},null,"",null,{"$f":"SUM(BA65:BA77)","v":0},null,{"$f":"IF(BD64=0,\"\",\nIF($L$4=\"MIT\",((BD64/(AVERAGE($AB64,$AI64,$AP64,$AW64,$BD64)))-1)*100,))","v":""},{"$f":"SUM(BD65:BD77)","v":0},null,"",null,{"$f":"SUM(BH65:BH77)","v":0}]
[null,null,null,null,null,null,{"$f":"G$64","v":4},{"$f":"IF(G$162=\"\",\"\",ROW()-ROW(G$64))","v":1},"Hinweis zu vorhandener Mineralwolldämmung","Hinweis",{"$f":"IF(J65=\"Position\",\"\",IF(J65=\"Grundposition\",\"G\",IF(J65=\"Alternativposition\",\"A\",IF(J65=\"Bedarfsposition\",\"B\",IF(J65=\"Hinweis\",\"H\",IF(J65=\"Ausführungsbeschreibung\",\"AB\",IF(J65=\"Entfällt\",\"E\",IF(AND(I65<>\"\",L65<>\"\"),\"<-- Bitte Positionsart\",\"\"))))))))","v":"H"},null,null,null,{"$f":"IF(OR($K65=\"B\",$K65=\"A\",$K65=\"H\",$K65=\"AB\",$K65=\"<-- Bitte Positionsart\",SUM(AA65,AH65,AO65,AV65,BC65)=0),\"\",MIN(AA65,AH65,AO65,AV65,BC65))","v":""},{"$f":"IF(OR($K65=\"B\",$K65=\"A\",$K65=\"H\",$K65=\"AB\",$K65=\"<-- Bitte Positionsart\",SUM(AA65,AH65,AO65,AV65,BC65)=0),\"\",SUM(AA65,AH65,AO65,AV65,BC65)/COUNT(AA65,AH65,AO65,AV65,BC65))","v":""},{"$f":"IF(OR($K65=\"B\",$K65=\"A\",$K65=\"H\",$K65=\"AB\",$K65=\"<-- Bitte Positionsart\",SUM(AA65,AH65,AO65,AV65,BC65)=0),\"\",MAX(AA65,AH65,AO65,AV65,BC65))","v":""},{"$f":"IF(OR($K65=\"A\",$K65=\"B\"),\"Nur EP        \",IF($K65=\"E\",\"E                \",IF(AND($L65<>\"\",P65<>\"\"),$L65*P65,\"\")))","v":""},null,{"$f":"IF(OR($K65=\"\",$K65=\"H\",$K65=\"AB\",$K65=\"G\",$K65=\"<-- Bitte Positionsart\"),\"\",IF(OR($K65=\"A\",$K65=\"B\"),$L65*(SUM(AA65,AH65,AO65,AV65,BC65)/COUNT(AA65,AH65,AO65,AV65,BC65)),IF($K65=\"E\",$L65*P65)))","v":""},null,null,{"$f":"IF(OR($K65=\"A\",$K65=\"B\"),\"Nur EP        \",IF($K65=\"E\",\"E                \",IF(AND($L65<>\"\",V65<>\"\"),$L65*V65,\"\")))","v":""},{"$f":"IF(OR($L134=\"\",V65=\"\",$J65=\"Ausführungsbeschreibung\",$J65=\"Hinweis\"),\"\",\nIF(AND($V65,$AA65,$AH65,$AO65,$AV65,$BC65)=\"\",\"\",\n\nIF(OR($W65=\"Nur EP        \",$K65=\"E\"),(Y65/(AVERAGE($Y65,$AF65,$AM65,$AT65,Y65))-1),\nIF(AND($W65,$AB65,$AI65,$AP65,$AW65)=\"\",\"\",(W65/(AVERAGE($W65,$AB65,$AI65,$AP65,$AW65)))-1))))","v":""},{"$f":"IF(OR($K65=\"\",$K65=\"H\",$K65=\"AB\",$K65=\"G\",$J65=\"Position\",$K65=\"<-- Bitte Positionsart\",V65=\"\",$L65=\"\"),\"\",\nIF(OR($K65=\"A\",$K65=\"B\",$K65=\"E\"),$L65*V65))","v":""},null,null,{"$f":"IF(C65=\"Hinweis\",\"\",IF(OR($K65=\"A\",$K65=\"B\"),\"Nur EP        \",IF($K65=\"E\",\"E                \",IF(AND($L65<>\"\",AA65<>\"\"),$L65*AA65,\"\"))))","v":""},null,"",{"$f":"IF(OR($L65=\"\",AA65=\"\",$J65=\"Ausführungsbeschreibung\",$J65=\"Hinweis\"),\"\",\nIF(AND($AA65,$AH65,$AO65,$AV65,$BC65)=\"\",\"\",\nIF($L$4=\"MIT\",\nIF(OR(AB65=\"Nur EP        \",$K65=\"E\"),((AF65/(AVERAGE($AF65,$AM65,$AT65,$BA65,$BH65)))-1),\nIF($L$4=\"MIT\",((AB65/(AVERAGE($AB65,$AI65,$AP65,$AW65,$BD65)))-1),\nIF($L$4=\"MIN\",\nIF(OR(AB65=\"Nur EP        \",$K65=\"E\"),((AF65/(MIN($AF65,$AM65,$AT65,$BA65,$BH65)))-1),\nIF($L$4=\"MIN\",((AB65/(MIN($AB65,$AI65,$AP65,$AW65,$BD65)))-1))\n)))))))","v":""},{"$f":"IF(OR($K65=\"\",$K65=\"H\",$K65=\"AB\",$K65=\"G\",$J65=\"Position\",$K65=\"<-- Bitte Positionsart\",AA65=\"\",$L65=\"\"),\"\",\nIF(OR($K65=\"A\",$K65=\"B\",$K65=\"E\"),$L65*AA65))","v":""},null,null,{"$f":"IF(J65=\"Hinweis\",\"\",IF(OR($K65=\"A\",$K65=\"B\"),\"Nur EP        \",IF($K65=\"E\",\"E                \",IF(AND($L65<>\"\",AH65<>\"\"),$L65*AH65,\"\"))))","v":""},null,"",{"$f":"IF(OR($L65=\"\",AH65=\"\",$J65=\"Ausführungsbeschreibung\",$J65=\"Hinweis\"),\"\",\nIF(AND($AA65,$AH65,$AO65,$AV65,$BC65)=\"\",\"\",\nIF($L$4=\"MIT\",\nIF(OR(AI65=\"Nur EP        \",$K65=\"E\"),((AM65/(AVERAGE($AF65,$AM65,$AT65,$BA65,$BH65)))-1),\nIF($L$4=\"MIT\",((AI65/(AVERAGE($AB65,$AI65,$AP65,$AW65,$BD65)))-1),\nIF($L$4=\"MIN\",\nIF(OR(AI65=\"Nur EP        \",$K65=\"E\"),((AM65/(MIN($AF65,$AM65,$AT65,$BA65,$BH65)))-1),\nIF($L$4=\"MIN\",(AI65/(MIN($AB65,$AI65,$AP65,$AW65,$BD65)))-1)\n)))))))","v":""},{"$f":"IF(OR($K65=\"\",$K65=\"H\",$K65=\"AB\",$K65=\"G\",$J65=\"Position\",$K65=\"<-- Bitte Positionsart\",AH65=\"\",$L65=\"\"),\"\",\nIF(OR($K65=\"A\",$K65=\"B\",$K65=\"E\"),$L65*AH65))","v":""},null,null,{"$f":"IF(P65=\"Hinweis\",\"\",IF(OR($K65=\"A\",$K65=\"B\"),\"Nur EP        \",IF($K65=\"E\",\"E                \",IF(AND($L65<>\"\",AO65<>\"\"),$L65*AO65,\"\"))))","v":""},null,"",{"$f":"IF(OR($L65=\"\",AO65=\"\",$J65=\"Ausführungsbeschreibung\",$J65=\"Hinweis\"),\"\",\nIF(AND($AA65,$AH65,$AO65,$AV65,$BC65)=\"\",\"\",\nIF($L$4=\"MIT\",\nIF(OR(AP65=\"Nur EP        \",$K65=\"E\"),((AT65/(AVERAGE($AF65,$AM65,$AT65,$BA65,$BH65)))-1),\nIF($L$4=\"MIT\",((AP65/(AVERAGE($AB65,$AI65,$AP65,$AW65,$BD65)))-1),\nIF($L$4=\"MIN\",\nIF(OR(AP65=\"Nur EP        \",$K65=\"E\"),((AT65/(MIN($AF65,$AM65,$AT65,$BA65,$BH65)))-1),\nIF($L$4=\"MIN\",(AP65/(MIN($AB65,$AI65,$AP65,$AW65,$BD65)))-1)\n)))))))","v":""},{"$f":"IF(OR($K65=\"\",$K65=\"H\",$K65=\"AB\",$K65=\"G\",$J65=\"Position\",$K65=\"<-- Bitte Positionsart\",AO65=\"\",$L65=\"\"),\"\",\nIF(OR($K65=\"A\",$K65=\"B\",$K65=\"E\"),$L65*AO65))","v":""},null,null,{"$f":"IF(W65=\"Hinweis\",\"\",IF(OR($K65=\"A\",$K65=\"B\"),\"Nur EP        \",IF($K65=\"E\",\"E                \",IF(AND($L65<>\"\",AV65<>\"\"),$L65*AV65,\"\"))))","v":""},null,{"$f":"IF(AX65=\"\",\"\",IF(AX65=\"X\",AW65,AW65*AX65))","v":""},{"$f":"IF(OR($L65=\"\",AV65=\"\",$J65=\"Ausführungsbeschreibung\",$J65=\"Hinweis\"),\"\",\nIF(AND($AA65,$AH65,$AO65,$AV65,$BC65)=\"\",\"\",\nIF($L$4=\"MIT\",\nIF(OR(AW65=\"Nur EP        \",$K65=\"E\"),((BA65/(AVERAGE($AF65,$AM65,$AT65,$BA65,$BH65)))-1),\nIF($L$4=\"MIT\",((AW65/(AVERAGE($AB65,$AI65,$AP65,$AW65,$BD65)))-1),\nIF($L$4=\"MIN\",\nIF(OR(AW65=\"Nur EP        \",$K65=\"E\"),((BA65/(MIN($AF65,$AM65,$AT65,$BA65,$BH65)))-1),\nIF($L$4=\"MIN\",(AW65/(MIN($AB65,$AI65,$AP65,$AW65,$BD65)))-1)\n)))))))","v":""},{"$f":"IF(OR($K65=\"\",$K65=\"H\",$K65=\"AB\",$K65=\"G\",$J65=\"Position\",$K65=\"<-- Bitte Positionsart\",AV65=\"\",$L65=\"\"),\"\",\nIF(OR($K65=\"A\",$K65=\"B\",$K65=\"E\"),$L65*AV65))","v":""},null,null,{"$f":"IF(AD65=\"Hinweis\",\"\",IF(OR($K65=\"A\",$K65=\"B\"),\"Nur EP        \",IF($K65=\"E\",\"E                \",IF(AND($L65<>\"\",BC65<>\"\"),$L65*BC65,\"\"))))","v":""},null,{"$f":"IF(BE65=\"\",\"\",IF(BE65=\"X\",BD65,BD65*BE65))","v":""},{"$f":"IF(OR($L65=\"\",BC65=\"\",$J65=\"Ausführungsbeschreibung\",$J65=\"Hinweis\"),\"\",\nIF(AND($AA65,$AH65,$AO65,$AV65,$BC65)=\"\",\"\",\nIF($L$4=\"MIT\",\nIF(OR(BD65=\"Nur EP        \",$K65=\"E\"),((BH65/(AVERAGE($AF65,$AM65,$AT65,$BA65,$BH65)))-1),\nIF($L$4=\"MIT\",((BD65/(AVERAGE($AB65,$AI65,$AP65,$AW65,$BD65)))-1),\nIF($L$4=\"MIN\",\nIF(OR(BD65=\"Nur EP        \",$K65=\"E\"),((BH65/(MIN($AF65,$AM65,$AT65,$BA65,$BH65)))-1),\nIF($L$4=\"MIN\",((BD65/(MIN($AB65,$AI65,$AP65,$AW65,$BD65)))-1))\n)))))))","v":""},{"$f":"IF(OR($K65=\"\",$K65=\"H\",$K65=\"AB\",$K65=\"G\",$J65=\"Position\",$K65=\"<-- Bitte Positionsart\",BC65=\"\",$L65=\"\"),\"\",\nIF(OR($K65=\"A\",$K65=\"B\",$K65=\"E\"),$L65*BC65))","v":""}]
[null,null,null,null,null,null,{"$f":"G$64","v":4},2,"Abschnittweiser Abriss /Rückbau der PVC Folienabdichtung samt Flies  - Gaubendächer","Position","",66,"qm",null,{"$f":"IF(OR($K66=\"B\",$K66=\"A\",$K66=\"H\",$K66=\"AB\",$K66=\"<-- Bitte Positionsart\",SUM(AA66,AH66,AO66,AV66,BC66)=0),\"\",MIN(AA66,AH66,AO66,AV66,BC66))","v":33},{"$f":"IF(OR($K66=\"B\",$K66=\"A\",$K66=\"H\",$K66=\"AB\",$K66=\"<-- Bitte Positionsart\",SUM(AA66,AH66,AO66,AV66,BC66)=0),\"\",SUM(AA66,AH66,AO66,AV66,BC66)/COUNT(AA66,AH66,AO66,AV66,BC66))","v":47.843333333333334},{"$f":"IF(OR($K66=\"B\",$K66=\"A\",$K66=\"H\",$K66=\"AB\",$K66=\"<-- Bitte Positionsart\",SUM(AA66,AH66,AO66,AV66,BC66)=0),\"\",MAX(AA66,AH66,AO66,AV66,BC66))","v":56.69},{"$f":"IF(OR($K66=\"A\",$K66=\"B\"),\"Nur EP        \",IF($K66=\"E\",\"E                \",IF(AND($L66<>\"\",P66<>\"\"),$L66*P66,\"\")))","v":3157.66},null,{"$f":"IF(OR($K66=\"\",$K66=\"H\",$K66=\"AB\",$K66=\"G\",$K66=\"<-- Bitte Positionsart\"),\"\",IF(OR($K66=\"A\",$K66=\"B\"),$L66*(SUM(AA66,AH66,AO66,AV66,BC66)/COUNT(AA66,AH66,AO66,AV66,BC66)),IF($K66=\"E\",$L66*P66)))","v":""},null,25,1650,{"$f":"IF(OR($L135=\"\",V66=\"\",$J66=\"Ausführungsbeschreibung\",$J66=\"Hinweis\"),\"\",\nIF(AND($V66,$AA66,$AH66,$AO66,$AV66,$BC66)=\"\",\"\",\n\nIF(OR($W66=\"Nur EP        \",$K66=\"E\"),(Y66/(AVERAGE($Y66,$AF66,$AM66,$AT66,Y66))-1),\nIF(AND($W66,$AB66,$AI66,$AP66,$AW66)=\"\",\"\",(W66/(AVERAGE($W66,$AB66,$AI66,$AP66,$AW66)))-1))))","v":-0.40663383373880024},{"$f":"IF(OR($K66=\"\",$K66=\"H\",$K66=\"AB\",$K66=\"G\",$J66=\"Position\",$K66=\"<-- Bitte Positionsart\",V66=\"\",$L66=\"\"),\"\",\nIF(OR($K66=\"A\",$K66=\"B\",$K66=\"E\"),$L66*V66))","v":""},null,53.84,3553.44,null,"",0.12533965024733518,{"$f":"IF(OR($K66=\"\",$K66=\"H\",$K66=\"AB\",$K66=\"G\",$J66=\"Position\",$K66=\"<-- Bitte Positionsart\",AA66=\"\",$L66=\"\"),\"\",\nIF(OR($K66=\"A\",$K66=\"B\",$K66=\"E\"),$L66*AA66))","v":""},null,56.69,3741.54,null,"",{"$f":"IF(OR($L66=\"\",AH66=\"\",$J66=\"Ausführungsbeschreibung\",$J66=\"Hinweis\"),\"\",\nIF(AND($AA66,$AH66,$AO66,$AV66,$BC66)=\"\",\"\",\nIF($L$4=\"MIT\",\nIF(OR(AI66=\"Nur EP        \",$K66=\"E\"),((AM66/(AVERAGE($AF66,$AM66,$AT66,$BA66,$BH66)))-1),\nIF($L$4=\"MIT\",((AI66/(AVERAGE($AB66,$AI66,$AP66,$AW66,$BD66)))-1),\nIF($L$4=\"MIN\",\nIF(OR(AI66=\"Nur EP        \",$K66=\"E\"),((AM66/(MIN($AF66,$AM66,$AT66,$BA66,$BH66)))-1),\nIF($L$4=\"MIN\",(AI66/(MIN($AB66,$AI66,$AP66,$AW66,$BD66)))-1)\n)))))))","v":0.18490907824148262},{"$f":"IF(OR($K66=\"\",$K66=\"H\",$K66=\"AB\",$K66=\"G\",$J66=\"Position\",$K66=\"<-- Bitte Positionsart\",AH66=\"\",$L66=\"\"),\"\",\nIF(OR($K66=\"A\",$K66=\"B\",$K66=\"E\"),$L66*AH66))","v":""},null,33,2178,null,"",{"$f":"IF(OR($L66=\"\",AO66=\"\",$J66=\"Ausführungsbeschreibung\",$J66=\"Hinweis\"),\"\",\nIF(AND($AA66,$AH66,$AO66,$AV66,$BC66)=\"\",\"\",\nIF($L$4=\"MIT\",\nIF(OR(AP66=\"Nur EP        \",$K66=\"E\"),((AT66/(AVERAGE($AF66,$AM66,$AT66,$BA66,$BH66)))-1),\nIF($L$4=\"MIT\",((AP66/(AVERAGE($AB66,$AI66,$AP66,$AW66,$BD66)))-1),\nIF($L$4=\"MIN\",\nIF(OR(AP66=\"Nur EP        \",$K66=\"E\"),((AT66/(MIN($AF66,$AM66,$AT66,$BA66,$BH66)))-1),\nIF($L$4=\"MIN\",(AP66/(MIN($AB66,$AI66,$AP66,$AW66,$BD66)))-1)\n)))))))","v":-0.31024872848881768},{"$f":"IF(OR($K66=\"\",$K66=\"H\",$K66=\"AB\",$K66=\"G\",$J66=\"Position\",$K66=\"<-- Bitte Positionsart\",AO66=\"\",$L66=\"\"),\"\",\nIF(OR($K66=\"A\",$K66=\"B\",$K66=\"E\"),$L66*AO66))","v":""},null,null,"",null,"",{"$f":"IF(OR($L66=\"\",AV66=\"\",$J66=\"Ausführungsbeschreibung\",$J66=\"Hinweis\"),\"\",\nIF(AND($AA66,$AH66,$AO66,$AV66,$BC66)=\"\",\"\",\nIF($L$4=\"MIT\",\nIF(OR(AW66=\"Nur EP        \",$K66=\"E\"),((BA66/(AVERAGE($AF66,$AM66,$AT66,$BA66,$BH66)))-1),\nIF($L$4=\"MIT\",((AW66/(AVERAGE($AB66,$AI66,$AP66,$AW66,$BD66)))-1),\nIF($L$4=\"MIN\",\nIF(OR(AW66=\"Nur EP        \",$K66=\"E\"),((BA66/(MIN($AF66,$AM66,$AT66,$BA66,$BH66)))-1),\nIF($L$4=\"MIN\",(AW66/(MIN($AB66,$AI66,$AP66,$AW66,$BD66)))-1)\n)))))))","v":""},{"$f":"IF(OR($K66=\"\",$K66=\"H\",$K66=\"AB\",$K66=\"G\",$J66=\"Position\",$K66=\"<-- Bitte Positionsart\",AV66=\"\",$L66=\"\"),\"\",\nIF(OR($K66=\"A\",$K66=\"B\",$K66=\"E\"),$L66*AV66))","v":""},null,null,"",null,"",{"$f":"IF(OR($L66=\"\",BC66=\"\",$J66=\"Ausführungsbeschreibung\",$J66=\"Hinweis\"),\"\",\nIF(AND($AA66,$AH66,$AO66,$AV66,$BC66)=\"\",\"\",\nIF($L$4=\"MIT\",\nIF(OR(BD66=\"Nur EP        \",$K66=\"E\"),((BH66/(AVERAGE($AF66,$AM66,$AT66,$BA66,$BH66)))-1),\nIF($L$4=\"MIT\",((BD66/(AVERAGE($AB66,$AI66,$AP66,$AW66,$BD66)))-1),\nIF($L$4=\"MIN\",\nIF(OR(BD66=\"Nur EP        \",$K66=\"E\"),((BH66/(MIN($AF66,$AM66,$AT66,$BA66,$BH66)))-1),\nIF($L$4=\"MIN\",((BD66/(MIN($AB66,$AI66,$AP66,$AW66,$BD66)))-1))\n)))))))","v":""},{"$f":"IF(OR($K66=\"\",$K66=\"H\",$K66=\"AB\",$K66=\"G\",$J66=\"Position\",$K66=\"<-- Bitte Positionsart\",BC66=\"\",$L66=\"\"),\"\",\nIF(OR($K66=\"A\",$K66=\"B\",$K66=\"E\"),$L66*BC66))","v":""}]
[null,null,null,null,null,null,{"$f":"G$64","v":4},3,"Abriss Entsorgung Zinkblechverkleidung der Gaubenseitenwände","Position","",32.4,"qm",null,37.51,57.843333333333334,95.5,1874.124,null,"",null,30,972,-0.41040632830540946,"",null,37.51,1215.3239999999998,null,"",-0.35152423212124706,{"$f":"IF(OR($K67=\"\",$K67=\"H\",$K67=\"AB\",$K67=\"G\",$J67=\"Position\",$K67=\"<-- Bitte Positionsart\",AA67=\"\",$L67=\"\"),\"\",\nIF(OR($K67=\"A\",$K67=\"B\",$K67=\"E\"),$L67*AA67))","v":""},null,40.520000000000003,1312.848,null,"",-0.29948712038264269,{"$f":"IF(OR($K67=\"\",$K67=\"H\",$K67=\"AB\",$K67=\"G\",$J67=\"Position\",$K67=\"<-- Bitte Positionsart\",AH67=\"\",$L67=\"\"),\"\",\nIF(OR($K67=\"A\",$K67=\"B\",$K67=\"E\"),$L67*AH67))","v":""},null,95.5,3094.2,null,"",0.65101135250388986,{"$f":"IF(OR($K67=\"\",$K67=\"H\",$K67=\"AB\",$K67=\"G\",$J67=\"Position\",$K67=\"<-- Bitte Positionsart\",AO67=\"\",$L67=\"\"),\"\",\nIF(OR($K67=\"A\",$K67=\"B\",$K67=\"E\"),$L67*AO67))","v":""},null,null,"",null,"",{"$f":"IF(OR($L67=\"\",AV67=\"\",$J67=\"Ausführungsbeschreibung\",$J67=\"Hinweis\"),\"\",\nIF(AND($AA67,$AH67,$AO67,$AV67,$BC67)=\"\",\"\",\nIF($L$4=\"MIT\",\nIF(OR(AW67=\"Nur EP        \",$K67=\"E\"),((BA67/(AVERAGE($AF67,$AM67,$AT67,$BA67,$BH67)))-1),\nIF($L$4=\"MIT\",((AW67/(AVERAGE($AB67,$AI67,$AP67,$AW67,$BD67)))-1),\nIF($L$4=\"MIN\",\nIF(OR(AW67=\"Nur EP        \",$K67=\"E\"),((BA67/(MIN($AF67,$AM67,$AT67,$BA67,$BH67)))-1),\nIF($L$4=\"MIN\",(AW67/(MIN($AB67,$AI67,$AP67,$AW67,$BD67)))-1)\n)))))))","v":""},{"$f":"IF(OR($K67=\"\",$K67=\"H\",$K67=\"AB\",$K67=\"G\",$J67=\"Position\",$K67=\"<-- Bitte Positionsart\",AV67=\"\",$L67=\"\"),\"\",\nIF(OR($K67=\"A\",$K67=\"B\",$K67=\"E\"),$L67*AV67))","v":""},null,null,"",null,"","",{"$f":"IF(OR($K67=\"\",$K67=\"H\",$K67=\"AB\",$K67=\"G\",$J67=\"Position\",$K67=\"<-- Bitte Positionsart\",BC67=\"\",$L67=\"\"),\"\",\nIF(OR($K67=\"A\",$K67=\"B\",$K67=\"E\"),$L67*BC67))","v":""}]
[null,null,null,null,null,null,{"$f":"G$64","v":4},4,"Temporäre Demontage der Geländer an den Erker-Gauben","Position","",3,"Stck.",null,245,576.09333333333336,773.69,1728.2800000000002,null,"",null,150,450,-0.6805588091232404,"",null,709.59,2128.77,null,"",0.23172749785914326,"",null,773.69,2321.0700000000002,null,"",0.34299419075612758,"",null,245,735,null,"",-0.57472168861527062,"",null,null,"",null,"","","",null,null,{"$f":"IF(AD68=\"Hinweis\",\"\",IF(OR($K68=\"A\",$K68=\"B\"),\"Nur EP        \",IF($K68=\"E\",\"E                \",IF(AND($L68<>\"\",BC68<>\"\"),$L68*BC68,\"\"))))","v":""},null,{"$f":"IF(BE68=\"\",\"\",IF(BE68=\"X\",BD68,BD68*BE68))","v":""},"",""]
[null,null,null,null,null,null,{"$f":"G$64","v":4},5,null,null,"",null,null,null,"","","","",null,"",null,null,"","","",null,null,"",null,"","","",null,null,"",null,"","","",null,null,"",null,"","","",null,null,"",null,"","","",null,null,"",null,"","",""]
[null,null,null,null,null,null,4,6,null,null,"",null,null,null,"","","","",null,"",null,null,"","","",null,null,"",null,"","","",null,null,{"$f":"IF(J70=\"Hinweis\",\"\",IF(OR($K70=\"A\",$K70=\"B\"),\"Nur EP        \",IF($K70=\"E\",\"E                \",IF(AND($L70<>\"\",AH70<>\"\"),$L70*AH70,\"\"))))","v":""},null,{"$f":"IF(AJ70=\"\",\"\",IF(AJ70=\"X\",AI70,AI70*AJ70))","v":""},"","",null,null,"",null,"","","",null,null,"",null,"","","",null,null,"",null,"","",{"$f":"IF(OR($K70=\"\",$K70=\"H\",$K70=\"AB\",$K70=\"G\",$J70=\"Position\",$K70=\"<-- Bitte Positionsart\",BC70=\"\",$L70=\"\"),\"\",\nIF(OR($K70=\"A\",$K70=\"B\",$K70=\"E\"),$L70*BC70))","v":""}]
[null,null,null,null,null,null,4,7,null,null,"",null,null,null,"","","","",null,"",null,null,"","","",null,null,"",null,"","","",null,null,"",null,"","","",null,null,"",null,"","","",null,null,"",null,"","","",null,null,"",null,"","",""]
[null,null,null,null,null,null,4,8,null,null,"",null,null,null,"","","","",null,"",null,null,"","","",null,null,{"$f":"IF($C72=\"Hinweis\",\"\",IF(OR($K72=\"A\",$K72=\"B\"),\"Nur EP        \",IF($K72=\"E\",\"E                \",IF(AND($L72<>\"\",AA72<>\"\"),$L72*AA72,\"\"))))","v":""},null,"","","",null,null,"",null,"","",{"$f":"IF(OR($K72=\"\",$K72=\"H\",$K72=\"AB\",$K72=\"G\",$J72=\"Position\",$K72=\"<-- Bitte Positionsart\",AH72=\"\",$L72=\"\"),\"\",\nIF(OR($K72=\"A\",$K72=\"B\",$K72=\"E\"),$L72*AH72))","v":""},null,null,{"$f":"IF($C72=\"Hinweis\",\"\",IF(OR($K72=\"A\",$K72=\"B\"),\"Nur EP        \",IF($K72=\"E\",\"E                \",IF(AND($L72<>\"\",AO72<>\"\"),$L72*AO72,\"\"))))","v":""},null,"","","",null,null,"",null,"","","",null,null,"",null,"","",""]
[null,null,null,null,null,null,4,9,null,null,"",null,null,null,"","","","",null,"",null,null,"","","",null,null,{"$f":"IF($C73=\"Hinweis\",\"\",IF(OR($K73=\"A\",$K73=\"B\"),\"Nur EP        \",IF($K73=\"E\",\"E                \",IF(AND($L73<>\"\",AA73<>\"\"),$L73*AA73,\"\"))))","v":""},null,"","","",null,null,"",null,"","","",null,null,{"$f":"IF($C73=\"Hinweis\",\"\",IF(OR($K73=\"A\",$K73=\"B\"),\"Nur EP        \",IF($K73=\"E\",\"E                \",IF(AND($L73<>\"\",AO73<>\"\"),$L73*AO73,\"\"))))","v":""},null,"","","",null,null,"",null,"","","",null,null,"",null,"","",""]
[null,null,null,null,null,null,4,10,null,null,"",null,null,null,"","","","",null,"",null,null,"","","",null,null,{"$f":"IF(C74=\"Hinweis\",\"\",IF(OR($K74=\"A\",$K74=\"B\"),\"Nur EP        \",IF($K74=\"E\",\"E                \",IF(AND($L74<>\"\",AA74<>\"\"),$L74*AA74,\"\"))))","v":""},null,{"$f":"IF(AC74=\"\",\"\",IF(AC74=\"X\",AB74,AB74*AC74))","v":""},"","",null,null,"",null,"","","",null,null,{"$f":"IF(P74=\"Hinweis\",\"\",IF(OR($K74=\"A\",$K74=\"B\"),\"Nur EP        \",IF($K74=\"E\",\"E                \",IF(AND($L74<>\"\",AO74<>\"\"),$L74*AO74,\"\"))))","v":""},null,"","","",null,null,"",null,"","","",null,null,"",null,"","",""]
[null,null,null,null,null,null,4,11,null,null,"",null,null,null,"","","","",null,"",null,null,"","","",null,null,"",null,"","","",null,null,"",null,"","","",null,null,{"$f":"IF(OR($K75=\"A\",$K75=\"B\"),\"Nur EP        \",IF($K75=\"E\",\"E                \",IF(AND($L75<>\"\",AO75<>\"\"),$L75*AO75,\"\")))","v":""},null,{"$f":"IF(AQ75=\"\",\"\",IF(AQ75=\"X\",AP75,AP75*AQ75))","v":""},"","",null,null,"",null,"","","",null,null,"",null,"","",""]
[null,null,null,null,null,null,4,12,null,null,"",null,null,null,"","","","",null,"",null,null,"","","",null,null,{"$f":"IF(C76=\"Hinweis\",\"\",IF(OR($K76=\"A\",$K76=\"B\"),\"Nur EP        \",IF($K76=\"E\",\"E                \",IF(AND($L76<>\"\",AA76<>\"\"),$L76*AA76,\"\"))))","v":""},null,"","",{"$f":"IF(OR($K76=\"\",$K76=\"H\",$K76=\"AB\",$K76=\"G\",$J76=\"Position\",$K76=\"<-- Bitte Positionsart\",AA76=\"\",$L76=\"\"),\"\",\nIF(OR($K76=\"A\",$K76=\"B\",$K76=\"E\"),$L76*AA76))","v":""},null,null,"",null,"","","",null,null,{"$f":"IF(P76=\"Hinweis\",\"\",IF(OR($K76=\"A\",$K76=\"B\"),\"Nur EP        \",IF($K76=\"E\",\"E                \",IF(AND($L76<>\"\",AO76<>\"\"),$L76*AO76,\"\"))))","v":""},null,{"$f":"IF(AQ76=\"\",\"\",IF(AQ76=\"X\",AP76,AP76*AQ76))","v":""},"",{"$f":"IF(OR($K76=\"\",$K76=\"H\",$K76=\"AB\",$K76=\"G\",$J76=\"Position\",$K76=\"<-- Bitte Positionsart\",AO76=\"\",$L76=\"\"),\"\",\nIF(OR($K76=\"A\",$K76=\"B\",$K76=\"E\"),$L76*AO76))","v":""},null,null,{"$f":"IF(W76=\"Hinweis\",\"\",IF(OR($K76=\"A\",$K76=\"B\"),\"Nur EP        \",IF($K76=\"E\",\"E                \",IF(AND($L76<>\"\",AV76<>\"\"),$L76*AV76,\"\"))))","v":""},null,{"$f":"IF(AX76=\"\",\"\",IF(AX76=\"X\",AW76,AW76*AX76))","v":""},{"$f":"IF(OR($L76=\"\",AV76=\"\",$J76=\"Ausführungsbeschreibung\",$J76=\"Hinweis\"),\"\",\nIF(AND($AA76,$AH76,$AO76,$AV76,$BC76)=\"\",\"\",\nIF($L$4=\"MIT\",\nIF(OR(AW76=\"Nur EP        \",$K76=\"E\"),((BA76/(AVERAGE($AF76,$AM76,$AT76,$BA76,$BH76)))-1),\nIF($L$4=\"MIT\",((AW76/(AVERAGE($AB76,$AI76,$AP76,$AW76,$BD76)))-1),\nIF($L$4=\"MIN\",\nIF(OR(AW76=\"Nur EP        \",$K76=\"E\"),((BA76/(MIN($AF76,$AM76,$AT76,$BA76,$BH76)))-1),\nIF($L$4=\"MIN\",(AW76/(MIN($AB76,$AI76,$AP76,$AW76,$BD76)))-1)\n)))))))","v":""},{"$f":"IF(OR($K76=\"\",$K76=\"H\",$K76=\"AB\",$K76=\"G\",$J76=\"Position\",$K76=\"<-- Bitte Positionsart\",AV76=\"\",$L76=\"\"),\"\",\nIF(OR($K76=\"A\",$K76=\"B\",$K76=\"E\"),$L76*AV76))","v":""},null,null,"",null,"","",""]
[null,null,null,null,null,null,null,null,null,null,null,null,null,null,null,null,null,null,null,null,null,null,{"$f":"IF(OR($K77=\"A\",$K77=\"B\"),\"Nur EP        \",IF($K77=\"E\",\"\",IF(AND($L77<>\"\",V77<>\"\"),$L77*V77,\"\")))","v":""},null,{"$f":"IF($K77=\"Ja\",IF(AND($L77<>\"\",V77<>\"\"),$L77*V77),\"\")","v":""},null,"EP / % Titel","Positions- / Titelsumme",null,"",null,{"$f":"IF($K77=\"Ja\",IF(AND($L77<>\"\",AA77<>\"\"),$L77*AA77),\"\")","v":""},null,"EP / % Titel","Positions- / Titelsumme",null,"",null,{"$f":"IF($K77=\"Ja\",IF(AND($L77<>\"\",AH77<>\"\"),$L77*AH77),\"\")","v":""},null,"EP / % Titel","Positions- / Titelsumme",null,"",null,{"$f":"IF($K77=\"Ja\",IF(AND($L77<>\"\",AO77<>\"\"),$L77*AO77),\"\")","v":""},null,"EP / % Titel","Positions- / Titelsumme",null,{"$f":"IF(AX77=\"\",\"\",IF(AX77=\"X\",AW77,AW77*AX77))","v":""},null,{"$f":"IF($K77=\"Ja\",IF(AND($L77<>\"\",AV77<>\"\"),$L77*AV77),\"\")","v":""},null,"EP / % Titel","Positions- / Titelsumme",null,"",null,{"$f":"IF($K77=\"Ja\",IF(AND($L77<>\"\",BC77<>\"\"),$L77*BC77),\"\")","v":""}]
[null,null,null,null,null,null,5,null,"Zimmermannsarbeiten",null,null,null,null,null,{"$f":"CONCATENATE(\"Titelsumme\",CHAR(10),\"MIN\",CHAR(10),TEXT(SUMPRODUCT($L79:$L104,O79:O104),\"##.##0,00\"),\" €\")","v":"Titelsumme\nMIN\n39.100,74 €"},{"$f":"CONCATENATE(\"Titelsumme\",CHAR(10),\"MIT\",CHAR(10),TEXT(SUMPRODUCT($L79:$L104,P79:P104),\"##.##0,00\"),\" €\")","v":"Titelsumme\nMIT\n73.243,13 €"},{"$f":"CONCATENATE(\"Titelsumme\",CHAR(10),\"MAX\",CHAR(10),TEXT(SUMPRODUCT($L79:$L104,Q79:Q104),\"##.##0,00\"),\" €\")","v":"Titelsumme\nMAX\n92.964,70 €"},{"$f":"SUM(R79:R104)","v":73243.127116666656},null,{"$f":"SUM(T79:T104)","v":15633.45},null,null,{"$f":"SUM(W79:W104)","v":0},null,{"$f":"SUM(Y79:Y104)","v":0},null,{"$f":"IF(AB78=0,\"\",\nIF($L$4=\"MIT\",((AB78/(AVERAGE($AB78,$AI78,$AP78,$AW78,$BD78)))-1)*100,))","v":99.548056707801805},{"$f":"SUM(AB79:AB103)","v":87693.142099999997},null,"",null,{"$f":"SUM(AF79:AF104)","v":15633.45},null,{"$f":"IF(AI78=0,\"\",\nIF($L$4=\"MIT\",((AI78/(AVERAGE($AB78,$AI78,$AP78,$AW78,$BD78)))-1)*100,))","v":103.6110070948416},{"$f":"SUM(AI79:AI104)","v":89478.641250000001},null,"",null,{"$f":"SUM(AM79:AM104)","v":15633.45},null,{"$f":"IF(AP78=0,\"\",\nIF($L$4=\"MIT\",((AP78/(AVERAGE($AB78,$AI78,$AP78,$AW78,$BD78)))-1)*100,))","v":-3.1590638026433138},{"$f":"SUM(AP79:AP104)","v":42557.598000000005},null,{"$f":"IF(AQ78=\"\",\"\",IF(AQ78=\"X\",AP78,AP78*AQ78))","v":""},null,{"$f":"SUM(AT79:AT104)","v":0},null,{"$f":"IF(AW78=0,\"\",\nIF($L$4=\"MIT\",((AW78/(AVERAGE($AB78,$AI78,$AP78,$AW78,$BD78)))-1)*100,))","v":""},{"$f":"SUM(AW79:AW104)","v":0},null,{"$f":"IF(AX78=\"\",\"\",IF(AX78=\"X\",AW78,AW78*AX78))","v":""},null,{"$f":"SUM(BA79:BA104)","v":0},null,{"$f":"IF(BD78=0,\"\",\nIF($L$4=\"MIT\",((BD78/(AVERAGE($AB78,$AI78,$AP78,$AW78,$BD78)))-1)*100,))","v":""},{"$f":"SUM(BD79:BD104)","v":0},null,{"$f":"IF(BE78=\"\",\"\",IF(BE78=\"X\",BD78,BD78*BE78))","v":""},null,{"$f":"SUM(BH79:BH104)","v":0}]
[null,null,null,null,null,null,{"$f":"G$78","v":5},{"$f":"IF(G$162=\"\",\"\",ROW()-ROW(G$78))","v":1},"Hinweis zu vorhandener Mineralwolldämmung","Hinweis",{"$f":"IF(J79=\"Position\",\"\",IF(J79=\"Grundposition\",\"G\",IF(J79=\"Alternativposition\",\"A\",IF(J79=\"Bedarfsposition\",\"B\",IF(J79=\"Hinweis\",\"H\",IF(J79=\"Ausführungsbeschreibung\",\"AB\",IF(J79=\"Entfällt\",\"E\",IF(AND(I79<>\"\",L79<>\"\"),\"<-- Bitte Positionsart\",\"\"))))))))","v":"H"},null,null,null,{"$f":"IF(OR($K79=\"B\",$K79=\"A\",$K79=\"H\",$K79=\"AB\",$K79=\"<-- Bitte Positionsart\",SUM(AA79,AH79,AO79,AV79,BC79)=0),\"\",MIN(AA79,AH79,AO79,AV79,BC79))","v":""},{"$f":"IF(OR($K79=\"B\",$K79=\"A\",$K79=\"H\",$K79=\"AB\",$K79=\"<-- Bitte Positionsart\",SUM(AA79,AH79,AO79,AV79,BC79)=0),\"\",SUM(AA79,AH79,AO79,AV79,BC79)/COUNT(AA79,AH79,AO79,AV79,BC79))","v":""},{"$f":"IF(OR($K79=\"B\",$K79=\"A\",$K79=\"H\",$K79=\"AB\",$K79=\"<-- Bitte Positionsart\",SUM(AA79,AH79,AO79,AV79,BC79)=0),\"\",MAX(AA79,AH79,AO79,AV79,BC79))","v":""},{"$f":"IF(OR($K79=\"A\",$K79=\"B\"),\"Nur EP        \",IF($K79=\"E\",\"E                \",IF(AND($L79<>\"\",P79<>\"\"),$L79*P79,\"\")))","v":""},null,{"$f":"IF(OR($K79=\"\",$K79=\"H\",$K79=\"AB\",$K79=\"G\",$K79=\"<-- Bitte Positionsart\"),\"\",IF(OR($K79=\"A\",$K79=\"B\"),$L79*(SUM(AA79,AH79,AO79,AV79,BC79)/COUNT(AA79,AH79,AO79,AV79,BC79)),IF($K79=\"E\",$L79*P79)))","v":""},null,null,{"$f":"IF(OR($K79=\"A\",$K79=\"B\"),\"Nur EP        \",IF($K79=\"E\",\"E                \",IF(AND($L79<>\"\",V79<>\"\"),$L79*V79,\"\")))","v":""},{"$f":"IF(OR($L148=\"\",V79=\"\",$J79=\"Ausführungsbeschreibung\",$J79=\"Hinweis\"),\"\",\nIF(AND($V79,$AA79,$AH79,$AO79,$AV79,$BC79)=\"\",\"\",\n\nIF(OR($W79=\"Nur EP        \",$K79=\"E\"),(Y79/(AVERAGE($Y79,$AF79,$AM79,$AT79,Y79))-1),\nIF(AND($W79,$AB79,$AI79,$AP79,$AW79)=\"\",\"\",(W79/(AVERAGE($W79,$AB79,$AI79,$AP79,$AW79)))-1))))","v":""},{"$f":"IF(OR($K79=\"\",$K79=\"H\",$K79=\"AB\",$K79=\"G\",$J79=\"Position\",$K79=\"<-- Bitte Positionsart\",V79=\"\",$L79=\"\"),\"\",\nIF(OR($K79=\"A\",$K79=\"B\",$K79=\"E\"),$L79*V79))","v":""},null,null,{"$f":"IF(C79=\"Hinweis\",\"\",IF(OR($K79=\"A\",$K79=\"B\"),\"Nur EP        \",IF($K79=\"E\",\"E                \",IF(AND($L79<>\"\",AA79<>\"\"),$L79*AA79,\"\"))))","v":""},null,"",{"$f":"IF(OR($L79=\"\",AA79=\"\",$J79=\"Ausführungsbeschreibung\",$J79=\"Hinweis\"),\"\",\nIF(AND($AA79,$AH79,$AO79,$AV79,$BC79)=\"\",\"\",\nIF($L$4=\"MIT\",\nIF(OR(AB79=\"Nur EP        \",$K79=\"E\"),((AF79/(AVERAGE($AF79,$AM79,$AT79,$BA79,$BH79)))-1),\nIF($L$4=\"MIT\",((AB79/(AVERAGE($AB79,$AI79,$AP79,$AW79,$BD79)))-1),\nIF($L$4=\"MIN\",\nIF(OR(AB79=\"Nur EP        \",$K79=\"E\"),((AF79/(MIN($AF79,$AM79,$AT79,$BA79,$BH79)))-1),\nIF($L$4=\"MIN\",((AB79/(MIN($AB79,$AI79,$AP79,$AW79,$BD79)))-1))\n)))))))","v":""},{"$f":"IF(OR($K79=\"\",$K79=\"H\",$K79=\"AB\",$K79=\"G\",$J79=\"Position\",$K79=\"<-- Bitte Positionsart\",AA79=\"\",$L79=\"\"),\"\",\nIF(OR($K79=\"A\",$K79=\"B\",$K79=\"E\"),$L79*AA79))","v":""},null,null,{"$f":"IF(J79=\"Hinweis\",\"\",IF(OR($K79=\"A\",$K79=\"B\"),\"Nur EP        \",IF($K79=\"E\",\"E                \",IF(AND($L79<>\"\",AH79<>\"\"),$L79*AH79,\"\"))))","v":""},null,"",{"$f":"IF(OR($L79=\"\",AH79=\"\",$J79=\"Ausführungsbeschreibung\",$J79=\"Hinweis\"),\"\",\nIF(AND($AA79,$AH79,$AO79,$AV79,$BC79)=\"\",\"\",\nIF($L$4=\"MIT\",\nIF(OR(AI79=\"Nur EP        \",$K79=\"E\"),((AM79/(AVERAGE($AF79,$AM79,$AT79,$BA79,$BH79)))-1)*100,\nIF($L$4=\"MIT\",((AI79/(AVERAGE($AB79,$AI79,$AP79,$AW79,$BD79)))-1)*100,\nIF($L$4=\"MIN\",\nIF(OR(AI79=\"Nur EP        \",$K79=\"E\"),((AM79/(MIN($AF79,$AM79,$AT79,$BA79,$BH79)))-1)*100,\nIF($L$4=\"MIN\",(AI79/(MIN($AB79,$AI79,$AP79,$AW79,$BD79)))-1)*100\n)))))))","v":""},{"$f":"IF(OR($K79=\"\",$K79=\"H\",$K79=\"AB\",$K79=\"G\",$J79=\"Position\",$K79=\"<-- Bitte Positionsart\",AH79=\"\",$L79=\"\"),\"\",\nIF(OR($K79=\"A\",$K79=\"B\",$K79=\"E\"),$L79*AH79))","v":""},null,null,{"$f":"IF(P79=\"Hinweis\",\"\",IF(OR($K79=\"A\",$K79=\"B\"),\"Nur EP        \",IF($K79=\"E\",\"E                \",IF(AND($L79<>\"\",AO79<>\"\"),$L79*AO79,\"\"))))","v":""},null,"",{"$f":"IF(OR($L79=\"\",AO79=\"\",$J79=\"Ausführungsbeschreibung\",$J79=\"Hinweis\"),\"\",\nIF(AND($AA79,$AH79,$AO79,$AV79,$BC79)=\"\",\"\",\nIF($L$4=\"MIT\",\nIF(OR(AP79=\"Nur EP        \",$K79=\"E\"),((AT79/(AVERAGE($AF79,$AM79,$AT79,$BA79,$BH79)))-1),\nIF($L$4=\"MIT\",((AP79/(AVERAGE($AB79,$AI79,$AP79,$AW79,$BD79)))-1),\nIF($L$4=\"MIN\",\nIF(OR(AP79=\"Nur EP        \",$K79=\"E\"),((AT79/(MIN($AF79,$AM79,$AT79,$BA79,$BH79)))-1),\nIF($L$4=\"MIN\",(AP79/(MIN($AB79,$AI79,$AP79,$AW79,$BD79)))-1)\n)))))))","v":""},{"$f":"IF(OR($K79=\"\",$K79=\"H\",$K79=\"AB\",$K79=\"G\",$J79=\"Position\",$K79=\"<-- Bitte Positionsart\",AO79=\"\",$L79=\"\"),\"\",\nIF(OR($K79=\"A\",$K79=\"B\",$K79=\"E\"),$L79*AO79))","v":""},null,null,{"$f":"IF(W79=\"Hinweis\",\"\",IF(OR($K79=\"A\",$K79=\"B\"),\"Nur EP        \",IF($K79=\"E\",\"E                \",IF(AND($L79<>\"\",AV79<>\"\"),$L79*AV79,\"\"))))","v":""},null,"",{"$f":"IF(OR($L79=\"\",AV79=\"\",$J79=\"Ausführungsbeschreibung\",$J79=\"Hinweis\"),\"\",\nIF(AND($AA79,$AH79,$AO79,$AV79,$BC79)=\"\",\"\",\nIF($L$4=\"MIT\",\nIF(OR(AW79=\"Nur EP        \",$K79=\"E\"),((BA79/(AVERAGE($AF79,$AM79,$AT79,$BA79,$BH79)))-1),\nIF($L$4=\"MIT\",((AW79/(AVERAGE($AB79,$AI79,$AP79,$AW79,$BD79)))-1),\nIF($L$4=\"MIN\",\nIF(OR(AW79=\"Nur EP        \",$K79=\"E\"),((BA79/(MIN($AF79,$AM79,$AT79,$BA79,$BH79)))-1),\nIF($L$4=\"MIN\",(AW79/(MIN($AB79,$AI79,$AP79,$AW79,$BD79)))-1)\n)))))))","v":""},{"$f":"IF(OR($K79=\"\",$K79=\"H\",$K79=\"AB\",$K79=\"G\",$J79=\"Position\",$K79=\"<-- Bitte Positionsart\",AV79=\"\",$L79=\"\"),\"\",\nIF(OR($K79=\"A\",$K79=\"B\",$K79=\"E\"),$L79*AV79))","v":""},null,null,{"$f":"IF(AD79=\"Hinweis\",\"\",IF(OR($K79=\"A\",$K79=\"B\"),\"Nur EP        \",IF($K79=\"E\",\"E                \",IF(AND($L79<>\"\",BC79<>\"\"),$L79*BC79,\"\"))))","v":""},null,"",{"$f":"IF(OR($L79=\"\",BC79=\"\",$J79=\"Ausführungsbeschreibung\",$J79=\"Hinweis\"),\"\",\nIF(AND($AA79,$AH79,$AO79,$AV79,$BC79)=\"\",\"\",\nIF($L$4=\"MIT\",\nIF(OR(BD79=\"Nur EP        \",$K79=\"E\"),((BH79/(AVERAGE($AF79,$AM79,$AT79,$BA79,$BH79)))-1),\nIF($L$4=\"MIT\",((BD79/(AVERAGE($AB79,$AI79,$AP79,$AW79,$BD79)))-1),\nIF($L$4=\"MIN\",\nIF(OR(BD79=\"Nur EP        \",$K79=\"E\"),((BH79/(MIN($AF79,$AM79,$AT79,$BA79,$BH79)))-1),\nIF($L$4=\"MIN\",((BD79/(MIN($AB79,$AI79,$AP79,$AW79,$BD79)))-1))\n)))))))","v":""},{"$f":"IF(OR($K79=\"\",$K79=\"H\",$K79=\"AB\",$K79=\"G\",$J79=\"Position\",$K79=\"<-- Bitte Positionsart\",BC79=\"\",$L79=\"\"),\"\",\nIF(OR($K79=\"A\",$K79=\"B\",$K79=\"E\"),$L79*BC79))","v":""}]
[null,null,null,null,null,null,{"$f":"G$78","v":5},2,"Hinweis zu Holzqualitäten","Hinweis",{"$f":"IF(J80=\"Position\",\"\",IF(J80=\"Grundposition\",\"G\",IF(J80=\"Alternativposition\",\"A\",IF(J80=\"Bedarfsposition\",\"B\",IF(J80=\"Hinweis\",\"H\",IF(J80=\"Ausführungsbeschreibung\",\"AB\",IF(J80=\"Entfällt\",\"E\",IF(AND(I80<>\"\",L80<>\"\"),\"<-- Bitte Positionsart\",\"\"))))))))","v":"H"},null,null,null,"","","","",null,"",null,null,"",{"$f":"IF(OR($L149=\"\",V80=\"\",$J80=\"Ausführungsbeschreibung\",$J80=\"Hinweis\"),\"\",\nIF(AND($V80,$AA80,$AH80,$AO80,$AV80,$BC80)=\"\",\"\",\n\nIF(OR($W80=\"Nur EP        \",$K80=\"E\"),(Y80/(AVERAGE($Y80,$AF80,$AM80,$AT80,Y80))-1),\nIF(AND($W80,$AB80,$AI80,$AP80,$AW80)=\"\",\"\",(W80/(AVERAGE($W80,$AB80,$AI80,$AP80,$AW80)))-1))))","v":""},{"$f":"IF(OR($K80=\"\",$K80=\"H\",$K80=\"AB\",$K80=\"G\",$J80=\"Position\",$K80=\"<-- Bitte Positionsart\",V80=\"\",$L80=\"\"),\"\",\nIF(OR($K80=\"A\",$K80=\"B\",$K80=\"E\"),$L80*V80))","v":""},null,null,"",null,"","","",null,null,"",null,"",{"$f":"IF(OR($L80=\"\",AH80=\"\",$J80=\"Ausführungsbeschreibung\",$J80=\"Hinweis\"),\"\",\nIF(AND($AA80,$AH80,$AO80,$AV80,$BC80)=\"\",\"\",\nIF($L$4=\"MIT\",\nIF(OR(AI80=\"Nur EP        \",$K80=\"E\"),((AM80/(AVERAGE($AF80,$AM80,$AT80,$BA80,$BH80)))-1)*100,\nIF($L$4=\"MIT\",((AI80/(AVERAGE($AB80,$AI80,$AP80,$AW80,$BD80)))-1)*100,\nIF($L$4=\"MIN\",\nIF(OR(AI80=\"Nur EP        \",$K80=\"E\"),((AM80/(MIN($AF80,$AM80,$AT80,$BA80,$BH80)))-1)*100,\nIF($L$4=\"MIN\",(AI80/(MIN($AB80,$AI80,$AP80,$AW80,$BD80)))-1)*100\n)))))))","v":""},{"$f":"IF(OR($K80=\"\",$K80=\"H\",$K80=\"AB\",$K80=\"G\",$J80=\"Position\",$K80=\"<-- Bitte Positionsart\",AH80=\"\",$L80=\"\"),\"\",\nIF(OR($K80=\"A\",$K80=\"B\",$K80=\"E\"),$L80*AH80))","v":""},null,null,"",null,"",{"$f":"IF(OR($L80=\"\",AO80=\"\",$J80=\"Ausführungsbeschreibung\",$J80=\"Hinweis\"),\"\",\nIF(AND($AA80,$AH80,$AO80,$AV80,$BC80)=\"\",\"\",\nIF($L$4=\"MIT\",\nIF(OR(AP80=\"Nur EP        \",$K80=\"E\"),((AT80/(AVERAGE($AF80,$AM80,$AT80,$BA80,$BH80)))-1),\nIF($L$4=\"MIT\",((AP80/(AVERAGE($AB80,$AI80,$AP80,$AW80,$BD80)))-1),\nIF($L$4=\"MIN\",\nIF(OR(AP80=\"Nur EP        \",$K80=\"E\"),((AT80/(MIN($AF80,$AM80,$AT80,$BA80,$BH80)))-1),\nIF($L$4=\"MIN\",(AP80/(MIN($AB80,$AI80,$AP80,$AW80,$BD80)))-1)\n)))))))","v":""},"",null,null,"",null,"",{"$f":"IF(OR($L80=\"\",AV80=\"\",$J80=\"Ausführungsbeschreibung\",$J80=\"Hinweis\"),\"\",\nIF(AND($AA80,$AH80,$AO80,$AV80,$BC80)=\"\",\"\",\nIF($L$4=\"MIT\",\nIF(OR(AW80=\"Nur EP        \",$K80=\"E\"),((BA80/(AVERAGE($AF80,$AM80,$AT80,$BA80,$BH80)))-1),\nIF($L$4=\"MIT\",((AW80/(AVERAGE($AB80,$AI80,$AP80,$AW80,$BD80)))-1),\nIF($L$4=\"MIN\",\nIF(OR(AW80=\"Nur EP        \",$K80=\"E\"),((BA80/(MIN($AF80,$AM80,$AT80,$BA80,$BH80)))-1),\nIF($L$4=\"MIN\",(AW80/(MIN($AB80,$AI80,$AP80,$AW80,$BD80)))-1)\n)))))))","v":""},{"$f":"IF(OR($K80=\"\",$K80=\"H\",$K80=\"AB\",$K80=\"G\",$J80=\"Position\",$K80=\"<-- Bitte Positionsart\",AV80=\"\",$L80=\"\"),\"\",\nIF(OR($K80=\"A\",$K80=\"B\",$K80=\"E\"),$L80*AV80))","v":""},null,null,"",null,"",{"$f":"IF(OR($L80=\"\",BC80=\"\",$J80=\"Ausführungsbeschreibung\",$J80=\"Hinweis\"),\"\",\nIF(AND($AA80,$AH80,$AO80,$AV80,$BC80)=\"\",\"\",\nIF($L$4=\"MIT\",\nIF(OR(BD80=\"Nur EP        \",$K80=\"E\"),((BH80/(AVERAGE($AF80,$AM80,$AT80,$BA80,$BH80)))-1),\nIF($L$4=\"MIT\",((BD80/(AVERAGE($AB80,$AI80,$AP80,$AW80,$BD80)))-1),\nIF($L$4=\"MIN\",\nIF(OR(BD80=\"Nur EP        \",$K80=\"E\"),((BH80/(MIN($AF80,$AM80,$AT80,$BA80,$BH80)))-1),\nIF($L$4=\"MIN\",((BD80/(MIN($AB80,$AI80,$AP80,$AW80,$BD80)))-1))\n)))))))","v":""},""]
[null,null,null,null,null,null,{"$f":"G$78","v":5},3,"Hinweis zum nachfolgenden Dämmsystem","Hinweis","H",null,null,null,"","","","",null,"",null,null,"","","",null,null,"",null,"","","",null,null,"",null,"",{"$f":"IF(OR($L81=\"\",AH81=\"\",$J81=\"Ausführungsbeschreibung\",$J81=\"Hinweis\"),\"\",\nIF(AND($AA81,$AH81,$AO81,$AV81,$BC81)=\"\",\"\",\nIF($L$4=\"MIT\",\nIF(OR(AI81=\"Nur EP        \",$K81=\"E\"),((AM81/(AVERAGE($AF81,$AM81,$AT81,$BA81,$BH81)))-1)*100,\nIF($L$4=\"MIT\",((AI81/(AVERAGE($AB81,$AI81,$AP81,$AW81,$BD81)))-1)*100,\nIF($L$4=\"MIN\",\nIF(OR(AI81=\"Nur EP        \",$K81=\"E\"),((AM81/(MIN($AF81,$AM81,$AT81,$BA81,$BH81)))-1)*100,\nIF($L$4=\"MIN\",(AI81/(MIN($AB81,$AI81,$AP81,$AW81,$BD81)))-1)*100\n)))))))","v":""},{"$f":"IF(OR($K81=\"\",$K81=\"H\",$K81=\"AB\",$K81=\"G\",$J81=\"Position\",$K81=\"<-- Bitte Positionsart\",AH81=\"\",$L81=\"\"),\"\",\nIF(OR($K81=\"A\",$K81=\"B\",$K81=\"E\"),$L81*AH81))","v":""},null,null,"",null,"","","",null,null,"",null,"","","",null,null,"",null,"","",""]
[null,null,null,null,null,null,5,4,"Probeöffnung des Dach zur Ermittlung der möglichen zusätzlichen Dämmstärke","Position","",1,"pausch.",null,127.02,145.44,180,145.44,null,"",null,null,"","","",null,127.02,127.02,null,"",-0.12665016501650161,"",null,129.30000000000001,129.30000000000001,null,"",{"$f":"IF(OR($L82=\"\",AH82=\"\",$J82=\"Ausführungsbeschreibung\",$J82=\"Hinweis\"),\"\",\nIF(AND($AA82,$AH82,$AO82,$AV82,$BC82)=\"\",\"\",\nIF($L$4=\"MIT\",\nIF(OR(AI82=\"Nur EP        \",$K82=\"E\"),((AM82/(AVERAGE($AF82,$AM82,$AT82,$BA82,$BH82)))-1),\nIF($L$4=\"MIT\",((AI82/(AVERAGE($AB82,$AI82,$AP82,$AW82,$BD82)))-1),\nIF($L$4=\"MIN\",\nIF(OR(AI82=\"Nur EP        \",$K82=\"E\"),((AM82/(MIN($AF82,$AM82,$AT82,$BA82,$BH82)))-1),\nIF($L$4=\"MIN\",(AI82/(MIN($AB82,$AI82,$AP82,$AW82,$BD82)))-1)\n)))))))","v":-0.11097359735973589},"",null,180,180,null,"",0.23762376237623761,"",null,null,"",null,"","","",null,null,"",null,"","",""]
[null,null,null,null,null,null,5,5,"Holzfaser Dämmplatten Ergänzung der Zwischensparrendämmung ","Grundposition","G",195,"qm",null,{"$f":"IF(OR($K83=\"B\",$K83=\"A\",$K83=\"H\",$K83=\"AB\",$K83=\"<-- Bitte Positionsart\",SUM(AA83,AH83,AO83,AV83,BC83)=0),\"\",MIN(AA83,AH83,AO83,AV83,BC83))","v":22.5},{"$f":"IF(OR($K83=\"B\",$K83=\"A\",$K83=\"H\",$K83=\"AB\",$K83=\"<-- Bitte Positionsart\",SUM(AA83,AH83,AO83,AV83,BC83)=0),\"\",SUM(AA83,AH83,AO83,AV83,BC83)/COUNT(AA83,AH83,AO83,AV83,BC83))","v":37.183333333333337},{"$f":"IF(OR($K83=\"B\",$K83=\"A\",$K83=\"H\",$K83=\"AB\",$K83=\"<-- Bitte Positionsart\",SUM(AA83,AH83,AO83,AV83,BC83)=0),\"\",MAX(AA83,AH83,AO83,AV83,BC83))","v":45.34},{"$f":"IF(OR($K83=\"A\",$K83=\"B\"),\"Nur EP        \",IF($K83=\"E\",\"E                \",IF(AND($L83<>\"\",P83<>\"\"),$L83*P83,\"\")))","v":7250.7500000000009},null,{"$f":"IF(OR($K83=\"\",$K83=\"H\",$K83=\"AB\",$K83=\"G\",$K83=\"<-- Bitte Positionsart\"),\"\",IF(OR($K83=\"A\",$K83=\"B\"),$L83*(SUM(AA83,AH83,AO83,AV83,BC83)/COUNT(AA83,AH83,AO83,AV83,BC83)),IF($K83=\"E\",$L83*P83)))","v":""},null,null,"","","",null,43.71,8523.4500000000007,null,"",{"$f":"IF(OR($L83=\"\",AA83=\"\",$J83=\"Ausführungsbeschreibung\",$J83=\"Hinweis\"),\"\",\nIF(AND($AA83,$AH83,$AO83,$AV83,$BC83)=\"\",\"\",\nIF($L$4=\"MIT\",\nIF(OR(AB83=\"Nur EP        \",$K83=\"E\"),((AF83/(AVERAGE($AF83,$AM83,$AT83,$BA83,$BH83)))-1),\nIF($L$4=\"MIT\",((AB83/(AVERAGE($AB83,$AI83,$AP83,$AW83,$BD83)))-1),\nIF($L$4=\"MIN\",\nIF(OR(AB83=\"Nur EP        \",$K83=\"E\"),((AF83/(MIN($AF83,$AM83,$AT83,$BA83,$BH83)))-1),\nIF($L$4=\"MIN\",((AB83/(MIN($AB83,$AI83,$AP83,$AW83,$BD83)))-1))\n)))))))","v":0.17552666965486341},"",null,45.34,8841.3000000000011,null,"",{"$f":"IF(OR($L83=\"\",AH83=\"\",$J83=\"Ausführungsbeschreibung\",$J83=\"Hinweis\"),\"\",\nIF(AND($AA83,$AH83,$AO83,$AV83,$BC83)=\"\",\"\",\nIF($L$4=\"MIT\",\nIF(OR(AI83=\"Nur EP        \",$K83=\"E\"),((AM83/(AVERAGE($AF83,$AM83,$AT83,$BA83,$BH83)))-1),\nIF($L$4=\"MIT\",((AI83/(AVERAGE($AB83,$AI83,$AP83,$AW83,$BD83)))-1),\nIF($L$4=\"MIN\",\nIF(OR(AI83=\"Nur EP        \",$K83=\"E\"),((AM83/(MIN($AF83,$AM83,$AT83,$BA83,$BH83)))-1),\nIF($L$4=\"MIN\",(AI83/(MIN($AB83,$AI83,$AP83,$AW83,$BD83)))-1)\n)))))))","v":0.21936351411922916},"",null,22.5,4387.5,null,"",-0.39489018377409235,"",null,null,"",null,"","","",null,null,"",null,"","",""]
[null,null,null,null,null,null,5,6,"Holzfaser Dämmplatten Ergänzung der Zwischensparrendämmung ","Alternativposition","A",195,"qm",null,"","","","Nur EP        ",null,{"$f":"IF(OR($K84=\"\",$K84=\"H\",$K84=\"AB\",$K84=\"G\",$K84=\"<-- Bitte Positionsart\"),\"\",IF(OR($K84=\"A\",$K84=\"B\"),$L84*(SUM(AA84,AH84,AO84,AV84,BC84)/COUNT(AA84,AH84,AO84,AV84,BC84)),IF($K84=\"E\",$L84*P84)))","v":8523.4500000000007},null,null,"Nur EP        ","","",null,43.71,"Nur EP        ",null,"",0,8523.4500000000007,null,43.71,"Nur EP        ",null,"",0,8523.4500000000007,null,null,"Nur EP        ",null,"","","",null,null,"Nur EP        ",null,"","","",null,null,"Nur EP        ",null,"","",""]
[null,null,null,null,null,null,5,7,"Einbau einer Unterdeckbahn als luftdichte Ebene der Dachflächen","Position","",219.15,"qm",null,8.9,17.563333333333333,22.73,3849.0045,null,"",null,null,"","","",null,21.06,{"$f":"IF(C85=\"Hinweis\",\"\",IF(OR($K85=\"A\",$K85=\"B\"),\"Nur EP        \",IF($K85=\"E\",\"E                \",IF(AND($L85<>\"\",AA85<>\"\"),$L85*AA85,\"\"))))","v":4615.299},null,{"$f":"IF(AC85=\"\",\"\",IF(AC85=\"X\",AB85,AB85*AC85))","v":""},0.19908901119757072,"",null,22.73,{"$f":"IF(J85=\"Hinweis\",\"\",IF(OR($K85=\"A\",$K85=\"B\"),\"Nur EP        \",IF($K85=\"E\",\"E                \",IF(AND($L85<>\"\",AH85<>\"\"),$L85*AH85,\"\"))))","v":4981.2795000000006},null,{"$f":"IF(AJ85=\"\",\"\",IF(AJ85=\"X\",AI85,AI85*AJ85))","v":""},0.2941734674511296,{"$f":"IF(J85=\"Hinweis\",\"\",IF($K85=\"\",\"\",IF(OR($K85=\"A\",$K85=\"B\"),$L85*AH85,IF($K85=\"E\",$L85*AH85))))","v":""},null,8.9,{"$f":"IF(P85=\"Hinweis\",\"\",IF(OR($K85=\"A\",$K85=\"B\"),\"Nur EP        \",IF($K85=\"E\",\"E                \",IF(AND($L85<>\"\",AO85<>\"\"),$L85*AO85,\"\"))))","v":1950.4350000000002},null,"",-0.49326247864869988,"",null,null,"",null,"","","",null,null,{"$f":"IF(AD85=\"Hinweis\",\"\",IF(OR($K85=\"A\",$K85=\"B\"),\"Nur EP        \",IF($K85=\"E\",\"E                \",IF(AND($L85<>\"\",BC85<>\"\"),$L85*BC85,\"\"))))","v":""},null,"","",""]
[null,null,null,null,null,null,5,8,"Einbau einer Unterdeckbahn als luftdichte Ebene - Gaubenwände","Position","",18,"qm",null,21.06,30.296666666666667,48.3,545.34,null,"",null,null,"","","",null,21.06,379.08,null,"",-0.30487402354494453,"",null,21.53,387.54,null,"",-0.28936076576080982,"",null,48.3,869.4,null,"",0.59423478930575402,"",null,null,"",null,"","","",null,null,"",null,"","",""]
[null,null,null,null,null,null,5,9,"Herstellung von luftdichten Anschlüssen an benachbarte Flächen und Durchdringungen","Position","",225,"m",null,4.8,10.06,12.88,2263.5,null,"",null,null,{"$f":"IF(OR($K87=\"A\",$K87=\"B\"),\"Nur EP        \",IF($K87=\"E\",\"E                \",IF(AND($L87<>\"\",V87<>\"\"),$L87*V87,\"\")))","v":""},"","",null,12.88,2898,null,"",0.28031809145129216,"",null,12.5,2812.5,null,"",0.24254473161033796,"",null,4.8,1080,null,"",-0.52286282306163023,"",null,null,"",null,"","","",null,null,"",null,"","",""]
[null,null,null,null,null,null,5,10,"Herstellen eines temporär bewitterungsfähigen Unterdachs mit Hozfaserplatten u.Konterlattung","Grundposition",{"$f":"IF(J88=\"Position\",\"\",IF(J88=\"Grundposition\",\"G\",IF(J88=\"Alternativposition\",\"A\",IF(J88=\"Bedarfsposition\",\"B\",IF(J88=\"Hinweis\",\"H\",IF(J88=\"Ausführungsbeschreibung\",\"AB\",IF(J88=\"Entfällt\",\"E\",IF(AND(I88<>\"\",L88<>\"\"),\"<-- Bitte Positionsart\",\"\"))))))))","v":"G"},200,"qm",null,{"$f":"IF(OR($K88=\"B\",$K88=\"A\",$K88=\"H\",$K88=\"AB\",$K88=\"<-- Bitte Positionsart\",SUM(AA88,AH88,AO88,AV88,BC88)=0),\"\",MIN(AA88,AH88,AO88,AV88,BC88))","v":35.549999999999997},{"$f":"IF(OR($K88=\"B\",$K88=\"A\",$K88=\"H\",$K88=\"AB\",$K88=\"<-- Bitte Positionsart\",SUM(AA88,AH88,AO88,AV88,BC88)=0),\"\",SUM(AA88,AH88,AO88,AV88,BC88)/COUNT(AA88,AH88,AO88,AV88,BC88))","v":38.566666666666663},{"$f":"IF(OR($K88=\"B\",$K88=\"A\",$K88=\"H\",$K88=\"AB\",$K88=\"<-- Bitte Positionsart\",SUM(AA88,AH88,AO88,AV88,BC88)=0),\"\",MAX(AA88,AH88,AO88,AV88,BC88))","v":44.5},{"$f":"IF(OR($K88=\"A\",$K88=\"B\"),\"Nur EP        \",IF($K88=\"E\",\"E                \",IF(AND($L88<>\"\",P88<>\"\"),$L88*P88,\"\")))","v":7713.3333333333321},null,"",null,null,{"$f":"IF(OR($K88=\"A\",$K88=\"B\"),\"Nur EP        \",IF($K88=\"E\",\"E                \",IF(AND($L88<>\"\",V88<>\"\"),$L88*V88,\"\")))","v":""},"","",null,35.549999999999997,{"$f":"IF(C88=\"Hinweis\",\"\",IF(OR($K88=\"A\",$K88=\"B\"),\"Nur EP        \",IF($K88=\"E\",\"E                \",IF(AND($L88<>\"\",AA88<>\"\"),$L88*AA88,\"\"))))","v":7109.9999999999991},null,{"$f":"IF(AC88=\"\",\"\",IF(AC88=\"X\",AB88,AB88*AC88))","v":""},-7.8219533275713182E-2,{"$f":"IF(OR($K88=\"\",$K88=\"H\",$K88=\"AB\",$K88=\"G\",$J88=\"Position\",$K88=\"<-- Bitte Positionsart\",AA88=\"\",$L88=\"\"),\"\",\nIF(OR($K88=\"A\",$K88=\"B\",$K88=\"E\"),$L88*AA88))","v":""},null,35.65,{"$f":"IF(J88=\"Hinweis\",\"\",IF(OR($K88=\"A\",$K88=\"B\"),\"Nur EP        \",IF($K88=\"E\",\"E                \",IF(AND($L88<>\"\",AH88<>\"\"),$L88*AH88,\"\"))))","v":7130},null,{"$f":"IF(AJ88=\"\",\"\",IF(AJ88=\"X\",AI88,AI88*AJ88))","v":""},-7.5626620570440783E-2,{"$f":"IF(OR($K88=\"\",$K88=\"H\",$K88=\"AB\",$K88=\"G\",$J88=\"Position\",$K88=\"<-- Bitte Positionsart\",AH88=\"\",$L88=\"\"),\"\",\nIF(OR($K88=\"A\",$K88=\"B\",$K88=\"E\"),$L88*AH88))","v":""},null,44.5,{"$f":"IF(P88=\"Hinweis\",\"\",IF(OR($K88=\"A\",$K88=\"B\"),\"Nur EP        \",IF($K88=\"E\",\"E                \",IF(AND($L88<>\"\",AO88<>\"\"),$L88*AO88,\"\"))))","v":8900},null,{"$f":"IF(AQ88=\"\",\"\",IF(AQ88=\"X\",AP88,AP88*AQ88))","v":""},0.15384615384615397,"",null,null,"",null,"","","",null,null,{"$f":"IF(AD88=\"Hinweis\",\"\",IF(OR($K88=\"A\",$K88=\"B\"),\"Nur EP        \",IF($K88=\"E\",\"E                \",IF(AND($L88<>\"\",BC88<>\"\"),$L88*BC88,\"\"))))","v":""},null,{"$f":"IF(BE88=\"\",\"\",IF(BE88=\"X\",BD88,BD88*BE88))","v":""},"",""]
[null,null,null,null,null,null,5,11,"Herstellen eines temporär bewitterungsfähigen Unterdachs mit Hozfaserplatten u.Konterlattung","Alternativposition","A",200,"qm",null,"","","","Nur EP        ",null,7109.9999999999991,null,null,"Nur EP        ","","",null,35.549999999999997,"Nur EP        ",null,"",0,7109.9999999999991,null,35.549999999999997,"Nur EP        ",null,"",0,{"$f":"IF(J89=\"Hinweis\",\"\",IF($K89=\"\",\"\",IF(OR($K89=\"A\",$K89=\"B\"),$L89*AH89,IF($K89=\"E\",$L89*AH89))))","v":7109.9999999999991},null,null,"Nur EP        ",null,"","","",null,null,"Nur EP        ",null,"",{"$f":"IF(OR($L89=\"\",AV89=\"\",$J89=\"Ausführungsbeschreibung\",$J89=\"Hinweis\"),\"\",\nIF(AND($AA89,$AH89,$AO89,$AV89,$BC89)=\"\",\"\",\nIF($L$4=\"MIT\",\nIF(OR(AW89=\"Nur EP        \",$K89=\"E\"),((BA89/(AVERAGE($AF89,$AM89,$AT89,$BA89,$BH89)))-1),\nIF($L$4=\"MIT\",((AW89/(AVERAGE($AB89,$AI89,$AP89,$AW89,$BD89)))-1),\nIF($L$4=\"MIN\",\nIF(OR(AW89=\"Nur EP        \",$K89=\"E\"),((BA89/(MIN($AF89,$AM89,$AT89,$BA89,$BH89)))-1),\nIF($L$4=\"MIN\",(AW89/(MIN($AB89,$AI89,$AP89,$AW89,$BD89)))-1)\n)))))))","v":""},{"$f":"IF(OR($K89=\"\",$K89=\"H\",$K89=\"AB\",$K89=\"G\",$J89=\"Position\",$K89=\"<-- Bitte Positionsart\",AV89=\"\",$L89=\"\"),\"\",\nIF(OR($K89=\"A\",$K89=\"B\",$K89=\"E\"),$L89*AV89))","v":""},null,null,"Nur EP        ",null,"","",""]
[null,null,null,null,null,null,5,12,"Herstellen eines Wasserdichten Anschluss der Unterdeckplatte an das Traufblech","Position","",61,"m",null,9.5,21.47666666666667,27.55,1310.0766666666668,null,"",null,null,"","","",null,27.38,1670.1799999999998,null,"",0.27487195405866816,"",null,27.55,1680.55,null,"",0.28278752134099028,"",null,9.5,579.5,null,"",-0.55765947539965854,"",null,null,{"$f":"IF(W90=\"Hinweis\",\"\",IF(OR($K90=\"A\",$K90=\"B\"),\"Nur EP        \",IF($K90=\"E\",\"E                \",IF(AND($L90<>\"\",AV90<>\"\"),$L90*AV90,\"\"))))","v":""},null,{"$f":"IF(AX90=\"\",\"\",IF(AX90=\"X\",AW90,AW90*AX90))","v":""},{"$f":"IF(OR($L90=\"\",AV90=\"\",$J90=\"Ausführungsbeschreibung\",$J90=\"Hinweis\"),\"\",\nIF(AND($AA90,$AH90,$AO90,$AV90,$BC90)=\"\",\"\",\nIF($L$4=\"MIT\",\nIF(OR(AW90=\"Nur EP        \",$K90=\"E\"),((BA90/(AVERAGE($AF90,$AM90,$AT90,$BA90,$BH90)))-1),\nIF($L$4=\"MIT\",((AW90/(AVERAGE($AB90,$AI90,$AP90,$AW90,$BD90)))-1),\nIF($L$4=\"MIN\",\nIF(OR(AW90=\"Nur EP        \",$K90=\"E\"),((BA90/(MIN($AF90,$AM90,$AT90,$BA90,$BH90)))-1),\nIF($L$4=\"MIN\",(AW90/(MIN($AB90,$AI90,$AP90,$AW90,$BD90)))-1)\n)))))))","v":""},{"$f":"IF(OR($K90=\"\",$K90=\"H\",$K90=\"AB\",$K90=\"G\",$J90=\"Position\",$K90=\"<-- Bitte Positionsart\",AV90=\"\",$L90=\"\"),\"\",\nIF(OR($K90=\"A\",$K90=\"B\",$K90=\"E\"),$L90*AV90))","v":""},null,null,"",null,"","",""]
[null,null,null,null,null,null,5,13,"Herstellen von Anschlüssen an Durchdringungen u.Flächenabschlüssen der Unterdeckplatten","Position","",224.5,"m",null,4.5999999999999996,10.196666666666667,13.11,2289.1516666666666,null,"",null,null,"","","",null,12.88,2891.5600000000004,null,"",0.26315789473684226,"",null,13.11,2943.1949999999997,null,"",0.28571428571428559,"",null,4.5999999999999996,1032.6999999999998,null,"",-0.54887218045112784,"",null,null,"",null,"","","",null,null,"",null,"","",""]
[null,null,null,null,null,null,5,14,"Lieferung und Einbau einer Traufbohle /Erweiterung des Traufgesims","Position","",61,"m",null,54,80.056666666666672,93.91,4883.4566666666669,null,"",null,null,"","","",null,92.26,5627.8600000000006,null,"",0.15243369280093266,"",null,93.91,5728.51,null,"",0.1730440937669151,"",null,54,3294,null,"",-0.32547778656784776,"",null,null,"",null,"","","",null,null,"",null,"","",""]
[null,null,null,null,null,null,5,15,"Lieferung und Einbau eines oberen Steildachbschluss im  Übergang zum Flachdachbereich","Position","",63,"m",null,65,83.946666666666673,94.58,5288.64,null,"",null,null,"","","",null,92.26,5812.38,null,"",9.9031130876747087E-2,"",null,94.58,5958.54,null,"",0.12666772554002526,"",null,65,4095,null,"",-0.22569885641677256,"",null,null,"",null,"","","",null,null,"",null,"","",""]
[null,null,null,null,null,null,5,16,"Holz UK am Übergang Gaubendach - Steildach","Position","",25.75,"qm",null,38.5,89.174333333333337,115.133,2296.2390833333334,null,"",null,null,"","","",null,113.89,2932.6675,null,"",0.27716121604497546,"",null,115.133,2964.6747499999997,null,"",{"$f":"IF(OR($L94=\"\",AH94=\"\",$J94=\"Ausführungsbeschreibung\",$J94=\"Hinweis\"),\"\",\nIF(AND($AA94,$AH94,$AO94,$AV94,$BC94)=\"\",\"\",\nIF($L$4=\"MIT\",\nIF(OR(AI94=\"Nur EP        \",$K94=\"E\"),((AM94/(AVERAGE($AF94,$AM94,$AT94,$BA94,$BH94)))-1),\nIF($L$4=\"MIT\",((AI94/(AVERAGE($AB94,$AI94,$AP94,$AW94,$BD94)))-1),\nIF($L$4=\"MIN\",\nIF(OR(AI94=\"Nur EP        \",$K94=\"E\"),((AM94/(MIN($AF94,$AM94,$AT94,$BA94,$BH94)))-1),\nIF($L$4=\"MIN\",(AI94/(MIN($AB94,$AI94,$AP94,$AW94,$BD94)))-1)\n)))))))","v":0.29110020446840057},"",null,38.5,991.375,null,"",-0.56826142051337647,"",null,null,"",null,"","","",null,null,"",null,"","",""]
[null,null,null,null,null,null,5,17,"Holz UK der Gaubenfronten und Gaubenseiten -  Balkon Gauben","Position","",3,"pausch.",null,1160,3324.75,4443,9974.25,null,"",null,null,"","","",null,4371.25,13113.75,null,"",0.31476050830889535,"",null,4443,13329,null,"",0.33634107827656212,"",null,1160,3480,null,"",-0.65110158658545747,"",null,null,"",null,"","","",null,null,"",null,"","",""]
[null,null,null,null,null,null,5,18,"Holz UK der Gaubenfronten und Gaubenseiten - Erker Gauben","Position","",3,"pausch.",null,1320,4085.6699999999996,5514.44,12257.009999999998,null,"",null,null,"","","",null,5422.57,16267.71,null,"",0.32721683346917385,"",null,5514.44,16543.32,null,"",0.34970274153321235,"",null,1320,3960,null,"",-0.67691957500238642,"",null,null,"",null,"","","",null,null,"",null,"","",""]
[null,null,null,null,null,null,5,19,"Holz UK der Gaubenseitenwände","Position","",15.6,"qm",null,183,572.77666666666664,776.13,8935.3159999999989,null,"",null,null,"","","",null,759.2,11843.52,null,"",0.32547298830841576,"",null,776.13,12107.627999999999,null,"",0.35503075660670502,"",null,183,2854.7999999999997,null,"",-0.68050374491512111,"",null,null,"",null,"","","",null,null,"",null,"","",""]
[null,null,null,null,null,null,5,20,"Lieferung und Einbau einer UK für die Fensterbank vor den seitlichen Erkerfenstern","Position","",6,"Stck.",null,276.77999999999997,337.58333333333331,455,2025.5,null,"",null,null,"","","",null,276.77999999999997,1660.6799999999998,null,"",-0.18011355220933112,"",null,280.97000000000003,1685.8200000000002,null,"",-0.16770180202419149,"",null,455,2730,null,"",0.3478153542335225,"",null,null,"",null,"","","",null,null,"",null,"","",""]
[null,null,null,null,null,null,5,21,"Anschlüsse an Durchdringungen von Strangentlüftungen","Position","",3,"Stck.",null,26.92,32.993333333333332,45,98.97999999999999,null,"",null,null,"","","",null,26.92,80.760000000000005,null,"",-0.1840775914326126,"",null,27.06,81.179999999999993,null,"",-0.17983430996160854,"",null,45,135,null,"",0.36391190139422092,"",null,null,"",null,"","","",null,null,"",null,"","",""]
[null,null,null,null,null,null,5,22,"Dämmung des Drempelmauerwerk und Ringanker","Position","",55.68,"m",null,36.6,38.023333333333333,39.049999999999997,2117.1392000000001,null,"",null,null,"","","",null,38.42,2139.2256000000002,null,"",1.0432190760059745E-2,"",null,39.049999999999997,2174.3039999999996,null,"",2.7000964320154086E-2,"",null,36.6,2037.8880000000001,null,"",-3.7433155080213831E-2,"",null,null,"",null,"","","",null,null,"",null,"","",""]
[null,null,null,null,null,null,5,23,null,null,"",null,null,null,"","","","",null,"",null,null,"","","",null,null,"",null,"","","",null,null,"",null,"","","",null,null,"",null,"","","",null,null,"",null,"","","",null,null,"",null,"","",""]
[null,null,null,null,null,null,5,24,null,null,"",null,null,null,"","","","",null,"",null,null,"","","",null,null,"",null,{"$f":"IF(AC102=\"\",\"\",IF(AC102=\"X\",AB102,AB102*AC102))","v":""},"","",null,null,"",null,{"$f":"IF(AJ102=\"\",\"\",IF(AJ102=\"X\",AI102,AI102*AJ102))","v":""},"","",null,null,"",null,{"$f":"IF(AQ102=\"\",\"\",IF(AQ102=\"X\",AP102,AP102*AQ102))","v":""},"","",null,null,"",null,"","","",null,null,"",null,"","",""]
[null,null,null,null,null,null,5,25,null,null,"",null,null,null,"","","","",null,"",null,null,"","","",null,null,"",null,"","","",null,null,"",null,"","","",null,null,"",null,"","","",null,null,"",null,"","","",null,null,"",null,"","",""]
[null,null,null,null,null,null,null,null,null,null,null,null,null,null,null,null,null,null,null,null,null,null,{"$f":"IF(OR($K104=\"A\",$K104=\"B\"),\"Nur EP        \",IF($K104=\"E\",\"\",IF(AND($L104<>\"\",V104<>\"\"),$L104*V104,\"\")))","v":""},null,{"$f":"IF($K104=\"Ja\",IF(AND($L104<>\"\",V104<>\"\"),$L104*V104),\"\")","v":""},null,"EP / % Titel","Positions- / Titelsumme",null,"",null,{"$f":"IF($K104=\"Ja\",IF(AND($L104<>\"\",AA104<>\"\"),$L104*AA104),\"\")","v":""},null,"EP / % Titel","Positions- / Titelsumme",null,"",null,{"$f":"IF($K104=\"Ja\",IF(AND($L104<>\"\",AH104<>\"\"),$L104*AH104),\"\")","v":""},null,"EP / % Titel","Positions- / Titelsumme",null,"",null,{"$f":"IF($K104=\"Ja\",IF(AND($L104<>\"\",AO104<>\"\"),$L104*AO104),\"\")","v":""},null,"EP / % Titel","Positions- / Titelsumme",null,{"$f":"IF(AX104=\"\",\"\",IF(AX104=\"X\",AW104,AW104*AX104))","v":""},null,{"$f":"IF($K104=\"Ja\",IF(AND($L104<>\"\",AV104<>\"\"),$L104*AV104),\"\")","v":""},null,"EP / % Titel","Positions- / Titelsumme",null,"",null,{"$f":"IF($K104=\"Ja\",IF(AND($L104<>\"\",BC104<>\"\"),$L104*BC104),\"\")","v":""}]
[null,null,null,null,null,null,6,null,"Dachdeckerarbeiten",null,null,null,null,null,{"$f":"CONCATENATE(\"Titelsumme\",CHAR(10),\"MIN\",CHAR(10),TEXT(SUMPRODUCT($L106:$L147,O106:O147),\"##.##0,00\"),\" €\")","v":"Titelsumme\nMIN\n47.394,18 €"},{"$f":"CONCATENATE(\"Titelsumme\",CHAR(10),\"MIT\",CHAR(10),TEXT(SUMPRODUCT($L106:$L147,P106:P147),\"##.##0,00\"),\" €\")","v":"Titelsumme\nMIT\n67.958,89 €"},{"$f":"CONCATENATE(\"Titelsumme\",CHAR(10),\"MAX\",CHAR(10),TEXT(SUMPRODUCT($L106:$L147,Q106:Q147),\"##.##0,00\"),\" €\")","v":"Titelsumme\nMAX\n79.674,40 €"},{"$f":"SUM(R106:R147)","v":67958.89433333333},null,{"$f":"SUM(T106:T147)","v":30904.686666666665},null,null,{"$f":"SUM(W106:W147)","v":0},null,{"$f":"SUM(Y106:Y147)","v":0},null,{"$f":"IF(AB105=0,\"\",\nIF($L$4=\"MIT\",((AB105/(AVERAGE($AB105,$AI105,$AP105,$AW105,$BD105)))-1)*100,))","v":87.732941976498637},{"$f":"SUM(AB106:AB147)","v":76548.739000000016},null,"",null,{"$f":"SUM(AF106:AF147)","v":33627.380000000005},null,{"$f":"IF(AI105=0,\"\",\nIF($L$4=\"MIT\",((AI105/(AVERAGE($AB105,$AI105,$AP105,$AW105,$BD105)))-1)*100,))","v":90.909187982031312},{"$f":"SUM(AI106:AI147)","v":77843.864000000016},null,"",null,{"$f":"SUM(AM106:AM147)","v":33650.18},null,{"$f":"IF(AP105=0,\"\",\nIF($L$4=\"MIT\",((AP105/(AVERAGE($AB105,$AI105,$AP105,$AW105,$BD105)))-1)*100,))","v":21.357870041470093},{"$f":"SUM(AP106:AP147)","v":49484.079999999994},null,"",null,{"$f":"SUM(AT106:AT147)","v":25436.5},null,{"$f":"IF(AW105=0,\"\",\nIF($L$4=\"MIT\",((AW105/(AVERAGE($AB105,$AI105,$AP105,$AW105,$BD105)))-1)*100,))","v":""},{"$f":"SUM(AW106:AW147)","v":0},null,"",null,{"$f":"SUM(BA106:BA147)","v":0},null,{"$f":"IF(BD105=0,\"\",\nIF($L$4=\"MIT\",((BD105/(AVERAGE($AB105,$AI105,$AP105,$AW105,$BD105)))-1)*100,))","v":""},{"$f":"SUM(BD106:BD147)","v":0},null,"",null,{"$f":"SUM(BH106:BH147)","v":0}]
[null,null,null,null,null,null,{"$f":"G$105","v":6},{"$f":"IF(G$162=\"\",\"\",ROW()-ROW(G$105))","v":1},"Ausführungshinweise /Materialhinweise","Ausführungsbeschreibung",{"$f":"IF(J106=\"Position\",\"\",IF(J106=\"Grundposition\",\"G\",IF(J106=\"Alternativposition\",\"A\",IF(J106=\"Bedarfsposition\",\"B\",IF(J106=\"Hinweis\",\"H\",IF(J106=\"Ausführungsbeschreibung\",\"AB\",IF(J106=\"Entfällt\",\"E\",IF(AND(I106<>\"\",L106<>\"\"),\"<-- Bitte Positionsart\",\"\"))))))))","v":"AB"},null,null,null,{"$f":"IF(OR($K106=\"B\",$K106=\"A\",$K106=\"H\",$K106=\"AB\",$K106=\"<-- Bitte Positionsart\",SUM(AA106,AH106,AO106,AV106,BC106)=0),\"\",MIN(AA106,AH106,AO106,AV106,BC106))","v":""},{"$f":"IF(OR($K106=\"B\",$K106=\"A\",$K106=\"H\",$K106=\"AB\",$K106=\"<-- Bitte Positionsart\",SUM(AA106,AH106,AO106,AV106,BC106)=0),\"\",SUM(AA106,AH106,AO106,AV106,BC106)/COUNT(AA106,AH106,AO106,AV106,BC106))","v":""},{"$f":"IF(OR($K106=\"B\",$K106=\"A\",$K106=\"H\",$K106=\"AB\",$K106=\"<-- Bitte Positionsart\",SUM(AA106,AH106,AO106,AV106,BC106)=0),\"\",MAX(AA106,AH106,AO106,AV106,BC106))","v":""},{"$f":"IF(OR($K106=\"A\",$K106=\"B\"),\"Nur EP        \",IF($K106=\"E\",\"E                \",IF(AND($L106<>\"\",P106<>\"\"),$L106*P106,\"\")))","v":""},null,{"$f":"IF(OR($K106=\"\",$K106=\"H\",$K106=\"AB\",$K106=\"G\",$K106=\"<-- Bitte Positionsart\"),\"\",IF(OR($K106=\"A\",$K106=\"B\"),$L106*(SUM(AA106,AH106,AO106,AV106,BC106)/COUNT(AA106,AH106,AO106,AV106,BC106)),IF($K106=\"E\",$L106*P106)))","v":""},null,null,{"$f":"IF(OR($K106=\"A\",$K106=\"B\"),\"Nur EP        \",IF($K106=\"E\",\"E                \",IF(AND($L106<>\"\",V106<>\"\"),$L106*V106,\"\")))","v":""},{"$f":"IF(OR($L106=\"\",W106=\"\"),\"\",\nIF(OR($W106=\"Nur EP        \",$K106=\"E\"),(Y106/(AVERAGE($Y106,$AF106,$AM106,$AT106,Y106))-1),\nIF(AND($W106,$AB106,$AI106,$AP106,$AW106)=\"\",\"\",(W106/(AVERAGE($W106,$AB106,$AI106,$AP106,$AW106)))-1)))","v":""},{"$f":"IF(OR($K106=\"\",$K106=\"H\",$K106=\"AB\",$K106=\"G\",$J106=\"Position\",$K106=\"<-- Bitte Positionsart\",V106=\"\",$L106=\"\"),\"\",\nIF(OR($K106=\"A\",$K106=\"B\",$K106=\"E\"),$L106*V106))","v":""},null,null,{"$f":"IF(C106=\"Hinweis\",\"\",IF(OR($K106=\"A\",$K106=\"B\"),\"Nur EP        \",IF($K106=\"E\",\"E                \",IF(AND($L106<>\"\",AA106<>\"\"),$L106*AA106,\"\"))))","v":""},null,{"$f":"IF(AC106=\"\",\"\",IF(AC106=\"X\",AB106,AB106*AC106))","v":""},{"$f":"IF(OR($L106=\"\",AA106=\"\",$J106=\"Ausführungsbeschreibung\",$J106=\"Hinweis\"),\"\",\nIF(AND($AA106,$AH106,$AO106,$AV106,$BC106)=\"\",\"\",\nIF($L$4=\"MIT\",\nIF(OR(AB106=\"Nur EP        \",$K106=\"E\"),((AF106/(AVERAGE($AF106,$AM106,$AT106,$BA106,$BH106)))-1),\nIF($L$4=\"MIT\",((AB106/(AVERAGE($AB106,$AI106,$AP106,$AW106,$BD106)))-1),\nIF($L$4=\"MIN\",\nIF(OR(AB106=\"Nur EP        \",$K106=\"E\"),((AF106/(MIN($AF106,$AM106,$AT106,$BA106,$BH106)))-1),\nIF($L$4=\"MIN\",((AB106/(MIN($AB106,$AI106,$AP106,$AW106,$BD106)))-1))\n)))))))","v":""},{"$f":"IF(OR($K106=\"\",$K106=\"H\",$K106=\"AB\",$K106=\"G\",$J106=\"Position\",$K106=\"<-- Bitte Positionsart\",AA106=\"\",$L106=\"\"),\"\",\nIF(OR($K106=\"A\",$K106=\"B\",$K106=\"E\"),$L106*AA106))","v":""},null,null,{"$f":"IF(J106=\"Hinweis\",\"\",IF(OR($K106=\"A\",$K106=\"B\"),\"Nur EP        \",IF($K106=\"E\",\"E                \",IF(AND($L106<>\"\",AH106<>\"\"),$L106*AH106,\"\"))))","v":""},null,{"$f":"IF(AJ106=\"\",\"\",IF(AJ106=\"X\",AI106,AI106*AJ106))","v":""},{"$f":"IF(OR($L106=\"\",AH106=\"\",$J106=\"Ausführungsbeschreibung\",$J106=\"Hinweis\"),\"\",\nIF(AND($AA106,$AH106,$AO106,$AV106,$BC106)=\"\",\"\",\nIF($L$4=\"MIT\",\nIF(OR(AI106=\"Nur EP        \",$K106=\"E\"),((AM106/(AVERAGE($AF106,$AM106,$AT106,$BA106,$BH106)))-1),\nIF($L$4=\"MIT\",((AI106/(AVERAGE($AB106,$AI106,$AP106,$AW106,$BD106)))-1),\nIF($L$4=\"MIN\",\nIF(OR(AI106=\"Nur EP        \",$K106=\"E\"),((AM106/(MIN($AF106,$AM106,$AT106,$BA106,$BH106)))-1),\nIF($L$4=\"MIN\",(AI106/(MIN($AB106,$AI106,$AP106,$AW106,$BD106)))-1)\n)))))))","v":""},{"$f":"IF(OR($K106=\"\",$K106=\"H\",$K106=\"AB\",$K106=\"G\",$J106=\"Position\",$K106=\"<-- Bitte Positionsart\",AH106=\"\",$L106=\"\"),\"\",\nIF(OR($K106=\"A\",$K106=\"B\",$K106=\"E\"),$L106*AH106))","v":""},null,null,{"$f":"IF(P106=\"Hinweis\",\"\",IF(OR($K106=\"A\",$K106=\"B\"),\"Nur EP        \",IF($K106=\"E\",\"E                \",IF(AND($L106<>\"\",AO106<>\"\"),$L106*AO106,\"\"))))","v":""},null,"",{"$f":"IF(OR($L106=\"\",AO106=\"\",$J106=\"Ausführungsbeschreibung\",$J106=\"Hinweis\"),\"\",\nIF(AND($AA106,$AH106,$AO106,$AV106,$BC106)=\"\",\"\",\nIF($L$4=\"MIT\",\nIF(OR(AP106=\"Nur EP        \",$K106=\"E\"),((AT106/(AVERAGE($AF106,$AM106,$AT106,$BA106,$BH106)))-1),\nIF($L$4=\"MIT\",((AP106/(AVERAGE($AB106,$AI106,$AP106,$AW106,$BD106)))-1),\nIF($L$4=\"MIN\",\nIF(OR(AP106=\"Nur EP        \",$K106=\"E\"),((AT106/(MIN($AF106,$AM106,$AT106,$BA106,$BH106)))-1),\nIF($L$4=\"MIN\",(AP106/(MIN($AB106,$AI106,$AP106,$AW106,$BD106)))-1)\n)))))))","v":""},{"$f":"IF(OR($K106=\"\",$K106=\"H\",$K106=\"AB\",$K106=\"G\",$J106=\"Position\",$K106=\"<-- Bitte Positionsart\",AO106=\"\",$L106=\"\"),\"\",\nIF(OR($K106=\"A\",$K106=\"B\",$K106=\"E\"),$L106*AO106))","v":""},null,null,{"$f":"IF(W106=\"Hinweis\",\"\",IF(OR($K106=\"A\",$K106=\"B\"),\"Nur EP        \",IF($K106=\"E\",\"E                \",IF(AND($L106<>\"\",AV106<>\"\"),$L106*AV106,\"\"))))","v":""},null,{"$f":"IF(AX106=\"\",\"\",IF(AX106=\"X\",AW106,AW106*AX106))","v":""},{"$f":"IF(OR($L106=\"\",AV106=\"\",$J106=\"Ausführungsbeschreibung\",$J106=\"Hinweis\"),\"\",\nIF(AND($AA106,$AH106,$AO106,$AV106,$BC106)=\"\",\"\",\nIF($L$4=\"MIT\",\nIF(OR(AW106=\"Nur EP        \",$K106=\"E\"),((BA106/(AVERAGE($AF106,$AM106,$AT106,$BA106,$BH106)))-1),\nIF($L$4=\"MIT\",((AW106/(AVERAGE($AB106,$AI106,$AP106,$AW106,$BD106)))-1),\nIF($L$4=\"MIN\",\nIF(OR(AW106=\"Nur EP        \",$K106=\"E\"),((BA106/(MIN($AF106,$AM106,$AT106,$BA106,$BH106)))-1),\nIF($L$4=\"MIN\",(AW106/(MIN($AB106,$AI106,$AP106,$AW106,$BD106)))-1)\n)))))))","v":""},{"$f":"IF(OR($K106=\"\",$K106=\"H\",$K106=\"AB\",$K106=\"G\",$J106=\"Position\",$K106=\"<-- Bitte Positionsart\",AV106=\"\",$L106=\"\"),\"\",\nIF(OR($K106=\"A\",$K106=\"B\",$K106=\"E\"),$L106*AV106))","v":""},null,null,{"$f":"IF(AD106=\"Hinweis\",\"\",IF(OR($K106=\"A\",$K106=\"B\"),\"Nur EP        \",IF($K106=\"E\",\"E                \",IF(AND($L106<>\"\",BC106<>\"\"),$L106*BC106,\"\"))))","v":""},null,{"$f":"IF(BE106=\"\",\"\",IF(BE106=\"X\",BD106,BD106*BE106))","v":""},{"$f":"IF(OR($L106=\"\",BC106=\"\",$J106=\"Ausführungsbeschreibung\",$J106=\"Hinweis\"),\"\",\nIF(AND($AA106,$AH106,$AO106,$AV106,$BC106)=\"\",\"\",\nIF($L$4=\"MIT\",\nIF(OR(BD106=\"Nur EP        \",$K106=\"E\"),((BH106/(AVERAGE($AF106,$AM106,$AT106,$BA106,$BH106)))-1),\nIF($L$4=\"MIT\",((BD106/(AVERAGE($AB106,$AI106,$AP106,$AW106,$BD106)))-1),\nIF($L$4=\"MIN\",\nIF(OR(BD106=\"Nur EP        \",$K106=\"E\"),((BH106/(MIN($AF106,$AM106,$AT106,$BA106,$BH106)))-1),\nIF($L$4=\"MIN\",((BD106/(MIN($AB106,$AI106,$AP106,$AW106,$BD106)))-1))\n)))))))","v":""},{"$f":"IF(OR($K106=\"\",$K106=\"H\",$K106=\"AB\",$K106=\"G\",$J106=\"Position\",$K106=\"<-- Bitte Positionsart\",BC106=\"\",$L106=\"\"),\"\",\nIF(OR($K106=\"A\",$K106=\"B\",$K106=\"E\"),$L106*BC106))","v":""}]
[null,null,null,null,null,null,{"$f":"G$105","v":6},{"$f":"IF(G$162=\"\",\"\",ROW()-ROW(G$105))","v":2},"Pfanneneindeckung aus Dachziegeln","Grundposition",{"$f":"IF(J107=\"Position\",\"\",IF(J107=\"Grundposition\",\"G\",IF(J107=\"Alternativposition\",\"A\",IF(J107=\"Bedarfsposition\",\"B\",IF(J107=\"Hinweis\",\"H\",IF(J107=\"Ausführungsbeschreibung\",\"AB\",IF(J107=\"Entfällt\",\"E\",IF(AND(I107<>\"\",L107<>\"\"),\"<-- Bitte Positionsart\",\"\"))))))))","v":"G"},200,"qm",null,{"$f":"IF(OR($K107=\"B\",$K107=\"A\",$K107=\"H\",$K107=\"AB\",$K107=\"<-- Bitte Positionsart\",SUM(AA107,AH107,AO107,AV107,BC107)=0),\"\",MIN(AA107,AH107,AO107,AV107,BC107))","v":32.5},{"$f":"IF(OR($K107=\"B\",$K107=\"A\",$K107=\"H\",$K107=\"AB\",$K107=\"<-- Bitte Positionsart\",SUM(AA107,AH107,AO107,AV107,BC107)=0),\"\",SUM(AA107,AH107,AO107,AV107,BC107)/COUNT(AA107,AH107,AO107,AV107,BC107))","v":37.686666666666667},{"$f":"IF(OR($K107=\"B\",$K107=\"A\",$K107=\"H\",$K107=\"AB\",$K107=\"<-- Bitte Positionsart\",SUM(AA107,AH107,AO107,AV107,BC107)=0),\"\",MAX(AA107,AH107,AO107,AV107,BC107))","v":40.409999999999997},{"$f":"IF(OR($K107=\"A\",$K107=\"B\"),\"Nur EP        \",IF($K107=\"E\",\"E                \",IF(AND($L107<>\"\",P107<>\"\"),$L107*P107,\"\")))","v":7537.3333333333339},null,{"$f":"IF(OR($K107=\"\",$K107=\"H\",$K107=\"AB\",$K107=\"G\",$K107=\"<-- Bitte Positionsart\"),\"\",IF(OR($K107=\"A\",$K107=\"B\"),$L107*(SUM(AA107,AH107,AO107,AV107,BC107)/COUNT(AA107,AH107,AO107,AV107,BC107)),IF($K107=\"E\",$L107*P107)))","v":""},null,null,{"$f":"IF(OR($K107=\"A\",$K107=\"B\"),\"Nur EP        \",IF($K107=\"E\",\"E                \",IF(AND($L107<>\"\",V107<>\"\"),$L107*V107,\"\")))","v":""},{"$f":"IF(OR($L107=\"\",W107=\"\"),\"\",\nIF(OR($W107=\"Nur EP        \",$K107=\"E\"),(Y107/(AVERAGE($Y107,$AF107,$AM107,$AT107,Y107))-1),\nIF(AND($W107,$AB107,$AI107,$AP107,$AW107)=\"\",\"\",(W107/(AVERAGE($W107,$AB107,$AI107,$AP107,$AW107)))-1)))","v":""},{"$f":"IF(OR($K107=\"\",$K107=\"H\",$K107=\"AB\",$K107=\"G\",$J107=\"Position\",$K107=\"<-- Bitte Positionsart\",V107=\"\",$L107=\"\"),\"\",\nIF(OR($K107=\"A\",$K107=\"B\",$K107=\"E\"),$L107*V107))","v":""},null,40.15,{"$f":"IF(C107=\"Hinweis\",\"\",IF(OR($K107=\"A\",$K107=\"B\"),\"Nur EP        \",IF($K107=\"E\",\"E                \",IF(AND($L107<>\"\",AA107<>\"\"),$L107*AA107,\"\"))))","v":8030},null,{"$f":"IF(AC107=\"\",\"\",IF(AC107=\"X\",AB107,AB107*AC107))","v":""},6.5363523792676403E-2,{"$f":"IF(OR($K107=\"\",$K107=\"H\",$K107=\"AB\",$K107=\"G\",$J107=\"Position\",$K107=\"<-- Bitte Positionsart\",AA107=\"\",$L107=\"\"),\"\",\nIF(OR($K107=\"A\",$K107=\"B\",$K107=\"E\"),$L107*AA107))","v":""},null,40.409999999999997,{"$f":"IF(J107=\"Hinweis\",\"\",IF(OR($K107=\"A\",$K107=\"B\"),\"Nur EP        \",IF($K107=\"E\",\"E                \",IF(AND($L107<>\"\",AH107<>\"\"),$L107*AH107,\"\"))))","v":8081.9999999999991},null,{"$f":"IF(AJ107=\"\",\"\",IF(AJ107=\"X\",AI107,AI107*AJ107))","v":""},{"$f":"IF(OR($L107=\"\",AH107=\"\",$J107=\"Ausführungsbeschreibung\",$J107=\"Hinweis\"),\"\",\nIF(AND($AA107,$AH107,$AO107,$AV107,$BC107)=\"\",\"\",\nIF($L$4=\"MIT\",\nIF(OR(AI107=\"Nur EP        \",$K107=\"E\"),((AM107/(AVERAGE($AF107,$AM107,$AT107,$BA107,$BH107)))-1),\nIF($L$4=\"MIT\",((AI107/(AVERAGE($AB107,$AI107,$AP107,$AW107,$BD107)))-1),\nIF($L$4=\"MIN\",\nIF(OR(AI107=\"Nur EP        \",$K107=\"E\"),((AM107/(MIN($AF107,$AM107,$AT107,$BA107,$BH107)))-1),\nIF($L$4=\"MIN\",(AI107/(MIN($AB107,$AI107,$AP107,$AW107,$BD107)))-1)\n)))))))","v":7.2262515478506817E-2},{"$f":"IF(OR($K107=\"\",$K107=\"H\",$K107=\"AB\",$K107=\"G\",$J107=\"Position\",$K107=\"<-- Bitte Positionsart\",AH107=\"\",$L107=\"\"),\"\",\nIF(OR($K107=\"A\",$K107=\"B\",$K107=\"E\"),$L107*AH107))","v":""},null,32.5,{"$f":"IF(P107=\"Hinweis\",\"\",IF(OR($K107=\"A\",$K107=\"B\"),\"Nur EP        \",IF($K107=\"E\",\"E                \",IF(AND($L107<>\"\",AO107<>\"\"),$L107*AO107,\"\"))))","v":6500},null,{"$f":"IF(AQ107=\"\",\"\",IF(AQ107=\"X\",AP107,AP107*AQ107))","v":""},{"$f":"IF(OR($L107=\"\",AO107=\"\",$J107=\"Ausführungsbeschreibung\",$J107=\"Hinweis\"),\"\",\nIF(AND($AA107,$AH107,$AO107,$AV107,$BC107)=\"\",\"\",\nIF($L$4=\"MIT\",\nIF(OR(AP107=\"Nur EP        \",$K107=\"E\"),((AT107/(AVERAGE($AF107,$AM107,$AT107,$BA107,$BH107)))-1),\nIF($L$4=\"MIT\",((AP107/(AVERAGE($AB107,$AI107,$AP107,$AW107,$BD107)))-1),\nIF($L$4=\"MIN\",\nIF(OR(AP107=\"Nur EP        \",$K107=\"E\"),((AT107/(MIN($AF107,$AM107,$AT107,$BA107,$BH107)))-1),\nIF($L$4=\"MIN\",(AP107/(MIN($AB107,$AI107,$AP107,$AW107,$BD107)))-1)\n)))))))","v":-0.13762603927118344},{"$f":"IF(OR($K107=\"\",$K107=\"H\",$K107=\"AB\",$K107=\"G\",$J107=\"Position\",$K107=\"<-- Bitte Positionsart\",AO107=\"\",$L107=\"\"),\"\",\nIF(OR($K107=\"A\",$K107=\"B\",$K107=\"E\"),$L107*AO107))","v":""},null,null,"",null,"",{"$f":"IF(OR($L107=\"\",AV107=\"\",$J107=\"Ausführungsbeschreibung\",$J107=\"Hinweis\"),\"\",\nIF(AND($AA107,$AH107,$AO107,$AV107,$BC107)=\"\",\"\",\nIF($L$4=\"MIT\",\nIF(OR(AW107=\"Nur EP        \",$K107=\"E\"),((BA107/(AVERAGE($AF107,$AM107,$AT107,$BA107,$BH107)))-1),\nIF($L$4=\"MIT\",((AW107/(AVERAGE($AB107,$AI107,$AP107,$AW107,$BD107)))-1),\nIF($L$4=\"MIN\",\nIF(OR(AW107=\"Nur EP        \",$K107=\"E\"),((BA107/(MIN($AF107,$AM107,$AT107,$BA107,$BH107)))-1),\nIF($L$4=\"MIN\",(AW107/(MIN($AB107,$AI107,$AP107,$AW107,$BD107)))-1)\n)))))))","v":""},{"$f":"IF(OR($K107=\"\",$K107=\"H\",$K107=\"AB\",$K107=\"G\",$J107=\"Position\",$K107=\"<-- Bitte Positionsart\",AV107=\"\",$L107=\"\"),\"\",\nIF(OR($K107=\"A\",$K107=\"B\",$K107=\"E\"),$L107*AV107))","v":""},null,null,{"$f":"IF(AD107=\"Hinweis\",\"\",IF(OR($K107=\"A\",$K107=\"B\"),\"Nur EP        \",IF($K107=\"E\",\"E                \",IF(AND($L107<>\"\",BC107<>\"\"),$L107*BC107,\"\"))))","v":""},null,{"$f":"IF(BE107=\"\",\"\",IF(BE107=\"X\",BD107,BD107*BE107))","v":""},{"$f":"IF(OR($L107=\"\",BC107=\"\",$J107=\"Ausführungsbeschreibung\",$J107=\"Hinweis\"),\"\",\nIF(AND($AA107,$AH107,$AO107,$AV107,$BC107)=\"\",\"\",\nIF($L$4=\"MIT\",\nIF(OR(BD107=\"Nur EP        \",$K107=\"E\"),((BH107/(AVERAGE($AF107,$AM107,$AT107,$BA107,$BH107)))-1),\nIF($L$4=\"MIT\",((BD107/(AVERAGE($AB107,$AI107,$AP107,$AW107,$BD107)))-1),\nIF($L$4=\"MIN\",\nIF(OR(BD107=\"Nur EP        \",$K107=\"E\"),((BH107/(MIN($AF107,$AM107,$AT107,$BA107,$BH107)))-1),\nIF($L$4=\"MIN\",((BD107/(MIN($AB107,$AI107,$AP107,$AW107,$BD107)))-1))\n)))))))","v":""},{"$f":"IF(OR($K107=\"\",$K107=\"H\",$K107=\"AB\",$K107=\"G\",$J107=\"Position\",$K107=\"<-- Bitte Positionsart\",BC107=\"\",$L107=\"\"),\"\",\nIF(OR($K107=\"A\",$K107=\"B\",$K107=\"E\"),$L107*BC107))","v":""}]
[null,null,null,null,null,null,{"$f":"G$105","v":6},3,"Pfanneneindeckung aus Dachziegeln","Alternativposition","A",200,"qm",null,"","","","Nur EP        ",null,7653.333333333333,null,null,{"$f":"IF(OR($K108=\"A\",$K108=\"B\"),\"Nur EP        \",IF($K108=\"E\",\"E                \",IF(AND($L108<>\"\",V108<>\"\"),$L108*V108,\"\")))","v":"Nur EP        "},{"$f":"IF(OR($L108=\"\",W108=\"\"),\"\",\nIF(OR($W108=\"Nur EP        \",$K108=\"E\"),(Y108/(AVERAGE($Y108,$AF108,$AM108,$AT108,Y108))-1),\nIF(AND($W108,$AB108,$AI108,$AP108,$AW108)=\"\",\"\",(W108/(AVERAGE($W108,$AB108,$AI108,$AP108,$AW108)))-1)))","v":{"$error":"#VALUE!"}},"",null,40.15,"Nur EP        ",null,"",4.9216027874564583E-2,{"$f":"IF(OR($K108=\"\",$K108=\"H\",$K108=\"AB\",$K108=\"G\",$J108=\"Position\",$K108=\"<-- Bitte Positionsart\",AA108=\"\",$L108=\"\"),\"\",\nIF(OR($K108=\"A\",$K108=\"B\",$K108=\"E\"),$L108*AA108))","v":8030},null,40.15,"Nur EP        ",null,"",4.9216027874564583E-2,{"$f":"IF(OR($K108=\"\",$K108=\"H\",$K108=\"AB\",$K108=\"G\",$J108=\"Position\",$K108=\"<-- Bitte Positionsart\",AH108=\"\",$L108=\"\"),\"\",\nIF(OR($K108=\"A\",$K108=\"B\",$K108=\"E\"),$L108*AH108))","v":8030},null,34.5,"Nur EP        ",null,"",-9.8432055749128833E-2,6900,null,null,"Nur EP        ",null,"","","",null,null,"Nur EP        ",null,"","",{"$f":"IF(OR($K108=\"\",$K108=\"H\",$K108=\"AB\",$K108=\"G\",$J108=\"Position\",$K108=\"<-- Bitte Positionsart\",BC108=\"\",$L108=\"\"),\"\",\nIF(OR($K108=\"A\",$K108=\"B\",$K108=\"E\"),$L108*BC108))","v":""}]
[null,null,null,null,null,null,6,4,"Pfanneneindeckung aus Dachziegeln","Alternativposition","A",200,"qm",null,"","","","Nur EP        ",null,7520,null,null,"Nur EP        ",{"$error":"#VALUE!"},"",null,40.15,"Nur EP        ",null,"",6.7819148936170137E-2,8030,null,40.15,"Nur EP        ",null,"",6.7819148936170137E-2,8030,null,32.5,"Nur EP        ",null,"",-0.13563829787234039,6500,null,null,"Nur EP        ",null,"","","",null,null,"Nur EP        ",null,"","",""]
[null,null,null,null,null,null,6,5,"Dunstrohrziegel für Strangentlüftungen","Position","",3,"Stck.",null,240,309.67666666666668,349.26,929.03,null,"",null,null,"","","",null,339.77,1019.31,null,"",9.7176625082074697E-2,"",null,349.26,1047.78,null,"",0.12782149123279107,"",null,240,720,null,"",-0.2249981163148661,"",null,null,"",null,"","","",null,null,"",null,"","",""]
[null,null,null,null,null,null,6,6,"Schneiden von Pfannen an Gauben, Dachflächenfenstern u. sonst. aufgehenden Bauteilen und Dachflächenfenstern","Position","",97.2,"m",null,12.88,13.83,15.5,1344.2760000000001,null,"",null,null,"","","",null,12.88,1251.9360000000001,null,"",-6.8691250903832213E-2,"",null,13.11,1274.2919999999999,null,"",-5.2060737527115042E-2,"",null,15.5,1506.6000000000001,null,"",0.12075198843094737,"",null,null,"",null,"","","",null,null,"",null,"","",""]
[null,null,null,null,null,null,6,7,"Schneiden von Pfannen an Kehlen und Graten","Position","",68,"m",null,24.6,25.856666666666666,26.62,1758.2533333333333,null,"",null,null,"","","",null,26.35,1791.8000000000002,null,"",1.9079541059688232E-2,"",null,26.62,1810.16,null,"",2.9521722315328125E-2,"",null,24.6,1672.8000000000002,null,"",-4.8601263375016024E-2,"",null,null,"",null,"","","",null,null,"",null,"","",""]
[null,null,null,null,null,null,6,8,"Herstellen von Graten auf den Holzfaser Unterdeckplatten","Position","",44,"m",null,44.17,46.946666666666665,52,2065.6533333333332,null,"",null,null,"","","",null,44.17,1943.48,null,"",-5.9145129224651982E-2,"",null,44.67,1965.48,null,"",-4.8494745810849116E-2,"",null,52,2288,null,"",0.10763987503550143,"",null,null,"",null,"","","",null,null,"",null,"","",""]
[null,null,null,null,null,null,6,9,"Konische Firstpfanne als Gratdachpfannen passend zur Dachpfanne","Position","",43.5,"m",null,42,47.293333333333329,50.42,2057.2599999999998,null,"",null,null,"","","",null,49.46,2151.5100000000002,null,"",4.5813363405694973E-2,"",null,50.42,2193.27,null,"",6.6112207499295028E-2,"",null,42,1827,null,"",-0.11192557090499022,"",null,null,"",null,"","","",null,null,"",null,"","",""]
[null,null,null,null,null,null,6,{"$f":"IF(G$162=\"\",\"\",ROW()-94)","v":21},"Firstanfänger passend Gratdachpfannen - Aufpreis","Position","",9,"Stck.",null,35,127.82666666666667,175.72,1150.44,null,"",null,null,"","","",null,172.76,1554.84,null,"",0.35151768019192664,"",null,175.72,1581.48,null,"",0.37467403775946617,"",null,35,315,null,"",-0.72619171795139248,"",null,null,"",null,"","","",null,null,"",null,"","",""]
[null,null,null,null,null,null,6,22,"Herstellen von Kehlen aus Alublechen (rot)","Grundposition","G",24,"m",null,49.46,59.836666666666666,80,1436.08,null,"",null,null,"","","",null,49.46,1187.04,null,"",-0.17341652275639241,"",null,50.05,1201.1999999999998,null,"",-0.16355634783577522,"",null,80,1920,null,"",0.33697287059216774,"",null,null,"",null,"",{"$f":"IF(OR($L116=\"\",AV116=\"\",$J116=\"Ausführungsbeschreibung\",$J116=\"Hinweis\"),\"\",\nIF(AND($AA116,$AH116,$AO116,$AV116,$BC116)=\"\",\"\",\nIF($L$4=\"MIT\",\nIF(OR(AW116=\"Nur EP        \",$K116=\"E\"),((BA116/(AVERAGE($AF116,$AM116,$AT116,$BA116,$BH116)))-1),\nIF($L$4=\"MIT\",((AW116/(AVERAGE($AB116,$AI116,$AP116,$AW116,$BD116)))-1),\nIF($L$4=\"MIN\",\nIF(OR(AW116=\"Nur EP        \",$K116=\"E\"),((BA116/(MIN($AF116,$AM116,$AT116,$BA116,$BH116)))-1),\nIF($L$4=\"MIN\",(AW116/(MIN($AB116,$AI116,$AP116,$AW116,$BD116)))-1)\n)))))))","v":""},{"$f":"IF(OR($K116=\"\",$K116=\"H\",$K116=\"AB\",$K116=\"G\",$J116=\"Position\",$K116=\"<-- Bitte Positionsart\",AV116=\"\",$L116=\"\"),\"\",\nIF(OR($K116=\"A\",$K116=\"B\",$K116=\"E\"),$L116*AV116))","v":""},null,null,"",null,"","",""]
[null,null,null,null,null,null,6,23,"Herstellen von Kehlen aus Zinkblech (vorbewittert)","Alternativposition","A",24,"m",null,"","","","Nur EP        ",null,1358.96,null,null,"Nur EP        ",{"$error":"#VALUE!"},"",null,49.46,"Nur EP        ",null,"",-0.12650850650497447,1187.04,null,50.41,"Nur EP        ",null,"",-0.1097309707423324,1209.8399999999999,null,70,"Nur EP        ",null,"",0.23623947724730665,1680,null,null,"Nur EP        ",null,"",{"$f":"IF(OR($L117=\"\",AV117=\"\",$J117=\"Ausführungsbeschreibung\",$J117=\"Hinweis\"),\"\",\nIF(AND($AA117,$AH117,$AO117,$AV117,$BC117)=\"\",\"\",\nIF($L$4=\"MIT\",\nIF(OR(AW117=\"Nur EP        \",$K117=\"E\"),((BA117/(AVERAGE($AF117,$AM117,$AT117,$BA117,$BH117)))-1),\nIF($L$4=\"MIT\",((AW117/(AVERAGE($AB117,$AI117,$AP117,$AW117,$BD117)))-1),\nIF($L$4=\"MIN\",\nIF(OR(AW117=\"Nur EP        \",$K117=\"E\"),((BA117/(MIN($AF117,$AM117,$AT117,$BA117,$BH117)))-1),\nIF($L$4=\"MIN\",(AW117/(MIN($AB117,$AI117,$AP117,$AW117,$BD117)))-1)\n)))))))","v":""},{"$f":"IF(OR($K117=\"\",$K117=\"H\",$K117=\"AB\",$K117=\"G\",$J117=\"Position\",$K117=\"<-- Bitte Positionsart\",AV117=\"\",$L117=\"\"),\"\",\nIF(OR($K117=\"A\",$K117=\"B\",$K117=\"E\"),$L117*AV117))","v":""},null,null,"Nur EP        ",null,"","",""]
[null,null,null,null,null,null,6,24,"Bleianschluss an aufgehendem Gaubenseiten u vor den Seitenfenstern der Erker-Gauben","Position","",43.2,"m",null,38.9,48.686666666666667,54.12,2103.2640000000001,null,"",null,null,"","","",null,53.04,2291.328,null,"",8.941530877721493E-2,"",null,54.12,2337.9839999999999,null,"",0.11159797343557454,"",null,38.9,1680.48,null,"",-0.20101328221278913,"",null,null,"",null,"","","",null,null,"",null,"","",""]
[null,null,null,null,null,null,6,25,"Insektenschutz/ Belüftung Traufe","Position","",61,"m",null,15.76,16.676666666666666,18.5,1017.2766666666666,null,"",null,null,"","","",null,15.76,961.36,null,"",-5.4967019788127125E-2,"",null,15.77,961.97,null,"",-5.4367379572256569E-2,"",null,18.5,1128.5,null,"",0.10933439936038369,"",null,null,"",null,"","","",null,null,"",null,"","",""]
[null,null,null,null,null,null,6,26,"Insektenschutz/ Entüftung oberer Streildachabschluss","Position","",62,"m",null,15.3,18.693333333333332,20.420000000000002,1158.9866666666665,null,"",null,null,"","","",null,20.36,1262.32,null,"",8.9158345221112656E-2,"",null,20.420000000000002,1266.0400000000002,null,"",9.2368045649072972E-2,"",null,15.3,948.6,null,"",-0.18152639087018541,"",null,null,"",null,"","","",null,null,"",null,"","",""]
[null,null,null,null,null,null,6,27,"Höhenausgleich Schalbretter /Konterlattung oberhalb der Gaubendächer","Position","",30,"m",null,1E-4,5.8333666666666666,10,175.001,null,"",null,null,"","","",null,1E-4,3.0000000000000001E-3,null,"",-0.99998285724081581,"",null,7.5,225,null,"",0.28570693881749265,"",null,10,300,null,"",0.71427591842332361,"",null,null,"",null,"","","",null,null,"",null,"","",""]
[null,null,null,null,null,null,6,28,"Windlastberechnung für die fachgerechte Fixierung der Folienbahnen","Grundposition","G",1,"pausch.",null,500,678.71,776.88,678.71,null,"",null,null,"","","",null,759.25,759.25,null,"",0.11866629340955637,"",null,776.88,776.88,null,"",0.14464204151994209,"",null,500,500,null,"",-0.26330833492949868,"",null,null,"",null,"","","",null,null,"",null,"","",""]
[null,null,null,null,null,null,6,29,"Windlastberechnung für die fachgerechte Fixierung der Folienbahnen","Alternativposition","A",1,"pausch.",null,"","","","Nur EP        ",null,672.83333333333337,null,null,"Nur EP        ",{"$error":"#VALUE!"},"",null,759.25,"Nur EP        ",null,"",0.12843695813723066,759.25,null,759.25,"Nur EP        ",null,"",0.12843695813723066,759.25,null,500,"Nur EP        ",null,"",-0.25687391627446132,500,null,null,"Nur EP        ",null,"","","",null,null,"Nur EP        ",null,"","",""]
[null,null,null,null,null,null,{"$f":"G$105","v":6},19,"Vorstoßblech und Verbundblech, als umlaufendes Dachrand Abschlussprofil","Position","",63,"m",null,45.5,74.333333333333329,89.62,4683,null,"",null,null,"","","",null,87.88,5536.44,null,"",0.18224215246636755,{"$f":"IF(OR($K124=\"\",$K124=\"H\",$K124=\"AB\",$K124=\"G\",$J124=\"Position\",$K124=\"<-- Bitte Positionsart\",AA124=\"\",$L124=\"\"),\"\",\nIF(OR($K124=\"A\",$K124=\"B\",$K124=\"E\"),$L124*AA124))","v":""},null,89.62,5646.06,null,"",0.2056502242152467,{"$f":"IF(OR($K124=\"\",$K124=\"H\",$K124=\"AB\",$K124=\"G\",$J124=\"Position\",$K124=\"<-- Bitte Positionsart\",AH124=\"\",$L124=\"\"),\"\",\nIF(OR($K124=\"A\",$K124=\"B\",$K124=\"E\"),$L124*AH124))","v":""},null,45.5,2866.5,null,"",-0.38789237668161436,"",null,null,"",null,"","","",null,null,"",null,"","",{"$f":"IF(OR($K124=\"\",$K124=\"H\",$K124=\"AB\",$K124=\"G\",$J124=\"Position\",$K124=\"<-- Bitte Positionsart\",BC124=\"\",$L124=\"\"),\"\",\nIF(OR($K124=\"A\",$K124=\"B\",$K124=\"E\"),$L124*BC124))","v":""}]
[null,null,null,null,null,null,{"$f":"G$105","v":6},20,"Innen- und Außenecken als Zulage zum Verbundblech ","Position","",14,"Stck.",null,21.63,26.143333333333334,35,366.00666666666666,null,"",null,null,"","","",null,21.63,302.82,null,"",-0.17263802116537041,{"$f":"IF(OR($K125=\"\",$K125=\"H\",$K125=\"AB\",$K125=\"G\",$J125=\"Position\",$K125=\"<-- Bitte Positionsart\",AA125=\"\",$L125=\"\"),\"\",\nIF(OR($K125=\"A\",$K125=\"B\",$K125=\"E\"),$L125*AA125))","v":""},null,21.8,305.2,null,"",-0.16613540736962895,{"$f":"IF(OR($K125=\"\",$K125=\"H\",$K125=\"AB\",$K125=\"G\",$J125=\"Position\",$K125=\"<-- Bitte Positionsart\",AH125=\"\",$L125=\"\"),\"\",\nIF(OR($K125=\"A\",$K125=\"B\",$K125=\"E\"),$L125*AH125))","v":""},null,35,490,null,"",0.33877342853499948,"",null,null,"",null,"","","",null,null,"",null,"","",{"$f":"IF(OR($K125=\"\",$K125=\"H\",$K125=\"AB\",$K125=\"G\",$J125=\"Position\",$K125=\"<-- Bitte Positionsart\",BC125=\"\",$L125=\"\"),\"\",\nIF(OR($K125=\"A\",$K125=\"B\",$K125=\"E\"),$L125*BC125))","v":""}]
[null,null,null,null,null,null,6,21,"Schutzflies Unterlage des Foliendachs - Flachdachbereich","Position","",150,"qm",null,7,11.363333333333335,13.65,1704.5000000000002,null,"",null,null,"","","",null,13.65,2047.5,null,"",0.20123203285420943,"",null,13.44,{"$f":"IF(J126=\"Hinweis\",\"\",IF(OR($K126=\"A\",$K126=\"B\"),\"Nur EP        \",IF($K126=\"E\",\"E                \",IF(AND($L126<>\"\",AH126<>\"\"),$L126*AH126,\"\"))))","v":2016},null,{"$f":"IF(AJ126=\"\",\"\",IF(AJ126=\"X\",AI126,AI126*AJ126))","v":""},0.18275154004106775,"",null,7,1050,null,"",-0.38398357289527718,"",null,null,"",null,"","","",null,null,"",null,"","",""]
[null,null,null,null,null,null,6,22,"Folienabdichtung des Flachdach - PVC Folie","Grundposition","G",155,"qm",null,25.5,47.54,58.79,7368.7,null,"",null,null,"","","",null,58.33,9041.15,null,"",0.2269667648296172,"",null,58.79,9112.4500000000007,null,"",0.23664282709297457,"",null,25.5,3952.5,null,"",-0.46360959192259144,"",null,null,"",null,"","","",null,null,{"$f":"IF(AD127=\"Hinweis\",\"\",IF(OR($K127=\"A\",$K127=\"B\"),\"Nur EP        \",IF($K127=\"E\",\"E                \",IF(AND($L127<>\"\",BC127<>\"\"),$L127*BC127,\"\"))))","v":""},null,{"$f":"IF(BE127=\"\",\"\",IF(BE127=\"X\",BD127,BD127*BE127))","v":""},"",""]
[null,null,null,null,null,null,6,23,"Folienabdichtung des Flachdach - PVC Folie","Alternativposition","A",155,"qm",null,"","","","Nur EP        ",null,7894.666666666667,null,null,"Nur EP        ",{"$error":"#VALUE!"},"",null,60.05,{"$f":"IF(C128=\"Hinweis\",\"\",IF(OR($K128=\"A\",$K128=\"B\"),\"Nur EP        \",IF($K128=\"E\",\"E                \",IF(AND($L128<>\"\",AA128<>\"\"),$L128*AA128,\"\"))))","v":"Nur EP        "},null,{"$f":"IF(AC128=\"\",\"\",IF(AC128=\"X\",AB128,AB128*AC128))","v":""},0.17899214659685869,9307.75,null,60.05,"Nur EP        ",null,"",0.17899214659685869,{"$f":"IF(OR($K128=\"\",$K128=\"H\",$K128=\"AB\",$K128=\"G\",$J128=\"Position\",$K128=\"<-- Bitte Positionsart\",AH128=\"\",$L128=\"\"),\"\",\nIF(OR($K128=\"A\",$K128=\"B\",$K128=\"E\"),$L128*AH128))","v":9307.75},null,32.700000000000003,"Nur EP        ",null,"",-0.35798429319371727,5068.5,null,null,"Nur EP        ",null,"","","",null,null,"Nur EP        ",null,"","",""]
[null,null,null,null,null,null,6,24,"Anarbeiten der Folienabdichtung an bestehende und verbleibende Durchdringungen","Position","",1,"pausch.",null,1460,2651.5333333333333,3273.35,2651.5333333333333,null,"",null,null,"","","",null,3221.25,3221.25,null,"",0.21486309808161308,"",null,3273.35,3273.35,null,"",0.23451210620270024,"",null,1460,1460,null,"",-0.44937520428431343,"",null,null,"",null,"","","",null,null,"",null,"","",{"$f":"IF(OR($K129=\"\",$K129=\"H\",$K129=\"AB\",$K129=\"G\",$J129=\"Position\",$K129=\"<-- Bitte Positionsart\",BC129=\"\",$L129=\"\"),\"\",\nIF(OR($K129=\"A\",$K129=\"B\",$K129=\"E\"),$L129*BC129))","v":""}]
[null,null,null,null,null,null,6,25,"Innen- und Außenecken der Folienabdichtung","Position","",40,"Stck.",null,50,63.75333333333333,70.63,2550.1333333333332,null,"",null,null,"",{"$f":"IF(OR($L130=\"\",W130=\"\",$K130=\"E\"),\"\",\nIF(AND(V130=\"\",W130=\"Nur EP        \"),\"\",\nIF(OR(W130=\"Nur EP        \",$K130=\"A\"),(Y130/(AVERAGE($AF130,$AM130,$AT130,$BA130,$BH130))-1),\nIF(AND($AB130,$AI130,$AP130,$AW130,$BD130)=\"\",\"\",(W130/(AVERAGE($AB130,$AI130,$AP130,$AW130,$BD130)))-1))))","v":""},"",null,70.63,2825.2,null,"",0.10786364111680435,"",null,70.63,2825.2,null,"",0.10786364111680435,"",null,50,2000,null,"",-0.21572728223360871,"",null,null,"",null,"","","",null,null,"",null,"","",""]
[null,null,null,null,null,null,6,26,"Flüssigkunststoffabdichtungen an Durchdringungen von Strangentlüftungen","Position","",12,"Stck.",null,76.38,79.563333333333333,85,954.76,null,"",null,null,"","",{"$f":"IF(OR($K131=\"\",$K131=\"H\",$K131=\"AB\",$K131=\"G\",$J131=\"Position\",$K131=\"<-- Bitte Positionsart\",V131=\"\",$L131=\"\"),\"\",\nIF(OR($K131=\"A\",$K131=\"B\",$K131=\"E\"),$L131*V131))","v":""},null,76.38,916.56,null,"",-4.0010054882902435E-2,{"$f":"IF(OR($K131=\"\",$K131=\"H\",$K131=\"AB\",$K131=\"G\",$J131=\"Position\",$K131=\"<-- Bitte Positionsart\",AA131=\"\",$L131=\"\"),\"\",\nIF(OR($K131=\"A\",$K131=\"B\",$K131=\"E\"),$L131*AA131))","v":""},null,77.31,927.72,null,"",-2.8321253508735045E-2,"",null,85,1020,null,"",6.8331308391637924E-2,"",null,null,{"$f":"IF(W131=\"Hinweis\",\"\",IF(OR($K131=\"A\",$K131=\"B\"),\"Nur EP        \",IF($K131=\"E\",\"E                \",IF(AND($L131<>\"\",AV131<>\"\"),$L131*AV131,\"\"))))","v":""},null,{"$f":"IF(AX131=\"\",\"\",IF(AX131=\"X\",AW131,AW131*AX131))","v":""},{"$f":"IF(OR($L131=\"\",AV131=\"\",$J131=\"Ausführungsbeschreibung\",$J131=\"Hinweis\"),\"\",\nIF(AND($AA131,$AH131,$AO131,$AV131,$BC131)=\"\",\"\",\nIF($L$4=\"MIT\",\nIF(OR(AW131=\"Nur EP        \",$K131=\"E\"),((BA131/(AVERAGE($AF131,$AM131,$AT131,$BA131,$BH131)))-1),\nIF($L$4=\"MIT\",((AW131/(AVERAGE($AB131,$AI131,$AP131,$AW131,$BD131)))-1),\nIF($L$4=\"MIN\",\nIF(OR(AW131=\"Nur EP        \",$K131=\"E\"),((BA131/(MIN($AF131,$AM131,$AT131,$BA131,$BH131)))-1),\nIF($L$4=\"MIN\",(AW131/(MIN($AB131,$AI131,$AP131,$AW131,$BD131)))-1)\n)))))))","v":""},{"$f":"IF(OR($K131=\"\",$K131=\"H\",$K131=\"AB\",$K131=\"G\",$J131=\"Position\",$K131=\"<-- Bitte Positionsart\",AV131=\"\",$L131=\"\"),\"\",\nIF(OR($K131=\"A\",$K131=\"B\",$K131=\"E\"),$L131*AV131))","v":""},null,null,"",null,"","",""]
[null,null,null,null,null,null,6,{"$f":"IF(G$162=\"\",\"\",ROW()-94)","v":38},"Flüssigkunststoffabdichtungen an Durchdringungen von Oberlichtern","Position","",3,"Stck.",null,115,240.76333333333332,307.77,722.29,null,"",null,null,"","","",null,299.52,898.56,null,"",0.24404325132564475,"",null,307.77,923.31,null,"",0.27830926636115683,"",null,115,345,null,"",-0.52235251768680169,"",null,null,"",null,"",{"$f":"IF(OR($L132=\"\",AV132=\"\",$J132=\"Ausführungsbeschreibung\",$J132=\"Hinweis\"),\"\",\nIF(AND($AA132,$AH132,$AO132,$AV132,$BC132)=\"\",\"\",\nIF($L$4=\"MIT\",\nIF(OR(AW132=\"Nur EP        \",$K132=\"E\"),((BA132/(AVERAGE($AF132,$AM132,$AT132,$BA132,$BH132)))-1),\nIF($L$4=\"MIT\",((AW132/(AVERAGE($AB132,$AI132,$AP132,$AW132,$BD132)))-1),\nIF($L$4=\"MIN\",\nIF(OR(AW132=\"Nur EP        \",$K132=\"E\"),((BA132/(MIN($AF132,$AM132,$AT132,$BA132,$BH132)))-1),\nIF($L$4=\"MIN\",(AW132/(MIN($AB132,$AI132,$AP132,$AW132,$BD132)))-1)\n)))))))","v":""},{"$f":"IF(OR($K132=\"\",$K132=\"H\",$K132=\"AB\",$K132=\"G\",$J132=\"Position\",$K132=\"<-- Bitte Positionsart\",AV132=\"\",$L132=\"\"),\"\",\nIF(OR($K132=\"A\",$K132=\"B\",$K132=\"E\"),$L132*AV132))","v":""},null,null,"",null,"","",""]
[null,null,null,null,null,null,6,39,"Flüssigkunststoffabdichtungen an Durchdringungen des Flachdachausstieg","Position","",1,"Stck.",null,155,338.32,434.13,338.32,null,"",null,null,"","","",null,425.83,425.83,null,"",0.25866043982028852,"",null,434.13,434.13,null,"",0.2831934263419249,"",null,155,155,null,"",-0.5418538661622132,"",null,null,"",null,"","","",null,null,"",null,"","",""]
[null,null,null,null,null,null,6,40,"Flüssigkunststoffabdichtungen an Durchdringungen von Schornstein u. Aufzugsüberfahrt","Position","",12.2,"m",null,55,80.55,94.39,982.70999999999992,null,"",null,null,"","","",null,92.26,1125.5719999999999,null,"",0.14537554314090606,"",null,94.39,1151.558,null,"",0.17181874612042214,"",null,55,671,null,"",-0.31719428926132842,"",null,null,"",null,"","","",null,null,"",null,"","",""]
[null,null,null,null,null,null,6,{"$f":"IF(G$162=\"\",\"\",ROW()-94)","v":41},"Verbundblech, als vorderes Dachrand Anschlussprofil der Gaubendächer","Position",{"$f":"IF(J135=\"Position\",\"\",IF(J135=\"Grundposition\",\"G\",IF(J135=\"Alternativposition\",\"A\",IF(J135=\"Bedarfsposition\",\"B\",IF(J135=\"Hinweis\",\"H\",IF(J135=\"Ausführungsbeschreibung\",\"AB\",IF(J135=\"Entfällt\",\"E\",IF(AND(I135<>\"\",L135<>\"\"),\"<-- Bitte Positionsart\",\"\"))))))))","v":""},37,"m",null,33.5,58.79999999999999,72.27,2175.5999999999995,null,"",null,null,{"$f":"IF(OR($K135=\"A\",$K135=\"B\"),\"Nur EP        \",IF($K135=\"E\",\"E                \",IF(AND($L135<>\"\",V135<>\"\"),$L135*V135,\"\")))","v":""},{"$f":"IF(OR($L135=\"\",W135=\"\"),\"\",\nIF(OR($W135=\"Nur EP        \",$K135=\"E\"),(Y135/(AVERAGE($Y135,$AF135,$AM135,$AT135,Y135))-1),\nIF(AND($W135,$AB135,$AI135,$AP135,$AW135)=\"\",\"\",(W135/(AVERAGE($W135,$AB135,$AI135,$AP135,$AW135)))-1)))","v":""},"",null,70.63,{"$f":"IF(C135=\"Hinweis\",\"\",IF(OR($K135=\"A\",$K135=\"B\"),\"Nur EP        \",IF($K135=\"E\",\"E                \",IF(AND($L135<>\"\",AA135<>\"\"),$L135*AA135,\"\"))))","v":2613.31},null,{"$f":"IF(AC135=\"\",\"\",IF(AC135=\"X\",AB135,AB135*AC135))","v":""},0.20119047619047614,{"$f":"IF(OR($K135=\"\",$K135=\"H\",$K135=\"AB\",$K135=\"G\",$J135=\"Position\",$K135=\"<-- Bitte Positionsart\",AA135=\"\",$L135=\"\"),\"\",\nIF(OR($K135=\"A\",$K135=\"B\",$K135=\"E\"),$L135*AA135))","v":""},null,72.27,{"$f":"IF(J135=\"Hinweis\",\"\",IF(OR($K135=\"A\",$K135=\"B\"),\"Nur EP        \",IF($K135=\"E\",\"E                \",IF(AND($L135<>\"\",AH135<>\"\"),$L135*AH135,\"\"))))","v":2673.99},null,{"$f":"IF(AJ135=\"\",\"\",IF(AJ135=\"X\",AI135,AI135*AJ135))","v":""},0.22908163265306114,{"$f":"IF(OR($K135=\"\",$K135=\"H\",$K135=\"AB\",$K135=\"G\",$J135=\"Position\",$K135=\"<-- Bitte Positionsart\",AH135=\"\",$L135=\"\"),\"\",\nIF(OR($K135=\"A\",$K135=\"B\",$K135=\"E\"),$L135*AH135))","v":""},null,33.5,1239.5,null,"",-0.43027210884353739,"",null,null,"",null,"","","",null,null,{"$f":"IF(AD135=\"Hinweis\",\"\",IF(OR($K135=\"A\",$K135=\"B\"),\"Nur EP        \",IF($K135=\"E\",\"E                \",IF(AND($L135<>\"\",BC135<>\"\"),$L135*BC135,\"\"))))","v":""},null,{"$f":"IF(BE135=\"\",\"\",IF(BE135=\"X\",BD135,BD135*BE135))","v":""},"",{"$f":"IF(OR($K135=\"\",$K135=\"H\",$K135=\"AB\",$K135=\"G\",$J135=\"Position\",$K135=\"<-- Bitte Positionsart\",BC135=\"\",$L135=\"\"),\"\",\nIF(OR($K135=\"A\",$K135=\"B\",$K135=\"E\"),$L135*BC135))","v":""}]
[null,null,null,null,null,null,6,42,"Schutzflies Unterlage des Foliendachs - Gaubendächer","Position","",68,"qm",null,7,11.4,13.65,775.2,null,"",null,null,"","","",null,13.65,928.2,null,"",0.19736842105263142,"",null,13.55,921.40000000000009,null,"",0.18859649122806998,"",null,7,476,null,"",-0.38596491228070184,"",null,null,"",null,"","","",null,null,"",null,"","",""]
[null,null,null,null,null,null,6,43,"Folienabdichtung der Gaubendächer - PVC Folie","Grundposition","G",68,"qm",null,25.5,47.75333333333333,59.43,3247.2266666666665,null,"",null,null,"","","",null,58.33,3966.44,null,"",0.22148541114058351,"",null,59.43,4041.24,null,"",0.24452045232444486,"",null,25.5,1734,null,"",-0.4660058634650287,"",null,null,"",null,"","","",null,null,"",null,"","",""]
[null,null,null,null,null,null,6,44,"Folienabdichtung der Gaubendächer - PVC Folie","Alternativposition","A",68,"qm",null,"","","","Nur EP        ",null,3368.2666666666664,null,null,"Nur EP        ",{"$error":"#VALUE!"},"",null,60.05,"Nur EP        ",null,"",0.21231493943472413,4083.3999999999996,null,60.05,"Nur EP        ",null,"",0.21231493943472413,4083.3999999999996,null,28.5,"Nur EP        ",null,"",-0.42462987886944814,1938,null,null,"Nur EP        ",null,"","","",null,null,"Nur EP        ",null,"","",""]
[null,null,null,null,null,null,6,45,"Da die Wohnungen im derzeitigen Zustand und unter Berücksichtigung der derzeitigen Position der Dachflächenfenster bewohnt sind, ist die Position der neuen Dachflächenfenster wenn irgendmöglich deckungsgleich auszuführen. Hier besteht unbedingter Abs","Hinweis","H",null,null,null,"","","","",null,"",null,null,"","","",null,null,"",null,"","","",null,null,"",null,"","","",null,null,"",null,"","","",null,null,"",null,"","","",null,null,"",null,"","",""]
[null,null,null,null,null,null,6,46,"Neue Dachflächenfenster Treppenhaus und Wohnungen","Position","",4,"Stck.",null,1400,2025.4666666666665,2358.64,8101.8666666666659,null,"",null,null,"","","",null,2317.7600000000002,9271.0400000000009,null,"",0.14430913040616167,"",null,2358.64,9434.56,null,"",0.16449213350009884,"",null,1400,5600,null,"",-0.30880126390626017,"",null,null,"",null,"","","",null,null,"",null,"","",""]
[null,null,null,null,null,null,6,47,"Lieferung und Einbau eines neuen Flachdachausstieg","Position","",1,"Stck.",null,2890,4304.833333333333,5078.25,4304.833333333333,null,"",null,null,"","","",null,4946.25,4946.25,null,"",0.14899918696039349,"",null,5078.25,5078.25,null,"",0.17966239498238412,"",null,2890,2890,null,"",-0.3286615819427775,"",null,null,"",null,"",{"$f":"IF(OR($L141=\"\",AV141=\"\",$J141=\"Ausführungsbeschreibung\",$J141=\"Hinweis\"),\"\",\nIF(AND($AA141,$AH141,$AO141,$AV141,$BC141)=\"\",\"\",\nIF($L$4=\"MIT\",\nIF(OR(AW141=\"Nur EP        \",$K141=\"E\"),((BA141/(AVERAGE($AF141,$AM141,$AT141,$BA141,$BH141)))-1),\nIF($L$4=\"MIT\",((AW141/(AVERAGE($AB141,$AI141,$AP141,$AW141,$BD141)))-1),\nIF($L$4=\"MIN\",\nIF(OR(AW141=\"Nur EP        \",$K141=\"E\"),((BA141/(MIN($AF141,$AM141,$AT141,$BA141,$BH141)))-1),\nIF($L$4=\"MIN\",(AW141/(MIN($AB141,$AI141,$AP141,$AW141,$BD141)))-1)\n)))))))","v":""},{"$f":"IF(OR($K141=\"\",$K141=\"H\",$K141=\"AB\",$K141=\"G\",$J141=\"Position\",$K141=\"<-- Bitte Positionsart\",AV141=\"\",$L141=\"\"),\"\",\nIF(OR($K141=\"A\",$K141=\"B\",$K141=\"E\"),$L141*AV141))","v":""},null,null,"",null,"","",""]
[null,null,null,null,null,null,6,48,"Herstellen von Sekuranten zur Absicherung im Rahmen von Dachbegehungen oder Wartungsarbeiten Arbeiten am Dach","Position","",5,"Stck.",null,185,269.98,316.92,1349.9,null,"",null,null,"","","",null,308.02,1540.1,null,"",0.14089932587599097,"",null,316.92,1584.6000000000001,null,"",0.17386473072079434,"",null,185,925,null,"",-0.31476405659678486,"",null,null,"",null,"",{"$f":"IF(OR($L142=\"\",AV142=\"\",$J142=\"Ausführungsbeschreibung\",$J142=\"Hinweis\"),\"\",\nIF(AND($AA142,$AH142,$AO142,$AV142,$BC142)=\"\",\"\",\nIF($L$4=\"MIT\",\nIF(OR(AW142=\"Nur EP        \",$K142=\"E\"),((BA142/(AVERAGE($AF142,$AM142,$AT142,$BA142,$BH142)))-1),\nIF($L$4=\"MIT\",((AW142/(AVERAGE($AB142,$AI142,$AP142,$AW142,$BD142)))-1),\nIF($L$4=\"MIN\",\nIF(OR(AW142=\"Nur EP        \",$K142=\"E\"),((BA142/(MIN($AF142,$AM142,$AT142,$BA142,$BH142)))-1),\nIF($L$4=\"MIN\",(AW142/(MIN($AB142,$AI142,$AP142,$AW142,$BD142)))-1)\n)))))))","v":""},{"$f":"IF(OR($K142=\"\",$K142=\"H\",$K142=\"AB\",$K142=\"G\",$J142=\"Position\",$K142=\"<-- Bitte Positionsart\",AV142=\"\",$L142=\"\"),\"\",\nIF(OR($K142=\"A\",$K142=\"B\",$K142=\"E\"),$L142*AV142))","v":""},null,null,"",null,"","",""]
[null,null,null,null,null,null,6,49,"Flachdach Oberlichter 90/90","Bedarfsposition","B",1,"Stck.",null,"","","","Nur EP        ",null,2436.6266666666666,null,null,"Nur EP        ",{"$error":"#VALUE!"},"",null,2229.94,"Nur EP        ",null,"",-8.4824921886542559E-2,2229.94,null,2229.94,"Nur EP        ",null,"",-8.4824921886542559E-2,2229.94,null,2850,"Nur EP        ",null,"",0.16964984377308534,2850,null,null,"Nur EP        ",null,"","","",null,null,"Nur EP        ",null,"","",""]
[null,null,null,null,null,null,6,50,"Laubgitter Grau","Position","",62,"m",null,12.3,15.309999999999997,16.829999999999998,949.2199999999998,null,"",null,null,"","","",null,16.8,1041.6000000000001,null,"",9.7322011757021709E-2,"",null,16.829999999999998,1043.4599999999998,null,"",9.9281515349444627E-2,"",null,12.3,762.6,null,"",-0.19660352710646622,"",null,null,"",null,"","","",null,null,"",null,"","",""]
[null,null,null,null,null,null,6,51,"Neumontage der temporäre demontierten Geländer an den Erker-Gauben","Position","",3,"Stck.",null,180,440.51000000000005,575.95000000000005,1321.5300000000002,null,"",null,null,"","","",null,565.58000000000004,1696.7400000000002,null,"",0.28392090985448704,"",null,575.95000000000005,1727.8500000000001,null,"",0.30746180563437853,"",null,180,540,null,"",-0.59138271548886512,"",null,null,"",null,"","","",null,null,"",null,"","",""]
[null,null,null,null,null,null,6,52,null,null,"",null,null,null,"","","","",null,"",null,null,"","","",null,null,"",null,"","","",null,null,"",null,"","","",null,null,"",null,"","","",null,null,"",null,"","","",null,null,"",null,"","",""]
[null,null,null,null,null,null,null,null,null,null,null,null,null,null,null,null,null,null,null,null,null,null,{"$f":"IF(OR($K147=\"A\",$K147=\"B\"),\"Nur EP        \",IF($K147=\"E\",\"\",IF(AND($L147<>\"\",V147<>\"\"),$L147*V147,\"\")))","v":""},null,{"$f":"IF($K147=\"Ja\",IF(AND($L147<>\"\",V147<>\"\"),$L147*V147),\"\")","v":""},null,"EP / % Titel","Positions- / Titelsumme",null,"",null,{"$f":"IF($K147=\"Ja\",IF(AND($L147<>\"\",AA147<>\"\"),$L147*AA147),\"\")","v":""},null,"EP / % Titel","Positions- / Titelsumme",null,"",null,{"$f":"IF($K147=\"Ja\",IF(AND($L147<>\"\",AH147<>\"\"),$L147*AH147),\"\")","v":""},null,"EP / % Titel","Positions- / Titelsumme",null,{"$f":"IF(AQ147=\"\",\"\",IF(AQ147=\"X\",AP147,AP147*AQ147))","v":""},null,{"$f":"IF($K147=\"Ja\",IF(AND($L147<>\"\",AO147<>\"\"),$L147*AO147),\"\")","v":""},null,"EP / % Titel","Positions- / Titelsumme",null,{"$f":"IF(AX147=\"\",\"\",IF(AX147=\"X\",AW147,AW147*AX147))","v":""},null,{"$f":"IF($K147=\"Ja\",IF(AND($L147<>\"\",AV147<>\"\"),$L147*AV147),\"\")","v":""},null,"EP / % Titel","Positions- / Titelsumme",null,"",null,{"$f":"IF($K147=\"Ja\",IF(AND($L147<>\"\",BC147<>\"\"),$L147*BC147),\"\")","v":""}]
[null,null,null,null,null,null,7,null,"Photovoltaik",null,null,null,null,null,{"$f":"CONCATENATE(\"Titelsumme\",CHAR(10),\"MIN\",CHAR(10),TEXT(SUMPRODUCT($L149:$L161,O149:O161),\"##.##0,00\"),\" €\")","v":"Titelsumme\nMIN\n6.145,00 €"},{"$f":"CONCATENATE(\"Titelsumme\",CHAR(10),\"MIT\",CHAR(10),TEXT(SUMPRODUCT($L149:$L161,P149:P161),\"##.##0,00\"),\" €\")","v":"Titelsumme\nMIT\n9.554,78 €"},{"$f":"CONCATENATE(\"Titelsumme\",CHAR(10),\"MAX\",CHAR(10),TEXT(SUMPRODUCT($L149:$L161,Q149:Q161),\"##.##0,00\"),\" €\")","v":"Titelsumme\nMAX\n11.338,18 €"},{"$f":"SUM(R149:R161)","v":9554.7799999999988},null,{"$f":"SUM(T149:T161)","v":0},null,null,{"$f":"SUM(W149:W161)","v":0},null,{"$f":"SUM(Y149:Y161)","v":0},null,{"$f":"IF(AB148=0,\"\",\nIF($L$4=\"MIT\",((AB148/(AVERAGE($AB148,$AI148,$AP148,$AW148,$BD148)))-1)*100,))","v":95.036062229236734},{"$f":"SUM(AB149:AB161)","v":11181.16},null,{"$f":"IF(AC148=\"\",\"\",IF(AC148=\"X\",AB148,AB148*AC148))","v":""},null,{"$f":"SUM(AF149:AF161)","v":0},null,{"$f":"IF(AI148=0,\"\",\nIF($L$4=\"MIT\",((AI148/(AVERAGE($AB148,$AI148,$AP148,$AW148,$BD148)))-1)*100,))","v":97.775005459745444},{"$f":"SUM(AI149:AI161)","v":11338.18},null,{"$f":"IF(AJ148=\"\",\"\",IF(AJ148=\"X\",AI148,AI148*AJ148))","v":""},null,{"$f":"SUM(AM149:AM161)","v":0},null,{"$f":"IF(AP148=0,\"\",\nIF($L$4=\"MIT\",((AP148/(AVERAGE($AB148,$AI148,$AP148,$AW148,$BD148)))-1)*100,))","v":7.1889323110178038},{"$f":"SUM(AP149:AP161)","v":6145},null,"",null,{"$f":"SUM(AT149:AT161)","v":0},null,{"$f":"IF(AW148=0,\"\",\nIF($L$4=\"MIT\",((AW148/(AVERAGE($AB148,$AI148,$AP148,$AW148,$BD148)))-1)*100,))","v":""},{"$f":"SUM(AW149:AW161)","v":0},null,"",null,{"$f":"SUM(BA149:BA161)","v":0},null,{"$f":"IF(BD148=0,\"\",\nIF($L$4=\"MIT\",((BD148/(AVERAGE($AB148,$AI148,$AP148,$AW148,$BD148)))-1)*100,))","v":""},{"$f":"SUM(BD149:BD161)","v":0},null,"",null,{"$f":"SUM(BH149:BH161)","v":0}]
[null,null,null,null,null,null,{"$f":"G$148","v":7},{"$f":"IF(G$162=\"\",\"\",ROW()-ROW(G$148))","v":1},"BauderSOLAR GF inkl. MST-Folie - Grundfuß inkl. Manschette für ein PVC Foliendach","Position",{"$f":"IF(J149=\"Position\",\"\",IF(J149=\"Grundposition\",\"G\",IF(J149=\"Alternativposition\",\"A\",IF(J149=\"Bedarfsposition\",\"B\",IF(J149=\"Hinweis\",\"H\",IF(J149=\"Ausführungsbeschreibung\",\"AB\",IF(J149=\"Entfällt\",\"E\",IF(AND(I149<>\"\",L149<>\"\"),\"<-- Bitte Positionsart\",\"\"))))))))","v":""},61,"Stck.",null,{"$f":"IF(OR($K149=\"B\",$K149=\"A\",$K149=\"H\",$K149=\"AB\",$K149=\"<-- Bitte Positionsart\",SUM(AA149,AH149,AO149,AV149,BC149)=0),\"\",MIN(AA149,AH149,AO149,AV149,BC149))","v":45},{"$f":"IF(OR($K149=\"B\",$K149=\"A\",$K149=\"H\",$K149=\"AB\",$K149=\"<-- Bitte Positionsart\",SUM(AA149,AH149,AO149,AV149,BC149)=0),\"\",SUM(AA149,AH149,AO149,AV149,BC149)/COUNT(AA149,AH149,AO149,AV149,BC149))","v":51.713333333333331},{"$f":"IF(OR($K149=\"B\",$K149=\"A\",$K149=\"H\",$K149=\"AB\",$K149=\"<-- Bitte Positionsart\",SUM(AA149,AH149,AO149,AV149,BC149)=0),\"\",MAX(AA149,AH149,AO149,AV149,BC149))","v":55.38},{"$f":"IF(OR($K149=\"A\",$K149=\"B\"),\"Nur EP        \",IF($K149=\"E\",\"E                \",IF(AND($L149<>\"\",P149<>\"\"),$L149*P149,\"\")))","v":3154.5133333333333},null,{"$f":"IF(OR($K149=\"\",$K149=\"H\",$K149=\"AB\",$K149=\"G\",$K149=\"<-- Bitte Positionsart\"),\"\",IF(OR($K149=\"A\",$K149=\"B\"),$L149*(SUM(AA149,AH149,AO149,AV149,BC149)/COUNT(AA149,AH149,AO149,AV149,BC149)),IF($K149=\"E\",$L149*P149)))","v":""},null,null,{"$f":"IF(OR($K149=\"A\",$K149=\"B\"),\"Nur EP        \",IF($K149=\"E\",\"E                \",IF(AND($L149<>\"\",V149<>\"\"),$L149*V149,\"\")))","v":""},{"$f":"IF(OR($L149=\"\",W149=\"\"),\"\",\nIF(OR($W149=\"Nur EP        \",$K149=\"E\"),(Y149/(AVERAGE($Y149,$AF149,$AM149,$AT149,Y149))-1),\nIF(AND($W149,$AB149,$AI149,$AP149,$AW149)=\"\",\"\",(W149/(AVERAGE($W149,$AB149,$AI149,$AP149,$AW149)))-1)))","v":""},{"$f":"IF(OR($K149=\"\",$K149=\"H\",$K149=\"AB\",$K149=\"G\",$J149=\"Position\",$K149=\"<-- Bitte Positionsart\",V149=\"\",$L149=\"\"),\"\",\nIF(OR($K149=\"A\",$K149=\"B\",$K149=\"E\"),$L149*V149))","v":""},null,54.76,{"$f":"IF(C149=\"Hinweis\",\"\",IF(OR($K149=\"A\",$K149=\"B\"),\"Nur EP        \",IF($K149=\"E\",\"E                \",IF(AND($L149<>\"\",AA149<>\"\"),$L149*AA149,\"\"))))","v":3340.3599999999997},null,"",{"$f":"IF(OR($L149=\"\",AA149=\"\",$J149=\"Ausführungsbeschreibung\",$J149=\"Hinweis\"),\"\",\nIF(AND($AA149,$AH149,$AO149,$AV149,$BC149)=\"\",\"\",\nIF($L$4=\"MIT\",\nIF(OR(AB149=\"Nur EP        \",$K149=\"E\"),((AF149/(AVERAGE($AF149,$AM149,$AT149,$BA149,$BH149)))-1),\nIF($L$4=\"MIT\",((AB149/(AVERAGE($AB149,$AI149,$AP149,$AW149,$BD149)))-1),\nIF($L$4=\"MIN\",\nIF(OR(AB149=\"Nur EP        \",$K149=\"E\"),((AF149/(MIN($AF149,$AM149,$AT149,$BA149,$BH149)))-1),\nIF($L$4=\"MIN\",((AB149/(MIN($AB149,$AI149,$AP149,$AW149,$BD149)))-1))\n)))))))","v":5.8914528812685107E-2},{"$f":"IF(OR($K149=\"\",$K149=\"H\",$K149=\"AB\",$K149=\"G\",$J149=\"Position\",$K149=\"<-- Bitte Positionsart\",AA149=\"\",$L149=\"\"),\"\",\nIF(OR($K149=\"A\",$K149=\"B\",$K149=\"E\"),$L149*AA149))","v":""},null,55.38,{"$f":"IF(J149=\"Hinweis\",\"\",IF(OR($K149=\"A\",$K149=\"B\"),\"Nur EP        \",IF($K149=\"E\",\"E                \",IF(AND($L149<>\"\",AH149<>\"\"),$L149*AH149,\"\"))))","v":3378.1800000000003},null,"",{"$f":"IF(OR($L149=\"\",AH149=\"\",$J149=\"Ausführungsbeschreibung\",$J149=\"Hinweis\"),\"\",\nIF(AND($AA149,$AH149,$AO149,$AV149,$BC149)=\"\",\"\",\nIF($L$4=\"MIT\",\nIF(OR(AI149=\"Nur EP        \",$K149=\"E\"),((AM149/(AVERAGE($AF149,$AM149,$AT149,$BA149,$BH149)))-1),\nIF($L$4=\"MIT\",((AI149/(AVERAGE($AB149,$AI149,$AP149,$AW149,$BD149)))-1),\nIF($L$4=\"MIN\",\nIF(OR(AI149=\"Nur EP        \",$K149=\"E\"),((AM149/(MIN($AF149,$AM149,$AT149,$BA149,$BH149)))-1),\nIF($L$4=\"MIN\",(AI149/(MIN($AB149,$AI149,$AP149,$AW149,$BD149)))-1)\n)))))))","v":7.0903699883975602E-2},{"$f":"IF(OR($K149=\"\",$K149=\"H\",$K149=\"AB\",$K149=\"G\",$J149=\"Position\",$K149=\"<-- Bitte Positionsart\",AH149=\"\",$L149=\"\"),\"\",\nIF(OR($K149=\"A\",$K149=\"B\",$K149=\"E\"),$L149*AH149))","v":""},null,45,{"$f":"IF(P149=\"Hinweis\",\"\",IF(OR($K149=\"A\",$K149=\"B\"),\"Nur EP        \",IF($K149=\"E\",\"E                \",IF(AND($L149<>\"\",AO149<>\"\"),$L149*AO149,\"\"))))","v":2745},null,"",{"$f":"IF(OR($L149=\"\",AO149=\"\",$J149=\"Ausführungsbeschreibung\",$J149=\"Hinweis\"),\"\",\nIF(AND($AA149,$AH149,$AO149,$AV149,$BC149)=\"\",\"\",\nIF($L$4=\"MIT\",\nIF(OR(AP149=\"Nur EP        \",$K149=\"E\"),((AT149/(AVERAGE($AF149,$AM149,$AT149,$BA149,$BH149)))-1),\nIF($L$4=\"MIT\",((AP149/(AVERAGE($AB149,$AI149,$AP149,$AW149,$BD149)))-1),\nIF($L$4=\"MIN\",\nIF(OR(AP149=\"Nur EP        \",$K149=\"E\"),((AT149/(MIN($AF149,$AM149,$AT149,$BA149,$BH149)))-1),\nIF($L$4=\"MIN\",(AP149/(MIN($AB149,$AI149,$AP149,$AW149,$BD149)))-1)\n)))))))","v":-0.12981822869666115},{"$f":"IF(OR($K149=\"\",$K149=\"H\",$K149=\"AB\",$K149=\"G\",$J149=\"Position\",$K149=\"<-- Bitte Positionsart\",AO149=\"\",$L149=\"\"),\"\",\nIF(OR($K149=\"A\",$K149=\"B\",$K149=\"E\"),$L149*AO149))","v":""},null,null,{"$f":"IF(W149=\"Hinweis\",\"\",IF(OR($K149=\"A\",$K149=\"B\"),\"Nur EP        \",IF($K149=\"E\",\"E                \",IF(AND($L149<>\"\",AV149<>\"\"),$L149*AV149,\"\"))))","v":""},null,"",{"$f":"IF(OR($L149=\"\",AV149=\"\",$J149=\"Ausführungsbeschreibung\",$J149=\"Hinweis\"),\"\",\nIF(AND($AA149,$AH149,$AO149,$AV149,$BC149)=\"\",\"\",\nIF($L$4=\"MIT\",\nIF(OR(AW149=\"Nur EP        \",$K149=\"E\"),((BA149/(AVERAGE($AF149,$AM149,$AT149,$BA149,$BH149)))-1),\nIF($L$4=\"MIT\",((AW149/(AVERAGE($AB149,$AI149,$AP149,$AW149,$BD149)))-1),\nIF($L$4=\"MIN\",\nIF(OR(AW149=\"Nur EP        \",$K149=\"E\"),((BA149/(MIN($AF149,$AM149,$AT149,$BA149,$BH149)))-1),\nIF($L$4=\"MIN\",(AW149/(MIN($AB149,$AI149,$AP149,$AW149,$BD149)))-1)\n)))))))","v":""},{"$f":"IF(OR($K149=\"\",$K149=\"H\",$K149=\"AB\",$K149=\"G\",$J149=\"Position\",$K149=\"<-- Bitte Positionsart\",AV149=\"\",$L149=\"\"),\"\",\nIF(OR($K149=\"A\",$K149=\"B\",$K149=\"E\"),$L149*AV149))","v":""},null,null,{"$f":"IF(AD149=\"Hinweis\",\"\",IF(OR($K149=\"A\",$K149=\"B\"),\"Nur EP        \",IF($K149=\"E\",\"E                \",IF(AND($L149<>\"\",BC149<>\"\"),$L149*BC149,\"\"))))","v":""},null,"",{"$f":"IF(OR($L149=\"\",BC149=\"\",$J149=\"Ausführungsbeschreibung\",$J149=\"Hinweis\"),\"\",\nIF(AND($AA149,$AH149,$AO149,$AV149,$BC149)=\"\",\"\",\nIF($L$4=\"MIT\",\nIF(OR(BD149=\"Nur EP        \",$K149=\"E\"),((BH149/(AVERAGE($AF149,$AM149,$AT149,$BA149,$BH149)))-1),\nIF($L$4=\"MIT\",((BD149/(AVERAGE($AB149,$AI149,$AP149,$AW149,$BD149)))-1),\nIF($L$4=\"MIN\",\nIF(OR(BD149=\"Nur EP        \",$K149=\"E\"),((BH149/(MIN($AF149,$AM149,$AT149,$BA149,$BH149)))-1),\nIF($L$4=\"MIN\",((BD149/(MIN($AB149,$AI149,$AP149,$AW149,$BD149)))-1))\n)))))))","v":""},{"$f":"IF(OR($K149=\"\",$K149=\"H\",$K149=\"AB\",$K149=\"G\",$J149=\"Position\",$K149=\"<-- Bitte Positionsart\",BC149=\"\",$L149=\"\"),\"\",\nIF(OR($K149=\"A\",$K149=\"B\",$K149=\"E\"),$L149*BC149))","v":""}]
[null,null,null,null,null,null,{"$f":"G$148","v":7},2,"BauderSOLAR F XL Durchdringungsfrei PV-Unterkonstruktion","Position",{"$f":"IF(J150=\"Position\",\"\",IF(J150=\"Grundposition\",\"G\",IF(J150=\"Alternativposition\",\"A\",IF(J150=\"Bedarfsposition\",\"B\",IF(J150=\"Hinweis\",\"H\",IF(J150=\"Ausführungsbeschreibung\",\"AB\",IF(J150=\"Entfällt\",\"E\",IF(AND(I150<>\"\",L150<>\"\"),\"<-- Bitte Positionsart\",\"\"))))))))","v":""},40,"Stck.",null,{"$f":"IF(OR($K150=\"B\",$K150=\"A\",$K150=\"H\",$K150=\"AB\",$K150=\"<-- Bitte Positionsart\",SUM(AA150,AH150,AO150,AV150,BC150)=0),\"\",MIN(AA150,AH150,AO150,AV150,BC150))","v":85},{"$f":"IF(OR($K150=\"B\",$K150=\"A\",$K150=\"H\",$K150=\"AB\",$K150=\"<-- Bitte Positionsart\",SUM(AA150,AH150,AO150,AV150,BC150)=0),\"\",SUM(AA150,AH150,AO150,AV150,BC150)/COUNT(AA150,AH150,AO150,AV150,BC150))","v":160.00666666666666},{"$f":"IF(OR($K150=\"B\",$K150=\"A\",$K150=\"H\",$K150=\"AB\",$K150=\"<-- Bitte Positionsart\",SUM(AA150,AH150,AO150,AV150,BC150)=0),\"\",MAX(AA150,AH150,AO150,AV150,BC150))","v":199},{"$f":"IF(OR($K150=\"A\",$K150=\"B\"),\"Nur EP        \",IF($K150=\"E\",\"E                \",IF(AND($L150<>\"\",P150<>\"\"),$L150*P150,\"\")))","v":6400.2666666666664},null,{"$f":"IF(OR($K150=\"\",$K150=\"H\",$K150=\"AB\",$K150=\"G\",$K150=\"<-- Bitte Positionsart\"),\"\",IF(OR($K150=\"A\",$K150=\"B\"),$L150*(SUM(AA150,AH150,AO150,AV150,BC150)/COUNT(AA150,AH150,AO150,AV150,BC150)),IF($K150=\"E\",$L150*P150)))","v":""},null,null,"","",{"$f":"IF(OR($K150=\"\",$K150=\"H\",$K150=\"AB\",$K150=\"G\",$J150=\"Position\",$K150=\"<-- Bitte Positionsart\",V150=\"\",$L150=\"\"),\"\",\nIF(OR($K150=\"A\",$K150=\"B\",$K150=\"E\"),$L150*V150))","v":""},null,196.02,7840.8,null,"",0.22507395525186458,{"$f":"IF(OR($K150=\"\",$K150=\"H\",$K150=\"AB\",$K150=\"G\",$J150=\"Position\",$K150=\"<-- Bitte Positionsart\",AA150=\"\",$L150=\"\"),\"\",\nIF(OR($K150=\"A\",$K150=\"B\",$K150=\"E\"),$L150*AA150))","v":""},null,199,7960,null,"",{"$f":"IF(OR($L150=\"\",AH150=\"\",$J150=\"Ausführungsbeschreibung\",$J150=\"Hinweis\"),\"\",\nIF(AND($AA150,$AH150,$AO150,$AV150,$BC150)=\"\",\"\",\nIF($L$4=\"MIT\",\nIF(OR(AI150=\"Nur EP        \",$K150=\"E\"),((AM150/(AVERAGE($AF150,$AM150,$AT150,$BA150,$BH150)))-1),\nIF($L$4=\"MIT\",((AI150/(AVERAGE($AB150,$AI150,$AP150,$AW150,$BD150)))-1),\nIF($L$4=\"MIN\",\nIF(OR(AI150=\"Nur EP        \",$K150=\"E\"),((AM150/(MIN($AF150,$AM150,$AT150,$BA150,$BH150)))-1),\nIF($L$4=\"MIN\",(AI150/(MIN($AB150,$AI150,$AP150,$AW150,$BD150)))-1)\n)))))))","v":0.24369817924253168},{"$f":"IF(OR($K150=\"\",$K150=\"H\",$K150=\"AB\",$K150=\"G\",$J150=\"Position\",$K150=\"<-- Bitte Positionsart\",AH150=\"\",$L150=\"\"),\"\",\nIF(OR($K150=\"A\",$K150=\"B\",$K150=\"E\"),$L150*AH150))","v":""},null,85,3400,null,"",{"$f":"IF(OR($L150=\"\",AO150=\"\",$J150=\"Ausführungsbeschreibung\",$J150=\"Hinweis\"),\"\",\nIF(AND($AA150,$AH150,$AO150,$AV150,$BC150)=\"\",\"\",\nIF($L$4=\"MIT\",\nIF(OR(AP150=\"Nur EP        \",$K150=\"E\"),((AT150/(AVERAGE($AF150,$AM150,$AT150,$BA150,$BH150)))-1),\nIF($L$4=\"MIT\",((AP150/(AVERAGE($AB150,$AI150,$AP150,$AW150,$BD150)))-1),\nIF($L$4=\"MIN\",\nIF(OR(AP150=\"Nur EP        \",$K150=\"E\"),((AT150/(MIN($AF150,$AM150,$AT150,$BA150,$BH150)))-1),\nIF($L$4=\"MIN\",(AP150/(MIN($AB150,$AI150,$AP150,$AW150,$BD150)))-1)\n)))))))","v":-0.46877213449439603},{"$f":"IF(OR($K150=\"\",$K150=\"H\",$K150=\"AB\",$K150=\"G\",$J150=\"Position\",$K150=\"<-- Bitte Positionsart\",AO150=\"\",$L150=\"\"),\"\",\nIF(OR($K150=\"A\",$K150=\"B\",$K150=\"E\"),$L150*AO150))","v":""},null,null,"",null,"",{"$f":"IF(OR($L150=\"\",AV150=\"\",$J150=\"Ausführungsbeschreibung\",$J150=\"Hinweis\"),\"\",\nIF(AND($AA150,$AH150,$AO150,$AV150,$BC150)=\"\",\"\",\nIF($L$4=\"MIT\",\nIF(OR(AW150=\"Nur EP        \",$K150=\"E\"),((BA150/(AVERAGE($AF150,$AM150,$AT150,$BA150,$BH150)))-1),\nIF($L$4=\"MIT\",((AW150/(AVERAGE($AB150,$AI150,$AP150,$AW150,$BD150)))-1),\nIF($L$4=\"MIN\",\nIF(OR(AW150=\"Nur EP        \",$K150=\"E\"),((BA150/(MIN($AF150,$AM150,$AT150,$BA150,$BH150)))-1),\nIF($L$4=\"MIN\",(AW150/(MIN($AB150,$AI150,$AP150,$AW150,$BD150)))-1)\n)))))))","v":""},{"$f":"IF(OR($K150=\"\",$K150=\"H\",$K150=\"AB\",$K150=\"G\",$J150=\"Position\",$K150=\"<-- Bitte Positionsart\",AV150=\"\",$L150=\"\"),\"\",\nIF(OR($K150=\"A\",$K150=\"B\",$K150=\"E\"),$L150*AV150))","v":""},null,null,"",null,"",{"$f":"IF(OR($L150=\"\",BC150=\"\",$J150=\"Ausführungsbeschreibung\",$J150=\"Hinweis\"),\"\",\nIF(AND($AA150,$AH150,$AO150,$AV150,$BC150)=\"\",\"\",\nIF($L$4=\"MIT\",\nIF(OR(BD150=\"Nur EP        \",$K150=\"E\"),((BH150/(AVERAGE($AF150,$AM150,$AT150,$BA150,$BH150)))-1),\nIF($L$4=\"MIT\",((BD150/(AVERAGE($AB150,$AI150,$AP150,$AW150,$BD150)))-1),\nIF($L$4=\"MIN\",\nIF(OR(BD150=\"Nur EP        \",$K150=\"E\"),((BH150/(MIN($AF150,$AM150,$AT150,$BA150,$BH150)))-1),\nIF($L$4=\"MIN\",((BD150/(MIN($AB150,$AI150,$AP150,$AW150,$BD150)))-1))\n)))))))","v":""},{"$f":"IF(OR($K150=\"\",$K150=\"H\",$K150=\"AB\",$K150=\"G\",$J150=\"Position\",$K150=\"<-- Bitte Positionsart\",BC150=\"\",$L150=\"\"),\"\",\nIF(OR($K150=\"A\",$K150=\"B\",$K150=\"E\"),$L150*BC150))","v":""}]
[null,null,null,null,null,null,7,3,null,null,"",null,null,null,"","","","",null,"",null,null,"","","",null,null,"",null,"","",{"$f":"IF(OR($K151=\"\",$K151=\"H\",$K151=\"AB\",$K151=\"G\",$J151=\"Position\",$K151=\"<-- Bitte Positionsart\",AA151=\"\",$L151=\"\"),\"\",\nIF(OR($K151=\"A\",$K151=\"B\",$K151=\"E\"),$L151*AA151))","v":""},null,null,"",null,"","",{"$f":"IF(OR($K151=\"\",$K151=\"H\",$K151=\"AB\",$K151=\"G\",$J151=\"Position\",$K151=\"<-- Bitte Positionsart\",AH151=\"\",$L151=\"\"),\"\",\nIF(OR($K151=\"A\",$K151=\"B\",$K151=\"E\"),$L151*AH151))","v":""},null,null,"",null,"","",{"$f":"IF(OR($K151=\"\",$K151=\"H\",$K151=\"AB\",$K151=\"G\",$J151=\"Position\",$K151=\"<-- Bitte Positionsart\",AO151=\"\",$L151=\"\"),\"\",\nIF(OR($K151=\"A\",$K151=\"B\",$K151=\"E\"),$L151*AO151))","v":""},null,null,"",null,"","","",null,null,"",null,"","",{"$f":"IF(OR($K151=\"\",$K151=\"H\",$K151=\"AB\",$K151=\"G\",$J151=\"Position\",$K151=\"<-- Bitte Positionsart\",BC151=\"\",$L151=\"\"),\"\",\nIF(OR($K151=\"A\",$K151=\"B\",$K151=\"E\"),$L151*BC151))","v":""}]
[null,null,null,null,null,null,7,4,null,null,"",null,null,null,"","","","",null,"",null,null,"","","",null,null,"",null,"","","",null,null,"",null,"","","",null,null,"",null,"","","",null,null,"",null,"","","",null,null,"",null,"","",""]
[null,null,null,null,null,null,7,5,null,null,"",null,null,null,"","","","",null,"",null,null,"","","",null,null,"",null,"","","",null,null,"",null,"","","",null,null,"",null,"","","",null,null,"",null,"","","",null,null,"",null,"","",""]
[null,null,null,null,null,null,7,6,null,null,"",null,null,null,"","","","",null,"",null,null,"","","",null,null,"",null,"","","",null,null,"",null,"","","",null,null,"",null,"","","",null,null,"",null,"","","",null,null,"",null,"","",""]
[null,null,null,null,null,null,7,7,null,null,"",null,null,null,"","","","",null,"",null,null,"","",{"$f":"IF(OR($K155=\"\",$K155=\"H\",$K155=\"AB\",$K155=\"G\",$J155=\"Position\",$K155=\"<-- Bitte Positionsart\",V155=\"\",$L155=\"\"),\"\",\nIF(OR($K155=\"A\",$K155=\"B\",$K155=\"E\"),$L155*V155))","v":""},null,null,"",null,"","","",null,null,"",null,"","","",null,null,"",null,"","","",null,null,"",null,"","","",null,null,"",null,"","",""]
[null,null,null,null,null,null,7,8,null,null,"",null,null,null,"","","","",null,"",null,null,"","","",null,null,"",null,"","","",null,null,"",null,"","","",null,null,"",null,"","","",null,null,"",null,"","","",null,null,"",null,"","",""]
[null,null,null,null,null,null,7,9,null,null,"",null,null,null,"","","","",null,"",null,null,"","","",null,null,"",null,"","","",null,null,"",null,"","","",null,null,"",null,"","","",null,null,"",null,"","","",null,null,"",null,"","",""]
[null,null,null,null,null,null,7,10,null,null,"",null,null,null,"","","","",null,"",null,null,"","","",null,null,"",null,"","","",null,null,"",null,"","","",null,null,"",null,"","","",null,null,"",null,"","","",null,null,"",null,"","",""]
[null,null,null,null,null,null,7,11,null,null,"",null,null,null,"","","","",null,"",null,null,"","","",null,null,"",null,"","","",null,null,"",null,"","","",null,null,"",null,"","","",null,null,{"$f":"IF(W159=\"Hinweis\",\"\",IF(OR($K159=\"A\",$K159=\"B\"),\"Nur EP        \",IF($K159=\"E\",\"E                \",IF(AND($L159<>\"\",AV159<>\"\"),$L159*AV159,\"\"))))","v":""},null,{"$f":"IF(AX159=\"\",\"\",IF(AX159=\"X\",AW159,AW159*AX159))","v":""},{"$f":"IF(OR($L159=\"\",AV159=\"\",$J159=\"Ausführungsbeschreibung\",$J159=\"Hinweis\"),\"\",\nIF(AND($AA159,$AH159,$AO159,$AV159,$BC159)=\"\",\"\",\nIF($L$4=\"MIT\",\nIF(OR(AW159=\"Nur EP        \",$K159=\"E\"),((BA159/(AVERAGE($AF159,$AM159,$AT159,$BA159,$BH159)))-1),\nIF($L$4=\"MIT\",((AW159/(AVERAGE($AB159,$AI159,$AP159,$AW159,$BD159)))-1),\nIF($L$4=\"MIN\",\nIF(OR(AW159=\"Nur EP        \",$K159=\"E\"),((BA159/(MIN($AF159,$AM159,$AT159,$BA159,$BH159)))-1),\nIF($L$4=\"MIN\",(AW159/(MIN($AB159,$AI159,$AP159,$AW159,$BD159)))-1)\n)))))))","v":""},{"$f":"IF(OR($K159=\"\",$K159=\"H\",$K159=\"AB\",$K159=\"G\",$J159=\"Position\",$K159=\"<-- Bitte Positionsart\",AV159=\"\",$L159=\"\"),\"\",\nIF(OR($K159=\"A\",$K159=\"B\",$K159=\"E\"),$L159*AV159))","v":""},null,null,"",null,"","",""]
[null,null,null,null,null,null,7,12,null,null,"",null,null,null,"","","","",null,"",null,null,"","","",null,null,"",null,"","","",null,null,"",null,"","","",null,null,"",null,"",{"$f":"IF(OR($L160=\"\",AO160=\"\",$J160=\"Ausführungsbeschreibung\",$J160=\"Hinweis\"),\"\",\nIF(AND($AA160,$AH160,$AO160,$AV160,$BC160)=\"\",\"\",\nIF($L$4=\"MIT\",\nIF(OR(AP160=\"Nur EP        \",$K160=\"E\"),((AT160/(AVERAGE($AF160,$AM160,$AT160,$BA160,$BH160)))-1),\nIF($L$4=\"MIT\",((AP160/(AVERAGE($AB160,$AI160,$AP160,$AW160,$BD160)))-1),\nIF($L$4=\"MIN\",\nIF(OR(AP160=\"Nur EP        \",$K160=\"E\"),((AT160/(MIN($AF160,$AM160,$AT160,$BA160,$BH160)))-1),\nIF($L$4=\"MIN\",(AP160/(MIN($AB160,$AI160,$AP160,$AW160,$BD160)))-1)\n)))))))","v":""},"",null,null,"",null,"",{"$f":"IF(OR($L160=\"\",AV160=\"\",$J160=\"Ausführungsbeschreibung\",$J160=\"Hinweis\"),\"\",\nIF(AND($AA160,$AH160,$AO160,$AV160,$BC160)=\"\",\"\",\nIF($L$4=\"MIT\",\nIF(OR(AW160=\"Nur EP        \",$K160=\"E\"),((BA160/(AVERAGE($AF160,$AM160,$AT160,$BA160,$BH160)))-1),\nIF($L$4=\"MIT\",((AW160/(AVERAGE($AB160,$AI160,$AP160,$AW160,$BD160)))-1),\nIF($L$4=\"MIN\",\nIF(OR(AW160=\"Nur EP        \",$K160=\"E\"),((BA160/(MIN($AF160,$AM160,$AT160,$BA160,$BH160)))-1),\nIF($L$4=\"MIN\",(AW160/(MIN($AB160,$AI160,$AP160,$AW160,$BD160)))-1)\n)))))))","v":""},{"$f":"IF(OR($K160=\"\",$K160=\"H\",$K160=\"AB\",$K160=\"G\",$J160=\"Position\",$K160=\"<-- Bitte Positionsart\",AV160=\"\",$L160=\"\"),\"\",\nIF(OR($K160=\"A\",$K160=\"B\",$K160=\"E\"),$L160*AV160))","v":""},null,null,"",null,{"$f":"IF(BE160=\"\",\"\",IF(BE160=\"X\",BD160,BD160*BE160))","v":""},{"$f":"IF(OR($L160=\"\",BC160=\"\",$J160=\"Ausführungsbeschreibung\",$J160=\"Hinweis\"),\"\",\nIF(AND($AA160,$AH160,$AO160,$AV160,$BC160)=\"\",\"\",\nIF($L$4=\"MIT\",\nIF(OR(BD160=\"Nur EP        \",$K160=\"E\"),((BH160/(AVERAGE($AF160,$AM160,$AT160,$BA160,$BH160)))-1),\nIF($L$4=\"MIT\",((BD160/(AVERAGE($AB160,$AI160,$AP160,$AW160,$BD160)))-1),\nIF($L$4=\"MIN\",\nIF(OR(BD160=\"Nur EP        \",$K160=\"E\"),((BH160/(MIN($AF160,$AM160,$AT160,$BA160,$BH160)))-1),\nIF($L$4=\"MIN\",((BD160/(MIN($AB160,$AI160,$AP160,$AW160,$BD160)))-1))\n)))))))","v":""},""]
[null,null,null,null,null,null,null,null,null,null,null,null,null,null,null,null,null,null,null,null,null,null,{"$f":"IF(OR($K161=\"A\",$K161=\"B\"),\"Nur EP        \",IF($K161=\"E\",\"\",IF(AND($L161<>\"\",V161<>\"\"),$L161*V161,\"\")))","v":""},null,{"$f":"IF($K161=\"Ja\",IF(AND($L161<>\"\",V161<>\"\"),$L161*V161),\"\")","v":""},null,"EP / % Titel","Positions- / Titelsumme",null,"",null,{"$f":"IF($K161=\"Ja\",IF(AND($L161<>\"\",AA161<>\"\"),$L161*AA161),\"\")","v":""},null,"EP / % Titel","Positions- / Titelsumme",null,"",null,{"$f":"IF($K161=\"Ja\",IF(AND($L161<>\"\",AH161<>\"\"),$L161*AH161),\"\")","v":""},null,"EP / % Titel","Positions- / Titelsumme",null,"",null,{"$f":"IF($K161=\"Ja\",IF(AND($L161<>\"\",AO161<>\"\"),$L161*AO161),\"\")","v":""},null,"EP / % Titel","Positions- / Titelsumme",null,"",null,{"$f":"IF($K161=\"Ja\",IF(AND($L161<>\"\",AV161<>\"\"),$L161*AV161),\"\")","v":""},null,"EP / % Titel","Positions- / Titelsumme",null,"",null,{"$f":"IF($K161=\"Ja\",IF(AND($L161<>\"\",BC161<>\"\"),$L161*BC161),\"\")","v":""}]
[null,null,null,null,null,null,8,null,"Klempnerarbeiten",null,null,null,null,null,{"$f":"CONCATENATE(\"Titelsumme\",CHAR(10),\"MIN\",CHAR(10),TEXT(SUMPRODUCT($L163:$L182,O163:O182),\"##.##0,00\"),\" €\")","v":"Titelsumme\nMIN\n20.458,97 €"},{"$f":"CONCATENATE(\"Titelsumme\",CHAR(10),\"MIT\",CHAR(10),TEXT(SUMPRODUCT($L163:$L182,P163:P182),\"##.##0,00\"),\" €\")","v":"Titelsumme\nMIT\n34.542,41 €"},{"$f":"CONCATENATE(\"Titelsumme\",CHAR(10),\"MAX\",CHAR(10),TEXT(SUMPRODUCT($L163:$L182,Q163:Q182),\"##.##0,00\"),\" €\")","v":"Titelsumme\nMAX\n42.197,08 €"},{"$f":"SUM(R163:R182)","v":34542.409999999996},null,{"$f":"SUM(T163:T182)","v":5485.22},null,null,{"$f":"SUM(W163:W182)","v":0},null,{"$f":"SUM(Y163:Y182)","v":0},null,{"$f":"IF(AB162=0,\"\",\nIF($L$4=\"MIT\",((AB162/(AVERAGE($AB162,$AI162,$AP162,$AW162,$BD162)))-1)*100,))","v":97.685589009761159},{"$f":"SUM(AB163:AB182)","v":40971.219999999994},null,{"$f":"IF(AC162=\"\",\"\",IF(AC162=\"X\",AB162,AB162*AC162))","v":""},null,{"$f":"SUM(AF163:AF182)","v":5774.48},null,{"$f":"IF(AI162=0,\"\",\nIF($L$4=\"MIT\",((AI162/(AVERAGE($AB162,$AI162,$AP162,$AW162,$BD162)))-1)*100,))","v":101.2883582818917},{"$f":"SUM(AI163:AI182)","v":41717.910000000003},null,"",null,{"$f":"SUM(AM163:AM182)","v":5774.48},null,{"$f":"IF(AP162=0,\"\",\nIF($L$4=\"MIT\",((AP162/(AVERAGE($AB162,$AI162,$AP162,$AW162,$BD162)))-1)*100,))","v":1.0260527083469917},{"$f":"SUM(AP163:AP182)","v":20938.099999999999},null,"",null,{"$f":"SUM(AT163:AT182)","v":2889},null,{"$f":"IF(AW162=0,\"\",\nIF($L$4=\"MIT\",((AW162/(AVERAGE($AB162,$AI162,$AP162,$AW162,$BD162)))-1)*100,))","v":""},{"$f":"SUM(AW163:AW182)","v":0},null,"",null,{"$f":"SUM(BA163:BA182)","v":0},null,{"$f":"IF(BD162=0,\"\",\nIF($L$4=\"MIT\",((BD162/(AVERAGE($AB162,$AI162,$AP162,$AW162,$BD162)))-1)*100,))","v":""},{"$f":"SUM(BD163:BD182)","v":0},null,{"$f":"IF(BE162=\"\",\"\",IF(BE162=\"X\",BD162,BD162*BE162))","v":""},null,{"$f":"SUM(BH163:BH182)","v":0}]
[null,null,null,null,null,null,{"$f":"G$162","v":8},{"$f":"IF(G$162=\"\",\"\",ROW()-ROW(G$162))","v":1},"Allgemeines zu Zinkblecharbeiten","Hinweis",{"$f":"IF(J163=\"Position\",\"\",IF(J163=\"Grundposition\",\"G\",IF(J163=\"Alternativposition\",\"A\",IF(J163=\"Bedarfsposition\",\"B\",IF(J163=\"Hinweis\",\"H\",IF(J163=\"Ausführungsbeschreibung\",\"AB\",IF(J163=\"Entfällt\",\"E\",IF(AND(I163<>\"\",L163<>\"\"),\"<-- Bitte Positionsart\",\"\"))))))))","v":"H"},null,null,null,{"$f":"IF(OR($K163=\"B\",$K163=\"A\",$K163=\"H\",$K163=\"AB\",$K163=\"<-- Bitte Positionsart\",SUM(AA163,AH163,AO163,AV163,BC163)=0),\"\",MIN(AA163,AH163,AO163,AV163,BC163))","v":""},{"$f":"IF(OR($K163=\"B\",$K163=\"A\",$K163=\"H\",$K163=\"AB\",$K163=\"<-- Bitte Positionsart\",SUM(AA163,AH163,AO163,AV163,BC163)=0),\"\",SUM(AA163,AH163,AO163,AV163,BC163)/COUNT(AA163,AH163,AO163,AV163,BC163))","v":""},{"$f":"IF(OR($K163=\"B\",$K163=\"A\",$K163=\"H\",$K163=\"AB\",$K163=\"<-- Bitte Positionsart\",SUM(AA163,AH163,AO163,AV163,BC163)=0),\"\",MAX(AA163,AH163,AO163,AV163,BC163))","v":""},{"$f":"IF(OR($K163=\"A\",$K163=\"B\"),\"Nur EP        \",IF($K163=\"E\",\"E                \",IF(AND($L163<>\"\",P163<>\"\"),$L163*P163,\"\")))","v":""},null,{"$f":"IF(OR($K163=\"\",$K163=\"H\",$K163=\"AB\",$K163=\"G\",$K163=\"<-- Bitte Positionsart\"),\"\",IF(OR($K163=\"A\",$K163=\"B\"),$L163*(SUM(AA163,AH163,AO163,AV163,BC163)/COUNT(AA163,AH163,AO163,AV163,BC163)),IF($K163=\"E\",$L163*P163)))","v":""},null,null,{"$f":"IF(OR($K163=\"A\",$K163=\"B\"),\"Nur EP        \",IF($K163=\"E\",\"E                \",IF(AND($L163<>\"\",V163<>\"\"),$L163*V163,\"\")))","v":""},{"$f":"IF(OR($L163=\"\",W163=\"\"),\"\",\nIF(OR($W163=\"Nur EP        \",$K163=\"E\"),(Y163/(AVERAGE($Y163,$AF163,$AM163,$AT163,Y163))-1),\nIF(AND($W163,$AB163,$AI163,$AP163,$AW163)=\"\",\"\",(W163/(AVERAGE($W163,$AB163,$AI163,$AP163,$AW163)))-1)))","v":""},{"$f":"IF(OR($K163=\"\",$K163=\"H\",$K163=\"AB\",$K163=\"G\",$J163=\"Position\",$K163=\"<-- Bitte Positionsart\",V163=\"\",$L163=\"\"),\"\",\nIF(OR($K163=\"A\",$K163=\"B\",$K163=\"E\"),$L163*V163))","v":""},null,null,{"$f":"IF(C163=\"Hinweis\",\"\",IF(OR($K163=\"A\",$K163=\"B\"),\"Nur EP        \",IF($K163=\"E\",\"E                \",IF(AND($L163<>\"\",AA163<>\"\"),$L163*AA163,\"\"))))","v":""},null,"",{"$f":"IF(OR($L163=\"\",AA163=\"\",$J163=\"Ausführungsbeschreibung\",$J163=\"Hinweis\"),\"\",\nIF(AND($AA163,$AH163,$AO163,$AV163,$BC163)=\"\",\"\",\nIF($L$4=\"MIT\",\nIF(OR(AB163=\"Nur EP        \",$K163=\"E\"),((AF163/(AVERAGE($AF163,$AM163,$AT163,$BA163,$BH163)))-1),\nIF($L$4=\"MIT\",((AB163/(AVERAGE($AB163,$AI163,$AP163,$AW163,$BD163)))-1),\nIF($L$4=\"MIN\",\nIF(OR(AB163=\"Nur EP        \",$K163=\"E\"),((AF163/(MIN($AF163,$AM163,$AT163,$BA163,$BH163)))-1),\nIF($L$4=\"MIN\",((AB163/(MIN($AB163,$AI163,$AP163,$AW163,$BD163)))-1))\n)))))))","v":""},{"$f":"IF(OR($K163=\"\",$K163=\"H\",$K163=\"AB\",$K163=\"G\",$J163=\"Position\",$K163=\"<-- Bitte Positionsart\",AA163=\"\",$L163=\"\"),\"\",\nIF(OR($K163=\"A\",$K163=\"B\",$K163=\"E\"),$L163*AA163))","v":""},null,null,{"$f":"IF(J163=\"Hinweis\",\"\",IF(OR($K163=\"A\",$K163=\"B\"),\"Nur EP        \",IF($K163=\"E\",\"E                \",IF(AND($L163<>\"\",AH163<>\"\"),$L163*AH163,\"\"))))","v":""},null,{"$f":"IF(AJ163=\"\",\"\",IF(AJ163=\"X\",AI163,AI163*AJ163))","v":""},{"$f":"IF(OR($L163=\"\",AH163=\"\",$J163=\"Ausführungsbeschreibung\",$J163=\"Hinweis\"),\"\",\nIF(AND($AA163,$AH163,$AO163,$AV163,$BC163)=\"\",\"\",\nIF($L$4=\"MIT\",\nIF(OR(AI163=\"Nur EP        \",$K163=\"E\"),((AM163/(AVERAGE($AF163,$AM163,$AT163,$BA163,$BH163)))-1)*100,\nIF($L$4=\"MIT\",((AI163/(AVERAGE($AB163,$AI163,$AP163,$AW163,$BD163)))-1)*100,\nIF($L$4=\"MIN\",\nIF(OR(AI163=\"Nur EP        \",$K163=\"E\"),((AM163/(MIN($AF163,$AM163,$AT163,$BA163,$BH163)))-1)*100,\nIF($L$4=\"MIN\",(AI163/(MIN($AB163,$AI163,$AP163,$AW163,$BD163)))-1)*100\n)))))))","v":""},{"$f":"IF(OR($K163=\"\",$K163=\"H\",$K163=\"AB\",$K163=\"G\",$J163=\"Position\",$K163=\"<-- Bitte Positionsart\",AH163=\"\",$L163=\"\"),\"\",\nIF(OR($K163=\"A\",$K163=\"B\",$K163=\"E\"),$L163*AH163))","v":""},null,null,{"$f":"IF(P163=\"Hinweis\",\"\",IF(OR($K163=\"A\",$K163=\"B\"),\"Nur EP        \",IF($K163=\"E\",\"E                \",IF(AND($L163<>\"\",AO163<>\"\"),$L163*AO163,\"\"))))","v":""},null,{"$f":"IF(AQ163=\"\",\"\",IF(AQ163=\"X\",AP163,AP163*AQ163))","v":""},{"$f":"IF(OR($L163=\"\",AO163=\"\",$J163=\"Ausführungsbeschreibung\",$J163=\"Hinweis\"),\"\",\nIF(AND($AA163,$AH163,$AO163,$AV163,$BC163)=\"\",\"\",\nIF($L$4=\"MIT\",\nIF(OR(AP163=\"Nur EP        \",$K163=\"E\"),((AT163/(AVERAGE($AF163,$AM163,$AT163,$BA163,$BH163)))-1),\nIF($L$4=\"MIT\",((AP163/(AVERAGE($AB163,$AI163,$AP163,$AW163,$BD163)))-1),\nIF($L$4=\"MIN\",\nIF(OR(AP163=\"Nur EP        \",$K163=\"E\"),((AT163/(MIN($AF163,$AM163,$AT163,$BA163,$BH163)))-1),\nIF($L$4=\"MIN\",(AP163/(MIN($AB163,$AI163,$AP163,$AW163,$BD163)))-1)\n)))))))","v":""},{"$f":"IF(OR($K163=\"\",$K163=\"H\",$K163=\"AB\",$K163=\"G\",$J163=\"Position\",$K163=\"<-- Bitte Positionsart\",AO163=\"\",$L163=\"\"),\"\",\nIF(OR($K163=\"A\",$K163=\"B\",$K163=\"E\"),$L163*AO163))","v":""},null,null,{"$f":"IF(W163=\"Hinweis\",\"\",IF(OR($K163=\"A\",$K163=\"B\"),\"Nur EP        \",IF($K163=\"E\",\"E                \",IF(AND($L163<>\"\",AV163<>\"\"),$L163*AV163,\"\"))))","v":""},null,{"$f":"IF(AX163=\"\",\"\",IF(AX163=\"X\",AW163,AW163*AX163))","v":""},{"$f":"IF(OR($L163=\"\",AV163=\"\",$J163=\"Ausführungsbeschreibung\",$J163=\"Hinweis\"),\"\",\nIF(AND($AA163,$AH163,$AO163,$AV163,$BC163)=\"\",\"\",\nIF($L$4=\"MIT\",\nIF(OR(AW163=\"Nur EP        \",$K163=\"E\"),((BA163/(AVERAGE($AF163,$AM163,$AT163,$BA163,$BH163)))-1),\nIF($L$4=\"MIT\",((AW163/(AVERAGE($AB163,$AI163,$AP163,$AW163,$BD163)))-1),\nIF($L$4=\"MIN\",\nIF(OR(AW163=\"Nur EP        \",$K163=\"E\"),((BA163/(MIN($AF163,$AM163,$AT163,$BA163,$BH163)))-1),\nIF($L$4=\"MIN\",(AW163/(MIN($AB163,$AI163,$AP163,$AW163,$BD163)))-1)\n)))))))","v":""},{"$f":"IF(OR($K163=\"\",$K163=\"H\",$K163=\"AB\",$K163=\"G\",$J163=\"Position\",$K163=\"<-- Bitte Positionsart\",AV163=\"\",$L163=\"\"),\"\",\nIF(OR($K163=\"A\",$K163=\"B\",$K163=\"E\"),$L163*AV163))","v":""},null,null,{"$f":"IF(AD163=\"Hinweis\",\"\",IF(OR($K163=\"A\",$K163=\"B\"),\"Nur EP        \",IF($K163=\"E\",\"E                \",IF(AND($L163<>\"\",BC163<>\"\"),$L163*BC163,\"\"))))","v":""},null,"",{"$f":"IF(OR($L163=\"\",BC163=\"\",$J163=\"Ausführungsbeschreibung\",$J163=\"Hinweis\"),\"\",\nIF(AND($AA163,$AH163,$AO163,$AV163,$BC163)=\"\",\"\",\nIF($L$4=\"MIT\",\nIF(OR(BD163=\"Nur EP        \",$K163=\"E\"),((BH163/(AVERAGE($AF163,$AM163,$AT163,$BA163,$BH163)))-1),\nIF($L$4=\"MIT\",((BD163/(AVERAGE($AB163,$AI163,$AP163,$AW163,$BD163)))-1),\nIF($L$4=\"MIN\",\nIF(OR(BD163=\"Nur EP        \",$K163=\"E\"),((BH163/(MIN($AF163,$AM163,$AT163,$BA163,$BH163)))-1),\nIF($L$4=\"MIN\",((BD163/(MIN($AB163,$AI163,$AP163,$AW163,$BD163)))-1))\n)))))))","v":""},{"$f":"IF(OR($K163=\"\",$K163=\"H\",$K163=\"AB\",$K163=\"G\",$J163=\"Position\",$K163=\"<-- Bitte Positionsart\",BC163=\"\",$L163=\"\"),\"\",\nIF(OR($K163=\"A\",$K163=\"B\",$K163=\"E\"),$L163*BC163))","v":""}]
[null,null,null,null,null,null,{"$f":"G$162","v":8},{"$f":"IF(G$162=\"\",\"\",ROW()-ROW(G$162))","v":2},"Neue Dachrinne Steildach 6teilig","Grundposition","G",63,"m",null,35.5,44.793333333333329,49.87,2821.9799999999996,null,"",null,null,"","",{"$f":"IF(OR($K164=\"\",$K164=\"H\",$K164=\"AB\",$K164=\"G\",$J164=\"Position\",$K164=\"<-- Bitte Positionsart\",V164=\"\",$L164=\"\"),\"\",\nIF(OR($K164=\"A\",$K164=\"B\",$K164=\"E\"),$L164*V164))","v":""},null,49.01,3087.6299999999997,null,"",9.4136032147640991E-2,{"$f":"IF(OR($K164=\"\",$K164=\"H\",$K164=\"AB\",$K164=\"G\",$J164=\"Position\",$K164=\"<-- Bitte Positionsart\",AA164=\"\",$L164=\"\"),\"\",\nIF(OR($K164=\"A\",$K164=\"B\",$K164=\"E\"),$L164*AA164))","v":""},null,49.87,3141.81,null,"",{"$f":"IF(OR($L164=\"\",AH164=\"\",$J164=\"Ausführungsbeschreibung\",$J164=\"Hinweis\"),\"\",\nIF(AND($AA164,$AH164,$AO164,$AV164,$BC164)=\"\",\"\",\nIF($L$4=\"MIT\",\nIF(OR(AI164=\"Nur EP        \",$K164=\"E\"),((AM164/(AVERAGE($AF164,$AM164,$AT164,$BA164,$BH164)))-1),\nIF($L$4=\"MIT\",((AI164/(AVERAGE($AB164,$AI164,$AP164,$AW164,$BD164)))-1),\nIF($L$4=\"MIN\",\nIF(OR(AI164=\"Nur EP        \",$K164=\"E\"),((AM164/(MIN($AF164,$AM164,$AT164,$BA164,$BH164)))-1),\nIF($L$4=\"MIN\",(AI164/(MIN($AB164,$AI164,$AP164,$AW164,$BD164)))-1)\n)))))))","v":0.11333531775561845},{"$f":"IF(OR($K164=\"\",$K164=\"H\",$K164=\"AB\",$K164=\"G\",$J164=\"Position\",$K164=\"<-- Bitte Positionsart\",AH164=\"\",$L164=\"\"),\"\",\nIF(OR($K164=\"A\",$K164=\"B\",$K164=\"E\"),$L164*AH164))","v":""},null,35.5,2236.5,null,"",{"$f":"IF(OR($L164=\"\",AO164=\"\",$J164=\"Ausführungsbeschreibung\",$J164=\"Hinweis\"),\"\",\nIF(AND($AA164,$AH164,$AO164,$AV164,$BC164)=\"\",\"\",\nIF($L$4=\"MIT\",\nIF(OR(AP164=\"Nur EP        \",$K164=\"E\"),((AT164/(AVERAGE($AF164,$AM164,$AT164,$BA164,$BH164)))-1),\nIF($L$4=\"MIT\",((AP164/(AVERAGE($AB164,$AI164,$AP164,$AW164,$BD164)))-1),\nIF($L$4=\"MIN\",\nIF(OR(AP164=\"Nur EP        \",$K164=\"E\"),((AT164/(MIN($AF164,$AM164,$AT164,$BA164,$BH164)))-1),\nIF($L$4=\"MIN\",(AP164/(MIN($AB164,$AI164,$AP164,$AW164,$BD164)))-1)\n)))))))","v":-0.20747134990325933},{"$f":"IF(OR($K164=\"\",$K164=\"H\",$K164=\"AB\",$K164=\"G\",$J164=\"Position\",$K164=\"<-- Bitte Positionsart\",AO164=\"\",$L164=\"\"),\"\",\nIF(OR($K164=\"A\",$K164=\"B\",$K164=\"E\"),$L164*AO164))","v":""},null,null,"",null,"",{"$f":"IF(OR($L164=\"\",AV164=\"\",$J164=\"Ausführungsbeschreibung\",$J164=\"Hinweis\"),\"\",\nIF(AND($AA164,$AH164,$AO164,$AV164,$BC164)=\"\",\"\",\nIF($L$4=\"MIT\",\nIF(OR(AW164=\"Nur EP        \",$K164=\"E\"),((BA164/(AVERAGE($AF164,$AM164,$AT164,$BA164,$BH164)))-1),\nIF($L$4=\"MIT\",((AW164/(AVERAGE($AB164,$AI164,$AP164,$AW164,$BD164)))-1),\nIF($L$4=\"MIN\",\nIF(OR(AW164=\"Nur EP        \",$K164=\"E\"),((BA164/(MIN($AF164,$AM164,$AT164,$BA164,$BH164)))-1),\nIF($L$4=\"MIN\",(AW164/(MIN($AB164,$AI164,$AP164,$AW164,$BD164)))-1)\n)))))))","v":""},{"$f":"IF(OR($K164=\"\",$K164=\"H\",$K164=\"AB\",$K164=\"G\",$J164=\"Position\",$K164=\"<-- Bitte Positionsart\",AV164=\"\",$L164=\"\"),\"\",\nIF(OR($K164=\"A\",$K164=\"B\",$K164=\"E\"),$L164*AV164))","v":""},null,null,"",null,"",{"$f":"IF(OR($L164=\"\",BC164=\"\",$J164=\"Ausführungsbeschreibung\",$J164=\"Hinweis\"),\"\",\nIF(AND($AA164,$AH164,$AO164,$AV164,$BC164)=\"\",\"\",\nIF($L$4=\"MIT\",\nIF(OR(BD164=\"Nur EP        \",$K164=\"E\"),((BH164/(AVERAGE($AF164,$AM164,$AT164,$BA164,$BH164)))-1),\nIF($L$4=\"MIT\",((BD164/(AVERAGE($AB164,$AI164,$AP164,$AW164,$BD164)))-1),\nIF($L$4=\"MIN\",\nIF(OR(BD164=\"Nur EP        \",$K164=\"E\"),((BH164/(MIN($AF164,$AM164,$AT164,$BA164,$BH164)))-1),\nIF($L$4=\"MIN\",((BD164/(MIN($AB164,$AI164,$AP164,$AW164,$BD164)))-1))\n)))))))","v":""},{"$f":"IF(OR($K164=\"\",$K164=\"H\",$K164=\"AB\",$K164=\"G\",$J164=\"Position\",$K164=\"<-- Bitte Positionsart\",BC164=\"\",$L164=\"\"),\"\",\nIF(OR($K164=\"A\",$K164=\"B\",$K164=\"E\"),$L164*BC164))","v":""}]
[null,null,null,null,null,null,8,3,"Neue Dachrinne Steildach alternativ 5teilig","Alternativposition","A",63,"m",null,"","","","Nur EP        ",null,3120.18,null,null,"Nur EP        ",{"$error":"#VALUE!"},"",null,53.04,"Nur EP        ",null,"",7.0938215102974711E-2,{"$f":"IF(OR($K165=\"\",$K165=\"H\",$K165=\"AB\",$K165=\"G\",$J165=\"Position\",$K165=\"<-- Bitte Positionsart\",AA165=\"\",$L165=\"\"),\"\",\nIF(OR($K165=\"A\",$K165=\"B\",$K165=\"E\"),$L165*AA165))","v":3341.52},null,53.04,"Nur EP        ",null,"",{"$f":"IF(OR($L165=\"\",AH165=\"\",$J165=\"Ausführungsbeschreibung\",$J165=\"Hinweis\"),\"\",\nIF(AND($AA165,$AH165,$AO165,$AV165,$BC165)=\"\",\"\",\nIF($L$4=\"MIT\",\nIF(OR(AI165=\"Nur EP        \",$K165=\"E\"),((AM165/(AVERAGE($AF165,$AM165,$AT165,$BA165,$BH165)))-1),\nIF($L$4=\"MIT\",((AI165/(AVERAGE($AB165,$AI165,$AP165,$AW165,$BD165)))-1),\nIF($L$4=\"MIN\",\nIF(OR(AI165=\"Nur EP        \",$K165=\"E\"),((AM165/(MIN($AF165,$AM165,$AT165,$BA165,$BH165)))-1),\nIF($L$4=\"MIN\",(AI165/(MIN($AB165,$AI165,$AP165,$AW165,$BD165)))-1)\n)))))))","v":7.0938215102974711E-2},{"$f":"IF(OR($K165=\"\",$K165=\"H\",$K165=\"AB\",$K165=\"G\",$J165=\"Position\",$K165=\"<-- Bitte Positionsart\",AH165=\"\",$L165=\"\"),\"\",\nIF(OR($K165=\"A\",$K165=\"B\",$K165=\"E\"),$L165*AH165))","v":3341.52},null,42.5,"Nur EP        ",null,"",-0.14187643020594976,{"$f":"IF(OR($K165=\"\",$K165=\"H\",$K165=\"AB\",$K165=\"G\",$J165=\"Position\",$K165=\"<-- Bitte Positionsart\",AO165=\"\",$L165=\"\"),\"\",\nIF(OR($K165=\"A\",$K165=\"B\",$K165=\"E\"),$L165*AO165))","v":2677.5},null,null,"Nur EP        ",null,"","","",null,null,"Nur EP        ",null,"","",{"$f":"IF(OR($K165=\"\",$K165=\"H\",$K165=\"AB\",$K165=\"G\",$J165=\"Position\",$K165=\"<-- Bitte Positionsart\",BC165=\"\",$L165=\"\"),\"\",\nIF(OR($K165=\"A\",$K165=\"B\",$K165=\"E\"),$L165*BC165))","v":""}]
[null,null,null,null,null,null,8,4,"Rinnenenddeckel","Position","",12,"Stck.",null,8.5,16.079999999999998,19.91,192.95999999999998,null,"",null,null,"","","",null,19.91,238.92000000000002,null,"",0.23818407960199006,"",null,19.829999999999998,237.95999999999998,null,"",0.23320895522388052,"",null,8.5,102,null,"",-0.47139303482587069,"",null,null,"",null,"","","",null,null,"",null,"","",""]
[null,null,null,null,null,null,{"$f":"G$162","v":8},{"$f":"IF(G$162=\"\",\"\",ROW()-ROW(G$162))","v":5},"Rinneneinhangstutzen für den Anschluss der Fallrohre","Position",{"$f":"IF(J167=\"Position\",\"\",IF(J167=\"Grundposition\",\"G\",IF(J167=\"Alternativposition\",\"A\",IF(J167=\"Bedarfsposition\",\"B\",IF(J167=\"Hinweis\",\"H\",IF(J167=\"Ausführungsbeschreibung\",\"AB\",IF(J167=\"Entfällt\",\"E\",IF(AND(I167<>\"\",L167<>\"\"),\"<-- Bitte Positionsart\",\"\"))))))))","v":""},8,"Stck.",null,22,27.51,30.27,220.08,null,"",null,null,{"$f":"IF(OR($K167=\"A\",$K167=\"B\"),\"Nur EP        \",IF($K167=\"E\",\"E                \",IF(AND($L167<>\"\",V167<>\"\"),$L167*V167,\"\")))","v":""},{"$f":"IF(OR($L167=\"\",W167=\"\"),\"\",\nIF(OR($W167=\"Nur EP        \",$K167=\"E\"),(Y167/(AVERAGE($Y167,$AF167,$AM167,$AT167,Y167))-1),\nIF(AND($W167,$AB167,$AI167,$AP167,$AW167)=\"\",\"\",(W167/(AVERAGE($W167,$AB167,$AI167,$AP167,$AW167)))-1)))","v":""},"",null,30.26,{"$f":"IF(C167=\"Hinweis\",\"\",IF(OR($K167=\"A\",$K167=\"B\"),\"Nur EP        \",IF($K167=\"E\",\"E                \",IF(AND($L167<>\"\",AA167<>\"\"),$L167*AA167,\"\"))))","v":242.08},null,{"$f":"IF(AC167=\"\",\"\",IF(AC167=\"X\",AB167,AB167*AC167))","v":""},9.9963649581970238E-2,{"$f":"IF(OR($K167=\"\",$K167=\"H\",$K167=\"AB\",$K167=\"G\",$J167=\"Position\",$K167=\"<-- Bitte Positionsart\",AA167=\"\",$L167=\"\"),\"\",\nIF(OR($K167=\"A\",$K167=\"B\",$K167=\"E\"),$L167*AA167))","v":""},null,30.27,{"$f":"IF(J167=\"Hinweis\",\"\",IF(OR($K167=\"A\",$K167=\"B\"),\"Nur EP        \",IF($K167=\"E\",\"E                \",IF(AND($L167<>\"\",AH167<>\"\"),$L167*AH167,\"\"))))","v":242.16},null,{"$f":"IF(AJ167=\"\",\"\",IF(AJ167=\"X\",AI167,AI167*AJ167))","v":""},0.10032715376226808,{"$f":"IF(OR($K167=\"\",$K167=\"H\",$K167=\"AB\",$K167=\"G\",$J167=\"Position\",$K167=\"<-- Bitte Positionsart\",AH167=\"\",$L167=\"\"),\"\",\nIF(OR($K167=\"A\",$K167=\"B\",$K167=\"E\"),$L167*AH167))","v":""},null,22,{"$f":"IF(P167=\"Hinweis\",\"\",IF(OR($K167=\"A\",$K167=\"B\"),\"Nur EP        \",IF($K167=\"E\",\"E                \",IF(AND($L167<>\"\",AO167<>\"\"),$L167*AO167,\"\"))))","v":176},null,{"$f":"IF(AQ167=\"\",\"\",IF(AQ167=\"X\",AP167,AP167*AQ167))","v":""},-0.20029080334423854,{"$f":"IF(OR($K167=\"\",$K167=\"H\",$K167=\"AB\",$K167=\"G\",$J167=\"Position\",$K167=\"<-- Bitte Positionsart\",AO167=\"\",$L167=\"\"),\"\",\nIF(OR($K167=\"A\",$K167=\"B\",$K167=\"E\"),$L167*AO167))","v":""},null,null,"",null,"","","",null,null,{"$f":"IF(AD167=\"Hinweis\",\"\",IF(OR($K167=\"A\",$K167=\"B\"),\"Nur EP        \",IF($K167=\"E\",\"E                \",IF(AND($L167<>\"\",BC167<>\"\"),$L167*BC167,\"\"))))","v":""},null,{"$f":"IF(BE167=\"\",\"\",IF(BE167=\"X\",BD167,BD167*BE167))","v":""},"",{"$f":"IF(OR($K167=\"\",$K167=\"H\",$K167=\"AB\",$K167=\"G\",$J167=\"Position\",$K167=\"<-- Bitte Positionsart\",BC167=\"\",$L167=\"\"),\"\",\nIF(OR($K167=\"A\",$K167=\"B\",$K167=\"E\"),$L167*BC167))","v":""}]
[null,null,null,null,null,null,8,6,"Bogenrohr passend zum Fallrohr - Anschluss an die verbleibenden alten Fallrohre","Position","",8,"Stck.",null,14.5,16.866666666666664,18.059999999999999,134.93333333333331,null,"",null,null,"","","",null,18.059999999999999,144.47999999999999,null,"",7.0750988142292526E-2,{"$f":"IF(OR($K168=\"\",$K168=\"H\",$K168=\"AB\",$K168=\"G\",$J168=\"Position\",$K168=\"<-- Bitte Positionsart\",AA168=\"\",$L168=\"\"),\"\",\nIF(OR($K168=\"A\",$K168=\"B\",$K168=\"E\"),$L168*AA168))","v":""},null,18.04,144.32,null,"",6.956521739130439E-2,{"$f":"IF(OR($K168=\"\",$K168=\"H\",$K168=\"AB\",$K168=\"G\",$J168=\"Position\",$K168=\"<-- Bitte Positionsart\",AH168=\"\",$L168=\"\"),\"\",\nIF(OR($K168=\"A\",$K168=\"B\",$K168=\"E\"),$L168*AH168))","v":""},null,14.5,116,null,"",-0.14031620553359669,{"$f":"IF(OR($K168=\"\",$K168=\"H\",$K168=\"AB\",$K168=\"G\",$J168=\"Position\",$K168=\"<-- Bitte Positionsart\",AO168=\"\",$L168=\"\"),\"\",\nIF(OR($K168=\"A\",$K168=\"B\",$K168=\"E\"),$L168*AO168))","v":""},null,null,"",null,"","","",null,null,"",null,"","",{"$f":"IF(OR($K168=\"\",$K168=\"H\",$K168=\"AB\",$K168=\"G\",$J168=\"Position\",$K168=\"<-- Bitte Positionsart\",BC168=\"\",$L168=\"\"),\"\",\nIF(OR($K168=\"A\",$K168=\"B\",$K168=\"E\"),$L168*BC168))","v":""}]
[null,null,null,null,null,null,8,7,"Rohrbogen passend zum Fallrohr - Anschluss an die verbleibenden alten Fallrohre","Position","",8,"Stck.",null,16.5,17.559999999999999,18.12,140.47999999999999,null,"",null,null,"","",{"$f":"IF(OR($K169=\"\",$K169=\"H\",$K169=\"AB\",$K169=\"G\",$J169=\"Position\",$K169=\"<-- Bitte Positionsart\",V169=\"\",$L169=\"\"),\"\",\nIF(OR($K169=\"A\",$K169=\"B\",$K169=\"E\"),$L169*V169))","v":""},null,18.059999999999999,144.47999999999999,null,"",2.8473804100227706E-2,"",null,18.12,144.96,null,"",3.1890660592255315E-2,"",null,16.5,132,null,"",-6.03644646924828E-2,"",null,null,"",null,"","","",null,null,"",null,"","",""]
[null,null,null,null,null,null,8,8,"Fallrohr zur Dachentwässerung - Anschluss an die verbleibenden alten Fallrohre","Bedarfsposition","B",9,"m",null,"","","","Nur EP        ",null,347.34000000000003,null,null,"Nur EP        ",{"$error":"#VALUE!"},"",null,46.14,"Nur EP        ",null,"",0.19554327172223185,415.26,null,46.14,"Nur EP        ",null,"",0.19554327172223185,415.26,null,23.5,"Nur EP        ",null,"",-0.39108654344446359,211.5,null,null,"Nur EP        ",null,"","","",null,null,"Nur EP        ",null,"","",""]
[null,null,null,null,null,null,8,9,"Traufstreifen als Rinneneinhangblech","Position","",61,"m",null,23.31,23.756666666666671,24.6,1449.156666666667,null,"",null,null,"","","",null,23.36,1424.96,null,"",-1.6697067489827466E-2,"",null,23.31,1421.9099999999999,null,"",-1.8801739862494893E-2,"",null,24.6,1500.6000000000001,null,"",3.5498807352322137E-2,"",null,null,"",null,"","","",null,null,"",null,"","",""]
[null,null,null,null,null,null,8,10,"Schornsteinverkleidung aus Stehfalzblech - Zink vorbewittert","Bedarfsposition","B",1,"Stck.",null,"","","","Nur EP        ",null,2017.7,null,null,"Nur EP        ",{"$error":"#VALUE!"},"",null,2017.7,"Nur EP        ",null,"",0,2017.7,null,2017.7,"Nur EP        ",null,"",0,2017.7,null,null,"Nur EP        ",null,"","","",null,null,"Nur EP        ",null,"","","",null,null,"Nur EP        ",null,"","",""]
[null,null,null,null,null,null,8,11,"Zinkblecharbeiten vor den seitlichen Erkerfenstern","Position","",6,"Stck.",null,215,515.2166666666667,673.59,3091.3,null,"",null,null,"","","",null,657.06,3942.3599999999997,null,"",0.27530812279623462,"",null,673.59,4041.54,null,"",0.30739171222463058,"",null,215,1290,null,"",-0.58269983502086498,"",null,null,"",null,"",{"$f":"IF(OR($L173=\"\",AV173=\"\",$J173=\"Ausführungsbeschreibung\",$J173=\"Hinweis\"),\"\",\nIF(AND($AA173,$AH173,$AO173,$AV173,$BC173)=\"\",\"\",\nIF($L$4=\"MIT\",\nIF(OR(AW173=\"Nur EP        \",$K173=\"E\"),((BA173/(AVERAGE($AF173,$AM173,$AT173,$BA173,$BH173)))-1),\nIF($L$4=\"MIT\",((AW173/(AVERAGE($AB173,$AI173,$AP173,$AW173,$BD173)))-1),\nIF($L$4=\"MIN\",\nIF(OR(AW173=\"Nur EP        \",$K173=\"E\"),((BA173/(MIN($AF173,$AM173,$AT173,$BA173,$BH173)))-1),\nIF($L$4=\"MIN\",(AW173/(MIN($AB173,$AI173,$AP173,$AW173,$BD173)))-1)\n)))))))","v":""},{"$f":"IF(OR($K173=\"\",$K173=\"H\",$K173=\"AB\",$K173=\"G\",$J173=\"Position\",$K173=\"<-- Bitte Positionsart\",AV173=\"\",$L173=\"\"),\"\",\nIF(OR($K173=\"A\",$K173=\"B\",$K173=\"E\"),$L173*AV173))","v":""},null,null,"",null,"","",""]
[null,null,null,null,null,null,8,12,"Winkelstehfalz an den Seitengiebeln der Gauben","Position","",12,"Stck.",null,405,422.28999999999996,435.33,5067.4799999999996,null,"",null,null,"","","",null,426.54,5118.4800000000005,null,"",1.0064173908925111E-2,"",null,435.33,5223.96,null,"",3.0879253593502076E-2,"",null,405,4860,null,"",-4.0943427502427299E-2,"",null,null,"",null,"",{"$f":"IF(OR($L174=\"\",AV174=\"\",$J174=\"Ausführungsbeschreibung\",$J174=\"Hinweis\"),\"\",\nIF(AND($AA174,$AH174,$AO174,$AV174,$BC174)=\"\",\"\",\nIF($L$4=\"MIT\",\nIF(OR(AW174=\"Nur EP        \",$K174=\"E\"),((BA174/(AVERAGE($AF174,$AM174,$AT174,$BA174,$BH174)))-1),\nIF($L$4=\"MIT\",((AW174/(AVERAGE($AB174,$AI174,$AP174,$AW174,$BD174)))-1),\nIF($L$4=\"MIN\",\nIF(OR(AW174=\"Nur EP        \",$K174=\"E\"),((BA174/(MIN($AF174,$AM174,$AT174,$BA174,$BH174)))-1),\nIF($L$4=\"MIN\",(AW174/(MIN($AB174,$AI174,$AP174,$AW174,$BD174)))-1)\n)))))))","v":""},{"$f":"IF(OR($K174=\"\",$K174=\"H\",$K174=\"AB\",$K174=\"G\",$J174=\"Position\",$K174=\"<-- Bitte Positionsart\",AV174=\"\",$L174=\"\"),\"\",\nIF(OR($K174=\"A\",$K174=\"B\",$K174=\"E\"),$L174*AV174))","v":""},null,null,"",null,"","",""]
[null,null,null,null,null,null,{"$f":"G$162","v":8},{"$f":"IF(G$162=\"\",\"\",ROW()-ROW(G$162))","v":13},"Winkelstehfalz an den Frontseiten der Gauben","Position","",6,"Stck.",null,{"$f":"IF(OR($K175=\"B\",$K175=\"A\",$K175=\"H\",$K175=\"AB\",$K175=\"<-- Bitte Positionsart\",SUM(AA175,AH175,AO175,AV175,BC175)=0),\"\",MIN(AA175,AH175,AO175,AV175,BC175))","v":1150},{"$f":"IF(OR($K175=\"B\",$K175=\"A\",$K175=\"H\",$K175=\"AB\",$K175=\"<-- Bitte Positionsart\",SUM(AA175,AH175,AO175,AV175,BC175)=0),\"\",SUM(AA175,AH175,AO175,AV175,BC175)/COUNT(AA175,AH175,AO175,AV175,BC175))","v":2608.4299999999998},{"$f":"IF(OR($K175=\"B\",$K175=\"A\",$K175=\"H\",$K175=\"AB\",$K175=\"<-- Bitte Positionsart\",SUM(AA175,AH175,AO175,AV175,BC175)=0),\"\",MAX(AA175,AH175,AO175,AV175,BC175))","v":3369.09},{"$f":"IF(OR($K175=\"A\",$K175=\"B\"),\"Nur EP        \",IF($K175=\"E\",\"E                \",IF(AND($L175<>\"\",P175<>\"\"),$L175*P175,\"\")))","v":15650.579999999998},null,{"$f":"IF(OR($K175=\"\",$K175=\"H\",$K175=\"AB\",$K175=\"G\",$K175=\"<-- Bitte Positionsart\"),\"\",IF(OR($K175=\"A\",$K175=\"B\"),$L175*(SUM(AA175,AH175,AO175,AV175,BC175)/COUNT(AA175,AH175,AO175,AV175,BC175)),IF($K175=\"E\",$L175*P175)))","v":""},null,null,"","",{"$f":"IF(OR($K175=\"\",$K175=\"H\",$K175=\"AB\",$K175=\"G\",$J175=\"Position\",$K175=\"<-- Bitte Positionsart\",V175=\"\",$L175=\"\"),\"\",\nIF(OR($K175=\"A\",$K175=\"B\",$K175=\"E\"),$L175*V175))","v":""},null,3306.2,19837.199999999997,null,"",0.26750574100129176,{"$f":"IF(OR($K175=\"\",$K175=\"H\",$K175=\"AB\",$K175=\"G\",$J175=\"Position\",$K175=\"<-- Bitte Positionsart\",AA175=\"\",$L175=\"\"),\"\",\nIF(OR($K175=\"A\",$K175=\"B\",$K175=\"E\"),$L175*AA175))","v":""},null,3369.09,20214.54,null,"",0.29161602956567756,{"$f":"IF(OR($K175=\"\",$K175=\"H\",$K175=\"AB\",$K175=\"G\",$J175=\"Position\",$K175=\"<-- Bitte Positionsart\",AH175=\"\",$L175=\"\"),\"\",\nIF(OR($K175=\"A\",$K175=\"B\",$K175=\"E\"),$L175*AH175))","v":""},null,1150,6900,null,"",-0.55912177056696932,{"$f":"IF(OR($K175=\"\",$K175=\"H\",$K175=\"AB\",$K175=\"G\",$J175=\"Position\",$K175=\"<-- Bitte Positionsart\",AO175=\"\",$L175=\"\"),\"\",\nIF(OR($K175=\"A\",$K175=\"B\",$K175=\"E\"),$L175*AO175))","v":""},null,null,{"$f":"IF(W175=\"Hinweis\",\"\",IF(OR($K175=\"A\",$K175=\"B\"),\"Nur EP        \",IF($K175=\"E\",\"E                \",IF(AND($L175<>\"\",AV175<>\"\"),$L175*AV175,\"\"))))","v":""},null,{"$f":"IF(AX175=\"\",\"\",IF(AX175=\"X\",AW175,AW175*AX175))","v":""},{"$f":"IF(OR($L175=\"\",AV175=\"\",$J175=\"Ausführungsbeschreibung\",$J175=\"Hinweis\"),\"\",\nIF(AND($AA175,$AH175,$AO175,$AV175,$BC175)=\"\",\"\",\nIF($L$4=\"MIT\",\nIF(OR(AW175=\"Nur EP        \",$K175=\"E\"),((BA175/(AVERAGE($AF175,$AM175,$AT175,$BA175,$BH175)))-1),\nIF($L$4=\"MIT\",((AW175/(AVERAGE($AB175,$AI175,$AP175,$AW175,$BD175)))-1),\nIF($L$4=\"MIN\",\nIF(OR(AW175=\"Nur EP        \",$K175=\"E\"),((BA175/(MIN($AF175,$AM175,$AT175,$BA175,$BH175)))-1),\nIF($L$4=\"MIN\",(AW175/(MIN($AB175,$AI175,$AP175,$AW175,$BD175)))-1)\n)))))))","v":""},{"$f":"IF(OR($K175=\"\",$K175=\"H\",$K175=\"AB\",$K175=\"G\",$J175=\"Position\",$K175=\"<-- Bitte Positionsart\",AV175=\"\",$L175=\"\"),\"\",\nIF(OR($K175=\"A\",$K175=\"B\",$K175=\"E\"),$L175*AV175))","v":""},null,null,"",null,"","",{"$f":"IF(OR($K175=\"\",$K175=\"H\",$K175=\"AB\",$K175=\"G\",$J175=\"Position\",$K175=\"<-- Bitte Positionsart\",BC175=\"\",$L175=\"\"),\"\",\nIF(OR($K175=\"A\",$K175=\"B\",$K175=\"E\"),$L175*BC175))","v":""}]
[null,null,null,null,null,null,8,14,"Zinkblechabdeckung des Kantholz an der vorderen Gaubendachkante","Position","",37,"m",null,25,47.46,59.05,1756.02,null,"",null,null,"","","",null,58.33,2158.21,null,"",0.22903497682258767,{"$f":"IF(OR($K176=\"\",$K176=\"H\",$K176=\"AB\",$K176=\"G\",$J176=\"Position\",$K176=\"<-- Bitte Positionsart\",AA176=\"\",$L176=\"\"),\"\",\nIF(OR($K176=\"A\",$K176=\"B\",$K176=\"E\"),$L176*AA176))","v":""},null,59.05,2184.85,null,"",{"$f":"IF(OR($L176=\"\",AH176=\"\",$J176=\"Ausführungsbeschreibung\",$J176=\"Hinweis\"),\"\",\nIF(AND($AA176,$AH176,$AO176,$AV176,$BC176)=\"\",\"\",\nIF($L$4=\"MIT\",\nIF(OR(AI176=\"Nur EP        \",$K176=\"E\"),((AM176/(AVERAGE($AF176,$AM176,$AT176,$BA176,$BH176)))-1),\nIF($L$4=\"MIT\",((AI176/(AVERAGE($AB176,$AI176,$AP176,$AW176,$BD176)))-1),\nIF($L$4=\"MIN\",\nIF(OR(AI176=\"Nur EP        \",$K176=\"E\"),((AM176/(MIN($AF176,$AM176,$AT176,$BA176,$BH176)))-1),\nIF($L$4=\"MIN\",(AI176/(MIN($AB176,$AI176,$AP176,$AW176,$BD176)))-1)\n)))))))","v":0.24420564686051427},{"$f":"IF(OR($K176=\"\",$K176=\"H\",$K176=\"AB\",$K176=\"G\",$J176=\"Position\",$K176=\"<-- Bitte Positionsart\",AH176=\"\",$L176=\"\"),\"\",\nIF(OR($K176=\"A\",$K176=\"B\",$K176=\"E\"),$L176*AH176))","v":""},null,25,925,null,"",-0.47324062368310149,{"$f":"IF(OR($K176=\"\",$K176=\"H\",$K176=\"AB\",$K176=\"G\",$J176=\"Position\",$K176=\"<-- Bitte Positionsart\",AO176=\"\",$L176=\"\"),\"\",\nIF(OR($K176=\"A\",$K176=\"B\",$K176=\"E\"),$L176*AO176))","v":""},null,null,"",null,"",{"$f":"IF(OR($L176=\"\",AV176=\"\",$J176=\"Ausführungsbeschreibung\",$J176=\"Hinweis\"),\"\",\nIF(AND($AA176,$AH176,$AO176,$AV176,$BC176)=\"\",\"\",\nIF($L$4=\"MIT\",\nIF(OR(AW176=\"Nur EP        \",$K176=\"E\"),((BA176/(AVERAGE($AF176,$AM176,$AT176,$BA176,$BH176)))-1),\nIF($L$4=\"MIT\",((AW176/(AVERAGE($AB176,$AI176,$AP176,$AW176,$BD176)))-1),\nIF($L$4=\"MIN\",\nIF(OR(AW176=\"Nur EP        \",$K176=\"E\"),((BA176/(MIN($AF176,$AM176,$AT176,$BA176,$BH176)))-1),\nIF($L$4=\"MIN\",(AW176/(MIN($AB176,$AI176,$AP176,$AW176,$BD176)))-1)\n)))))))","v":""},{"$f":"IF(OR($K176=\"\",$K176=\"H\",$K176=\"AB\",$K176=\"G\",$J176=\"Position\",$K176=\"<-- Bitte Positionsart\",AV176=\"\",$L176=\"\"),\"\",\nIF(OR($K176=\"A\",$K176=\"B\",$K176=\"E\"),$L176*AV176))","v":""},null,null,"",null,"","",{"$f":"IF(OR($K176=\"\",$K176=\"H\",$K176=\"AB\",$K176=\"G\",$J176=\"Position\",$K176=\"<-- Bitte Positionsart\",BC176=\"\",$L176=\"\"),\"\",\nIF(OR($K176=\"A\",$K176=\"B\",$K176=\"E\"),$L176*BC176))","v":""}]
[null,null,null,null,null,null,8,15,"Zinkblechabdeckung des Kantholz - Zulage Innen und Außenecken","Position","",12,"Stck.",null,21.63,32.783333333333331,55,393.4,null,"",null,null,"","","",null,21.63,259.56,null,"",-0.34021352313167263,"",null,21.72,260.64,null,"",-0.33746822572445356,"",null,55,660,null,"",0.67768174885612598,"",null,null,"",null,"","","",null,null,"",null,"","",""]
[null,null,null,null,null,null,8,{"$f":"IF(G$162=\"\",\"\",ROW()-ROW(G$162))","v":16},"Zinkblech Rinne an den schräg geschnittenen Seitenfenstern der Erker-Gauben","Position","",6,"Stck.",null,250,251.94666666666669,255.84,1511.68,null,"",null,null,"","","",null,250,1500,null,"",-7.7265029635902316E-3,"",null,255.84,1535.04,null,"",1.5453005927180241E-2,"",null,250,1500,null,"",-7.7265029635902316E-3,"",null,null,"",null,"","","",null,null,"",null,"","",""]
[null,null,null,null,null,null,8,17,"Zinkblechverkleidung der seitlichen  Verschneidung der Dachfläche mit dem Balkonen","Position","",6,"Stck.",null,90,352.06,487.37,2112.36,null,"",null,null,"","","",null,478.81,2872.86,null,"",0.36002385956939165,"",null,487.37,2924.2200000000003,null,"",0.38433789694938358,"",null,90,540,null,"",-0.74436175651877523,"",null,null,"",null,"","","",null,null,"",null,"","",""]
[null,null,null,null,null,null,8,{"$f":"IF(G$162=\"\",\"\",ROW()-ROW(G$162))","v":18},null,null,"",null,null,null,"","","","",null,"",null,null,"","","",null,null,"",null,"","","",null,null,"",null,"","","",null,null,"",null,"","","",null,null,"",null,"","","",null,null,"",null,"","",""]
[null,null,null,null,null,null,8,19,null,null,"",null,null,null,"","","","",null,"",null,null,"","",{"$f":"IF(OR($K181=\"\",$K181=\"H\",$K181=\"AB\",$K181=\"G\",$J181=\"Position\",$K181=\"<-- Bitte Positionsart\",V181=\"\",$L181=\"\"),\"\",\nIF(OR($K181=\"A\",$K181=\"B\",$K181=\"E\"),$L181*V181))","v":""},null,null,"",null,"","","",null,null,"",null,"","","",null,null,"",null,"","","",null,null,"",null,"","","",null,null,"",null,"","",""]
[null,null,null,null,null,null,null,null,null,null,null,null,null,null,null,null,null,null,null,null,null,null,null,null,{"$f":"IF($K182=\"\",\"\",IF(OR($K182=\"A\",$K182=\"B\"),$L182*V182,IF($K182=\"E\",\"\")))","v":""},null,"EP / % Titel","Positions- / Titelsumme",null,"",null,{"$f":"IF($K182=\"Ja\",IF(AND($L182<>\"\",AA182<>\"\"),$L182*AA182),\"\")","v":""},null,"EP / % Titel","Positions- / Titelsumme",null,"",null,{"$f":"IF($K182=\"Ja\",IF(AND($L182<>\"\",AH182<>\"\"),$L182*AH182),\"\")","v":""},null,"EP / % Titel","Positions- / Titelsumme",null,"",null,{"$f":"IF($K182=\"Ja\",IF(AND($L182<>\"\",AO182<>\"\"),$L182*AO182),\"\")","v":""},null,"EP / % Titel","Positions- / Titelsumme",null,{"$f":"IF(AX182=\"\",\"\",IF(AX182=\"X\",AW182,AW182*AX182))","v":""},null,{"$f":"IF($K182=\"Ja\",IF(AND($L182<>\"\",AV182<>\"\"),$L182*AV182),\"\")","v":""},null,"EP / % Titel","Positions- / Titelsumme",null,"",null,{"$f":"IF($K182=\"Ja\",IF(AND($L182<>\"\",BC182<>\"\"),$L182*BC182),\"\")","v":""}]
[null,null,null,null,null,null,9,null,"Trockenbauarbeiten",null,null,null,null,null,{"$f":"CONCATENATE(\"Titelsumme\",CHAR(10),\"MIN\",CHAR(10),TEXT(SUMPRODUCT($L184:$L194,O184:O194),\"##.##0,00\"),\" €\")","v":"Titelsumme\nMIN\n1.000,00 €"},{"$f":"CONCATENATE(\"Titelsumme\",CHAR(10),\"MIT\",CHAR(10),TEXT(SUMPRODUCT($L184:$L194,P184:P194),\"##.##0,00\"),\" €\")","v":"Titelsumme\nMIT\n1.823,16 €"},{"$f":"CONCATENATE(\"Titelsumme\",CHAR(10),\"MAX\",CHAR(10),TEXT(SUMPRODUCT($L184:$L194,Q184:Q194),\"##.##0,00\"),\" €\")","v":"Titelsumme\nMAX\n2.255,24 €"},{"$f":"SUM(R184:R194)","v":1823.1599999999999},null,{"$f":"SUM(T184:T194)","v":0},null,null,{"$f":"SUM(W184:W194)","v":0},null,{"$f":"SUM(Y184:Y194)","v":0},null,{"$f":"IF(AB183=0,\"\",\nIF($L$4=\"MIT\",((AB183/(AVERAGE($AB183,$AI183,$AP183,$AW183,$BD183)))-1)*100,))","v":102.41778011803682},{"$f":"SUM(AB184:AB194)","v":2214.2399999999998},null,"",null,{"$f":"SUM(AF184:AF194)","v":0},null,{"$f":"IF(AI183=0,\"\",\nIF($L$4=\"MIT\",((AI183/(AVERAGE($AB183,$AI183,$AP183,$AW183,$BD183)))-1)*100,))","v":106.1658512326583},{"$f":"SUM(AI184:AI194)","v":2255.2399999999998},null,{"$f":"IF(AJ183=\"\",\"\",IF(AJ183=\"X\",AI183,AI183*AJ183))","v":""},null,{"$f":"SUM(AM184:AM194)","v":0},null,{"$f":"IF(AP183=0,\"\",\nIF($L$4=\"MIT\",((AP183/(AVERAGE($AB183,$AI183,$AP183,$AW183,$BD183)))-1)*100,))","v":-8.5836313506951321},{"$f":"SUM(AP184:AP194)","v":1000},null,{"$f":"IF(AQ183=\"\",\"\",IF(AQ183=\"X\",AP183,AP183*AQ183))","v":""},null,{"$f":"SUM(AT184:AT194)","v":0},null,{"$f":"IF(AW183=0,\"\",\nIF($L$4=\"MIT\",((AW183/(AVERAGE($AB183,$AI183,$AP183,$AW183,$BD183)))-1)*100,))","v":""},{"$f":"SUM(AW184:AW194)","v":0},null,{"$f":"IF(AX183=\"\",\"\",IF(AX183=\"X\",AW183,AW183*AX183))","v":""},null,{"$f":"SUM(BA184:BA194)","v":0},null,{"$f":"IF(BD183=0,\"\",\nIF($L$4=\"MIT\",((BD183/(AVERAGE($AB183,$AI183,$AP183,$AW183,$BD183)))-1)*100,))","v":""},{"$f":"SUM(BD184:BD194)","v":0},null,"",null,{"$f":"SUM(BH184:BH194)","v":0}]
[null,null,null,null,null,null,{"$f":"G$183","v":9},{"$f":"IF(G$162=\"\",\"\",ROW()-ROW(G$183))","v":1},"Laibung der neuen Dachflächenfenster (78/118) aus GK Trockenbauverkleidung","Position",{"$f":"IF(J184=\"Position\",\"\",IF(J184=\"Grundposition\",\"G\",IF(J184=\"Alternativposition\",\"A\",IF(J184=\"Bedarfsposition\",\"B\",IF(J184=\"Hinweis\",\"H\",IF(J184=\"Ausführungsbeschreibung\",\"AB\",IF(J184=\"Entfällt\",\"E\",IF(AND(I184<>\"\",L184<>\"\"),\"<-- Bitte Positionsart\",\"\"))))))))","v":""},4,"Stck.",null,{"$f":"IF(OR($K184=\"B\",$K184=\"A\",$K184=\"H\",$K184=\"AB\",$K184=\"<-- Bitte Positionsart\",SUM(AA184,AH184,AO184,AV184,BC184)=0),\"\",MIN(AA184,AH184,AO184,AV184,BC184))","v":250},{"$f":"IF(OR($K184=\"B\",$K184=\"A\",$K184=\"H\",$K184=\"AB\",$K184=\"<-- Bitte Positionsart\",SUM(AA184,AH184,AO184,AV184,BC184)=0),\"\",SUM(AA184,AH184,AO184,AV184,BC184)/COUNT(AA184,AH184,AO184,AV184,BC184))","v":455.78999999999996},{"$f":"IF(OR($K184=\"B\",$K184=\"A\",$K184=\"H\",$K184=\"AB\",$K184=\"<-- Bitte Positionsart\",SUM(AA184,AH184,AO184,AV184,BC184)=0),\"\",MAX(AA184,AH184,AO184,AV184,BC184))","v":563.80999999999995},{"$f":"IF(OR($K184=\"A\",$K184=\"B\"),\"Nur EP        \",IF($K184=\"E\",\"E                \",IF(AND($L184<>\"\",P184<>\"\"),$L184*P184,\"\")))","v":1823.1599999999999},null,{"$f":"IF(OR($K184=\"\",$K184=\"H\",$K184=\"AB\",$K184=\"G\",$K184=\"<-- Bitte Positionsart\"),\"\",IF(OR($K184=\"A\",$K184=\"B\"),$L184*(SUM(AA184,AH184,AO184,AV184,BC184)/COUNT(AA184,AH184,AO184,AV184,BC184)),IF($K184=\"E\",$L184*P184)))","v":""},null,null,{"$f":"IF(OR($K184=\"A\",$K184=\"B\"),\"Nur EP        \",IF($K184=\"E\",\"E                \",IF(AND($L184<>\"\",V184<>\"\"),$L184*V184,\"\")))","v":""},{"$f":"IF(OR($L184=\"\",W184=\"\"),\"\",\nIF(OR($W184=\"Nur EP        \",$K184=\"E\"),(Y184/(AVERAGE($Y184,$AF184,$AM184,$AT184,Y184))-1),\nIF(AND($W184,$AB184,$AI184,$AP184,$AW184)=\"\",\"\",(W184/(AVERAGE($W184,$AB184,$AI184,$AP184,$AW184)))-1)))","v":""},{"$f":"IF(OR($K184=\"\",$K184=\"H\",$K184=\"AB\",$K184=\"G\",$J184=\"Position\",$K184=\"<-- Bitte Positionsart\",V184=\"\",$L184=\"\"),\"\",\nIF(OR($K184=\"A\",$K184=\"B\",$K184=\"E\"),$L184*V184))","v":""},null,553.55999999999995,{"$f":"IF(C184=\"Hinweis\",\"\",IF(OR($K184=\"A\",$K184=\"B\"),\"Nur EP        \",IF($K184=\"E\",\"E                \",IF(AND($L184<>\"\",AA184<>\"\"),$L184*AA184,\"\"))))","v":2214.2399999999998},null,{"$f":"IF(AC184=\"\",\"\",IF(AC184=\"X\",AB184,AB184*AC184))","v":""},{"$f":"IF(OR($L184=\"\",AA184=\"\",$J184=\"Ausführungsbeschreibung\",$J184=\"Hinweis\"),\"\",\nIF(AND($AA184,$AH184,$AO184,$AV184,$BC184)=\"\",\"\",\nIF($L$4=\"MIT\",\nIF(OR(AB184=\"Nur EP        \",$K184=\"E\"),((AF184/(AVERAGE($AF184,$AM184,$AT184,$BA184,$BH184)))-1),\nIF($L$4=\"MIT\",((AB184/(AVERAGE($AB184,$AI184,$AP184,$AW184,$BD184)))-1),\nIF($L$4=\"MIN\",\nIF(OR(AB184=\"Nur EP        \",$K184=\"E\"),((AF184/(MIN($AF184,$AM184,$AT184,$BA184,$BH184)))-1),\nIF($L$4=\"MIN\",((AB184/(MIN($AB184,$AI184,$AP184,$AW184,$BD184)))-1))\n)))))))","v":0.21450668070822076},{"$f":"IF(OR($K184=\"\",$K184=\"H\",$K184=\"AB\",$K184=\"G\",$J184=\"Position\",$K184=\"<-- Bitte Positionsart\",AA184=\"\",$L184=\"\"),\"\",\nIF(OR($K184=\"A\",$K184=\"B\",$K184=\"E\"),$L184*AA184))","v":""},null,563.80999999999995,{"$f":"IF(J184=\"Hinweis\",\"\",IF(OR($K184=\"A\",$K184=\"B\"),\"Nur EP        \",IF($K184=\"E\",\"E                \",IF(AND($L184<>\"\",AH184<>\"\"),$L184*AH184,\"\"))))","v":2255.2399999999998},null,"",{"$f":"IF(OR($L184=\"\",AH184=\"\",$J184=\"Ausführungsbeschreibung\",$J184=\"Hinweis\"),\"\",\nIF(AND($AA184,$AH184,$AO184,$AV184,$BC184)=\"\",\"\",\nIF($L$4=\"MIT\",\nIF(OR(AI184=\"Nur EP        \",$K184=\"E\"),((AM184/(AVERAGE($AF184,$AM184,$AT184,$BA184,$BH184)))-1),\nIF($L$4=\"MIT\",((AI184/(AVERAGE($AB184,$AI184,$AP184,$AW184,$BD184)))-1),\nIF($L$4=\"MIN\",\nIF(OR(AI184=\"Nur EP        \",$K184=\"E\"),((AM184/(MIN($AF184,$AM184,$AT184,$BA184,$BH184)))-1),\nIF($L$4=\"MIN\",(AI184/(MIN($AB184,$AI184,$AP184,$AW184,$BD184)))-1)\n)))))))","v":0.23699510739594998},{"$f":"IF(OR($K184=\"\",$K184=\"H\",$K184=\"AB\",$K184=\"G\",$J184=\"Position\",$K184=\"<-- Bitte Positionsart\",AH184=\"\",$L184=\"\"),\"\",\nIF(OR($K184=\"A\",$K184=\"B\",$K184=\"E\"),$L184*AH184))","v":""},null,250,{"$f":"IF(P184=\"Hinweis\",\"\",IF(OR($K184=\"A\",$K184=\"B\"),\"Nur EP        \",IF($K184=\"E\",\"E                \",IF(AND($L184<>\"\",AO184<>\"\"),$L184*AO184,\"\"))))","v":1000},null,"",{"$f":"IF(OR($L184=\"\",AO184=\"\",$J184=\"Ausführungsbeschreibung\",$J184=\"Hinweis\"),\"\",\nIF(AND($AA184,$AH184,$AO184,$AV184,$BC184)=\"\",\"\",\nIF($L$4=\"MIT\",\nIF(OR(AP184=\"Nur EP        \",$K184=\"E\"),((AT184/(AVERAGE($AF184,$AM184,$AT184,$BA184,$BH184)))-1),\nIF($L$4=\"MIT\",((AP184/(AVERAGE($AB184,$AI184,$AP184,$AW184,$BD184)))-1),\nIF($L$4=\"MIN\",\nIF(OR(AP184=\"Nur EP        \",$K184=\"E\"),((AT184/(MIN($AF184,$AM184,$AT184,$BA184,$BH184)))-1),\nIF($L$4=\"MIN\",(AP184/(MIN($AB184,$AI184,$AP184,$AW184,$BD184)))-1)\n)))))))","v":-0.45150178810417074},{"$f":"IF(OR($K184=\"\",$K184=\"H\",$K184=\"AB\",$K184=\"G\",$J184=\"Position\",$K184=\"<-- Bitte Positionsart\",AO184=\"\",$L184=\"\"),\"\",\nIF(OR($K184=\"A\",$K184=\"B\",$K184=\"E\"),$L184*AO184))","v":""},null,null,{"$f":"IF(W184=\"Hinweis\",\"\",IF(OR($K184=\"A\",$K184=\"B\"),\"Nur EP        \",IF($K184=\"E\",\"E                \",IF(AND($L184<>\"\",AV184<>\"\"),$L184*AV184,\"\"))))","v":""},null,"",{"$f":"IF(OR($L184=\"\",AV184=\"\",$J184=\"Ausführungsbeschreibung\",$J184=\"Hinweis\"),\"\",\nIF(AND($AA184,$AH184,$AO184,$AV184,$BC184)=\"\",\"\",\nIF($L$4=\"MIT\",\nIF(OR(AW184=\"Nur EP        \",$K184=\"E\"),((BA184/(AVERAGE($AF184,$AM184,$AT184,$BA184,$BH184)))-1),\nIF($L$4=\"MIT\",((AW184/(AVERAGE($AB184,$AI184,$AP184,$AW184,$BD184)))-1),\nIF($L$4=\"MIN\",\nIF(OR(AW184=\"Nur EP        \",$K184=\"E\"),((BA184/(MIN($AF184,$AM184,$AT184,$BA184,$BH184)))-1),\nIF($L$4=\"MIN\",(AW184/(MIN($AB184,$AI184,$AP184,$AW184,$BD184)))-1)\n)))))))","v":""},{"$f":"IF(OR($K184=\"\",$K184=\"H\",$K184=\"AB\",$K184=\"G\",$J184=\"Position\",$K184=\"<-- Bitte Positionsart\",AV184=\"\",$L184=\"\"),\"\",\nIF(OR($K184=\"A\",$K184=\"B\",$K184=\"E\"),$L184*AV184))","v":""},null,null,{"$f":"IF(AD184=\"Hinweis\",\"\",IF(OR($K184=\"A\",$K184=\"B\"),\"Nur EP        \",IF($K184=\"E\",\"E                \",IF(AND($L184<>\"\",BC184<>\"\"),$L184*BC184,\"\"))))","v":""},null,{"$f":"IF(BE184=\"\",\"\",IF(BE184=\"X\",BD184,BD184*BE184))","v":""},{"$f":"IF(OR($L184=\"\",BC184=\"\",$J184=\"Ausführungsbeschreibung\",$J184=\"Hinweis\"),\"\",\nIF(AND($AA184,$AH184,$AO184,$AV184,$BC184)=\"\",\"\",\nIF($L$4=\"MIT\",\nIF(OR(BD184=\"Nur EP        \",$K184=\"E\"),((BH184/(AVERAGE($AF184,$AM184,$AT184,$BA184,$BH184)))-1),\nIF($L$4=\"MIT\",((BD184/(AVERAGE($AB184,$AI184,$AP184,$AW184,$BD184)))-1),\nIF($L$4=\"MIN\",\nIF(OR(BD184=\"Nur EP        \",$K184=\"E\"),((BH184/(MIN($AF184,$AM184,$AT184,$BA184,$BH184)))-1),\nIF($L$4=\"MIN\",((BD184/(MIN($AB184,$AI184,$AP184,$AW184,$BD184)))-1))\n)))))))","v":""},{"$f":"IF(OR($K184=\"\",$K184=\"H\",$K184=\"AB\",$K184=\"G\",$J184=\"Position\",$K184=\"<-- Bitte Positionsart\",BC184=\"\",$L184=\"\"),\"\",\nIF(OR($K184=\"A\",$K184=\"B\",$K184=\"E\"),$L184*BC184))","v":""}]
[null,null,null,null,null,null,{"$f":"G$183","v":9},2,null,null,"",null,null,null,{"$f":"IF(OR($K185=\"B\",$K185=\"A\",$K185=\"H\",$K185=\"AB\",$K185=\"<-- Bitte Positionsart\",SUM(AA185,AH185,AO185,AV185,BC185)=0),\"\",MIN(AA185,AH185,AO185,AV185,BC185))","v":""},{"$f":"IF(OR($K185=\"B\",$K185=\"A\",$K185=\"H\",$K185=\"AB\",$K185=\"<-- Bitte Positionsart\",SUM(AA185,AH185,AO185,AV185,BC185)=0),\"\",SUM(AA185,AH185,AO185,AV185,BC185)/COUNT(AA185,AH185,AO185,AV185,BC185))","v":""},{"$f":"IF(OR($K185=\"B\",$K185=\"A\",$K185=\"H\",$K185=\"AB\",$K185=\"<-- Bitte Positionsart\",SUM(AA185,AH185,AO185,AV185,BC185)=0),\"\",MAX(AA185,AH185,AO185,AV185,BC185))","v":""},{"$f":"IF(OR($K185=\"A\",$K185=\"B\"),\"Nur EP        \",IF($K185=\"E\",\"E                \",IF(AND($L185<>\"\",P185<>\"\"),$L185*P185,\"\")))","v":""},null,{"$f":"IF(OR($K185=\"\",$K185=\"H\",$K185=\"AB\",$K185=\"G\",$K185=\"<-- Bitte Positionsart\"),\"\",IF(OR($K185=\"A\",$K185=\"B\"),$L185*(SUM(AA185,AH185,AO185,AV185,BC185)/COUNT(AA185,AH185,AO185,AV185,BC185)),IF($K185=\"E\",$L185*P185)))","v":""},null,null,"","",{"$f":"IF(OR($K185=\"\",$K185=\"H\",$K185=\"AB\",$K185=\"G\",$J185=\"Position\",$K185=\"<-- Bitte Positionsart\",V185=\"\",$L185=\"\"),\"\",\nIF(OR($K185=\"A\",$K185=\"B\",$K185=\"E\"),$L185*V185))","v":""},null,null,"",null,"","",{"$f":"IF(OR($K185=\"\",$K185=\"H\",$K185=\"AB\",$K185=\"G\",$J185=\"Position\",$K185=\"<-- Bitte Positionsart\",AA185=\"\",$L185=\"\"),\"\",\nIF(OR($K185=\"A\",$K185=\"B\",$K185=\"E\"),$L185*AA185))","v":""},null,null,"",null,"",{"$f":"IF(OR($L185=\"\",AH185=\"\",$J185=\"Ausführungsbeschreibung\",$J185=\"Hinweis\"),\"\",\nIF(AND($AA185,$AH185,$AO185,$AV185,$BC185)=\"\",\"\",\nIF($L$4=\"MIT\",\nIF(OR(AI185=\"Nur EP        \",$K185=\"E\"),((AM185/(AVERAGE($AF185,$AM185,$AT185,$BA185,$BH185)))-1),\nIF($L$4=\"MIT\",((AI185/(AVERAGE($AB185,$AI185,$AP185,$AW185,$BD185)))-1),\nIF($L$4=\"MIN\",\nIF(OR(AI185=\"Nur EP        \",$K185=\"E\"),((AM185/(MIN($AF185,$AM185,$AT185,$BA185,$BH185)))-1),\nIF($L$4=\"MIN\",(AI185/(MIN($AB185,$AI185,$AP185,$AW185,$BD185)))-1)\n)))))))","v":""},{"$f":"IF(OR($K185=\"\",$K185=\"H\",$K185=\"AB\",$K185=\"G\",$J185=\"Position\",$K185=\"<-- Bitte Positionsart\",AH185=\"\",$L185=\"\"),\"\",\nIF(OR($K185=\"A\",$K185=\"B\",$K185=\"E\"),$L185*AH185))","v":""},null,null,"",null,"",{"$f":"IF(OR($L185=\"\",AO185=\"\",$J185=\"Ausführungsbeschreibung\",$J185=\"Hinweis\"),\"\",\nIF(AND($AA185,$AH185,$AO185,$AV185,$BC185)=\"\",\"\",\nIF($L$4=\"MIT\",\nIF(OR(AP185=\"Nur EP        \",$K185=\"E\"),((AT185/(AVERAGE($AF185,$AM185,$AT185,$BA185,$BH185)))-1),\nIF($L$4=\"MIT\",((AP185/(AVERAGE($AB185,$AI185,$AP185,$AW185,$BD185)))-1),\nIF($L$4=\"MIN\",\nIF(OR(AP185=\"Nur EP        \",$K185=\"E\"),((AT185/(MIN($AF185,$AM185,$AT185,$BA185,$BH185)))-1),\nIF($L$4=\"MIN\",(AP185/(MIN($AB185,$AI185,$AP185,$AW185,$BD185)))-1)\n)))))))","v":""},{"$f":"IF(OR($K185=\"\",$K185=\"H\",$K185=\"AB\",$K185=\"G\",$J185=\"Position\",$K185=\"<-- Bitte Positionsart\",AO185=\"\",$L185=\"\"),\"\",\nIF(OR($K185=\"A\",$K185=\"B\",$K185=\"E\"),$L185*AO185))","v":""},null,null,"",null,"",{"$f":"IF(OR($L185=\"\",AV185=\"\",$J185=\"Ausführungsbeschreibung\",$J185=\"Hinweis\"),\"\",\nIF(AND($AA185,$AH185,$AO185,$AV185,$BC185)=\"\",\"\",\nIF($L$4=\"MIT\",\nIF(OR(AW185=\"Nur EP        \",$K185=\"E\"),((BA185/(AVERAGE($AF185,$AM185,$AT185,$BA185,$BH185)))-1),\nIF($L$4=\"MIT\",((AW185/(AVERAGE($AB185,$AI185,$AP185,$AW185,$BD185)))-1),\nIF($L$4=\"MIN\",\nIF(OR(AW185=\"Nur EP        \",$K185=\"E\"),((BA185/(MIN($AF185,$AM185,$AT185,$BA185,$BH185)))-1),\nIF($L$4=\"MIN\",(AW185/(MIN($AB185,$AI185,$AP185,$AW185,$BD185)))-1)\n)))))))","v":""},{"$f":"IF(OR($K185=\"\",$K185=\"H\",$K185=\"AB\",$K185=\"G\",$J185=\"Position\",$K185=\"<-- Bitte Positionsart\",AV185=\"\",$L185=\"\"),\"\",\nIF(OR($K185=\"A\",$K185=\"B\",$K185=\"E\"),$L185*AV185))","v":""},null,null,"",null,"",{"$f":"IF(OR($L185=\"\",BC185=\"\",$J185=\"Ausführungsbeschreibung\",$J185=\"Hinweis\"),\"\",\nIF(AND($AA185,$AH185,$AO185,$AV185,$BC185)=\"\",\"\",\nIF($L$4=\"MIT\",\nIF(OR(BD185=\"Nur EP        \",$K185=\"E\"),((BH185/(AVERAGE($AF185,$AM185,$AT185,$BA185,$BH185)))-1),\nIF($L$4=\"MIT\",((BD185/(AVERAGE($AB185,$AI185,$AP185,$AW185,$BD185)))-1),\nIF($L$4=\"MIN\",\nIF(OR(BD185=\"Nur EP        \",$K185=\"E\"),((BH185/(MIN($AF185,$AM185,$AT185,$BA185,$BH185)))-1),\nIF($L$4=\"MIN\",((BD185/(MIN($AB185,$AI185,$AP185,$AW185,$BD185)))-1))\n)))))))","v":""},{"$f":"IF(OR($K185=\"\",$K185=\"H\",$K185=\"AB\",$K185=\"G\",$J185=\"Position\",$K185=\"<-- Bitte Positionsart\",BC185=\"\",$L185=\"\"),\"\",\nIF(OR($K185=\"A\",$K185=\"B\",$K185=\"E\"),$L185*BC185))","v":""}]
[null,null,null,null,null,null,{"$f":"G$183","v":9},3,null,null,"",null,null,null,"","","","",null,"",null,null,"","","",null,null,"",null,"","",{"$f":"IF(OR($K186=\"\",$K186=\"H\",$K186=\"AB\",$K186=\"G\",$J186=\"Position\",$K186=\"<-- Bitte Positionsart\",AA186=\"\",$L186=\"\"),\"\",\nIF(OR($K186=\"A\",$K186=\"B\",$K186=\"E\"),$L186*AA186))","v":""},null,null,"",null,"","",{"$f":"IF(OR($K186=\"\",$K186=\"H\",$K186=\"AB\",$K186=\"G\",$J186=\"Position\",$K186=\"<-- Bitte Positionsart\",AH186=\"\",$L186=\"\"),\"\",\nIF(OR($K186=\"A\",$K186=\"B\",$K186=\"E\"),$L186*AH186))","v":""},null,null,"",null,"","",{"$f":"IF(OR($K186=\"\",$K186=\"H\",$K186=\"AB\",$K186=\"G\",$J186=\"Position\",$K186=\"<-- Bitte Positionsart\",AO186=\"\",$L186=\"\"),\"\",\nIF(OR($K186=\"A\",$K186=\"B\",$K186=\"E\"),$L186*AO186))","v":""},null,null,"",null,"","","",null,null,"",null,"","",{"$f":"IF(OR($K186=\"\",$K186=\"H\",$K186=\"AB\",$K186=\"G\",$J186=\"Position\",$K186=\"<-- Bitte Positionsart\",BC186=\"\",$L186=\"\"),\"\",\nIF(OR($K186=\"A\",$K186=\"B\",$K186=\"E\"),$L186*BC186))","v":""}]
[null,null,null,null,null,null,{"$f":"G$183","v":9},4,null,null,"",null,null,null,"","","","",null,"",null,null,"","","",null,null,"",null,"","","",null,null,"",null,"","","",null,null,"",null,"","","",null,null,"",null,"","","",null,null,"",null,"","",""]
[null,null,null,null,null,null,9,5,null,null,"",null,null,null,"","","","",null,"",null,null,"","","",null,null,"",null,"","","",null,null,"",null,"","","",null,null,"",null,"","","",null,null,"",null,"","","",null,null,"",null,"","",""]
[null,null,null,null,null,null,{"$f":"G$183","v":9},6,null,null,"",null,null,null,"","","","",null,"",null,null,"","","",null,null,"",null,"","","",null,null,"",null,"","","",null,null,"",null,"","","",null,null,"",null,"","","",null,null,"",null,"","",""]
[null,null,null,null,null,null,{"$f":"G$183","v":9},7,null,null,"",null,null,null,"","","","",null,"",null,null,"","","",null,null,"",null,"","","",null,null,"",null,"","","",null,null,"",null,"","","",null,null,"",null,"","","",null,null,"",null,"","",""]
[null,null,null,null,null,null,9,8,null,null,"",null,null,null,"","","","",null,"",null,null,"","","",null,null,"",null,"","","",null,null,"",null,"","","",null,null,"",null,"","","",null,null,"",null,"","","",null,null,"",null,"","",""]
[null,null,null,null,null,null,{"$f":"G$183","v":9},9,null,null,"",null,null,null,"","","","",null,"",null,null,"","","",null,null,"",null,"","","",null,null,"",null,"","","",null,null,"",null,"","","",null,null,"",null,"","","",null,null,"",null,"","",""]
[null,null,null,null,null,null,9,10,null,null,"",null,null,null,"","","","",null,"",null,null,"","","",null,null,"",null,"","","",null,null,"",null,"","","",null,null,"",null,"","","",null,null,"",null,"","","",null,null,"",null,"","",""]
[null,null,null,null,null,null,null,null,null,null,null,null,null,null,null,null,null,null,null,null,null,null,null,null,{"$f":"IF($K194=\"\",\"\",IF(OR($K194=\"A\",$K194=\"B\"),$L194*V194,IF($K194=\"E\",\"\")))","v":""},null,"EP / % Titel","Positions- / Titelsumme",null,"",null,{"$f":"IF($K194=\"Ja\",IF(AND($L194<>\"\",AA194<>\"\"),$L194*AA194),\"\")","v":""},null,"EP / % Titel","Positions- / Titelsumme",null,"",null,{"$f":"IF($K194=\"Ja\",IF(AND($L194<>\"\",AH194<>\"\"),$L194*AH194),\"\")","v":""},null,"EP / % Titel","Positions- / Titelsumme",null,"",null,{"$f":"IF($K194=\"Ja\",IF(AND($L194<>\"\",AO194<>\"\"),$L194*AO194),\"\")","v":""},null,"EP / % Titel","Positions- / Titelsumme",null,"",null,{"$f":"IF($K194=\"Ja\",IF(AND($L194<>\"\",AV194<>\"\"),$L194*AV194),\"\")","v":""},null,"EP / % Titel","Positions- / Titelsumme",null,"",null,{"$f":"IF($K194=\"Ja\",IF(AND($L194<>\"\",BC194<>\"\"),$L194*BC194),\"\")","v":""}]
[null,null,null,null,null,null,10,null,"Material und Stundenlohnleistungen",null,null,null,null,null,{"$f":"CONCATENATE(\"Titelsumme\",CHAR(10),\"MIN\",CHAR(10),TEXT(SUMPRODUCT($L196:$L206,O196:O206),\"##.##0,00\"),\" €\")","v":"Titelsumme\nMIN\n9.040,40 €"},{"$f":"CONCATENATE(\"Titelsumme\",CHAR(10),\"MIT\",CHAR(10),TEXT(SUMPRODUCT($L196:$L206,P196:P206),\"##.##0,00\"),\" €\")","v":"Titelsumme\nMIT\n9.386,53 €"},{"$f":"CONCATENATE(\"Titelsumme\",CHAR(10),\"MAX\",CHAR(10),TEXT(SUMPRODUCT($L196:$L206,Q196:Q206),\"##.##0,00\"),\" €\")","v":"Titelsumme\nMAX\n9.613,60 €"},{"$f":"SUM(R196:R206)","v":9386.5333333333328},null,{"$f":"SUM(T196:T206)","v":0},null,null,{"$f":"SUM(W196:W206)","v":0},null,{"$f":"SUM(Y196:Y206)","v":0},null,{"$f":"IF(AB195=0,\"\",\nIF($L$4=\"MIT\",((AB195/(AVERAGE($AB195,$AI195,$AP195,$AW195,$BD195)))-1)*100,))","v":68.432790238497716},{"$f":"SUM(AB196:AB206)","v":9486},null,"",null,{"$f":"SUM(AF196:AF206)","v":0},null,{"$f":"IF(AI195=0,\"\",\nIF($L$4=\"MIT\",((AI195/(AVERAGE($AB195,$AI195,$AP195,$AW195,$BD195)))-1)*100,))","v":70.698447421128122},{"$f":"SUM(AI196:AI206)","v":9613.5999999999985},null,"",null,{"$f":"SUM(AM196:AM206)","v":0},null,{"$f":"IF(AP195=0,\"\",\nIF($L$4=\"MIT\",((AP195/(AVERAGE($AB195,$AI195,$AP195,$AW195,$BD195)))-1)*100,))","v":60.868762340374147},{"$f":"SUM(AP196:AP206)","v":9060},null,"",null,{"$f":"SUM(AT196:AT206)","v":0},null,{"$f":"IF(AW195=0,\"\",\nIF($L$4=\"MIT\",((AW195/(AVERAGE($AB195,$AI195,$AP195,$AW195,$BD195)))-1)*100,))","v":""},{"$f":"SUM(AW196:AW206)","v":0},null,"",null,{"$f":"SUM(BA196:BA206)","v":0},null,{"$f":"IF(BD195=0,\"\",\nIF($L$4=\"MIT\",((BD195/(AVERAGE($AB195,$AI195,$AP195,$AW195,$BD195)))-1)*100,))","v":""},{"$f":"SUM(BD196:BD206)","v":0},null,"",null,{"$f":"SUM(BH196:BH206)","v":0}]
[null,null,null,null,null,null,{"$f":"G$195","v":10},{"$f":"IF(G$162=\"\",\"\",ROW()-ROW(G$195))","v":1},"Materialpauschale für unvorhergesehenes","Position",{"$f":"IF(J196=\"Position\",\"\",IF(J196=\"Grundposition\",\"G\",IF(J196=\"Alternativposition\",\"A\",IF(J196=\"Bedarfsposition\",\"B\",IF(J196=\"Hinweis\",\"H\",IF(J196=\"Ausführungsbeschreibung\",\"AB\",IF(J196=\"Entfällt\",\"E\",IF(AND(I196<>\"\",L196<>\"\"),\"<-- Bitte Positionsart\",\"\"))))))))","v":""},1,"pausch.",null,{"$f":"IF(OR($K196=\"B\",$K196=\"A\",$K196=\"H\",$K196=\"AB\",$K196=\"<-- Bitte Positionsart\",SUM(AA196,AH196,AO196,AV196,BC196)=0),\"\",MIN(AA196,AH196,AO196,AV196,BC196))","v":2500},{"$f":"IF(OR($K196=\"B\",$K196=\"A\",$K196=\"H\",$K196=\"AB\",$K196=\"<-- Bitte Positionsart\",SUM(AA196,AH196,AO196,AV196,BC196)=0),\"\",SUM(AA196,AH196,AO196,AV196,BC196)/COUNT(AA196,AH196,AO196,AV196,BC196))","v":2500},{"$f":"IF(OR($K196=\"B\",$K196=\"A\",$K196=\"H\",$K196=\"AB\",$K196=\"<-- Bitte Positionsart\",SUM(AA196,AH196,AO196,AV196,BC196)=0),\"\",MAX(AA196,AH196,AO196,AV196,BC196))","v":2500},{"$f":"IF(OR($K196=\"A\",$K196=\"B\"),\"Nur EP        \",IF($K196=\"E\",\"E                \",IF(AND($L196<>\"\",P196<>\"\"),$L196*P196,\"\")))","v":2500},null,{"$f":"IF(OR($K196=\"\",$K196=\"H\",$K196=\"AB\",$K196=\"G\",$K196=\"<-- Bitte Positionsart\"),\"\",IF(OR($K196=\"A\",$K196=\"B\"),$L196*(SUM(AA196,AH196,AO196,AV196,BC196)/COUNT(AA196,AH196,AO196,AV196,BC196)),IF($K196=\"E\",$L196*P196)))","v":""},null,null,{"$f":"IF(OR($K196=\"A\",$K196=\"B\"),\"Nur EP        \",IF($K196=\"E\",\"E                \",IF(AND($L196<>\"\",V196<>\"\"),$L196*V196,\"\")))","v":""},{"$f":"IF(OR($L196=\"\",W196=\"\"),\"\",\nIF(OR($W196=\"Nur EP        \",$K196=\"E\"),(Y196/(AVERAGE($Y196,$AF196,$AM196,$AT196,Y196))-1),\nIF(AND($W196,$AB196,$AI196,$AP196,$AW196)=\"\",\"\",(W196/(AVERAGE($W196,$AB196,$AI196,$AP196,$AW196)))-1)))","v":""},{"$f":"IF(OR($K196=\"\",$K196=\"H\",$K196=\"AB\",$K196=\"G\",$J196=\"Position\",$K196=\"<-- Bitte Positionsart\",V196=\"\",$L196=\"\"),\"\",\nIF(OR($K196=\"A\",$K196=\"B\",$K196=\"E\"),$L196*V196))","v":""},null,2500,{"$f":"IF(C196=\"Hinweis\",\"\",IF(OR($K196=\"A\",$K196=\"B\"),\"Nur EP        \",IF($K196=\"E\",\"E                \",IF(AND($L196<>\"\",AA196<>\"\"),$L196*AA196,\"\"))))","v":2500},null,"",{"$f":"IF(OR($L196=\"\",AA196=\"\",$J196=\"Ausführungsbeschreibung\",$J196=\"Hinweis\"),\"\",\nIF(AND($AA196,$AH196,$AO196,$AV196,$BC196)=\"\",\"\",\nIF($L$4=\"MIT\",\nIF(OR(AB196=\"Nur EP        \",$K196=\"E\"),((AF196/(AVERAGE($AF196,$AM196,$AT196,$BA196,$BH196)))-1),\nIF($L$4=\"MIT\",((AB196/(AVERAGE($AB196,$AI196,$AP196,$AW196,$BD196)))-1),\nIF($L$4=\"MIN\",\nIF(OR(AB196=\"Nur EP        \",$K196=\"E\"),((AF196/(MIN($AF196,$AM196,$AT196,$BA196,$BH196)))-1),\nIF($L$4=\"MIN\",((AB196/(MIN($AB196,$AI196,$AP196,$AW196,$BD196)))-1))\n)))))))","v":0},{"$f":"IF(OR($K196=\"\",$K196=\"H\",$K196=\"AB\",$K196=\"G\",$J196=\"Position\",$K196=\"<-- Bitte Positionsart\",AA196=\"\",$L196=\"\"),\"\",\nIF(OR($K196=\"A\",$K196=\"B\",$K196=\"E\"),$L196*AA196))","v":""},null,2500,{"$f":"IF(J196=\"Hinweis\",\"\",IF(OR($K196=\"A\",$K196=\"B\"),\"Nur EP        \",IF($K196=\"E\",\"E                \",IF(AND($L196<>\"\",AH196<>\"\"),$L196*AH196,\"\"))))","v":2500},null,{"$f":"IF(AJ196=\"\",\"\",IF(AJ196=\"X\",AI196,AI196*AJ196))","v":""},{"$f":"IF(OR($L196=\"\",AH196=\"\",$J196=\"Ausführungsbeschreibung\",$J196=\"Hinweis\"),\"\",\nIF(AND($AA196,$AH196,$AO196,$AV196,$BC196)=\"\",\"\",\nIF($L$4=\"MIT\",\nIF(OR(AI196=\"Nur EP        \",$K196=\"E\"),((AM196/(AVERAGE($AF196,$AM196,$AT196,$BA196,$BH196)))-1),\nIF($L$4=\"MIT\",((AI196/(AVERAGE($AB196,$AI196,$AP196,$AW196,$BD196)))-1),\nIF($L$4=\"MIN\",\nIF(OR(AI196=\"Nur EP        \",$K196=\"E\"),((AM196/(MIN($AF196,$AM196,$AT196,$BA196,$BH196)))-1),\nIF($L$4=\"MIN\",(AI196/(MIN($AB196,$AI196,$AP196,$AW196,$BD196)))-1)\n)))))))","v":0},{"$f":"IF(OR($K196=\"\",$K196=\"H\",$K196=\"AB\",$K196=\"G\",$J196=\"Position\",$K196=\"<-- Bitte Positionsart\",AH196=\"\",$L196=\"\"),\"\",\nIF(OR($K196=\"A\",$K196=\"B\",$K196=\"E\"),$L196*AH196))","v":""},null,2500,{"$f":"IF(P196=\"Hinweis\",\"\",IF(OR($K196=\"A\",$K196=\"B\"),\"Nur EP        \",IF($K196=\"E\",\"E                \",IF(AND($L196<>\"\",AO196<>\"\"),$L196*AO196,\"\"))))","v":2500},null,{"$f":"IF(AQ196=\"\",\"\",IF(AQ196=\"X\",AP196,AP196*AQ196))","v":""},{"$f":"IF(OR($L196=\"\",AO196=\"\",$J196=\"Ausführungsbeschreibung\",$J196=\"Hinweis\"),\"\",\nIF(AND($AA196,$AH196,$AO196,$AV196,$BC196)=\"\",\"\",\nIF($L$4=\"MIT\",\nIF(OR(AP196=\"Nur EP        \",$K196=\"E\"),((AT196/(AVERAGE($AF196,$AM196,$AT196,$BA196,$BH196)))-1),\nIF($L$4=\"MIT\",((AP196/(AVERAGE($AB196,$AI196,$AP196,$AW196,$BD196)))-1),\nIF($L$4=\"MIN\",\nIF(OR(AP196=\"Nur EP        \",$K196=\"E\"),((AT196/(MIN($AF196,$AM196,$AT196,$BA196,$BH196)))-1),\nIF($L$4=\"MIN\",(AP196/(MIN($AB196,$AI196,$AP196,$AW196,$BD196)))-1)\n)))))))","v":0},{"$f":"IF(OR($K196=\"\",$K196=\"H\",$K196=\"AB\",$K196=\"G\",$J196=\"Position\",$K196=\"<-- Bitte Positionsart\",AO196=\"\",$L196=\"\"),\"\",\nIF(OR($K196=\"A\",$K196=\"B\",$K196=\"E\"),$L196*AO196))","v":""},null,null,{"$f":"IF(W196=\"Hinweis\",\"\",IF(OR($K196=\"A\",$K196=\"B\"),\"Nur EP        \",IF($K196=\"E\",\"E                \",IF(AND($L196<>\"\",AV196<>\"\"),$L196*AV196,\"\"))))","v":""},null,{"$f":"IF(AX196=\"\",\"\",IF(AX196=\"X\",AW196,AW196*AX196))","v":""},{"$f":"IF(OR($L196=\"\",AV196=\"\",$J196=\"Ausführungsbeschreibung\",$J196=\"Hinweis\"),\"\",\nIF(AND($AA196,$AH196,$AO196,$AV196,$BC196)=\"\",\"\",\nIF($L$4=\"MIT\",\nIF(OR(AW196=\"Nur EP        \",$K196=\"E\"),((BA196/(AVERAGE($AF196,$AM196,$AT196,$BA196,$BH196)))-1),\nIF($L$4=\"MIT\",((AW196/(AVERAGE($AB196,$AI196,$AP196,$AW196,$BD196)))-1),\nIF($L$4=\"MIN\",\nIF(OR(AW196=\"Nur EP        \",$K196=\"E\"),((BA196/(MIN($AF196,$AM196,$AT196,$BA196,$BH196)))-1),\nIF($L$4=\"MIN\",(AW196/(MIN($AB196,$AI196,$AP196,$AW196,$BD196)))-1)\n)))))))","v":""},{"$f":"IF(OR($K196=\"\",$K196=\"H\",$K196=\"AB\",$K196=\"G\",$J196=\"Position\",$K196=\"<-- Bitte Positionsart\",AV196=\"\",$L196=\"\"),\"\",\nIF(OR($K196=\"A\",$K196=\"B\",$K196=\"E\"),$L196*AV196))","v":""},null,null,{"$f":"IF(AD196=\"Hinweis\",\"\",IF(OR($K196=\"A\",$K196=\"B\"),\"Nur EP        \",IF($K196=\"E\",\"E                \",IF(AND($L196<>\"\",BC196<>\"\"),$L196*BC196,\"\"))))","v":""},null,"",{"$f":"IF(OR($L196=\"\",BC196=\"\",$J196=\"Ausführungsbeschreibung\",$J196=\"Hinweis\"),\"\",\nIF(AND($AA196,$AH196,$AO196,$AV196,$BC196)=\"\",\"\",\nIF($L$4=\"MIT\",\nIF(OR(BD196=\"Nur EP        \",$K196=\"E\"),((BH196/(AVERAGE($AF196,$AM196,$AT196,$BA196,$BH196)))-1),\nIF($L$4=\"MIT\",((BD196/(AVERAGE($AB196,$AI196,$AP196,$AW196,$BD196)))-1),\nIF($L$4=\"MIN\",\nIF(OR(BD196=\"Nur EP        \",$K196=\"E\"),((BH196/(MIN($AF196,$AM196,$AT196,$BA196,$BH196)))-1),\nIF($L$4=\"MIN\",((BD196/(MIN($AB196,$AI196,$AP196,$AW196,$BD196)))-1))\n)))))))","v":""},{"$f":"IF(OR($K196=\"\",$K196=\"H\",$K196=\"AB\",$K196=\"G\",$J196=\"Position\",$K196=\"<-- Bitte Positionsart\",BC196=\"\",$L196=\"\"),\"\",\nIF(OR($K196=\"A\",$K196=\"B\",$K196=\"E\"),$L196*BC196))","v":""}]
[null,null,null,null,null,null,{"$f":"G$195","v":10},2,"Stunden Facharbeiter /Geselle mit gesondertem Nachweis","Position","",40,"Std.",null,63.51,64.083333333333329,64.739999999999995,2563.333333333333,null,"",null,null,"","",{"$f":"IF(OR($K197=\"\",$K197=\"H\",$K197=\"AB\",$K197=\"G\",$J197=\"Position\",$K197=\"<-- Bitte Positionsart\",V197=\"\",$L197=\"\"),\"\",\nIF(OR($K197=\"A\",$K197=\"B\",$K197=\"E\"),$L197*V197))","v":""},null,63.51,2540.4,null,"",-8.9466840052015995E-3,{"$f":"IF(OR($K197=\"\",$K197=\"H\",$K197=\"AB\",$K197=\"G\",$J197=\"Position\",$K197=\"<-- Bitte Positionsart\",AA197=\"\",$L197=\"\"),\"\",\nIF(OR($K197=\"A\",$K197=\"B\",$K197=\"E\"),$L197*AA197))","v":""},null,64.739999999999995,2589.6,null,"",{"$f":"IF(OR($L197=\"\",AH197=\"\",$J197=\"Ausführungsbeschreibung\",$J197=\"Hinweis\"),\"\",\nIF(AND($AA197,$AH197,$AO197,$AV197,$BC197)=\"\",\"\",\nIF($L$4=\"MIT\",\nIF(OR(AI197=\"Nur EP        \",$K197=\"E\"),((AM197/(AVERAGE($AF197,$AM197,$AT197,$BA197,$BH197)))-1),\nIF($L$4=\"MIT\",((AI197/(AVERAGE($AB197,$AI197,$AP197,$AW197,$BD197)))-1),\nIF($L$4=\"MIN\",\nIF(OR(AI197=\"Nur EP        \",$K197=\"E\"),((AM197/(MIN($AF197,$AM197,$AT197,$BA197,$BH197)))-1),\nIF($L$4=\"MIN\",(AI197/(MIN($AB197,$AI197,$AP197,$AW197,$BD197)))-1)\n)))))))","v":1.0247074122236466E-2},{"$f":"IF(OR($K197=\"\",$K197=\"H\",$K197=\"AB\",$K197=\"G\",$J197=\"Position\",$K197=\"<-- Bitte Positionsart\",AH197=\"\",$L197=\"\"),\"\",\nIF(OR($K197=\"A\",$K197=\"B\",$K197=\"E\"),$L197*AH197))","v":""},null,64,2560,null,"",{"$f":"IF(OR($L197=\"\",AO197=\"\",$J197=\"Ausführungsbeschreibung\",$J197=\"Hinweis\"),\"\",\nIF(AND($AA197,$AH197,$AO197,$AV197,$BC197)=\"\",\"\",\nIF($L$4=\"MIT\",\nIF(OR(AP197=\"Nur EP        \",$K197=\"E\"),((AT197/(AVERAGE($AF197,$AM197,$AT197,$BA197,$BH197)))-1),\nIF($L$4=\"MIT\",((AP197/(AVERAGE($AB197,$AI197,$AP197,$AW197,$BD197)))-1),\nIF($L$4=\"MIN\",\nIF(OR(AP197=\"Nur EP        \",$K197=\"E\"),((AT197/(MIN($AF197,$AM197,$AT197,$BA197,$BH197)))-1),\nIF($L$4=\"MIN\",(AP197/(MIN($AB197,$AI197,$AP197,$AW197,$BD197)))-1)\n)))))))","v":-1.3003901170351995E-3},{"$f":"IF(OR($K197=\"\",$K197=\"H\",$K197=\"AB\",$K197=\"G\",$J197=\"Position\",$K197=\"<-- Bitte Positionsart\",AO197=\"\",$L197=\"\"),\"\",\nIF(OR($K197=\"A\",$K197=\"B\",$K197=\"E\"),$L197*AO197))","v":""},null,null,"",null,"",{"$f":"IF(OR($L197=\"\",AV197=\"\",$J197=\"Ausführungsbeschreibung\",$J197=\"Hinweis\"),\"\",\nIF(AND($AA197,$AH197,$AO197,$AV197,$BC197)=\"\",\"\",\nIF($L$4=\"MIT\",\nIF(OR(AW197=\"Nur EP        \",$K197=\"E\"),((BA197/(AVERAGE($AF197,$AM197,$AT197,$BA197,$BH197)))-1),\nIF($L$4=\"MIT\",((AW197/(AVERAGE($AB197,$AI197,$AP197,$AW197,$BD197)))-1),\nIF($L$4=\"MIN\",\nIF(OR(AW197=\"Nur EP        \",$K197=\"E\"),((BA197/(MIN($AF197,$AM197,$AT197,$BA197,$BH197)))-1),\nIF($L$4=\"MIN\",(AW197/(MIN($AB197,$AI197,$AP197,$AW197,$BD197)))-1)\n)))))))","v":""},{"$f":"IF(OR($K197=\"\",$K197=\"H\",$K197=\"AB\",$K197=\"G\",$J197=\"Position\",$K197=\"<-- Bitte Positionsart\",AV197=\"\",$L197=\"\"),\"\",\nIF(OR($K197=\"A\",$K197=\"B\",$K197=\"E\"),$L197*AV197))","v":""},null,null,"",null,"",{"$f":"IF(OR($L197=\"\",BC197=\"\",$J197=\"Ausführungsbeschreibung\",$J197=\"Hinweis\"),\"\",\nIF(AND($AA197,$AH197,$AO197,$AV197,$BC197)=\"\",\"\",\nIF($L$4=\"MIT\",\nIF(OR(BD197=\"Nur EP        \",$K197=\"E\"),((BH197/(AVERAGE($AF197,$AM197,$AT197,$BA197,$BH197)))-1),\nIF($L$4=\"MIT\",((BD197/(AVERAGE($AB197,$AI197,$AP197,$AW197,$BD197)))-1),\nIF($L$4=\"MIN\",\nIF(OR(BD197=\"Nur EP        \",$K197=\"E\"),((BH197/(MIN($AF197,$AM197,$AT197,$BA197,$BH197)))-1),\nIF($L$4=\"MIN\",((BD197/(MIN($AB197,$AI197,$AP197,$AW197,$BD197)))-1))\n)))))))","v":""},{"$f":"IF(OR($K197=\"\",$K197=\"H\",$K197=\"AB\",$K197=\"G\",$J197=\"Position\",$K197=\"<-- Bitte Positionsart\",BC197=\"\",$L197=\"\"),\"\",\nIF(OR($K197=\"A\",$K197=\"B\",$K197=\"E\"),$L197*BC197))","v":""}]
[null,null,null,null,null,null,{"$f":"G$195","v":10},3,"Stunden Lehrlling mit gesondertem Nachweis","Position","",40,"Std.",null,50,52.183333333333337,53.62,2087.3333333333335,null,"",null,null,"","","",null,52.93,2117.1999999999998,null,"",1.4308527626956113E-2,{"$f":"IF(OR($K198=\"\",$K198=\"H\",$K198=\"AB\",$K198=\"G\",$J198=\"Position\",$K198=\"<-- Bitte Positionsart\",AA198=\"\",$L198=\"\"),\"\",\nIF(OR($K198=\"A\",$K198=\"B\",$K198=\"E\"),$L198*AA198))","v":""},null,53.62,2144.7999999999997,null,"",2.7531140210795169E-2,{"$f":"IF(OR($K198=\"\",$K198=\"H\",$K198=\"AB\",$K198=\"G\",$J198=\"Position\",$K198=\"<-- Bitte Positionsart\",AH198=\"\",$L198=\"\"),\"\",\nIF(OR($K198=\"A\",$K198=\"B\",$K198=\"E\"),$L198*AH198))","v":""},null,50,2000,null,"",-4.1839667837751615E-2,{"$f":"IF(OR($K198=\"\",$K198=\"H\",$K198=\"AB\",$K198=\"G\",$J198=\"Position\",$K198=\"<-- Bitte Positionsart\",AO198=\"\",$L198=\"\"),\"\",\nIF(OR($K198=\"A\",$K198=\"B\",$K198=\"E\"),$L198*AO198))","v":""},null,null,"",null,"","","",null,null,"",null,"","",{"$f":"IF(OR($K198=\"\",$K198=\"H\",$K198=\"AB\",$K198=\"G\",$J198=\"Position\",$K198=\"<-- Bitte Positionsart\",BC198=\"\",$L198=\"\"),\"\",\nIF(OR($K198=\"A\",$K198=\"B\",$K198=\"E\"),$L198*BC198))","v":""}]
[null,null,null,null,null,null,10,4,"Stunden Helfer mit gesondertem Nachweis","Position","",40,"Std.",null,50,55.896666666666668,59.48,2235.8666666666668,null,"",null,null,"","","",null,58.21,2328.4,null,"",4.1385890631522537E-2,"",null,59.48,2379.1999999999998,null,"",6.4106386785139025E-2,"",null,50,2000,null,"",-0.10549227741666178,"",null,null,"",null,"","","",null,null,"",null,"","",""]
[null,null,null,null,null,null,{"$f":"G$195","v":10},5,null,null,"",null,null,null,"","","","",null,"",null,null,"","","",null,null,"",null,"","","",null,null,"",null,"","","",null,null,"",null,"","","",null,null,"",null,"","","",null,null,"",null,"","",""]
[null,null,null,null,null,null,10,6,null,null,"",null,null,null,"","","","",null,"",null,null,"","","",null,null,"",null,"","","",null,null,"",null,"","","",null,null,"",null,"","","",null,null,"",null,"","","",null,null,"",null,"","",""]
[null,null,null,null,null,null,{"$f":"G$195","v":10},7,null,null,"",null,null,null,"","","","",null,"",null,null,"","","",null,null,"",null,"","","",null,null,"",null,"","","",null,null,"",null,"","","",null,null,"",null,"","","",null,null,"",null,"","",""]
[null,null,null,null,null,null,10,8,null,null,"",null,null,null,"","","","",null,"",null,null,"","","",null,null,"",null,"","","",null,null,"",null,"","","",null,null,"",null,"","","",null,null,"",null,"","","",null,null,"",null,"","",""]
[null,null,null,null,null,null,10,9,null,null,"",null,null,null,"","","","",null,"",null,null,"","","",null,null,"",null,"","","",null,null,"",null,"","","",null,null,"",null,"","","",null,null,"",null,"","","",null,null,"",null,"","",""]
[null,null,null,null,null,null,10,10,null,null,"",null,null,null,"","","","",null,"",null,null,"","","",null,null,"",null,"","","",null,null,"",null,"","","",null,null,"",null,"","","",null,null,"",null,"","","",null,null,"",null,"","",""]
[null,null,null,null,null,null,null,null,null,null,null,null,null,null,{"$f":"IF(SUM(AA206,AH206,AO206,AV206)=0,\"\",MIN(AA206,AH206,AO206,AV206))","v":""},{"$f":"IF(SUM(AA206,AH206,AO206,AV206)=0,\"\",SUM(AA206,AH206,AO206,AV206)/COUNT(AA206,AH206,AO206,AV206))","v":""},{"$f":"IF(SUM(AA206,AH206,AO206,AV206)=0,\"\",MAX(AA206,AH206,AO206,AV206))","v":""},null,null,{"$f":"IF($K206=\"\",\"\",IF(OR($K206=\"A\",$K206=\"B\"),$L206*P206,IF($K206=\"E\",\"\")))","v":""},null,null,null,null,{"$f":"IF($K206=\"\",\"\",IF(OR($K206=\"A\",$K206=\"B\"),$L206*V206,IF($K206=\"E\",\"\")))","v":""},null,null,null,null,null,null,{"$f":"IF($K206=\"\",\"\",IF(OR($K206=\"A\",$K206=\"B\"),$L206*AA206,IF($K206=\"E\",\"\")))","v":""},null,null,null,null,null,null,{"$f":"IF($K206=\"\",\"\",IF(OR($K206=\"A\",$K206=\"B\"),$L206*AH206,IF($K206=\"E\",\"\")))","v":""},null,null,null,null,null,null,{"$f":"IF($K206=\"\",\"\",IF(OR($K206=\"A\",$K206=\"B\"),$L206*AO206,IF($K206=\"E\",\"\")))","v":""},null,null,null,null,null,null,{"$f":"IF($K206=\"\",\"\",IF(OR($K206=\"A\",$K206=\"B\"),$L206*AV206,IF($K206=\"E\",\"\")))","v":""},null,null,null,null,null,null,{"$f":"IF($K206=\"\",\"\",IF(OR($K206=\"A\",$K206=\"B\"),$L206*BC206,IF($K206=\"E\",\"\")))","v":""},{"$f":"IF(AV206=\"\",\"\",SUM(AW$28:AW206))","v":""}]
[]
[]
[]
[]
[]
[]
[]
[]
[null,null,null,null,null,null,null,null,null,null,null,null,null,null,null,null,null,null,null,null,null,null,null,null,null,null,null,null,null,null,null,null,null,null,null,null,null,null,null,null,null,null,null,null,null,null,null,null,null,null,null,null,null,null,null,null,null,null,null,null,null,{"$f":"IF(H215=\"\",\"\",IF(AB215>(AVERAGE(W215,AB215,AI215,AP215)*1.15),\"Groß\",IF(AB215<(AVERAGE(W215,AB215,AI215,AP215)*0.85),\"Klein\",\"\")))","v":""}]

{"sheet":"ALLGEMEINE ANGABEN","index":1,"n_rows":7,"n_cols":2,"rows_kept":7,"cut":false,"hidden":false,"merged":[]}
["Allgemeine Angaben zur Kostenermittlung auf den nachfolgenden Seiten"]
[]
["Berücksichtigte Mehrwertsteuer",0.19]
[]
["Projektnummer","196"]
[]
["Projektbezeichnung","Dachsanierung Auf der Raade 49/51"]

{"sheet":"-- Auswahllisten --","index":2,"n_rows":9,"n_cols":3,"rows_kept":9,"cut":false,"hidden":false,"merged":[]}
[]
["Positionsarten","Einheiten","Positionstypen"]
["Position","m","[B] edarf"]
["Grundposition","lfdm","[G] rundposition"]
["Alternativposition","qm","[A] lternativposition"]
["Bedarfsposition","cbm","[E] Entfällt"]
["Entfällt","Stck.","[H] inweis"]
["Hinweis","pausch.","[AB] usführungsbeschreibung"]
["Ausführungsbeschreibung","Std."]