{"text_format":"1","workbook":"xlsx","n_sheets":2,"sheets":["Tabelle1","Tabelle2"],"not_rendered":{"charts":0,"images":1,"macros":1,"external_links":1,"defined_names":26,"comments":0,"pivot_tables":0},"unopened":[],"bounds":{"document_bytes":16777216,"sheet_cells":100000,"rows_first":2000,"rows_last":500,"rows_between":2000,"halvings":0,"cell_chars":16384,"cell_head_chars":4096},"cells_cut":0,"cells_raw":0,"read":"whole","date_system":"1900"}

{"sheet":"Tabelle1","index":0,"n_rows":562,"n_cols":84,"rows_kept":562,"cut":false,"hidden":false,"merged":[[2,72,2,77],[2,78,2,83],[2,48,2,53],[2,54,2,59],[1,11,1,29],[2,60,2,65],[2,66,2,71],[2,30,2,35],[2,36,2,41],[2,42,2,47],[1,81,1,83],[2,0,2,5],[2,6,2,11],[2,12,2,17],[2,18,2,23],[2,24,2,29],[1,3,1,5],[1,75,1,77],[1,33,1,35],[1,45,1,47],[1,51,1,53]]}
[]
[null,null,null,2025,null,null,null,null,null,null,null,"Hauskalender -XY",null,null,null,null,null,null,null,null,null,null,null,null,null,null,null,null,null,null,null,null,null,"Ramadan",null,null,null,null,null,null,null,null,null,null,null,"Kollege1 U",null,null,null,null,null,"Kollege2 U",null,null,null,null,null,null,null,null,null,null,null,null,null,null,null,null,null,null,null,null,null,null,null,{"$f":"D2+1","v":2026}]
["Januar",null,null,null,null,null,"Februar",null,null,"Februar",null,null,"März",null,null,"März",null,null,"April",null,null,"April",null,null,"Mai",null,null,"Mai",null,null,"Juni",null,null,"Juni",null,null,"Juli",null,null,"Juli",null,null,"August",null,null,"August",null,null,"September",null,null,"September",null,null,"Oktober",null,null,"Oktober",null,null,"November",null,null,"November",null,null,"Dezember",null,null,"Dezember",null,null,"Januar",null,null,"November",null,null,"Februar",null,null,"Dezember"]
[{"$f":"B4","v":"2025-01-01"},{"$f":"C4","v":"2025-01-01"},{"$f":"D4","v":"2025-01-01"},{"$f":"E4","v":"2025-01-01"},{"$f":"DATE(D2,1,1)","v":"2025-01-01"},{"$f":"IF(ISNA(VLOOKUP(E4,Tabelle2!$B$3:$D$501,3,FALSE)),\"\",VLOOKUP(E4,Tabelle2!$B$3:$D$501,3,FALSE))","v":"Neujahr"},{"$f":"H4","v":"2025-02-01"},"2025-02-01","2025-02-01",{"$f":"K4","v":"2025-02-01"},{"$f":"EDATE(E4,1)","v":"2025-02-01"},{"$f":"IF(ISNA(VLOOKUP(K4,Tabelle2!$B$3:$D$501,3,FALSE)),\"\",VLOOKUP(K4,Tabelle2!$B$3:$D$501,3,FALSE))","v":""},{"$f":"N4","v":"2025-03-01"},{"$f":"O4","v":"2025-03-01"},{"$f":"P4","v":"2025-03-01"},{"$f":"Q4","v":"2025-03-01"},{"$f":"EDATE(K4,1)","v":"2025-03-01"},{"$f":"IF(ISNA(VLOOKUP(Q4,Tabelle2!$B$3:$D$501,3,FALSE)),\"\",VLOOKUP(Q4,Tabelle2!$B$3:$D$501,3,FALSE))","v":""},{"$f":"T4","v":"2025-04-01"},{"$f":"U4","v":"2025-04-01"},{"$f":"V4","v":"2025-04-01"},{"$f":"W4","v":"2025-04-01"},{"$f":"EDATE(Q4,1)","v":"2025-04-01"},{"$f":"IF(ISNA(VLOOKUP(W4,Tabelle2!$B$3:$D$501,3,FALSE)),\"\",VLOOKUP(W4,Tabelle2!$B$3:$D$501,3,FALSE))","v":""},{"$f":"Z4","v":"2025-05-01"},{"$f":"AA4","v":"2025-05-01"},{"$f":"AB4","v":"2025-05-01"},{"$f":"AC4","v":"2025-05-01"},{"$f":"EDATE(W4,1)","v":"2025-05-01"},{"$f":"IF(ISNA(VLOOKUP(AC4,Tabelle2!$B$3:$D$501,3,FALSE)),\"\",VLOOKUP(AC4,Tabelle2!$B$3:$D$501,3,FALSE))","v":"Tag der Arbeit"},{"$f":"AF4","v":"2025-06-01"},{"$f":"AG4","v":"2025-06-01"},{"$f":"AH4","v":"2025-06-01"},{"$f":"AI4","v":"2025-06-01"},{"$f":"EDATE(AC4,1)","v":"2025-06-01"},{"$f":"IF(ISNA(VLOOKUP(AI4,Tabelle2!$B$3:$D$501,3,FALSE)),\"\",VLOOKUP(AI4,Tabelle2!$B$3:$D$501,3,FALSE))","v":""},{"$f":"AL4","v":"2025-07-01"},{"$f":"AM4","v":"2025-07-01"},{"$f":"AN4","v":"2025-07-01"},{"$f":"AO4","v":"2025-07-01"},{"$f":"EDATE(AI4,1)","v":"2025-07-01"},{"$f":"IF(ISNA(VLOOKUP(AO4,Tabelle2!$B$3:$D$501,3,FALSE)),\"\",VLOOKUP(AO4,Tabelle2!$B$3:$D$501,3,FALSE))","v":""},{"$f":"AR4","v":"2025-08-01"},{"$f":"AS4","v":"2025-08-01"},{"$f":"AT4","v":"2025-08-01"},{"$f":"AU4","v":"2025-08-01"},{"$f":"EDATE(AO4,1)","v":"2025-08-01"},{"$f":"IF(ISNA(VLOOKUP(AU4,Tabelle2!$B$3:$D$501,3,FALSE)),\"\",VLOOKUP(AU4,Tabelle2!$B$3:$D$501,3,FALSE))","v":""},{"$f":"AX4","v":"2025-09-01"},{"$f":"AY4","v":"2025-09-01"},{"$f":"AZ4","v":"2025-09-01"},{"$f":"BA4","v":"2025-09-01"},{"$f":"EDATE(AU4,1)","v":"2025-09-01"},{"$f":"IF(ISNA(VLOOKUP(BA4,Tabelle2!$B$3:$D$501,3,FALSE)),\"\",VLOOKUP(BA4,Tabelle2!$B$3:$D$501,3,FALSE))","v":""},{"$f":"BD4","v":"2025-10-01"},{"$f":"BE4","v":"2025-10-01"},{"$f":"BF4","v":"2025-10-01"},{"$f":"BG4","v":"2025-10-01"},{"$f":"EDATE(BA4,1)","v":"2025-10-01"},{"$f":"IF(ISNA(VLOOKUP(BG4,Tabelle2!$B$3:$D$501,3,FALSE)),\"\",VLOOKUP(BG4,Tabelle2!$B$3:$D$501,3,FALSE))","v":""},{"$f":"BJ4","v":"2025-11-01"},{"$f":"BK4","v":"2025-11-01"},{"$f":"BL4","v":"2025-11-01"},{"$f":"BM4","v":"2025-11-01"},{"$f":"EDATE(BG4,1)","v":"2025-11-01"},{"$f":"IF(ISNA(VLOOKUP(BM4,Tabelle2!$B$3:$D$501,3,FALSE)),\"\",VLOOKUP(BM4,Tabelle2!$B$3:$D$501,3,FALSE))","v":""},{"$f":"BP4","v":"2025-12-01"},{"$f":"BQ4","v":"2025-12-01"},{"$f":"BR4","v":"2025-12-01"},{"$f":"BS4","v":"2025-12-01"},{"$f":"EDATE(BM4,1)","v":"2025-12-01"},{"$f":"IF(ISNA(VLOOKUP(BS4,Tabelle2!$B$3:$D$501,3,FALSE)),\"\",VLOOKUP(BS4,Tabelle2!$B$3:$D$501,3,FALSE))","v":""},{"$f":"BV4","v":"2026-01-01"},{"$f":"BW4","v":"2026-01-01"},{"$f":"BX4","v":"2026-01-01"},{"$f":"BY4","v":"2026-01-01"},{"$f":"EDATE(BS4,1)","v":"2026-01-01"},{"$f":"IF(ISNA(VLOOKUP(BY4,Tabelle2!$B$3:$D$501,3,FALSE)),\"\",VLOOKUP(BY4,Tabelle2!$B$3:$D$501,3,FALSE))","v":"Neujahr"},{"$f":"CB4","v":"2026-02-01"},{"$f":"CC4","v":"2026-02-01"},{"$f":"CD4","v":"2026-02-01"},{"$f":"CE4","v":"2026-02-01"},{"$f":"EDATE(BY4,1)","v":"2026-02-01"},{"$f":"IF(ISNA(VLOOKUP(CE4,Tabelle2!$B$3:$D$501,3,FALSE)),\"\",VLOOKUP(CE4,Tabelle2!$B$3:$D$501,3,FALSE))","v":""}]
[{"$f":"B5","v":"2025-01-02"},"2025-01-02","2025-01-02",{"$f":"IFERROR(IF(MONTH(D4+1)=MONTH(D$4),D4+1,\"\"),\"\")","v":"2025-01-02"},"2025-01-02",{"$f":"IF(ISNA(VLOOKUP(E5,Tabelle2!$B$3:$D$501,3,FALSE)),\"\",VLOOKUP(E5,Tabelle2!$B$3:$D$501,3,FALSE))","v":""},"2025-02-02","2025-02-02","2025-02-02",{"$f":"IFERROR(IF(MONTH(J4+1)=MONTH(J$4),J4+1,\"\"),\"\")","v":"2025-02-02"},"2025-02-02",{"$f":"IF(ISNA(VLOOKUP(K5,Tabelle2!$B$3:$D$501,3,FALSE)),\"\",VLOOKUP(K5,Tabelle2!$B$3:$D$501,3,FALSE))","v":"Max / Paul"},{"$f":"N5","v":"2025-03-02"},"2025-03-02","2025-03-02",{"$f":"IFERROR(IF(MONTH(P4+1)=MONTH(P$4),P4+1,\"\"),\"\")","v":"2025-03-02"},"2025-03-02",{"$f":"IF(ISNA(VLOOKUP(Q5,Tabelle2!$B$3:$D$501,3,FALSE)),\"\",VLOOKUP(Q5,Tabelle2!$B$3:$D$501,3,FALSE))","v":""},{"$f":"T5","v":"2025-04-02"},"2025-04-02","2025-04-02",{"$f":"IFERROR(IF(MONTH(V4+1)=MONTH(V$4),V4+1,\"\"),\"\")","v":"2025-04-02"},"2025-04-02",{"$f":"IF(ISNA(VLOOKUP(W5,Tabelle2!$B$3:$D$501,3,FALSE)),\"\",VLOOKUP(W5,Tabelle2!$B$3:$D$501,3,FALSE))","v":"Bob"},{"$f":"Z5","v":"2025-05-02"},"2025-05-02","2025-05-02",{"$f":"IFERROR(IF(MONTH(AB4+1)=MONTH(AB$4),AB4+1,\"\"),\"\")","v":"2025-05-02"},"2025-05-02",{"$f":"IF(ISNA(VLOOKUP(AC5,Tabelle2!$B$3:$D$501,3,FALSE)),\"\",VLOOKUP(AC5,Tabelle2!$B$3:$D$501,3,FALSE))","v":"Zaccharia"},{"$f":"AF5","v":"2025-06-02"},"2025-06-02","2025-06-02",{"$f":"IFERROR(IF(MONTH(AH4+1)=MONTH(AH$4),AH4+1,\"\"),\"\")","v":"2025-06-02"},"2025-06-02",{"$f":"IF(ISNA(VLOOKUP(AI5,Tabelle2!$B$3:$D$501,3,FALSE)),\"\",VLOOKUP(AI5,Tabelle2!$B$3:$D$501,3,FALSE))","v":"Leni"},{"$f":"AL5","v":"2025-07-02"},"2025-07-02","2025-07-02",{"$f":"IFERROR(IF(MONTH(AN4+1)=MONTH(AN$4),AN4+1,\"\"),\"\")","v":"2025-07-02"},"2025-07-02",{"$f":"IF(ISNA(VLOOKUP(AO5,Tabelle2!$B$3:$D$501,3,FALSE)),\"\",VLOOKUP(AO5,Tabelle2!$B$3:$D$501,3,FALSE))","v":"Elfriede"},{"$f":"AR5","v":"2025-08-02"},"2025-08-02","2025-08-02",{"$f":"IFERROR(IF(MONTH(AT4+1)=MONTH(AT$4),AT4+1,\"\"),\"\")","v":"2025-08-02"},"2025-08-02",{"$f":"IF(ISNA(VLOOKUP(AU5,Tabelle2!$B$3:$D$501,3,FALSE)),\"\",VLOOKUP(AU5,Tabelle2!$B$3:$D$501,3,FALSE))","v":""},{"$f":"AX5","v":"2025-09-02"},"2025-09-02","2025-09-02",{"$f":"IFERROR(IF(MONTH(AZ4+1)=MONTH(AZ$4),AZ4+1,\"\"),\"\")","v":"2025-09-02"},"2025-09-02",{"$f":"IF(ISNA(VLOOKUP(BA5,Tabelle2!$B$3:$D$501,3,FALSE)),\"\",VLOOKUP(BA5,Tabelle2!$B$3:$D$501,3,FALSE))","v":""},{"$f":"BD5","v":"2025-10-02"},"2025-10-02","2025-10-02",{"$f":"IFERROR(IF(MONTH(BF4+1)=MONTH(BF$4),BF4+1,\"\"),\"\")","v":"2025-10-02"},"2025-10-02",{"$f":"IF(ISNA(VLOOKUP(BG5,Tabelle2!$B$3:$D$501,3,FALSE)),\"\",VLOOKUP(BG5,Tabelle2!$B$3:$D$501,3,FALSE))","v":""},{"$f":"BJ5","v":"2025-11-02"},"2025-11-02","2025-11-02",{"$f":"IFERROR(IF(MONTH(BL4+1)=MONTH(BL$4),BL4+1,\"\"),\"\")","v":"2025-11-02"},"2025-11-02",{"$f":"IF(ISNA(VLOOKUP(BM5,Tabelle2!$B$3:$D$501,3,FALSE)),\"\",VLOOKUP(BM5,Tabelle2!$B$3:$D$501,3,FALSE))","v":"Kagami"},{"$f":"BP5","v":"2025-12-02"},"2025-12-02","2025-12-02",{"$f":"IFERROR(IF(MONTH(BR4+1)=MONTH(BR$4),BR4+1,\"\"),\"\")","v":"2025-12-02"},"2025-12-02",{"$f":"IF(ISNA(VLOOKUP(BS5,Tabelle2!$B$3:$D$501,3,FALSE)),\"\",VLOOKUP(BS5,Tabelle2!$B$3:$D$501,3,FALSE))","v":""},{"$f":"BV5","v":"2026-01-02"},"2026-01-02","2026-01-02",{"$f":"IFERROR(IF(MONTH(BX4+1)=MONTH(BX$4),BX4+1,\"\"),\"\")","v":"2026-01-02"},"2026-01-02",{"$f":"IF(ISNA(VLOOKUP(BY5,Tabelle2!$B$3:$D$501,3,FALSE)),\"\",VLOOKUP(BY5,Tabelle2!$B$3:$D$501,3,FALSE))","v":""},{"$f":"CB5","v":"2026-02-02"},"2026-02-02","2026-02-02",{"$f":"IFERROR(IF(MONTH(CD4+1)=MONTH(CD$4),CD4+1,\"\"),\"\")","v":"2026-02-02"},"2026-02-02",{"$f":"IF(ISNA(VLOOKUP(CE5,Tabelle2!$B$3:$D$501,3,FALSE)),\"\",VLOOKUP(CE5,Tabelle2!$B$3:$D$501,3,FALSE))","v":"Max / Paul"}]
["2025-01-03","2025-01-03","2025-01-03","2025-01-03","2025-01-03",{"$f":"IF(ISNA(VLOOKUP(E6,Tabelle2!$B$3:$D$501,3,FALSE)),\"\",VLOOKUP(E6,Tabelle2!$B$3:$D$501,3,FALSE))","v":"Susanne"},"2025-02-03","2025-02-03","2025-02-03","2025-02-03","2025-02-03",{"$f":"IF(ISNA(VLOOKUP(K6,Tabelle2!$B$3:$D$501,3,FALSE)),\"\",VLOOKUP(K6,Tabelle2!$B$3:$D$501,3,FALSE))","v":""},"2025-03-03","2025-03-03","2025-03-03","2025-03-03","2025-03-03",{"$f":"IF(ISNA(VLOOKUP(Q6,Tabelle2!$B$3:$D$501,3,FALSE)),\"\",VLOOKUP(Q6,Tabelle2!$B$3:$D$501,3,FALSE))","v":"Rosenmontag"},"2025-04-03","2025-04-03","2025-04-03","2025-04-03","2025-04-03",{"$f":"IF(ISNA(VLOOKUP(W6,Tabelle2!$B$3:$D$501,3,FALSE)),\"\",VLOOKUP(W6,Tabelle2!$B$3:$D$501,3,FALSE))","v":"Eliana"},"2025-05-03","2025-05-03","2025-05-03","2025-05-03","2025-05-03",{"$f":"IF(ISNA(VLOOKUP(AC6,Tabelle2!$B$3:$D$501,3,FALSE)),\"\",VLOOKUP(AC6,Tabelle2!$B$3:$D$501,3,FALSE))","v":"Jacob"},"2025-06-03","2025-06-03","2025-06-03","2025-06-03","2025-06-03",{"$f":"IF(ISNA(VLOOKUP(AI6,Tabelle2!$B$3:$D$501,3,FALSE)),\"\",VLOOKUP(AI6,Tabelle2!$B$3:$D$501,3,FALSE))","v":"Marlene"},"2025-07-03","2025-07-03","2025-07-03","2025-07-03","2025-07-03",{"$f":"IF(ISNA(VLOOKUP(AO6,Tabelle2!$B$3:$D$501,3,FALSE)),\"\",VLOOKUP(AO6,Tabelle2!$B$3:$D$501,3,FALSE))","v":""},"2025-08-03","2025-08-03","2025-08-03","2025-08-03","2025-08-03",{"$f":"IF(ISNA(VLOOKUP(AU6,Tabelle2!$B$3:$D$501,3,FALSE)),\"\",VLOOKUP(AU6,Tabelle2!$B$3:$D$501,3,FALSE))","v":""},"2025-09-03","2025-09-03","2025-09-03","2025-09-03","2025-09-03",{"$f":"IF(ISNA(VLOOKUP(BA6,Tabelle2!$B$3:$D$501,3,FALSE)),\"\",VLOOKUP(BA6,Tabelle2!$B$3:$D$501,3,FALSE))","v":""},"2025-10-03","2025-10-03","2025-10-03","2025-10-03","2025-10-03",{"$f":"IF(ISNA(VLOOKUP(BG6,Tabelle2!$B$3:$D$501,3,FALSE)),\"\",VLOOKUP(BG6,Tabelle2!$B$3:$D$501,3,FALSE))","v":"Tag d. Dt. Einheit"},"2025-11-03","2025-11-03","2025-11-03","2025-11-03","2025-11-03",{"$f":"IF(ISNA(VLOOKUP(BM6,Tabelle2!$B$3:$D$501,3,FALSE)),\"\",VLOOKUP(BM6,Tabelle2!$B$3:$D$501,3,FALSE))","v":""},"2025-12-03","2025-12-03","2025-12-03","2025-12-03","2025-12-03",{"$f":"IF(ISNA(VLOOKUP(BS6,Tabelle2!$B$3:$D$501,3,FALSE)),\"\",VLOOKUP(BS6,Tabelle2!$B$3:$D$501,3,FALSE))","v":""},"2026-01-03","2026-01-03","2026-01-03","2026-01-03","2026-01-03",{"$f":"IF(ISNA(VLOOKUP(BY6,Tabelle2!$B$3:$D$501,3,FALSE)),\"\",VLOOKUP(BY6,Tabelle2!$B$3:$D$501,3,FALSE))","v":"Susanne"},"2026-02-03","2026-02-03","2026-02-03","2026-02-03","2026-02-03",{"$f":"IF(ISNA(VLOOKUP(CE6,Tabelle2!$B$3:$D$501,3,FALSE)),\"\",VLOOKUP(CE6,Tabelle2!$B$3:$D$501,3,FALSE))","v":""}]
["2025-01-04","2025-01-04","2025-01-04","2025-01-04","2025-01-04",{"$f":"IF(ISNA(VLOOKUP(E7,Tabelle2!$B$3:$D$501,3,FALSE)),\"\",VLOOKUP(E7,Tabelle2!$B$3:$D$501,3,FALSE))","v":""},"2025-02-04","2025-02-04","2025-02-04","2025-02-04","2025-02-04",{"$f":"IF(ISNA(VLOOKUP(K7,Tabelle2!$B$3:$D$501,3,FALSE)),\"\",VLOOKUP(K7,Tabelle2!$B$3:$D$501,3,FALSE))","v":""},"2025-03-04","2025-03-04","2025-03-04","2025-03-04","2025-03-04",{"$f":"IF(ISNA(VLOOKUP(Q7,Tabelle2!$B$3:$D$501,3,FALSE)),\"\",VLOOKUP(Q7,Tabelle2!$B$3:$D$501,3,FALSE))","v":"Faschingsdienstag"},"2025-04-04","2025-04-04","2025-04-04","2025-04-04","2025-04-04",{"$f":"IF(ISNA(VLOOKUP(W7,Tabelle2!$B$3:$D$501,3,FALSE)),\"\",VLOOKUP(W7,Tabelle2!$B$3:$D$501,3,FALSE))","v":""},"2025-05-04","2025-05-04","2025-05-04","2025-05-04","2025-05-04",{"$f":"IF(ISNA(VLOOKUP(AC7,Tabelle2!$B$3:$D$501,3,FALSE)),\"\",VLOOKUP(AC7,Tabelle2!$B$3:$D$501,3,FALSE))","v":"Elias"},"2025-06-04","2025-06-04","2025-06-04","2025-06-04","2025-06-04",{"$f":"IF(ISNA(VLOOKUP(AI7,Tabelle2!$B$3:$D$501,3,FALSE)),\"\",VLOOKUP(AI7,Tabelle2!$B$3:$D$501,3,FALSE))","v":"Uschi"},"2025-07-04","2025-07-04","2025-07-04","2025-07-04","2025-07-04",{"$f":"IF(ISNA(VLOOKUP(AO7,Tabelle2!$B$3:$D$501,3,FALSE)),\"\",VLOOKUP(AO7,Tabelle2!$B$3:$D$501,3,FALSE))","v":""},"2025-08-04","2025-08-04","2025-08-04","2025-08-04","2025-08-04",{"$f":"IF(ISNA(VLOOKUP(AU7,Tabelle2!$B$3:$D$501,3,FALSE)),\"\",VLOOKUP(AU7,Tabelle2!$B$3:$D$501,3,FALSE))","v":"5. W"},"2025-09-04","2025-09-04","2025-09-04","2025-09-04","2025-09-04",{"$f":"IF(ISNA(VLOOKUP(BA7,Tabelle2!$B$3:$D$501,3,FALSE)),\"\",VLOOKUP(BA7,Tabelle2!$B$3:$D$501,3,FALSE))","v":""},"2025-10-04","2025-10-04","2025-10-04","2025-10-04","2025-10-04",{"$f":"IF(ISNA(VLOOKUP(BG7,Tabelle2!$B$3:$D$501,3,FALSE)),\"\",VLOOKUP(BG7,Tabelle2!$B$3:$D$501,3,FALSE))","v":""},"2025-11-04","2025-11-04","2025-11-04","2025-11-04","2025-11-04",{"$f":"IF(ISNA(VLOOKUP(BM7,Tabelle2!$B$3:$D$501,3,FALSE)),\"\",VLOOKUP(BM7,Tabelle2!$B$3:$D$501,3,FALSE))","v":""},"2025-12-04","2025-12-04","2025-12-04","2025-12-04","2025-12-04",{"$f":"IF(ISNA(VLOOKUP(BS7,Tabelle2!$B$3:$D$501,3,FALSE)),\"\",VLOOKUP(BS7,Tabelle2!$B$3:$D$501,3,FALSE))","v":""},"2026-01-04","2026-01-04","2026-01-04","2026-01-04","2026-01-04",{"$f":"IF(ISNA(VLOOKUP(BY7,Tabelle2!$B$3:$D$501,3,FALSE)),\"\",VLOOKUP(BY7,Tabelle2!$B$3:$D$501,3,FALSE))","v":""},"2026-02-04","2026-02-04","2026-02-04","2026-02-04","2026-02-04",{"$f":"IF(ISNA(VLOOKUP(CE7,Tabelle2!$B$3:$D$501,3,FALSE)),\"\",VLOOKUP(CE7,Tabelle2!$B$3:$D$501,3,FALSE))","v":""}]
["2025-01-05","2025-01-05","2025-01-05","2025-01-05","2025-01-05",{"$f":"IF(ISNA(VLOOKUP(E8,Tabelle2!$B$3:$D$501,3,FALSE)),\"\",VLOOKUP(E8,Tabelle2!$B$3:$D$501,3,FALSE))","v":""},"2025-02-05","2025-02-05","2025-02-05","2025-02-05","2025-02-05",{"$f":"IF(ISNA(VLOOKUP(K8,Tabelle2!$B$3:$D$501,3,FALSE)),\"\",VLOOKUP(K8,Tabelle2!$B$3:$D$501,3,FALSE))","v":"Termin IB / Sam"},"2025-03-05","2025-03-05","2025-03-05","2025-03-05","2025-03-05",{"$f":"IF(ISNA(VLOOKUP(Q8,Tabelle2!$B$3:$D$501,3,FALSE)),\"\",VLOOKUP(Q8,Tabelle2!$B$3:$D$501,3,FALSE))","v":"Aschermittwoch"},"2025-04-05","2025-04-05","2025-04-05","2025-04-05","2025-04-05",{"$f":"IF(ISNA(VLOOKUP(W8,Tabelle2!$B$3:$D$501,3,FALSE)),\"\",VLOOKUP(W8,Tabelle2!$B$3:$D$501,3,FALSE))","v":"Luzie"},"2025-05-05","2025-05-05","2025-05-05","2025-05-05","2025-05-05",{"$f":"IF(ISNA(VLOOKUP(AC8,Tabelle2!$B$3:$D$501,3,FALSE)),\"\",VLOOKUP(AC8,Tabelle2!$B$3:$D$501,3,FALSE))","v":""},"2025-06-05","2025-06-05","2025-06-05","2025-06-05","2025-06-05",{"$f":"IF(ISNA(VLOOKUP(AI8,Tabelle2!$B$3:$D$501,3,FALSE)),\"\",VLOOKUP(AI8,Tabelle2!$B$3:$D$501,3,FALSE))","v":"Alina"},"2025-07-05","2025-07-05","2025-07-05","2025-07-05","2025-07-05",{"$f":"IF(ISNA(VLOOKUP(AO8,Tabelle2!$B$3:$D$501,3,FALSE)),\"\",VLOOKUP(AO8,Tabelle2!$B$3:$D$501,3,FALSE))","v":"Karim / Karin"},"2025-08-05","2025-08-05","2025-08-05","2025-08-05","2025-08-05",{"$f":"IF(ISNA(VLOOKUP(AU8,Tabelle2!$B$3:$D$501,3,FALSE)),\"\",VLOOKUP(AU8,Tabelle2!$B$3:$D$501,3,FALSE))","v":""},"2025-09-05","2025-09-05","2025-09-05","2025-09-05","2025-09-05",{"$f":"IF(ISNA(VLOOKUP(BA8,Tabelle2!$B$3:$D$501,3,FALSE)),\"\",VLOOKUP(BA8,Tabelle2!$B$3:$D$501,3,FALSE))","v":""},"2025-10-05","2025-10-05","2025-10-05","2025-10-05","2025-10-05",{"$f":"IF(ISNA(VLOOKUP(BG8,Tabelle2!$B$3:$D$501,3,FALSE)),\"\",VLOOKUP(BG8,Tabelle2!$B$3:$D$501,3,FALSE))","v":"Erntedank"},"2025-11-05","2025-11-05","2025-11-05","2025-11-05","2025-11-05",{"$f":"IF(ISNA(VLOOKUP(BM8,Tabelle2!$B$3:$D$501,3,FALSE)),\"\",VLOOKUP(BM8,Tabelle2!$B$3:$D$501,3,FALSE))","v":""},"2025-12-05","2025-12-05","2025-12-05","2025-12-05","2025-12-05",{"$f":"IF(ISNA(VLOOKUP(BS8,Tabelle2!$B$3:$D$501,3,FALSE)),\"\",VLOOKUP(BS8,Tabelle2!$B$3:$D$501,3,FALSE))","v":""},"2026-01-05","2026-01-05","2026-01-05","2026-01-05","2026-01-05",{"$f":"IF(ISNA(VLOOKUP(BY8,Tabelle2!$B$3:$D$501,3,FALSE)),\"\",VLOOKUP(BY8,Tabelle2!$B$3:$D$501,3,FALSE))","v":""},"2026-02-05","2026-02-05","2026-02-05","2026-02-05","2026-02-05",{"$f":"IF(ISNA(VLOOKUP(CE8,Tabelle2!$B$3:$D$501,3,FALSE)),\"\",VLOOKUP(CE8,Tabelle2!$B$3:$D$501,3,FALSE))","v":"Sam"}]
["2025-01-06","2025-01-06","2025-01-06","2025-01-06","2025-01-06",{"$f":"IF(ISNA(VLOOKUP(E9,Tabelle2!$B$3:$D$501,3,FALSE)),\"\",VLOOKUP(E9,Tabelle2!$B$3:$D$501,3,FALSE))","v":"Heilige 3 Könige / Stefan"},"2025-02-06","2025-02-06","2025-02-06","2025-02-06","2025-02-06",{"$f":"IF(ISNA(VLOOKUP(K9,Tabelle2!$B$3:$D$501,3,FALSE)),\"\",VLOOKUP(K9,Tabelle2!$B$3:$D$501,3,FALSE))","v":"Projekt"},"2025-03-06","2025-03-06","2025-03-06","2025-03-06","2025-03-06",{"$f":"IF(ISNA(VLOOKUP(Q9,Tabelle2!$B$3:$D$501,3,FALSE)),\"\",VLOOKUP(Q9,Tabelle2!$B$3:$D$501,3,FALSE))","v":"Projekt / Tom / Lilu"},"2025-04-06","2025-04-06","2025-04-06","2025-04-06","2025-04-06",{"$f":"IF(ISNA(VLOOKUP(W9,Tabelle2!$B$3:$D$501,3,FALSE)),\"\",VLOOKUP(W9,Tabelle2!$B$3:$D$501,3,FALSE))","v":""},"2025-05-06","2025-05-06","2025-05-06","2025-05-06","2025-05-06",{"$f":"IF(ISNA(VLOOKUP(AC9,Tabelle2!$B$3:$D$501,3,FALSE)),\"\",VLOOKUP(AC9,Tabelle2!$B$3:$D$501,3,FALSE))","v":""},"2025-06-06","2025-06-06","2025-06-06","2025-06-06","2025-06-06",{"$f":"IF(ISNA(VLOOKUP(AI9,Tabelle2!$B$3:$D$501,3,FALSE)),\"\",VLOOKUP(AI9,Tabelle2!$B$3:$D$501,3,FALSE))","v":"Daniel"},"2025-07-06","2025-07-06","2025-07-06","2025-07-06","2025-07-06",{"$f":"IF(ISNA(VLOOKUP(AO9,Tabelle2!$B$3:$D$501,3,FALSE)),\"\",VLOOKUP(AO9,Tabelle2!$B$3:$D$501,3,FALSE))","v":""},"2025-08-06","2025-08-06","2025-08-06","2025-08-06","2025-08-06",{"$f":"IF(ISNA(VLOOKUP(AU9,Tabelle2!$B$3:$D$501,3,FALSE)),\"\",VLOOKUP(AU9,Tabelle2!$B$3:$D$501,3,FALSE))","v":""},"2025-09-06","2025-09-06","2025-09-06","2025-09-06","2025-09-06",{"$f":"IF(ISNA(VLOOKUP(BA9,Tabelle2!$B$3:$D$501,3,FALSE)),\"\",VLOOKUP(BA9,Tabelle2!$B$3:$D$501,3,FALSE))","v":"Jola"},"2025-10-06","2025-10-06","2025-10-06","2025-10-06","2025-10-06",{"$f":"IF(ISNA(VLOOKUP(BG9,Tabelle2!$B$3:$D$501,3,FALSE)),\"\",VLOOKUP(BG9,Tabelle2!$B$3:$D$501,3,FALSE))","v":"1. W"},"2025-11-06","2025-11-06","2025-11-06","2025-11-06","2025-11-06",{"$f":"IF(ISNA(VLOOKUP(BM9,Tabelle2!$B$3:$D$501,3,FALSE)),\"\",VLOOKUP(BM9,Tabelle2!$B$3:$D$501,3,FALSE))","v":""},"2025-12-06","2025-12-06","2025-12-06","2025-12-06","2025-12-06",{"$f":"IF(ISNA(VLOOKUP(BS9,Tabelle2!$B$3:$D$501,3,FALSE)),\"\",VLOOKUP(BS9,Tabelle2!$B$3:$D$501,3,FALSE))","v":"Nikolaus / Thorsten"},"2026-01-06","2026-01-06","2026-01-06","2026-01-06","2026-01-06",{"$f":"IF(ISNA(VLOOKUP(BY9,Tabelle2!$B$3:$D$501,3,FALSE)),\"\",VLOOKUP(BY9,Tabelle2!$B$3:$D$501,3,FALSE))","v":"Heilige 3 Könige / Stefan"},"2026-02-06","2026-02-06","2026-02-06","2026-02-06","2026-02-06",{"$f":"IF(ISNA(VLOOKUP(CE9,Tabelle2!$B$3:$D$501,3,FALSE)),\"\",VLOOKUP(CE9,Tabelle2!$B$3:$D$501,3,FALSE))","v":""}]
["2025-01-07","2025-01-07","2025-01-07","2025-01-07","2025-01-07",{"$f":"IF(ISNA(VLOOKUP(E10,Tabelle2!$B$3:$D$501,3,FALSE)),\"\",VLOOKUP(E10,Tabelle2!$B$3:$D$501,3,FALSE))","v":""},"2025-02-07","2025-02-07","2025-02-07","2025-02-07","2025-02-07",{"$f":"IF(ISNA(VLOOKUP(K10,Tabelle2!$B$3:$D$501,3,FALSE)),\"\",VLOOKUP(K10,Tabelle2!$B$3:$D$501,3,FALSE))","v":""},"2025-03-07","2025-03-07","2025-03-07","2025-03-07","2025-03-07",{"$f":"IF(ISNA(VLOOKUP(Q10,Tabelle2!$B$3:$D$501,3,FALSE)),\"\",VLOOKUP(Q10,Tabelle2!$B$3:$D$501,3,FALSE))","v":""},"2025-04-07","2025-04-07","2025-04-07","2025-04-07","2025-04-07",{"$f":"IF(ISNA(VLOOKUP(W10,Tabelle2!$B$3:$D$501,3,FALSE)),\"\",VLOOKUP(W10,Tabelle2!$B$3:$D$501,3,FALSE))","v":"1. W"},"2025-05-07","2025-05-07","2025-05-07","2025-05-07","2025-05-07",{"$f":"IF(ISNA(VLOOKUP(AC10,Tabelle2!$B$3:$D$501,3,FALSE)),\"\",VLOOKUP(AC10,Tabelle2!$B$3:$D$501,3,FALSE))","v":""},"2025-06-07","2025-06-07","2025-06-07","2025-06-07","2025-06-07",{"$f":"IF(ISNA(VLOOKUP(AI10,Tabelle2!$B$3:$D$501,3,FALSE)),\"\",VLOOKUP(AI10,Tabelle2!$B$3:$D$501,3,FALSE))","v":""},"2025-07-07","2025-07-07","2025-07-07","2025-07-07","2025-07-07",{"$f":"IF(ISNA(VLOOKUP(AO10,Tabelle2!$B$3:$D$501,3,FALSE)),\"\",VLOOKUP(AO10,Tabelle2!$B$3:$D$501,3,FALSE))","v":"1. W / Arda"},"2025-08-07","2025-08-07","2025-08-07","2025-08-07","2025-08-07",{"$f":"IF(ISNA(VLOOKUP(AU10,Tabelle2!$B$3:$D$501,3,FALSE)),\"\",VLOOKUP(AU10,Tabelle2!$B$3:$D$501,3,FALSE))","v":""},"2025-09-07","2025-09-07","2025-09-07","2025-09-07","2025-09-07",{"$f":"IF(ISNA(VLOOKUP(BA10,Tabelle2!$B$3:$D$501,3,FALSE)),\"\",VLOOKUP(BA10,Tabelle2!$B$3:$D$501,3,FALSE))","v":""},"2025-10-07","2025-10-07","2025-10-07","2025-10-07","2025-10-07",{"$f":"IF(ISNA(VLOOKUP(BG10,Tabelle2!$B$3:$D$501,3,FALSE)),\"\",VLOOKUP(BG10,Tabelle2!$B$3:$D$501,3,FALSE))","v":""},"2025-11-07","2025-11-07","2025-11-07","2025-11-07","2025-11-07",{"$f":"IF(ISNA(VLOOKUP(BM10,Tabelle2!$B$3:$D$501,3,FALSE)),\"\",VLOOKUP(BM10,Tabelle2!$B$3:$D$501,3,FALSE))","v":"Rose"},"2025-12-07","2025-12-07","2025-12-07","2025-12-07","2025-12-07",{"$f":"IF(ISNA(VLOOKUP(BS10,Tabelle2!$B$3:$D$501,3,FALSE)),\"\",VLOOKUP(BS10,Tabelle2!$B$3:$D$501,3,FALSE))","v":"2. Advent"},"2026-01-07","2026-01-07","2026-01-07","2026-01-07","2026-01-07",{"$f":"IF(ISNA(VLOOKUP(BY10,Tabelle2!$B$3:$D$501,3,FALSE)),\"\",VLOOKUP(BY10,Tabelle2!$B$3:$D$501,3,FALSE))","v":""},"2026-02-07","2026-02-07","2026-02-07","2026-02-07","2026-02-07",{"$f":"IF(ISNA(VLOOKUP(CE10,Tabelle2!$B$3:$D$501,3,FALSE)),\"\",VLOOKUP(CE10,Tabelle2!$B$3:$D$501,3,FALSE))","v":""}]
{"$rows_left_out":553}
{"sheet":"Tabelle2","index":1,"n_rows":389,"n_cols":17,"rows_kept":389,"cut":false,"hidden":false,"merged":[]}
["Feiertage 1-17","Termine 59-114","Geburtstage MA 118-231","Geburtstage Kinder 239-500"]
["Berechnung","Datum","Name",null,"Ferien",null,null,null,"Urlaub","Kollege1",null,"Urlaub","Kollege2",null,null,null,{"$f":"IF(COLUMN(B2)>COUNTIF($B:$B,$P2), \"\",INDEX($C:$C,SMALL(IF($B2:$B100=$P2,ROW(B$1:B$99)), COLUMN(B2))))","v":""}]
[null,{"$f":"(\"01.01.\"&Tabelle1!$D$2)+0","v":"2025-01-01"},"Neujahr",{"$f":"_xlfn.TEXTJOIN(\" / \",,IF($B$3:$B$500=B3,$C$3:$C$500,\"\"))","v":"Neujahr"},"von","bis",null,null,"von","bis",null,"von","bis"]
[null,{"$f":"(\"01.05.\"&Tabelle1!$D$2)+0","v":"2025-05-01"},"Tag der Arbeit",{"$f":"_xlfn.TEXTJOIN(\" / \",,IF($B$3:$B$500=B4,$C$3:$C$500,\"\"))","v":"Tag der Arbeit"},"2024-12-27","2025-01-10","Winter",null,"2025-01-31","2025-02-03",null,"2025-02-07","2025-02-07"]
["2 Tage vor ostersonntag",{"$f":"B9-2","v":"2025-04-18"},"Karfreitag",{"$f":"_xlfn.TEXTJOIN(\" / \",,IF($B$3:$B$500=B5,$C$3:$C$500,\"\"))","v":"Karfreitag"},"2025-04-07","2025-04-18","Ostern",null,"2025-03-28","2025-03-31",null,"2025-02-14","2025-02-17"]
["1 Tag vor osonn",{"$f":"B9+1","v":"2025-04-21"},"Ostermontag",{"$f":"_xlfn.TEXTJOIN(\" / \",,IF($B$3:$B$500=B6,$C$3:$C$500,\"\"))","v":"Ostermontag"},"2025-07-07","2025-08-15","Sommer",null,"2025-05-09","2025-05-09",null,"2025-05-02","2025-05-02"]
["39 Tage nach osonn",{"$f":"B9+39","v":"2025-05-29"},"Christi Himmelfahrt / Vatertag",{"$f":"_xlfn.TEXTJOIN(\" / \",,IF($B$3:$B$500=B7,$C$3:$C$500,\"\"))","v":"Christi Himmelfahrt / Vatertag / Lea / Kunigunde"},"2025-10-06","2025-10-17","Herbst",null,"2025-06-10","2025-06-20",null,{"$f":"F6-11","v":"2025-08-04"},{"$f":"F6+5","v":"2025-08-20"}]
[null,{"$f":"B10-1","v":"2025-06-08"},"Pfingstsonntag",{"$f":"_xlfn.TEXTJOIN(\" / \",,IF($B$3:$B$500=B8,$C$3:$C$500,\"\"))","v":"Pfingstsonntag"},null,null,null,null,"2025-08-25","2025-09-05"]
["49 Tage nach osonn",{"$f":"ROUND((DAY(MINUTE(Tabelle1!$D$2/38)/2+55)&\".4.\"&Tabelle1!$D$2)/7,)*7-6","v":"2025-04-20"},"Ostersonntag",{"$f":"_xlfn.TEXTJOIN(\" / \",,IF($B$3:$B$500=B9,$C$3:$C$500,\"\"))","v":"Ostersonntag"},"2025-12-22","2026-01-09","Winter",null,"2025-11-17","2025-11-21"]
["50 Tage nach osonn",{"$f":"B9+50","v":"2025-06-09"},"Pfingstmontag",{"$f":"_xlfn.TEXTJOIN(\" / \",,IF($B$3:$B$500=B10,$C$3:$C$500,\"\"))","v":"Pfingstmontag"}]
{"$rows_left_out":379}