{"text_format":"1","workbook":"xlsx","n_sheets":3,"sheets":["Start (2)","Tabelle 7er","null"],"not_rendered":{"charts":0,"images":0,"macros":1,"external_links":1,"defined_names":1,"comments":0,"pivot_tables":0},"unopened":[],"bounds":{"document_bytes":16777216,"sheet_cells":100000,"rows_first":2000,"rows_last":500,"rows_between":2000,"halvings":0,"cell_chars":16384,"cell_head_chars":4096},"cells_cut":0,"cells_raw":0,"read":"whole","date_system":"1900"}

{"sheet":"Start (2)","index":0,"n_rows":41,"n_cols":16,"rows_kept":41,"cut":false,"hidden":false,"merged":[[29,9,29,11],[30,9,30,11],[31,9,31,11],[0,9,0,11]]}
["Namen",null,"Einfügen",{"$f":"RAND()","v":0.61977085776328111},null,"Startgeld",5,"Sielgeld - kalkuliert",4,"       Zu zahlen",null,null,"Bezahlt",null,0,0]
["Robert","SP 1","Robert",{"$f":"RAND()","v":0.10686811827141951},null,{"$f":"C2","v":"Robert"},0,{"$f":"'Tabelle 7er'!Q75","v":0},0,{"$f":"F2","v":"Robert"},{"$f":"ROUNDUP(H2,0)","v":0},{"$f":"ROUNDUP(H2,0)-I2","v":0},0,null,4,5]
["Volker","SP 2","Volker",0.64991474724879339,null,{"$f":"C3","v":"Volker"},0,{"$f":"'Tabelle 7er'!Q76","v":0},0,{"$f":"F3","v":"Volker"},{"$f":"ROUNDUP(H3,0)","v":0},{"$f":"ROUNDUP(H3,0)-I3","v":0},0,null,5,8]
["Siggi","SP 3","Siggi",5.0620350048398377E-2,null,"Siggi",0,{"$f":"'Tabelle 7er'!Q77","v":0},0,"Siggi",0,0,0,null,6,10]
["Anja","SP 4","Anja",0.36761167701400088,null,"Anja",0,{"$f":"'Tabelle 7er'!Q78","v":0},0,"Anja",0,0,0,null,7]
["Vincent","SP 5","Vincent",0.96560267331935001,null,"Vincent",0,{"$f":"'Tabelle 7er'!Q79","v":0},0,"Vincent",0,0,0]
["Ralf","SP 6","Ralf",0.65831127101521425,null,"Ralf",0,{"$f":"'Tabelle 7er'!Q80","v":0},0,"Ralf",0,0,0]
["Erich","SP 7","Erich",0.17901935402715585,null,"Erich",0,{"$f":"'Tabelle 7er'!Q81","v":0},0,"Erich",0,0,0]
["Rene","SP 8","Rene",0.87735603779953775,null,"Rene",0,{"$f":"'Tabelle 7er'!Q82","v":0},0,"Rene",0,0,0]
["Nicole","SP 9","Nicole",2.9381797338331683E-2,null,"Nicole",0,{"$f":"'Tabelle 7er'!Q83","v":0},0,"Nicole",0,0,0]
["Frank","SP 10","Frank",0.74904515305878816,null,"Frank",0,{"$f":"'Tabelle 7er'!Q84","v":0},0,"Frank",0,0,0]
["Sasha","SP 11","Sasha",0.16556575715997146,null,"Sasha",0,{"$f":"'Tabelle 7er'!Q85","v":0},0,"Sasha",0,0,0]
["Klaus","SP 12","Klaus",0.4845914195929788,null,"Klaus",0,{"$f":"'Tabelle 7er'!Q86","v":0},0,"Klaus",0,0,0]
["Manuel","SP 13","Manuel",0.53230382893825579,null,"Manuel",0,{"$f":"'Tabelle 7er'!Q87","v":0},0,"Manuel",0,0,0]
["Christian","SP 14","Christian",0.54003051029769977,null,"Christian",0,{"$f":"'Tabelle 7er'!Q88","v":0},0,"Christian",0,0,0]
["Kerstin","SP 15","Kerstin",0.63260362207385945,null,"Kerstin",0,{"$f":"'Tabelle 7er'!Q89","v":0},0,"Kerstin",0,0,0]
["Dirk","SP 16","Dirk",0.58283792341507845,null,"Dirk",0,{"$f":"'Tabelle 7er'!Q90","v":0},0,"Dirk",0,0,0]
["Kevin","SP 17","Kevin",0.2039045328519038,null,"Kevin",0,{"$f":"'Tabelle 7er'!Q91","v":0},0,"Kevin",0,0,0]
["Aline","SP 18","Aline",0.26044820505330069,null,"Aline",0,{"$f":"'Tabelle 7er'!Q92","v":0},0,"Aline",0,0,0]
["Rosi N.","SP 19","Rosi N.",0.10907497359631857,null,"Rosi N.",0,{"$f":"'Tabelle 7er'!Q93","v":0},0,"Rosi N.",0,0,0]
["Rosi P.","SP 20","Rosi P.",0.97800536627867651,null,"Rosi P.",0,{"$f":"'Tabelle 7er'!Q94","v":0},0,"Rosi P.",0,0,0]
["Stefan","SP 21","Stefan",0.73837895848673896,null,"Stefan",0,{"$f":"'Tabelle 7er'!Q95","v":0},0,"Stefan",0,0,0]
["Werner","SP 22","Werner",8.4483763066469986E-2,null,"Werner",0,{"$f":"'Tabelle 7er'!Q96","v":0},0,"Werner",0,0,0]
["Achim","SP 23","Achim",0.41509160966983771,null,"Achim",0,{"$f":"'Tabelle 7er'!Q97","v":0},0,"Achim",0,0,0]
["Otto","SP 24","Otto",0.33609746159111975,null,"Otto",0,{"$f":"'Tabelle 7er'!Q98","v":0},0,"Otto",0,0,0]
["Paul","SP 25","Paul",8.4295887598843322E-2,null,"Paul",0,{"$f":"'Tabelle 7er'!Q99","v":0},0,"Paul",0,0,0]
["Fritz","SP 26","Fritz",4.1007914259202138E-2,null,"Fritz",0,{"$f":"'Tabelle 7er'!Q100","v":0},0,"Fritz",0,0,0]
["Hein","SP 27","Hein",0.95692967276520191,null,"Hein",0,{"$f":"'Tabelle 7er'!Q101","v":0},0,"Hein",0,0,0]
["Manni","SP 28","Manni",0.89644579902196531,null,"Manni",0,{"$f":"'Tabelle 7er'!Q102","v":0},0,"Manni",0,0,0]
[null,null,null,null,null,null,{"$f":"SUM(G2:G29,)","v":0},{"$f":"SUM(H2:H29)","v":0},null,"Spielgeld Ergebnisliste",null,null,{"$f":"SUM(M2:M29)","v":0}]
[null,null,null,null,null,null,"Überschuß",null,null,"Spielgeld Vorkasse",null,null,{"$f":"SUM(H30)","v":0}]
[null,null,null,null,"Preisgeld","Startgeld","Spielgeld",null,null,"Spielgeld Überschuß",null,null,{"$f":"SUM(M30)-M31","v":0}]
[null,null,"Sieger",{"$f":"'Tabelle 7er'!M67","v":{"$error":"#NUM!"}},{"$f":"SUM(F33:G33)","v":0},{"$f":"SUM(G30)/2","v":0},{"$f":"SUM(M32/2)","v":0}]
[null,null,"Zweiter",{"$f":"'Tabelle 7er'!M68","v":{"$error":"#NUM!"}},{"$f":"SUM(F34:G34)","v":0},{"$f":"SUM(G30)/100*30","v":0},{"$f":"SUM(M32/100*30)","v":0}]
[null,null,"Dritter",{"$f":"'Tabelle 7er'!M60","v":{"$error":"#NUM!"}},0,{"$f":"SUM(G30)/100*10","v":0},{"$f":"SUM(M32/100*10)","v":0}]
[null,null,"Vierter",{"$f":"'Tabelle 7er'!M61","v":{"$error":"#NUM!"}},0,{"$f":"SUM(G30)/100*10","v":0},{"$f":"SUM(M32/100*10)","v":0}]
[null,null,null,{"$f":"RAND()","v":0.19663170120645668}]
[null,"AUTOM.links aussen",null,{"$f":"RAND()","v":0.49253722575866887}]
[null,"AUTOM.links innen",null,{"$f":"RAND()","v":0.75019317601610547}]
[null,"AUTOM.rechts aussen",null,{"$f":"RAND()","v":0.52448262606222995}]
[null,"AUTOM.rechts innen",null,{"$f":"RAND()","v":0.8745017999554362}]

{"sheet":"Tabelle 7er","index":1,"n_rows":103,"n_cols":29,"rows_kept":103,"cut":false,"hidden":false,"merged":[[99,2,99,3],[99,4,99,5],[99,6,99,7],[99,8,99,9],[99,10,99,11],[99,13,99,14],[98,2,98,3],[98,4,98,5],[98,6,98,7],[98,8,98,9],[98,10,98,11],[98,13,98,14],[101,2,101,3],[101,6,101,7],[101,8,101,9],[101,10,101,11],[101,13,101,14],[100,2,100,3],[100,4,100,5],[100,6,100,7],[100,8,100,9],[100,10,100,11],[100,13,100,14],[97,2,97,3],[97,4,97,5],[97,6,97,7],[97,8,97,9],[97,10,97,11],[97,13,97,14],[96,2,96,3],[96,4,96,5],[96,6,96,7],[96,8,96,9],[96,10,96,11],[96,13,96,14],[95,2,95,3],[95,4,95,5],[95,6,95,7],[95,8,95,9],[95,10,95,11],[95,13,95,14],[94,2,94,3],[94,4,94,5],[94,6,94,7],[94,8,94,9],[94,10,94,11],[94,13,94,14],[93,2,93,3],[93,4,93,5],[93,6,93,7],[93,8,93,9],[93,10,93,11],[93,13,93,14],[92,2,92,3],[92,4,92,5],[92,6,92,7],[92,8,92,9],[92,10,92,11],[92,13,92,14],[91,2,91,3],[91,4,91,5],[91,6,91,7],[91,8,91,9],[91,10,91,11],[91,13,91,14],[90,2,90,3],[90,4,90,5],[90,6,90,7],[90,8,90,9],[90,10,90,11],[90,13,90,14],[89,2,89,3],[89,4,89,5],[89,6,89,7],[89,8,89,9],[89,10,89,11],[89,13,89,14],[88,2,88,3],[88,4,88,5],[88,6,88,7],[88,8,88,9],[88,10,88,11],[88,13,88,14],[87,2,87,3],[87,4,87,5],[87,6,87,7],[87,8,87,9],[87,10,87,11],[87,13,87,14],[86,2,86,3],[86,4,86,5],[86,6,86,7],[86,8,86,9],[86,10,86,11],[86,13,86,14],[85,2,85,3],[85,4,85,5],[85,6,85,7],[85,8,85,9],[85,10,85,11],[85,13,85,14],[84,2,84,3],[84,4,84,5],[84,6,84,7],[84,8,84,9],[84,10,84,11],[84,13,84,14],[83,2,83,3],[83,4,83,5],[83,6,83,7],[83,8,83,9],[83,10,83,11],[83,13,83,14],[82,2,82,3],[82,4,82,5],[82,6,82,7],[82,8,82,9],[82,10,82,11],[82,13,82,14],[81,2,81,3],[81,4,81,5],[81,6,81,7],[81,8,81,9],[81,10,81,11],[81,13,81,14],[80,2,80,3],[80,4,80,5],[80,6,80,7],[80,8,80,9],[80,10,80,11],[80,13,80,14],[79,2,79,3],[79,4,79,5],[79,6,79,7],[79,8,79,9],[79,10,79,11],[79,13,79,14],[78,2,78,3],[78,4,78,5],[78,6,78,7],[78,8,78,9],[78,10,78,11],[78,13,78,14],[77,2,77,3],[77,4,77,5],[77,6,77,7],[77,8,77,9],[77,10,77,11],[77,13,77,14],[76,2,76,3],[76,4,76,5],[76,6,76,7],[76,8,76,9],[76,10,76,11],[76,13,76,14],[75,2,75,3],[75,4,75,5],[75,6,75,7],[75,8,75,9],[75,10,75,11],[75,13,75,14],[74,2,74,3],[74,4,74,5],[74,6,74,7],[74,8,74,9],[74,10,74,11],[74,13,74,14],[48,12,48,13],[70,0,71,18],[73,2,73,3],[73,4,73,5],[73,6,73,7],[73,8,73,9],[73,10,73,11],[73,13,73,14],[73,15,73,16],[64,7,65,14],[66,7,66,8],[66,10,66,11],[66,13,66,14],[67,7,67,8],[67,10,67,11],[67,13,67,14],[66,16,66,17],[46,18,46,22],[50,0,50,4],[50,6,50,10],[50,12,50,16],[47,18,47,19],[47,0,47,1],[47,6,47,7],[47,12,47,13],[60,7,60,8],[60,10,60,11],[60,13,60,14],[54,1,54,2],[54,13,54,14],[59,16,59,17],[54,16,54,17],[57,7,58,14],[59,7,59,8],[59,10,59,11],[55,1,55,2],[55,13,55,14],[55,16,55,17],[59,13,59,14],[48,0,48,1],[48,6,48,7],[48,18,48,19],[49,0,49,4],[49,6,49,10],[49,12,49,16],[49,18,49,22],[50,18,50,22],[53,0,53,10],[53,12,53,22],[6,23,6,24],[37,2,37,3],[37,8,37,9],[37,14,37,15],[37,20,37,21],[38,2,38,3],[38,8,38,9],[38,14,38,15],[38,20,38,21],[7,0,7,4],[7,6,7,10],[7,12,7,16],[7,18,7,22],[46,0,46,4],[46,6,46,10],[46,12,46,16]]}
[{"$f":"'Start (2)'!C2","v":"Robert"},null,null,null,null,null,{"$f":"'Start (2)'!C9","v":"Rene"},null,null,null,null,null,{"$f":"'Start (2)'!C16","v":"Kerstin"},null,null,null,null,null,{"$f":"'Start (2)'!C23","v":"Werner"}]
[{"$f":"'Start (2)'!C3","v":"Volker"},null,null,null,null,null,{"$f":"'Start (2)'!C10","v":"Nicole"},null,null,null,null,null,{"$f":"'Start (2)'!C17","v":"Dirk"},null,null,null,null,null,{"$f":"'Start (2)'!C24","v":"Achim"}]
[{"$f":"'Start (2)'!C4","v":"Siggi"},null,null,null,null,null,{"$f":"'Start (2)'!C11","v":"Frank"},null,null,null,null,null,{"$f":"'Start (2)'!C18","v":"Kevin"},null,null,null,null,null,{"$f":"'Start (2)'!C25","v":"Otto"}]
[{"$f":"'Start (2)'!C5","v":"Anja"},null,null,null,null,null,{"$f":"'Start (2)'!C12","v":"Sasha"},null,null,null,null,null,{"$f":"'Start (2)'!C19","v":"Aline"},null,null,null,null,null,{"$f":"'Start (2)'!C26","v":"Paul"}]
[{"$f":"'Start (2)'!C6","v":"Vincent"},null,null,null,null,null,{"$f":"'Start (2)'!C13","v":"Klaus"},null,null,null,null,null,{"$f":"'Start (2)'!C20","v":"Rosi N."},null,null,null,null,null,{"$f":"'Start (2)'!C27","v":"Fritz"}]
[{"$f":"'Start (2)'!C7","v":"Ralf"},null,null,null,null,null,{"$f":"'Start (2)'!C14","v":"Manuel"},null,null,null,null,null,{"$f":"'Start (2)'!C21","v":"Rosi P."},null,null,null,null,null,{"$f":"'Start (2)'!C28","v":"Hein"}]
[{"$f":"'Start (2)'!C8","v":"Erich"},null,null,null,null,null,{"$f":"'Start (2)'!C15","v":"Christian"},null,null,null,null,null,{"$f":"'Start (2)'!C22","v":"Stefan"},null,null,null,null,null,{"$f":"'Start (2)'!C29","v":"Manni"},null,null,null,null,"Startzeit:"]
["Gruppe A",null,null,null,null,null,"Gruppe B",null,null,null,null,null,"Gruppe C",null,null,null,null,null,"Gruppe D",null,null,null,null,"17:00:00","Uhr"]
[null,null,null,null,{"$f":"SUM(C9:D9)","v":0},null,null,null,null,null,{"$f":"SUM(I9:J9)","v":0},null,null,null,null,null,{"$f":"SUM(O9:P9)","v":0},null,null,null,null,null,{"$f":"SUM(U9:V9)","v":0},{"$f":"X8","v":"17:00:00"},"Uhr",null,null,null,"16:00:00"]
[null,null,null,null,{"$f":"SUM(C10:D10)","v":0},null,null,null,null,null,{"$f":"SUM(I10:J10)","v":0},null,null,null,null,null,{"$f":"SUM(O10:P10)","v":0},null,null,null,null,null,0,{"$f":"X9+1/96","v":"17:15:00"},"Uhr",null,null,null,"17:00:00"]
[null,null,null,null,0,null,null,null,null,null,0,null,null,null,null,null,0,null,null,null,null,null,0,"17:30:00","Uhr",null,null,null,"18:00:00"]
[null,null,null,null,0,null,null,null,null,null,0,null,null,null,null,null,0,null,null,null,null,null,0,"17:45:00","Uhr"]
[null,null,null,null,0,null,null,null,null,null,0,null,null,null,null,null,0,null,null,null,null,null,0,"18:00:00","Uhr"]
[null,null,null,null,0,null,null,null,null,null,0,null,null,null,null,null,0,null,null,null,null,null,0,"18:15:00","Uhr"]
[null,null,null,null,0,null,null,null,null,null,0,null,null,null,null,null,0,null,null,null,null,null,0,"18:30:00","Uhr"]
[null,null,null,null,0,null,null,null,null,null,0,null,null,null,null,null,0,null,null,null,null,null,0,"18:45:00","Uhr"]
[null,null,null,null,0,null,null,null,null,null,0,null,null,null,null,null,0,null,null,null,null,null,0,"19:00:00","Uhr"]
[null,null,null,null,0,null,null,null,null,null,0,null,null,null,null,null,0,null,null,null,null,null,0,"19:15:00","Uhr"]
[null,null,null,null,0,null,null,null,null,null,0,null,null,null,null,null,0,null,null,null,null,null,0,"19:30:00","Uhr"]
[null,null,null,null,0,null,null,null,null,null,0,null,null,null,null,null,0,null,null,null,null,null,0,"19:45:00","Uhr"]
[null,null,null,null,0,null,null,null,null,null,0,null,null,null,null,null,0,null,null,null,null,null,0,"20:00:00","Uhr"]
[null,null,null,null,0,null,null,null,null,null,0,null,null,null,null,null,0,null,null,null,null,null,0,"20:15:00","Uhr"]
[null,null,null,null,0,null,null,null,null,null,0,null,null,null,null,null,0,null,null,null,null,null,0,"20:30:00","Uhr"]
[null,null,null,null,0,null,null,null,null,null,0,null,null,null,null,null,0,null,null,null,null,null,0,"20:45:00","Uhr"]
[null,null,null,null,0,null,null,null,null,null,0,null,null,null,null,null,0,null,null,null,null,null,0,"21:00:00","Uhr"]
[null,null,null,null,0,null,null,null,null,null,0,null,null,null,null,null,0,null,null,null,null,null,0,"21:15:00","Uhr"]
[null,null,null,null,0,null,null,null,null,null,0,null,null,null,null,null,0,null,null,null,null,null,0,"21:30:00","Uhr"]
[null,null,null,null,0,null,null,null,null,null,0,null,null,null,null,null,0,null,null,null,null,null,0,"21:45:00","Uhr"]
[null,null,null,null,0,null,null,null,null,null,0,null,null,null,null,null,0,null,null,null,null,null,0,"22:00:00","Uhr"]
[null,null,null,null,0,null,null,null,null,null,0,null,null,null,null,null,0,null,null,null,null,null,0,"22:15:00","Uhr"]
[null,null,null,null,0,null,null,null,null,null,0,null,null,null,null,null,0,null,null,null,null,null,0,"22:30:00","Uhr"]
[null,null,null,null,0,null,null,null,null,null,0,null,null,null,null,null,0,null,null,null,null,null,0,"22:45:00","Uhr"]
[null,null,null,null,0,null,null,null,null,null,0,null,null,null,null,null,0,null,null,null,null,null,0,"23:00:00","Uhr"]
[null,null,null,null,0,null,null,null,null,null,0,null,null,null,null,null,0,null,null,null,null,null,0,"23:15:00","Uhr"]
[null,null,null,null,0,null,null,null,null,null,0,null,null,null,null,null,0,null,null,null,null,null,0,"23:30:00","Uhr"]
[null,null,null,null,0,null,null,null,null,null,0,null,null,null,null,null,0,null,null,null,null,null,0,{"$f":"X35+1/96","v":"23:45:00"},"Uhr"]
[null,null,null,null,{"$f":"SUM(E9:E36)","v":0},null,null,null,null,null,{"$f":"SUM(K9:K36)","v":0},null,null,null,null,null,{"$f":"SUM(Q9:Q36)","v":0},null,null,null,null,null,{"$f":"SUM(W9:W36)","v":0}]
[{"$f":"A1","v":"Robert"},{"$f":"SUM(C10-D10,C15-D15,C20-D20,D24-C24,D27-C27,D30-C30,D33-C33)","v":0},"Sieger",null,{"$f":"INDEX(A38:A44,MATCH(LARGE(B38:B44,1),B38:B44,0))","v":"Robert"},null,{"$f":"G1","v":"Rene"},{"$f":"SUM(I10-J10,I15-J15,I20-J20,J24-I24,J27-I27,J30-I30,J33-I33)","v":0},"Sieger",null,{"$f":"INDEX(G38:G44,MATCH(LARGE(H38:H44,1),H38:H44,0))","v":"Rene"},null,{"$f":"M1","v":"Kerstin"},{"$f":"SUM(,O10-P10,O15-P15,O20-P20,P24-O24,P27-O27,P30-O30,P33-O33)","v":0},"Sieger",null,{"$f":"INDEX(M38:M44,MATCH(LARGE(N38:N44,1),N38:N44,0))","v":"Kerstin"},null,{"$f":"S1","v":"Werner"},{"$f":"SUM(,U10-V10,U15-V15,U20-V20,V24-U24,V27-U27,V30-U30,V33-U33)","v":0},"Sieger",null,{"$f":"INDEX(S38:S44,MATCH(LARGE(T38:T44,1),T38:T44,0))","v":"Werner"}]
[{"$f":"A2","v":"Volker"},{"$f":"SUM(C11-D11,C16-E16,D20-C20,D23-C23,D26-C26,D29-C29,C34-D34)","v":0},"Zweiter",null,{"$f":"INDEX(A38:A44,MATCH(LARGE(B38:B44,2),B38:B44,0))","v":"Robert"},null,"Nicole",{"$f":"SUM(I11-J11,I16-J16,J20-I20,J23-I23,J26-I26,J29-I29,I34-J34)","v":0},"Zweiter",null,{"$f":"INDEX(G38:G44,MATCH(LARGE(H38:H44,2),H38:H44,0))","v":"Rene"},null,"Dirk",{"$f":"SUM(,O11-P11,O16-P16,P20-O20,P23-O23,P26-O26,P29-O29,O34-P34)","v":0},"Zweiter",null,{"$f":"INDEX(M38:M44,MATCH(LARGE(N38:N44,2),N38:N44,0))","v":"Kerstin"},null,{"$f":"S2","v":"Achim"},{"$f":"SUM(,U11-V11,U16-V16,V20-U20,V23-U23,V26-U26,V29-U29,U34-V34)","v":0},"Zweiter",null,{"$f":"INDEX(S38:S44,MATCH(LARGE(T38:T44,2),T38:T44,0))","v":"Werner"}]
["Siggi",{"$f":"SUM(C12-D12,D16-C16,D19-C19,D22-C22,D25-C25,C30-D30,C35-D35)","v":0},null,null,{"$f":"INDEX(A38:A44,MATCH(LARGE(B38:B44,3),B38:B44,0))","v":"Robert"},null,"Frank",{"$f":"SUM(I12-J12,J16-I16,J19-I19,J22-I22,J25-I25,I30-J30,I35-J35)","v":0},null,null,{"$f":"INDEX(G38:G44,MATCH(LARGE(H38:H44,3),H38:H44,0))","v":"Rene"},null,"Kevin",{"$f":"SUM(,O12-P12,P16-O16,P19-O19,P22-O22,P25-O25,O30-P30,O35-P35)","v":0},null,null,{"$f":"INDEX(M38:M44,MATCH(LARGE(N38:N44,3),N38:N44,0))","v":"Kerstin"},null,"Otto",{"$f":"SUM(,U12-V12,V16-U16,V19-U19,V22-U22,V25-U25,U30-V30,U35-V35)","v":0},null,null,{"$f":"INDEX(S38:S44,MATCH(LARGE(T38:T44,3),T38:T44,0))","v":"Werner"}]
["Anja",{"$f":"SUM(D12-C12,D15-C15,D18-C18,D21-C21,C26-D26,C31-D31,C36-D36)","v":0},null,null,{"$f":"INDEX(A38:A44,MATCH(LARGE(B38:B44,4),B38:B44,0))","v":"Robert"},null,"Sasha",{"$f":"SUM(J12-I12,J15-I15,J18-I18,J21-I21,I26-J26,I31-J31,I36-J36)","v":0},null,null,{"$f":"INDEX(G38:G44,MATCH(LARGE(H38:H44,4),H38:H44,0))","v":"Rene"},null,"Aline",{"$f":"SUM(,P12-O12,P15-O15,P18-O18,P21-O21,O26-P26,O31-P31,O36-P36)","v":0},null,null,{"$f":"INDEX(M38:M44,MATCH(LARGE(N38:N44,4),N38:N44,0))","v":"Kerstin"},null,"Paul",{"$f":"SUM(,V12-U12,V15-U15,V18-U18,V21-U21,U26-V26,U31-V31,U36-V36)","v":0},null,null,{"$f":"INDEX(S38:S44,MATCH(LARGE(T38:T44,4),T38:T44,0))","v":"Werner"}]
["Vincent",{"$f":"SUM(D11-C11,D14-C14,D17-C17,C22-D22,C27-D27,C32-D32,D36-C36)","v":0},null,null,{"$f":"INDEX(A38:A44,MATCH(LARGE(B38:B44,5),B38:B44,0))","v":"Robert"},null,"Klaus",{"$f":"SUM(,J11-I11,J14-I14,J17-I17,I22-J22,I27-J27,I32-J32,J36-I36)","v":0},null,null,{"$f":"INDEX(G38:G44,MATCH(LARGE(H38:H44,5),H38:H44,0))","v":"Rene"},null,"Rosi N.",{"$f":"SUM(,P11-O11,P14-O14,P17-O17,O22-P22,O27-P27,O32-P32,P36-O36)","v":0},null,null,{"$f":"INDEX(M38:M44,MATCH(LARGE(N38:N44,5),N38:N44,0))","v":"Kerstin"},null,"Fritz",{"$f":"SUM(,V11-U11,V14-U14,V17-U17,U22-V22,U27-V27,U32-V32,V36-U36)","v":0},null,null,{"$f":"INDEX(S38:S44,MATCH(LARGE(T38:T44,5),T38:T44,0))","v":"Werner"}]
["Ralf",{"$f":"SUM(D10-C10,D13-C13,C18-D18,C23-D23,C28-D28,D32-C32,D35-C35)","v":0},null,null,{"$f":"INDEX(A38:A44,MATCH(LARGE(B38:B44,6),B38:B44,0))","v":"Robert"},null,"Manuel",{"$f":"SUM(,J10-I10,J13-I13,I18-J18,I23-J23,I28-J28,J32-I32,J35-I35)","v":0},null,null,{"$f":"INDEX(G38:G44,MATCH(LARGE(H38:H44,6),H38:H44,0))","v":"Rene"},null,"Rosi P.",{"$f":"SUM(,P10-O10,P13-O13,O18-P18,O23-P23,O28-P28,P32-O32,P35-O35)","v":0},null,null,{"$f":"INDEX(M38:M44,MATCH(LARGE(N38:N44,6),N38:N44,0))","v":"Kerstin"},null,"Hein",{"$f":"SUM(,V10-U10,V13-U13,U18-V18,U23-V23,U28-V28,V32-U32,V35-U35)","v":0},null,null,{"$f":"INDEX(S38:S44,MATCH(LARGE(T38:T44,6),T38:T44,0))","v":"Werner"}]
["Erich",{"$f":"SUM(D9-C9,C14-D14,C19-D19,C24-D24,D28-C28,D31-C31,D34-C34)","v":0},null,null,{"$f":"INDEX(A38:A44,MATCH(LARGE(B38:B44,7),B38:B44,0))","v":"Robert"},null,"Christian",{"$f":"SUM(,J9-I9,I14-J14,I19-J19,I24-J24,J28-I28,J31-I31,J34-I34)","v":0},null,null,{"$f":"INDEX(G38:G44,MATCH(LARGE(H38:H44,7),H38:H44,0))","v":"Rene"},null,"Stefan",{"$f":"SUM(,P9-O9,O14-P14,O19-P19,O24-P24,P28-O28,P31-O31,P34-O34)","v":0},null,null,{"$f":"INDEX(M38:M44,MATCH(LARGE(N38:N44,7),N38:N44,0))","v":"Kerstin"},null,"Manni",{"$f":"SUM(V12,U15,U18,V21,V24)","v":0},null,null,{"$f":"INDEX(S38:S44,MATCH(LARGE(T38:T44,7),T38:T44,0))","v":"Werner"}]
["Gruppe A"]
[null,{"$f":"SUM(E37)","v":0},null,null,null,null,null,{"$f":"SUM(K37)","v":0},null,null,null,null,null,{"$f":"SUM(Q37)","v":0},null,null,null,null,null,{"$f":"SUM(W37)","v":0}]
["Viertelfinale 1",null,null,null,null,null,"Viertelfinale 2",null,null,null,null,null,"Viertelfinale 3",null,null,null,null,null,"Viertelfinale 3"]
["Sieger Gruppe 1",null,{"$f":"E38","v":"Robert"},null,{"$f":"INDEX(C48:C49,MATCH(LARGE(D48:D49,1),D48:D49,0))","v":{"$error":"#NUM!"}},null,"Sieger Gruppe 3",null,{"$f":"Q38","v":"Kerstin"},null,{"$f":"INDEX(I48:I49,MATCH(LARGE(J48:J49,1),J48:J49,0))","v":{"$error":"#NUM!"}},null,"Sieger Gruppe 2",null,{"$f":"K38","v":"Rene"},null,{"$f":"INDEX(O48:O49,MATCH(LARGE(P48:P49,1),P48:P49,0))","v":{"$error":"#NUM!"}},null,"Sieger Gruppe 4",null,{"$f":"W38","v":"Werner"},null,{"$f":"INDEX(U48:U49,MATCH(LARGE(V48:V49,1),V48:V49,0))","v":{"$error":"#NUM!"}},{"$f":"X35+2/96","v":0.99999999999999911},"Uhr"]
["Zweiter Gruppe 3",null,{"$f":"Q39","v":"Kerstin"},null,{"$f":"INDEX(C48:C49,MATCH(LARGE(D48:D49,2),D48:D49,0))","v":{"$error":"#NUM!"}},null,"Zweiter Gruppe 1",null,{"$f":"E39","v":"Robert"},null,{"$f":"INDEX(I48:I49,MATCH(LARGE(J48:J49,2),J48:J49,0))","v":{"$error":"#NUM!"}},null,"Zweiter Gruppe 4",null,{"$f":"W39","v":"Werner"},null,{"$f":"INDEX(O48:O49,MATCH(LARGE(P48:P49,2),P48:P49,0))","v":{"$error":"#NUM!"}},null,"Zweiter Gruppe 2",null,{"$f":"K39","v":"Rene"},null,{"$f":"INDEX(U48:U49,MATCH(LARGE(V48:V49,2),V48:V49,0))","v":{"$error":"#NUM!"}}]
["Sieger",null,null,null,null,null,"Sieger",null,null,null,null,null,"Sieger",null,null,null,null,null,"Sieger"]
[{"$f":"E48","v":{"$error":"#NUM!"}},null,null,null,null,null,{"$f":"K48","v":{"$error":"#NUM!"}},null,null,null,null,null,{"$f":"O48","v":"Rene"},null,null,null,null,null,{"$f":"U48","v":"Werner"}]
[null,null,null,{"$f":"SUM(D48:D49)","v":0},{"$f":"SUM(D52)/2*0.5","v":0},null,null,null,null,{"$f":"SUM(J48:J49)","v":0},{"$f":"SUM(J52)/2*0.5","v":0},null,null,null,null,{"$f":"SUM(P48:P49)","v":0},{"$f":"SUM(P52)/2*0.5","v":0},null,null,null,null,{"$f":"SUM(V48:V49)","v":0},{"$f":"SUM(V52)/2*0.5","v":0}]
[null,null,null,3,{"$f":"SUM(D53)/2*0.5","v":0.75},null,null,null,null,{"$f":"SUM(J48:J49)","v":0},{"$f":"SUM(J53)/2*0.5","v":0},null,null,null,null,{"$f":"SUM(P48:P49)","v":0},{"$f":"SUM(P53)/2*0.5","v":0},null,null,null,null,{"$f":"SUM(V48:V49)","v":0},{"$f":"SUM(V53)/2*0.5","v":0}]
["Halbfinale 1",null,null,null,null,null,null,null,null,null,null,null,"Halbfinale 2",null,null,null,null,null,null,null,null,null,null,{"$f":"X48+1.35/96","v":1.0140624999999992},"Uhr"]
[null,{"$f":"A51","v":{"$error":"#NUM!"}},null,null,"Sieger:",null,{"$f":"INDEX(B55:B56,MATCH(LARGE(D55:D56,1),D55:D56,0))","v":{"$error":"#NUM!"}},null,null,null,null,null,null,{"$f":"M51","v":"Rene"},null,null,"Sieger:",null,{"$f":"INDEX(N55:N56,MATCH(LARGE(P55:P56,1),P55:P56,0))","v":{"$error":"#NUM!"}}]
[null,{"$f":"G51","v":{"$error":"#NUM!"}},null,null,"Zweiter:",null,{"$f":"INDEX(B55:B56,MATCH(LARGE(D55:D56,2),D55:D56,0))","v":{"$error":"#NUM!"}},null,null,null,null,null,null,{"$f":"S51","v":"Werner"},null,null,"Zweiter:",null,{"$f":"INDEX(N55:N56,MATCH(LARGE(P55:P56,2),P55:P56,0))","v":{"$error":"#NUM!"}}]
[null,null,null,{"$f":"SUM(D55:D56)","v":0},{"$f":"SUM(D57)/2*0.5","v":0},null,null,null,null,null,null,null,null,null,null,null,{"$f":"SUM(P55:P56)","v":0},null,{"$f":"SUM(Q57)/2*0.5","v":0}]
[null,null,null,{"$f":"SUM(D55:D56)","v":0},{"$f":"SUM(D58)/2*0.5","v":0},null,null,"Spiel um Platz 3",null,null,null,null,null,null,null,null,{"$f":"SUM(P55:P56)","v":0},null,{"$f":"SUM(S57)","v":0}]
[]
[null,null,null,null,null,null,null,{"$f":"G56","v":{"$error":"#NUM!"}},null,null,null,null,{"$f":"INDEX(H60:H61,MATCH(LARGE(J60:J61,1),J60:J61,0))","v":{"$error":"#NUM!"}},"Dritter",null,null,{"$f":"X54+1.35/96","v":1.0281249999999993},null,"Uhr"]
[null,null,null,null,null,null,null,{"$f":"S56","v":{"$error":"#NUM!"}},null,null,null,null,{"$f":"INDEX(H60:H61,MATCH(LARGE(J60:J61,2),J60:J61,0))","v":{"$error":"#NUM!"}},"Vierter"]
[null,null,null,null,null,null,null,null,null,{"$f":"SUM(J60:J61)","v":0},{"$f":"SUM(J62)/2*0.5","v":0}]
[null,null,null,null,null,null,null,null,null,null,{"$f":"K62","v":0}]
[]
[null,null,null,null,null,null,null,"Finale"]
[]
[null,null,null,null,null,null,null,{"$f":"G55","v":{"$error":"#NUM!"}},null,null,null,null,{"$f":"INDEX(H67:H68,MATCH(LARGE(J67:J68,1),J67:J68,0))","v":{"$error":"#NUM!"}},"Sieger",null,null,{"$f":"X54+1.35/96","v":1.0281249999999993},null,"Uhr"]
[null,null,null,null,null,null,null,{"$f":"S55","v":{"$error":"#NUM!"}},null,null,null,null,{"$f":"INDEX(H67:H68,MATCH(LARGE(J67:J68,2),J67:J68,0))","v":{"$error":"#NUM!"}},"Zweiter"]
[null,null,null,null,null,null,null,null,null,{"$f":"SUM(J67:J68)","v":0},{"$f":"SUM(J69)/2*0.5","v":0}]
[null,null,null,null,null,null,null,null,null,null,{"$f":"K69","v":0}]
["Spielgelder"]
[]
[]
[null,"Vorunde","Viertelfinale 1",null,"Viertelfinale 2",null,"Viertelfinale 3",null,"Viertelfinale 4",null,"Halbfinale 1",null,"Halbfinale 2","Spiel um Platz 3",null,"Finale"]
[{"$f":"A1","v":"Robert"},{"$f":"SUM(B46)/7*0.5","v":0},{"$f":"SUMIF(C48:C49,A75,E52)","v":0},null,{"$f":"SUMIF(I48:I49,A75,K52)","v":0},null,{"$f":"SUMIF(O48:O49,A75,Q52)","v":0},null,{"$f":"SUMIF(U48:U49,A75,W52)","v":0},null,{"$f":"SUMIF(B55:B56,A75,E57)","v":0},null,{"$f":"SUMIF(N55:N56,A75,S57)","v":0},{"$f":"SUMIF(H60:H61,A75,K62)","v":0},null,{"$f":"SUMIF(H67:H68,A75,K69)","v":0},{"$f":"SUM(B75:P75)","v":0},null,{"$f":"ROUNDUP(Q75,0)","v":0}]
["Volker",{"$f":"SUM(B46)/7*0.5","v":0},{"$f":"SUMIF(C48:C49,A76,E52)","v":0},null,{"$f":"SUMIF(I48:I49,A76,K52)","v":0},null,{"$f":"SUMIF(O48:O49,A76,Q52)","v":0},null,{"$f":"SUMIF(U48:U49,A76,W52)","v":0},null,{"$f":"SUMIF(B55:B56,A76,E57)","v":0},null,{"$f":"SUMIF(N55:N56,A76,S57)","v":0},{"$f":"SUMIF(H60:H61,A76,K62)","v":0},null,{"$f":"SUMIF(H67:H68,A76,K69)","v":0},{"$f":"SUM(B76:P76)","v":0},null,{"$f":"ROUNDUP(Q76,0)","v":0}]
["Siggi",{"$f":"SUM(B46)/7*0.5","v":0},{"$f":"SUMIF(C48:C49,A77,E52)","v":0},null,{"$f":"SUMIF(I48:I49,A77,K52)","v":0},null,{"$f":"SUMIF(O48:O49,A77,Q52)","v":0},null,{"$f":"SUMIF(U48:U49,A77,W52)","v":0},null,{"$f":"SUMIF(B55:B56,A77,E57)","v":0},null,{"$f":"SUMIF(N55:N56,A77,S57)","v":0},{"$f":"SUMIF(H60:H61,A77,K62)","v":0},null,{"$f":"SUMIF(H67:H68,A77,K69)","v":0},0,null,0]
["Anja",{"$f":"SUM(B46)/7*0.5","v":0},{"$f":"SUMIF(C48:C49,A78,E52)","v":0},null,{"$f":"SUMIF(I48:I49,A78,K52)","v":0},null,{"$f":"SUMIF(O48:O49,A78,Q52)","v":0},null,{"$f":"SUMIF(U48:U49,A78,W52)","v":0},null,{"$f":"SUMIF(B55:B56,A78,E57)","v":0},null,{"$f":"SUMIF(N55:N56,A78,S57)","v":0},{"$f":"SUMIF(H60:H61,A78,K62)","v":0},null,{"$f":"SUMIF(H67:H68,A78,K69)","v":0},0,null,0]
["Vincent",{"$f":"SUM(B46)/7*0.5","v":0},{"$f":"SUMIF(C48:C49,A79,E52)","v":0},null,{"$f":"SUMIF(I48:I49,A79,K52)","v":0},null,{"$f":"SUMIF(O48:O49,A79,Q52)","v":0},null,{"$f":"SUMIF(U48:U49,A79,W52)","v":0},null,{"$f":"SUMIF(B55:B56,A79,E57)","v":0},null,{"$f":"SUMIF(N55:N56,A79,S57)","v":0},{"$f":"SUMIF(H60:H61,A79,K62)","v":0},null,{"$f":"SUMIF(H67:H68,A79,K69)","v":0},0,null,0]
["Ralf",{"$f":"SUM(B46)/7*0.5","v":0},{"$f":"SUMIF(C48:C49,A80,E52)","v":0},null,{"$f":"SUMIF(I48:I49,A80,K52)","v":0},null,{"$f":"SUMIF(O48:O49,A80,Q52)","v":0},null,{"$f":"SUMIF(U48:U49,A80,W52)","v":0},null,{"$f":"SUMIF(B55:B56,A80,E57)","v":0},null,{"$f":"SUMIF(N55:N56,A80,S57)","v":0},{"$f":"SUMIF(H60:H61,A80,K62)","v":0},null,{"$f":"SUMIF(H67:H68,A80,K69)","v":0},0,null,0]
["Erich",{"$f":"SUM(B46)/7*0.5","v":0},{"$f":"SUMIF(C48:C49,A81,E52)","v":0},null,{"$f":"SUMIF(I48:I49,A81,K52)","v":0},null,{"$f":"SUMIF(O48:O49,A81,Q52)","v":0},null,{"$f":"SUMIF(U48:U49,A81,W52)","v":0},null,{"$f":"SUMIF(B55:B56,A81,E57)","v":0},null,{"$f":"SUMIF(N55:N56,A81,S57)","v":0},{"$f":"SUMIF(H60:H61,A81,K62)","v":0},null,{"$f":"SUMIF(H67:H68,A81,K69)","v":0},0,null,0]
[{"$f":"G1","v":"Rene"},{"$f":"SUM(H46)/7*0.5","v":0},{"$f":"SUMIF(C48:C49,A82,E52)","v":0},null,{"$f":"SUMIF(I48:I49,A82,K52)","v":0},null,{"$f":"SUMIF(O48:O49,A82,Q52)","v":0},null,{"$f":"SUMIF(U48:U49,A82,W52)","v":0},null,{"$f":"SUMIF(B55:B56,A82,E57)","v":0},null,{"$f":"SUMIF(N55:N56,A82,S57)","v":0},{"$f":"SUMIF(H60:H61,A82,K62)","v":0},null,{"$f":"SUMIF(H67:H68,A82,K69)","v":0},0,null,0]
["Nicole",{"$f":"SUM(H46)/7*0.5","v":0},{"$f":"SUMIF(C48:C49,A83,E52)","v":0},null,{"$f":"SUMIF(I48:I49,A83,K52)","v":0},null,{"$f":"SUMIF(O48:O49,A83,Q52)","v":0},null,{"$f":"SUMIF(U48:U49,A83,W52)","v":0},null,{"$f":"SUMIF(B55:B56,A83,E57)","v":0},null,{"$f":"SUMIF(N55:N56,A83,S57)","v":0},{"$f":"SUMIF(H60:H61,A83,K62)","v":0},null,{"$f":"SUMIF(H67:H68,A83,K69)","v":0},0,null,0]
["Frank",{"$f":"SUM(H46)/7*0.5","v":0},{"$f":"SUMIF(C48:C49,A84,E52)","v":0},null,{"$f":"SUMIF(I48:I49,A84,K52)","v":0},null,{"$f":"SUMIF(O48:O49,A84,Q52)","v":0},null,{"$f":"SUMIF(U48:U49,A84,W52)","v":0},null,{"$f":"SUMIF(B55:B56,A84,E57)","v":0},null,{"$f":"SUMIF(N55:N56,A84,S57)","v":0},{"$f":"SUMIF(H60:H61,A84,K62)","v":0},null,{"$f":"SUMIF(H67:H68,A84,K69)","v":0},0,null,0]
["Sasha",{"$f":"SUM(H46)/7*0.5","v":0},{"$f":"SUMIF(C48:C49,A85,E52)","v":0},null,{"$f":"SUMIF(I48:I49,A85,K52)","v":0},null,{"$f":"SUMIF(O48:O49,A85,Q52)","v":0},null,{"$f":"SUMIF(U48:U49,A85,W52)","v":0},null,{"$f":"SUMIF(B55:B56,A85,E57)","v":0},null,{"$f":"SUMIF(N55:N56,A85,S57)","v":0},{"$f":"SUMIF(H60:H61,A85,K62)","v":0},null,{"$f":"SUMIF(H67:H68,A85,K69)","v":0},0,null,0]
["Klaus",{"$f":"SUM(H46)/7*0.5","v":0},{"$f":"SUMIF(C48:C49,A86,E52)","v":0},null,{"$f":"SUMIF(I48:I49,A86,K52)","v":0},null,{"$f":"SUMIF(O48:O49,A86,Q52)","v":0},null,{"$f":"SUMIF(U48:U49,A86,W52)","v":0},null,{"$f":"SUMIF(B55:B56,A86,E57)","v":0},null,{"$f":"SUMIF(N55:N56,A86,S57)","v":0},{"$f":"SUMIF(H60:H61,A86,K62)","v":0},null,{"$f":"SUMIF(H67:H68,A86,K69)","v":0},0,null,0]
["Manuel",{"$f":"SUM(H46)/7*0.5","v":0},{"$f":"SUMIF(C48:C49,A87,E52)","v":0},null,{"$f":"SUMIF(I48:I49,A87,K52)","v":0},null,{"$f":"SUMIF(O48:O49,A87,Q52)","v":0},null,{"$f":"SUMIF(U48:U49,A87,W52)","v":0},null,{"$f":"SUMIF(B55:B56,A87,E57)","v":0},null,{"$f":"SUMIF(N55:N56,A87,S57)","v":0},{"$f":"SUMIF(H60:H61,A87,K62)","v":0},null,{"$f":"SUMIF(H67:H68,A87,K69)","v":0},0,null,0]
["Christian",{"$f":"SUM(H46)/7*0.5","v":0},{"$f":"SUMIF(C48:C49,A88,E52)","v":0},null,{"$f":"SUMIF(I48:I49,A88,K52)","v":0},null,{"$f":"SUMIF(O48:O49,A88,Q52)","v":0},null,{"$f":"SUMIF(U48:U49,A88,W52)","v":0},null,{"$f":"SUMIF(B55:B56,A88,E57)","v":0},null,{"$f":"SUMIF(N55:N56,A88,S57)","v":0},{"$f":"SUMIF(H60:H61,A88,K62)","v":0},null,{"$f":"SUMIF(H67:H68,A88,K69)","v":0},0,null,0]
[{"$f":"M1","v":"Kerstin"},{"$f":"SUM(N46)/7*0.5","v":0},{"$f":"SUMIF(C48:C49,A75,E52)","v":0},null,{"$f":"SUMIF(I48:I49,A89,K52)","v":0},null,{"$f":"SUMIF(O48:O49,A89,Q52)","v":0},null,{"$f":"SUMIF(U48:U49,A89,W52)","v":0},null,{"$f":"SUMIF(B55:B56,A89,E57)","v":0},null,{"$f":"SUMIF(N55:N56,A89,S57)","v":0},{"$f":"SUMIF(H60:H61,A89,K62)","v":0},null,{"$f":"SUMIF(H67:H68,A89,K69)","v":0},0,null,0]
["Dirk",{"$f":"SUM(N46)/7*0.5","v":0},{"$f":"SUMIF(C48:C49,A90,E52)","v":0},null,{"$f":"SUMIF(I48:I49,A90,K52)","v":0},null,{"$f":"SUMIF(O48:O49,A90,Q52)","v":0},null,{"$f":"SUMIF(U48:U49,A90,W52)","v":0},null,{"$f":"SUMIF(B55:B56,A90,E57)","v":0},null,{"$f":"SUMIF(N55:N56,A90,S57)","v":0},{"$f":"SUMIF(H60:H61,A90,K62)","v":0},null,{"$f":"SUMIF(H67:H68,A90,K69)","v":0},0,null,0]
["Kevin",{"$f":"SUM(N46)/7*0.5","v":0},{"$f":"SUMIF(C48:C49,A91,E52)","v":0},null,{"$f":"SUMIF(I48:I49,A91,K52)","v":0},null,{"$f":"SUMIF(O48:O49,A91,Q52)","v":0},null,{"$f":"SUMIF(U48:U49,A91,W52)","v":0},null,{"$f":"SUMIF(B55:B56,A91,E57)","v":0},null,{"$f":"SUMIF(N55:N56,A91,S57)","v":0},{"$f":"SUMIF(H60:H61,A91,K62)","v":0},null,{"$f":"SUMIF(H67:H68,A91,K69)","v":0},0,null,0]
["Aline",{"$f":"SUM(N46)/7*0.5","v":0},{"$f":"SUMIF(C48:C49,A92,E52)","v":0},null,{"$f":"SUMIF(I48:I49,A92,K52)","v":0},null,{"$f":"SUMIF(O48:O49,A92,Q52)","v":0},null,{"$f":"SUMIF(U48:U49,A92,W52)","v":0},null,{"$f":"SUMIF(B55:B56,A92,E57)","v":0},null,{"$f":"SUMIF(N55:N56,A92,S57)","v":0},{"$f":"SUMIF(H60:H61,A92,K62)","v":0},null,{"$f":"SUMIF(H67:H68,A92,K69)","v":0},0,null,0]
["Rosi N.",{"$f":"SUM(N46)/7*0.5","v":0},{"$f":"SUMIF(C48:C49,A93,E52)","v":0},null,{"$f":"SUMIF(I48:I49,A93,K52)","v":0},null,{"$f":"SUMIF(O48:O49,A93,Q52)","v":0},null,{"$f":"SUMIF(U48:U49,A93,W52)","v":0},null,{"$f":"SUMIF(B55:B56,A93,E57)","v":0},null,{"$f":"SUMIF(N55:N56,A93,S57)","v":0},{"$f":"SUMIF(H60:H61,A93,K62)","v":0},null,{"$f":"SUMIF(H67:H68,A93,K69)","v":0},0,null,0]
["Rosi P.",{"$f":"SUM(N46)/7*0.5","v":0},{"$f":"SUMIF(C48:C49,A94,E52)","v":0},null,{"$f":"SUMIF(I48:I49,A94,K52)","v":0},null,{"$f":"SUMIF(O48:O49,A94,Q52)","v":0},null,{"$f":"SUMIF(U48:U49,A94,W52)","v":0},null,{"$f":"SUMIF(B55:B56,A94,E57)","v":0},null,{"$f":"SUMIF(N55:N56,A94,S57)","v":0},{"$f":"SUMIF(H60:H61,A94,K62)","v":0},null,{"$f":"SUMIF(H67:H68,A94,K69)","v":0},0,null,0]
["Stefan",{"$f":"SUM(N46)/7*0.5","v":0},{"$f":"SUMIF(C48:C49,A95,E52)","v":0},null,{"$f":"SUMIF(I48:I49,A95,K52)","v":0},null,{"$f":"SUMIF(O48:O49,A95,Q52)","v":0},null,{"$f":"SUMIF(U48:U49,A95,W52)","v":0},null,{"$f":"SUMIF(B55:B56,A95,E57)","v":0},null,{"$f":"SUMIF(N55:N56,A95,S57)","v":0},{"$f":"SUMIF(H60:H61,A95,K62)","v":0},null,{"$f":"SUMIF(H67:H68,A95,K69)","v":0},0,null,0]
[{"$f":"S1","v":"Werner"},{"$f":"SUM(T46)/7*0.5","v":0},{"$f":"SUMIF(C48:C49,A96,E52)","v":0},null,{"$f":"SUMIF(I48:I49,A96,K52)","v":0},null,{"$f":"SUMIF(O48:O49,A96,Q52)","v":0},null,{"$f":"SUMIF(U48:U49,A96,W52)","v":0},null,{"$f":"SUMIF(B55:B56,A96,E57)","v":0},null,{"$f":"SUMIF(N55:N56,A96,S57)","v":0},{"$f":"SUMIF(H60:H61,A96,K62)","v":0},null,{"$f":"SUMIF(H67:H68,A96,K69)","v":0},0,null,0]
[{"$f":"S2","v":"Achim"},{"$f":"SUM(T46)/7*0.5","v":0},{"$f":"SUMIF(C48:C49,A97,E52)","v":0},null,{"$f":"SUMIF(I48:I49,A97,K52)","v":0},null,{"$f":"SUMIF(O48:O49,A97,Q52)","v":0},null,{"$f":"SUMIF(U48:U49,A97,W52)","v":0},null,{"$f":"SUMIF(B55:B56,A97,E57)","v":0},null,{"$f":"SUMIF(N55:N56,A97,S57)","v":0},{"$f":"SUMIF(H60:H61,A97,K62)","v":0},null,{"$f":"SUMIF(H67:H68,A97,K69)","v":0},0,null,0]
["Otto",{"$f":"SUM(T46)/7*0.5","v":0},{"$f":"SUMIF(C48:C49,A98,E52)","v":0},null,{"$f":"SUMIF(I48:I49,A98,K52)","v":0},null,{"$f":"SUMIF(O48:O49,A98,Q52)","v":0},null,{"$f":"SUMIF(U48:U49,A98,W52)","v":0},null,{"$f":"SUMIF(B55:B56,A98,E57)","v":0},null,{"$f":"SUMIF(N55:N56,A98,S57)","v":0},{"$f":"SUMIF(H60:H61,A98,K62)","v":0},null,{"$f":"SUMIF(H67:H68,A98,K69)","v":0},0,null,0]
["Paul",{"$f":"SUM(T46)/7*0.5","v":0},{"$f":"SUMIF(C48:C49,A99,E52)","v":0},null,{"$f":"SUMIF(I48:I49,A99,K52)","v":0},null,{"$f":"SUMIF(O48:O49,A99,Q52)","v":0},null,{"$f":"SUMIF(U48:U49,A99,W52)","v":0},null,{"$f":"SUMIF(B55:B56,A99,E57)","v":0},null,{"$f":"SUMIF(N55:N56,A99,S57)","v":0},{"$f":"SUMIF(H60:H61,A99,K62)","v":0},null,{"$f":"SUMIF(H67:H68,A99,K69)","v":0},0,null,0]
["Fritz",{"$f":"SUM(T46)/7*0.5","v":0},{"$f":"SUMIF(C48:C49,A100,E52)","v":0},null,{"$f":"SUMIF(I48:I49,A100,K52)","v":0},null,{"$f":"SUMIF(O48:O49,A100,Q52)","v":0},null,{"$f":"SUMIF(U48:U49,A100,W52)","v":0},null,{"$f":"SUMIF(B55:B56,A100,E57)","v":0},null,{"$f":"SUMIF(N55:N56,A100,S57)","v":0},{"$f":"SUMIF(H60:H61,A100,K62)","v":0},null,{"$f":"SUMIF(H67:H68,A100,K69)","v":0},0,null,0]
["Hein",{"$f":"SUM(T46)/7*0.5","v":0},{"$f":"SUMIF(C48:C49,A101,E52)","v":0},null,{"$f":"SUMIF(I48:I49,A101,K52)","v":0},null,{"$f":"SUMIF(O48:O49,A101,Q52)","v":0},null,{"$f":"SUMIF(U48:U49,A101,W52)","v":0},null,{"$f":"SUMIF(B55:B56,A101,E57)","v":0},null,{"$f":"SUMIF(N55:N56,A101,S57)","v":0},{"$f":"SUMIF(H60:H61,A101,K62)","v":0},null,{"$f":"SUMIF(H67:H68,A101,K69)","v":0},0,null,0]
["Manni",{"$f":"SUM(T46)/7*0.5","v":0},{"$f":"SUMIF(C48:C49,A102,E52)","v":0},null,{"$f":"SUMIF(I48:I49,A102,K52)","v":0},null,{"$f":"SUMIF(O48:O49,A102,Q52)","v":0},null,{"$f":"SUMIF(U48:U49,A102,W52)","v":0},null,{"$f":"SUMIF(B55:B56,A102,E57)","v":0},null,{"$f":"SUMIF(N55:N56,A102,S57)","v":0},{"$f":"SUMIF(H60:H61,A102,K62)","v":0},null,{"$f":"SUMIF(H67:H68,A102,K69)","v":0},0,null,0]
[null,null,null,null,null,null,null,null,null,null,null,null,null,null,null,null,{"$f":"SUM(Q75:Q102)","v":0},null,0]

{"sheet":"null","index":2,"n_rows":0,"n_cols":0,"rows_kept":0,"cut":false,"hidden":false,"merged":[]}