{"text_format":"1","workbook":"xlsx","n_sheets":4,"sheets":["HKL","Stahl","Bagger","Kran-Berlin"],"not_rendered":{"charts":0,"images":1,"macros":1,"external_links":1,"defined_names":1,"comments":0,"pivot_tables":0},"unopened":[],"bounds":{"document_bytes":16777216,"sheet_cells":100000,"rows_first":2000,"rows_last":500,"rows_between":2000,"halvings":0,"cell_chars":16384,"cell_head_chars":4096},"cells_cut":0,"cells_raw":0,"read":"whole","date_system":"1900"}

{"sheet":"HKL","index":0,"n_rows":363,"n_cols":5,"rows_kept":363,"cut":false,"hidden":true,"merged":[]}
[1,1097,"HKL Center Dresden Nord","Tel. 0351 / 64 65 66-6","Fax 0351 / 64 65 66-1"]
[2,1097,"Theisen Dresden/Nord","Tel. 0351 / 858 84 16","Fax 0351 / 858 84 17"]
[3,1157,"Theisen Container","Tel. 0351 / 420 03-375","Fax 0351 / 420 03-385"]
[4,1157,"Theisen DD","Tel. 0351 / 420 03-372","Fax 0351 / 420 03-385"]
[5,1157,"Theisen Dresden/West","Tel. 0351 / 420 03-361","Fax 0351 / 420 03-369"]
[6,1157,"Theisen Krane","Tel. 0351 / 420 03-375","Fax 0351 / 420 03-385"]
[7,1157,"Theisen Spezialtechnik","Tel. 0351 / 420 03-370","Fax 0351 / 420 03-385"]
[8,1157,"Theisen Werkzeugtechnik","Tel. 0351 / 420 03-347","Fax 0351 / 420 03-386"]
[9,1237,"HKL Center Dresden Süd","Tel. 0351 / 64 64 24-4","Fax 0351 / 64 64 24-1"]
[10,1239,"Theisen Dresden/Süd","Tel. 0351 / 281 58 45","Fax 0351 / 281 58 60"]
[11,1665,"Bools Dresden","Tel. 035204 / 47 90 3","Fax 035204 / 47 90 2"]
[12,1968,"HKL Center Senftenberg","Tel. 035 73 / 37 60-0","Fax 035 73 / 37 60-19"]
[13,2625,"Theisen Bautzen","Tel. 03591 / 30 50 55","Fax 03591 / 30 50 66"]
[14,2827,"Theisen Görlitz","Tel. 03581 / 85 19 94","Fax 03581 / 85 19 95"]
[15,3044,"Bools Cottbus ","Tel. 0355 / 8 66 29 09","Fax 0355 / 8 66 29 08"]
[16,3051,"Theisen Cottbus","Tel. 0355 / 53 00 29","Fax 0355 / 53 00 93"]
[17,3058,"HKL Center Cottbus","Tel. 03 55 / 48 38 50-0","Fax 03 55 / 48 38 50-1"]
[18,3130,"Theisen Spremberg","Tel. 03563 / 60 89 56","Fax 03563 / 60 89 57"]
[19,3149,"Bools Forst","Tel. 03562 / 98 42 50","Fax 03562 / 98 44 93"]
[20,3172,"Bools Guben","Tel. 03561 / 68 58 0","Fax 03561 / 68 58 21"]
[21,4159,"Theisen Leipzig/Nord","Tel. 0341 / 461 88 88","Fax 0341 / 461 88 90"]
[22,4179,"Theisen Leipzig/West","Tel. 0341 / 446 42-560","Fax 0341 / 446 42-585"]
[23,4319,"Bools Leipzig","Tel. 0341 / 65 17 33 4","Fax 0341 / 65 17 33 6"]
[24,4328,"Theisen Leipzig/Ost","Tel. 0341 / 251 87 34","Fax 0341 / 251 87 77"]
[25,4347,"HKL Center Leipzig","Tel. 03 41 / 245 35-0","Fax 03 41 / 245 35-29"]
[26,4720,"Theisen Döbeln","Tel. 03431 / 60 28 52","Fax 03431 / 60 28 53"]
[27,4910,"Theisen Elsterwerda","Tel. 03533 / 16 40 51","Fax 03533 / 16 40 52"]
[28,6112,"HKL Center Halle","Tel. 03 45 / 564 13-0","Fax 03 45 / 564 13-11"]
[29,6116,"Theisen Halle","Tel. 0345 / 522 82 85","Fax 0345 / 522 93 59"]
[30,6184,"Bools Halle","Tel. 034602 / 50 25 4","Fax 034602 / 50 25 6"]
[31,6217,"Theisen Merseburg","Tel. 03461 / 82 39 46","Fax 03461 / 82 39 47"]
[32,6406,"HKL Center Bernburg","Tel. 034 71 / 32 86-00","Fax 034 71 / 32 86-20"]
[33,6556,"C & M Baumaschinen Artern","Tel. 03466-33650","Fax 03466-336526"]
[34,6847,"HKL Center Dessau","Tel. 03 40 / 541 27-0","Fax 03 40 / 541 27-10"]
[35,6886,"Theisen Wittenberg","Tel. 03491 / 41 97 89","Fax 03491 / 41 97 90"]
[36,7318,"Theisen Saalfeld","Tel. 03671 / 46 16 87","Fax 03671 / 46 16 88"]
[37,7546,"Theisen Gera","Tel. 0365 / 420 82 75","Fax 0365 / 420 82 76"]
[38,7745,"HKL Center Jena","Tel. 036 41 / 215 40-8","Fax 036 41 / 215 40-7"]
[39,7745,"Theisen Jena","Tel. 03641 / 21 49 85","Fax 03641 / 21 49 86"]
[40,8056,"Theisen Zwickau","Tel. 0375 / 21 57 76","Fax 0375 / 21 57 77"]
[41,8058,"HKL Center Zwickau","Tel. 03 75 / 277 02-0","Fax 03 75 / 277 02-10"]
[42,8525,"Theisen Plauen","Tel. 03741 / 44 32 22","Fax 03741 / 44 32 62"]
[43,8606,"BMV Baumaschinen Oelsnitz","Tel. 037421-26258","Fax 037421-26261"]
[44,9114,"Bools Chemnitz ","Tel. 0371 / 4 58 60 91","Fax 0371 / 4 58 60 92"]
[45,9120,"Theisen Chemnitz","Tel. 0371 / 51 71 95","Fax 0371 / 530 88 36"]
[46,9125,"HKL Center Chemnitz","Tel. 0371 / 530 07 60","Fax 0371 / 334 74 77"]
[47,9599,"Theisen Freiberg","Tel. 03731 / 69 13 21","Fax 03731 / 69 13 22"]
[48,12277,"HKL Center Berlin Süd","Tel. 030 / 74 20 02-0","Fax 030 / 74 20 02-18"]
[49,12489,"Theisen Berlin/Süd","Tel. 030 / 67 89 21 36","Fax 030 / 67 89 21 37"]
[50,12681,"HKL Center Berlin Ost","Tel. 030 / 93 69 04-0","Fax 030 / 93 69 04-30"]
[51,13089,"Theisen Berlin/Nord","Tel. 030 / 474 48 62","Fax 030 / 47 47 18 20"]
[52,13629,"HKL Center Berlin West","Tel. 030 / 38 39 64-0","Fax 030 / 38 39 64-22"]
[53,14478,"Theisen Potsdam","Tel. 0331 / 20 10 494","Fax 0331 / 20 10 495"]
[54,14480,"HKL Center Potsdam","Tel. 03 31 / 70 17 84-1","Fax 03 31 / 70 17 84-8"]
[55,14627,"Bools Berlin - Elstal","Tel. 030 / 23 62 72 00","Fax 033234 / 87 11"]
[56,14797,"HKL Center Brandenburg","Tel. 033 81 / 26 01-0","Fax 033 81 / 26 01-19"]
[57,15236,"HKL Center Frankfurt/Oder","Tel. 03 35 / 521 67-0","Fax 03 35 / 521 67-19"]
[58,15562,"HKL Center Rüdersdorf","Tel. 03 36 38 / 706-0","Fax 03 36 38 / 706-39"]
[59,15566,"Bools Berlin - Schöneiche","Tel. 030 / 64 90 33 43","Fax 030 / 64 90 33 45"]
[60,15711,"HKL Königs Wusterhausen","Tel. 033 75 / 25 98-0","Fax 033 75 / 25 98-19"]
[61,15910,"HKL Center Lübben","Tel. 03 54 74 / 203-0","Fax 03 54 74 / 203-19"]
[62,16225,"HKL Center Eberswalde","Tel. 033 34 / 21 31-0","Fax 033 34 / 21 31-19"]
[63,16227,"Theisen Eberswalde","Tel. 03334 / 35 34 54","Fax 03334 / 35 55 94"]
[64,16515,"HKL Center Oranienburg","Tel. 033 01 / 59 87-0","Fax 033 01 / 59 87-59"]
[65,16928,"HKL Center Falkenhagen","Tel. 03 39 86 / 637-0","Fax 03 39 86 / 637-40"]
[66,17033,"HKL Center Neubrandenburg","Tel. 03 95 / 560 55-0","Fax 03 95 / 560 55-27"]
[67,17291,"HKL Center Prenzlau","Tel. 039 84 / 87 41-0","Fax 039 84 / 87 41-10"]
[68,17438,"BMV Wolgast","Tel: 03836-203671","Fax: 03836-201621"]
[69,18184,"HKL Center Rostock","Tel. 03 82 04 / 617-0","Fax 03 82 04 / 617-50"]
[70,18437,"HKL Center Stralsund","Tel. 038 31 / 47 02-0","Fax 038 31 / 47 02-44"]
[71,18528,"HKL Center Bergen","Tel. 038 38 / 254 6 5-0","Fax 038 38 / 254 6 5-8"]
[72,19061,"HKL Center Schwerin","Tel. 03 85 / 645 32-0","Fax 03 85 / 645 32-12"]
[73,19288,"HKL Center Ludwigslust","Tel. 038 74 / 326 04-0","Fax 038 74 / 326 04-4"]
[74,19370,"HKL Center Parchim","Tel. 038 71 / 63 01-0","Fax 038 71 / 63 01-11"]
[75,20539,"Theisen Hamburg","Tel. 040 / 79 75 42 86","Fax 040 / 79 75 45 39"]
[76,21079,"HKL Center Hamburg Süd","Tel. 040 / 767 95 23","Fax 040 / 765 75 49"]
[77,21493,"HKL Center Schwarzenbek","Tel. 041 51 / 40 69","Fax 041 51 / 49 42"]
[78,21682,"HKL Center Stade","Tel. 041 41 / 666 20","Fax 041 41 / 688 08"]
[79,21762,"Schölemann Otterndorf ","Tel: 04751-990041","Fax: 04751-990010"]
[80,22045,"HKL Center Hamburg Ost","Tel. 040 / 66 96 23-0","Fax 040 / 66 96 23-33"]
[81,22331,"HKL Center Hamburg Nord","Tel. 040 / 53 80 21","Fax 040 / 538 27 10"]
[82,22419,"Bools Hamburg","Tel. 040 / 53 90 84 54","Fax: 040 / 53 90 84 64"]
[83,22525,"HKL Center Hamburg West","Tel. 040 / 540 60-40","Fax 040 / 540 60-88"]
[84,23556,"HKL Center Lübeck","Tel. 04 51 / 89 09 90","Fax 04 51 / 89 28 24"]
[85,23560,"Theisen Lübeck","Tel. 0451 / 290 72 05","Fax 0451 / 290 72 56"]
[86,23923,"HKL Center Lübeck Ost","Tel. 04 51 / 61 99 10","Fax 04 51 / 69 11 54"]
[87,23970,"HKL Center Wismar","Tel. 038 41 / 72 82-0","Fax 038 41 / 72 82-33"]
[88,24145,"HKL Center Kiel","Tel. 04 31 / 71 85-0","Fax 04 31 / 71 85-99"]
[89,24147,"Theisen Kiel","Tel. 0431 / 6 00 46 27","Fax 0431 / 6 00 46 29"]
[90,24539,"Bools Neumünster","Tel. 04321 / 602 83 77","Fax 04321 / 602 83 79"]
[91,24539,"HKL Center Neumünster","Tel. 043 21 / 790 93","Fax 043 21 / 778 83"]
[92,24787,"HKL Center Rendsburg","Tel. 043 31 / 60 17-0","Fax 043 31 / 60 17-10"]
[93,24837,"Theisen Schleswig","Tel. 04621 / 85 24 47","Fax 04621 / 85 55 28"]
[94,24850,"HKL Center Schuby","Tel. 046 21 / 94 56-0","Fax 046 21 / 94 56-78"]
[95,24941,"HKL Center Flensburg","Tel. 04 61 / 960 99","Fax 04 61 / 961 68"]
[96,25421,"HKL Center Pinneberg","Tel. 041 01 / 408 88 11","Fax 041 01 / 408 88 16"]
[97,25560,"HKL Center Itzehoe","Tel. 048 92 / 17 17","Fax 048 92 / 17 02"]
[98,26135,"HKL Oldenburg","Tel. 0441 / 205729 0","Fax 0441 / 205729 10"]
[99,26389,"Bools Wilhelmshaven","Tel: 04421-7479312","Fax: 04421-7479600"]
[100,26655,"Kähler Baumasch. Nortmoor","Tel. 04950 / 2695","Fax 04950 / 2697"]
[101,28199,"Theisen Bremen","Tel. 0421 / 566 09 65","Fax 0421 / 566 09 68"]
[102,28816,"HKL Center Bremen","Tel. 04 21 / 830 14-0","Fax 04 21 / 830 14-20"]
[103,29410,"HKL Center Salzwedel","Tel. 039 01 / 27 45-0","Fax 039 01 / 27 45-2"]
[104,29553,"HKL Center Lüneburg","Tel. 058 23 / 98 06-0","Fax 058 23 / 98 06-19"]
[105,30165,"Theisen Hannover","Tel. 0511 / 169 29 52","Fax 0511 / 169 29 54"]
[106,30853,"HKL Center Hannover Nord","Tel. 05 11 / 72 59 51-0","Fax 05 11 / 72 59 51-20"]
[107,30916,"Bools Hannover","Tel. 05136 / 97 62 0 0   ","Fax 05136 / 97 62 0 10   "]
[108,30952,"HKL Center Hannover Süd","Tel. 05 11 / 438 58-0","Fax 05 11 / 438 58-11"]
[109,30974,"Kügler Barsinghausen","Tel: 05109-513596","Fax: 05109-513597"]
[110,31655,"MBN Hoppe Stadthagen","Tel. 05721 / 40210","Fax 05721 / 402141"]
[111,31812,"MSV Baumaschinen Hameln","Tel. 05151-94300","Fax 05151-943066"]
[112,32257,"Grotemeier Bünde","Tel: 05223-166 218","Fax: 05223-166 262"]
[113,32429,"Klamor Baumaschinen B.Oeynh.","Tel: 05731-20328","Fax: 05731-1862099"]
[114,33106,"HKL Center Paderborn","Tel. 052 51 / 77 50-3","Fax 052 51 / 77 50-40"]
[115,33334,"HKL Gütersloh","Tel. 05241 / 4009860","Fax 05241 / 4009869"]
[116,33719,"HKL Center Bielefeld","Tel. 05 21 / 20 98 33","Fax 05 21 / 270 47 46"]
[117,34266,"HKL Center Kassel","Tel. 05 61 / 952 38-0","Fax 05 61 / 952 38-11"]
[118,35394,"Wieseker Gießen","Tel: 0641-401020","Fax: 0641-4010217"]
[119,35396,"Theisen Gießen","Tel. 0641 / 7970859","Fax 0641 / 7970895"]
[120,36043,"Theisen Fulda","Tel. 0661 / 4800840","Fax 0661 / 4800841"]
{"$rows_left_out":244}
{"sheet":"Stahl","index":1,"n_rows":368,"n_cols":9,"rows_kept":368,"cut":false,"hidden":true,"merged":[[0,4,1,4],[0,5,1,5],[0,6,1,6],[0,7,1,7],[0,8,1,8]]}
[null,"Erweitererte Lieferantenliste",null,null,"Lifeertreue","Termineinhaltung","Qualität","Probleme","Zuverlässigkeit"]
[2,"Baustahl","Tel.","Fax."]
[3,"Möllers Stahlhandel Stadtlohn","Tel: 02563-914 0","Fax: 02563-914 14"]
[4,"Bieber-Stahl Gießen","Tel: 0641-7944224","Fax: 0641-7944291","x"]
[5,"Brandenburger Stahlhandel","Tel: 03381-62800","Fax: 03381-628023","x"]
[6,"Grefkes Viersen","Tel: 02162-37960","Fax: 02162-379640"]
[7,"Hack Nidderau ","Tel: 06187-909151","Fax: 06187-909190","x",null,null,null,"x"]
[8,"Hattebur Olfen","Tel: 02595-3869910","Fax: 02595-3869940","x"]
[9,"Hattebur Senden","Tel: 02597-696440","Fax: 02597-7029","x",null,null,null,"x"]
[10,"Huse&Philipp Braunschweig","Tel: 0531-5809-163","Fax: 0531-5809199","x"]
[11,"Raab-Karcher Falkensee","Tel: 03322-504198","Fax: 03322-504199","x"]
[12,"Raab-Karcher Koblenz","Tel: 0261-8080620","Fax: 0261-8080655"]
[13,"Rottländer Engelskirchen","Tel: 02263-8717","Fax: 02263-8758","x"]
[14,"Schmidt Sinsheim","Tel: 07261-92350","Fax: 07261-923525","x"]
[15,"Thielen Trier","Tel: 06592-92150","Fax: 06592-921516","x"]
[16,"Wiggers KG Neumünster","Tel: 04321-975148","Fax: 04321-975144","x"]
[17,"Stahlhandel Mechernich, Herr Wiesemann","Tel: 02256-94220","Fax: 02256-9422 30"]
[18,"Lammering Nordhorn","Tel: 05921-89990","Fax: 05921-899925","x",null,null,null,"x"]
[19]
[20]
[21,"Baustoffe"]
[22,"Achimer Baustoffmarkt","Tel: 04202-9778 8","Fax:04202-9778 99"]
[23,"Allweier Baustoffe Pfullendorf","Tel: 07552-93010","Fax: 07552-930174"]
[24,"Altenburg-Baustoffe Stadthagen","Tel: 05721704322","Fax: 05721-704310","x"]
[25,"Anre+Oestreicher Babenhausen","Tel: 06073-60040","Fax: 06073-4090","x"]
[26,"Asheuer Baubedarf Wickede","Tel: 02377-3999","Fax: 02377-6666"]
[27,"Baltes Wegberg","Tel: 02434-987616","Fax: 02434-987625","x"]
[28,"Bauen u. Leben Bedburg-Hau","Tel: 02821-7611 0","Fax: 02821-7611 20"]
[29,"Bauen u. Leben Hagen","Tel: 02331-37738 10","Fax: 02331-37738 29"]
[30,"Bäuerle Baustoffe Ottersweier","Tel: 07223-23004","Fax: 07223-23006"]
[31,"Bauking Betzdorf Herr Becker","Tel: 02741-923730","Fax: 02741-923780"]
[32,"Bauking Meinerzhagen","Tel: 02354-9193 0","Fax: 02354-9193 69","x","x",null,null,"x"]
[33,"Bauking Melle","Tel: 05422-94980","Fax: 05422-2938"]
[34,"Bauking Mosnabrück-Atter Herr Stolte","Tel: 0541-9571568","Fax: 0541-9571579","x","x",null,null,"x"]
[35,"Bauking Nordhorn","Tel: 05921-80400","Fax: 05921-804027","x"]
[36,"BauKing Osnabrück","Tel: 0541-91183 0","Fax: 0541-9118360"]
[37,"Baustoffe Breidenbach","Tel: 06465-92790","Fax: 06465-927920"]
[38,"BayWa AG Bad Neustadt","Tel: 09771-91810","Fax: 09771-91898"]
[39,"BayWa AG Bamberg-Hafen","Tel: 0951-7901232","Fax: 0951-7901239"]
[40,"BayWa AG Biberach","Tel: 07351-50480","Fax: 07351-504822"]
[41,"BayWa AG Bindlach","Tel: 09208-690882","Fax: 09208-690888"]
[42,"BayWa AG Burgebach Herr Wehr","Tel: 09546-593732","Fax: 09546-593749"]
[43,"BayWa AG Elsenfeld","Tel: 06022-61840","Fax: 06022-618423"]
[44,"BayWa AG Geretsried","Tel: 08171-9803 0","Fax: 08171-9803 55"]
[45,"BayWa AG Großmehring","Tel: 08456-917248","Fax: 08456-917276"]
[46,"BayWa AG Haßfurt","Tel: 09521-69332","Fax: 09521-69334"]
[47,"BayWa AG Kempten","Tel: 0831-5720370","Fax: 0831-5720202"]
[48,"BayWa AG Laufen","Tel: 08682-91010","Fax: 08682-91022"]
[49,"BayWa AG Memmingen","Tel: 08331-1393","Fax: 08331-1353"]
[50,"BayWa AG Mindelheim","Tel: 08261-9916 10","Fax: 08261-9916 30"]
[51,"BayWa AG Möttingen","Tel: 09083-808 31","Fax: 09083-808 29"]
[52,"BayWa AG Münchberg","Tel: 09251-9933 32","Fax: 09251-9933 33"]
[53,"BayWa AG Neuburg","Tel: 08431-591 10","Fax: 08431-591 19"]
[54,"BayWa AG Petershausen","Tel: 08137-5133","Fax: 08137-5137"]
[55,"BayWa AG Ravensburg-Mariental","Tel: 0751-36324 0","Fax: 0751-17281"]
[56,"BayWa AG Schrobenhausen","Tel: 08252-8955 21","Fax: 08252-8955 19"]
[57,"BayWa AG Schwabach","Tel: 09122-8322 10","Fax: 09122-8322 81"]
[58,"BayWa AG Schwabenmünchen Hr.Wenzel","Tel: 08232-500431","Fax: 08232-500444"]
[59,"BayWa Baustoffe Elsenfeld","Tel: 06022-618410","Fax: 06022-618419"]
[60,"BayWa Baustoffe Rothenburg o.d.T","Tel: 09861-703 33","Fax: 09861-86804"]
[61,"BayWa Küppers Dortmund","Tel: 0231-55747721","Fax: 0231-55747731"]
[62,"BayWa Küppers Iserlohn","Tel: 02374-501840","Fax: 02374-50184199"]
[63,"BayWa Küppers Münster","Tel: 0251-143330","Fax: 0251-1433333"]
[64,"BBK-Baustoffe Wasserliesch ","Tel: 06501-9440232","Fax: 06501-9440176"]
[65,"Beinbrech Baustoffe Bad Kreuznach","Tel: 0671-795 0","Fax: 0671-795 900"]
[66,"Beinbrech Baustoffe Bad Sobernheim","Tel: 06751-9310 0","Fax: 06751-9310 10"]
[67,"Benz-Baustoffe Eberbach","Tel: 06271-94790 0","Fax: 06271-94790 10"]
[68,"Benz-Baustoffe Hermsbach","Tel: 06201-4971 0","Fax: 06201-4971 10"]
[69,"Benz-Baustoffe Neckarbischofsheim","Tel: 07263-6490","Fax: 07263-649209"]
[70,"Benz-Baustoffe Neckarsulm","Tel: 07132-341110","m.lautermilch@benz-baustoffe.de"]
[71,"Bergele Mühlacker","Tel: 07041-871111","Fax: 07041-871129","x","x",null,null,"x"]
[72,"Bergele Vaihingen Enz","Tel: 07042-97330","Fax: 07042-973333"]
[73,"Bermes Baustoffe Bitburg","Tel: 06561-9534 0","Fax: 06561-9534 38"]
[74,"Bierkamp-Baustoffe Moringen","Tel: 05554-9938 0","Fax: 05554-9938 20"]
[75,"Blatter Baustoffe Erligheim Herr Schaupp","Tel: 07143-88700","Fax: 07143-887031"]
[76,"Bücker Baustoffhandel","Tel: 02594-896330","Fax: 02594-8963333"]
[77,"Buckmann-Baustoffe","Tel: 0421-64395 39","Fax: 0421-64395-67"]
[78,"Bücheler&Martin Baustoffe Singen","Tel: 07731-8744 0","Fax: 07731-8744 44"]
[79,"Büscher Overath(Herr Wolber)","Tel: 02206-95760","Fax: 02206-81989"]
[80,"Cirkel-Baustoffe Dorsten","Tel: 02362-50560","Fax: 02362-605656"]
[81,"Crone Baustoffe Ennepetal","Tel: 02333-2974","Fax: 02333-4119","x"]
[82,"Cronrath Waldbröhl Hagebau","Tel: 02291-792125","Fax: 02291-6200"]
[83,"Dehnhard Baustoffe Zülpich","Tel: 02252-9090 0","Fax: 02252-9090 20"]
[84,"Dülken-Baustoffe Viersen","Tel: 02162-52070","Fax: 02162-58401"]
[85,"ED-Baustoffe, Andernach, Herr Schmitz","Tel: 02632-9877715","Fax: 02632-9877720"]
[86,"Engel Baustoffe Neuhausen","Tel. 07234-981763","Fax 07234-949754"]
[87,"Faßbender Tenten Rheinbach","Tel: 02226-8008 0","Fax: 02226-8008 41"]
[88,"Faßbender-Tenten Köln","Tel: 0221-340908 0","Fax: 0221-340908 10"]
[89,"Fliesen/Baustoffmarkt Göttingen","Tel: 0551-99871 0","Fax: 0551-99871 10"]
[90,"Friedrich Baustoffe Elz","Tel: 06431-9564 0","Fax: 06431-956461"]
[91,"Gaissmeier","Tel: 07542-53050","Fax: 07542-530580","x","x","x"]
[92,"Gaul Baustoffe Herr Piberski","Tel: 06701-9344 105","Fax: 06701-9344 109"]
[93,"Gebhardt Baustoffe  Erlangen","Tel: 09131-754544","Fax: 09131-754533"]
[94,"Gebhardt Baustoffe Hof","Tel: 09281-3273","Fax: 09281-84296"]
[95,"Gerhardt Hagebau Butzbach (Herr Jost)","Tel: 06033-9870 16","Fax: 06033-9870 20"]
[96,"Gerhardt Hagebau Dreieich","Tel: 06103-8900 0","Fax: 06103-890036"]
[97,"Gillet-Baustoffe Landau","Tel: 06341-972170","Fax: 06341-972190"]
[98,"Graf GmbH Baustoffe Nagold","Tel: 07452-600064","Fax: 07452-600088"]
[99,"Grah Baustoffe Solingen","Tel: 0212-288 0","Fax: 0212-288 27","x",null,"x"]
[100,"Grüppen Herr Kaalmink","Tel: 05943-930011","Fax: 05943-930050"]
[101,"Haass&Hatje Ratzeburg","Tel: 04541-8639 0","Fax: 04541-8639 80","x",null,null,null,"x"]
[102,"Hack Nidderau ","Tel: 06187-909151","Fax: 06187-909190"]
[103,"Hagebau Elskamp Bretten","Tel: 07252-59 0","Fax: 07252-5987"]
[104,"Hagebau Erkelenz, Herr Halkur","Tel: 02431-96290","Fax: 02431-4284"]
[105,"Hagebau Götz&Moritz","Tel: 07761-920510","Fax: 07761-920514"]
[106,"Happe-Baust. Bad Lippspringe","Tel: 05252-4063","Fax: 05252-4064","x"]
[107,"Hattebur Olfen","Tel: 02595-3869910","Fax: 02595-3869940","x",null,null,null,"x"]
[108,"Hattebur Senden","Tel: 02597-696440","Fax: 02597-7029"]
[109,"Held Baustoffe","Tel: 04944-911518","Fax: 04944-911555"]
[110,"Henrich Baustoffe Siegburg","Tel: 02241-121402","Fax: 02241-121400"]
[111,"Henrich Baustoffe Siegburg / Zimmermann","Tel: 02241-121 475","Fax: 02241-121460"]
[112,"Heideroder Mietpark Heiderod","Tel: 06124-508610","Fax: 06124-508612"]
[113,"Hilchenbach Baustoffe Soest","Tel: 02921-969560","Fax: 02921-4751"]
[114,"Hironimi Baustoffe Daun","Tel: 06592-96060","Fax: 06592-960650"]
[115,"Hironimi Baustoffe Faid","Tel: 02671-606 0","Fax: 02671-606 26"]
[116,"Hironimi Baustoffe Mülheim","Tel: 06534-1880","Fax: 06534-18817"]
[117,"Holcim Dortmund-Schüren","Tel: 0231-18881408","Fax: 0231-18881444"]
[118,"Hoch GmbH Simmern","Tel: 06761-8560","Fax: 06761-85630"]
[119,"Kemper Bauzentrum Ahaus","Tel: 02567-500","Fax: 02567-3456"]
[120,"Kemper Bauzentrum Verden","Tel: 02564-934358","Fax: 02564-934320"]
{"$rows_left_out":249}
{"sheet":"Bagger","index":2,"n_rows":46,"n_cols":15,"rows_kept":46,"cut":false,"hidden":false,"merged":[[26,9,26,10],[28,0,28,1],[8,5,8,6],[10,5,10,6],[9,5,9,6],[10,0,15,2],[11,5,11,6],[12,5,12,6],[13,5,13,6],[15,5,15,6],[16,5,16,6]]}
["Baumaschinen"]
[140]
["xxxxxxx"]
[]
[null,null,null,null,"48529 Nordhorn, Charlottenstraße 34"]
[]
[]
[]
[null,null,null,null,null,"Jürgen Wever"]
[null,null,null,null,null,"Tel.: 05921-72794 43"]
[null,null,null,null,null,"Fax.: 05921-72794 50"]
[null,null,null,null,null,"Mob.:01516-5555 098"]
[null,null,null,null,null,"juergen.wever@wolts-bau.de"]
[null,null,null,null,null,{"$f":"TODAY()","v":"2025-02-05"}]
[null,null,null,null,null,"Baustellenpolier:"]
[]
[null,null,null,null,null,{"$f":"VLOOKUP(F16,#REF!,2,FALSE)","v":{"$error":"#REF!"}}]
["Bei Rechnungsversand per Mail, bitte an: rechnungen.wolts@wolts-bau.de (nur Rechnungen, keine AB`s)"]
["Wie bitten um Anmietung mit Anlieferung und Abholung von der Baustelle  "]
["folgender Geräte: "]
[]
[924125,"← Bauvorhabennummer, Baustelle und Ort zwingend bei der Rechnungsstellung angeben !!"]
["Baustelle:",{"$f":"VLOOKUP(A22,[1]Tabelle1!A3:W4000,2,FALSE)","v":"Mitulla"},null,{"$f":"VLOOKUP(A22,[1]Tabelle1!A3:W4000,11,FALSE)","v":51570},{"$f":"VLOOKUP(A22,[1]Tabelle1!A3:W4000,12,FALSE)","v":"Windeck"}]
[null,"Straße:",{"$f":"VLOOKUP(A22,[1]Tabelle1!A3:W4000,13,FALSE)","v":"Alte Schulstraße"},null,null,"Nummer: ",{"$f":"VLOOKUP(A22,[1]Tabelle1!A3:W4000,14,FALSE)","v":0}]
["Unsere Baustellen sind Freitags grundsätzlich nicht besetzt und die Maschinen "]
["werden nicht genutzt. Falls ein Freitag in der Bestellzeit enthalten ist, bitten wir "]
["um Freistellung für den Tag.",null,null,null,null,null,null,null,null,"Lieferung am:",null,"2023-04-18",null,null,"7.00 Uhr "]
[null,null,null,null,null,null,null,null,null,"X","Kompaktbagger 8,0 Tonner (Gummikette)"]
["Lieferung am:",null,"2023-04-18",null,null,"7.00 Uhr ",null,null,null,"X","30er + 50er Tieflöffel mit Zähne"]
[null,null,null,null,null,null,null,null,null,"X","Hydr. Grabenräumschaufel, Groß!! "]
["X","Kompaktbagger 8,0 Tonner (Gummikette)",null,null,null,null,null,null,null,"X","Rüttelplatte 500-700 kg"]
["X","30er + 40er Tieflöffel mit Zähne",null,null,null,null,null,null,null,"X","Stampfer"]
["X","Hydr. Grabenräumschaufel, Groß!! ",null,null,null,null,null,null,null,"Tausch am:",null,"2020-01-28",null,null,"ab 16.00 Uhr"]
["X","Rüttelplatte 200 kg",null,null,null,null,null,null,null,"X","Minibagger 3,5 Tonner mit Kabine (Gummikette)"]
["X","Stampfer",null,null,null,null,null,null,null,"X","30er + 50er Tieflöffel mit Zähne"]
[null,null,null,null,null,null,null,null,null,"X","Hydr. Grabenräumschaufel"]
["Vorraussichtliche",null,"2020-01-28",null,null,"ab 16.00 Uhr",null,null,null,"X","Rüttelplatte 200 kg"]
["Abholung am:",null,"(Abholung vorher mit dem Polier absprechen)",null,null,null,null,null,null,"X","Stampfer"]
[]
[null,null,null,null,null,null,null,null,null,"Vorraussichtliche",null,"2020-01-28",null,null,"ab 16.00 Uhr"]
[null,"falls ein Löffel nicht vorhanden, unbedingt Rückinfo!!",null,null,null,null,null,null,null,"Abholung am:",null,"(Abholung vorher mit dem Polier absprechen)"]
[]
["Ich bitten um Bestätigung ",null,null,null,null,null,null,null,null,null,"falls ein Löffel nicht vorhanden, unbedingt Rückinfo!!"]
["Mit freundlichen Grüßen",null,null,null,null,null,null,null,null,"Ich bitten um Bestätigung "]
["Jürgen Wever",null,null,null,null,null,null,null,null,"Mit freundlichen Grüßen"]
[null,null,null,null,null,null,null,null,null,"Jürgen Wever"]

{"sheet":"Kran-Berlin","index":3,"n_rows":44,"n_cols":7,"rows_kept":44,"cut":false,"hidden":true,"merged":[[29,1,29,3],[24,1,24,6],[11,5,11,6],[12,5,12,6],[13,0,20,3],[13,5,13,6],[14,5,14,6],[15,5,15,6],[18,5,18,6],[19,5,19,6]]}
[]
["An die Firma"]
["BTB Logistik GmBH"]
[]
[]
["Berlin"]
[]
["Tel.:","030-7109900"]
["Fax.:","030-710990220"]
[]
[]
[null,null,null,null,null,"J. Wever"]
[]
[]
[]
[null,null,null,null,null,{"$f":"TODAY()","v":"2025-02-05"}]
[]
[null,null,null,null,null,"Baustellenpolier:"]
[null,null,null,null,null,"Foppe"]
[null,null,null,null,null,{"$f":"VLOOKUP(F19,#REF!,2,FALSE)","v":{"$error":"#REF!"}}]
[]
[]
[]
["Anmietung eines Autokranes für die Baustelle:"]
[null,"Volkland,Ilseler Steig 1, 12524 Berlin-Altglienicke"]
[]
["Sehr geehrete Damen und Herren,"]
["hiermit möchten wir über Sie einen Autokran anmieten."]
[]
["Wann:","2009-11-24",null,null,"um 08.00 Uhr",null,"(zugbereit)"]
[]
["Wo:","s.o."]
[]
["Art:","Wandelemente stellen und Deckenplatten abladen"]
[]
["Zeit:","4-4,5  Std"]
[]
["Krangröße:","80t"]
[]
["Wir bitten um Fax-Bestätigung unter 05921-174359"]
[]
["Mit freundlichen Grüßen"]
[]
["Jürgen Wever"]