{"text_format":"1","workbook":"xlsx","n_sheets":4,"sheets":["üNr","Tipps","Urlaubsauswertung","Lotsen"],"not_rendered":{"charts":0,"images":0,"macros":1,"external_links":0,"defined_names":1,"comments":0,"pivot_tables":0},"unopened":[],"bounds":{"document_bytes":16777216,"sheet_cells":100000,"rows_first":2000,"rows_last":500,"rows_between":2000,"halvings":0,"cell_chars":16384,"cell_head_chars":4096},"cells_cut":0,"cells_raw":0,"read":"whole","date_system":"1900"}

{"sheet":"üNr","index":0,"n_rows":1000,"n_cols":33,"rows_kept":1000,"cut":false,"hidden":false,"merged":[[0,1,0,8],[2,1,3,1],[2,2,3,2],[2,5,3,5],[2,6,3,6],[2,7,2,8],[2,3,2,4]]}
[null,"Liste für Abteilungen mit übersprungenen Nummern"]
[null,null,null,null,null,{"$f":"SUM(F5:F1000)","v":404},null,null,{"$f":"TODAY()","v":"2025-02-14"}]
[null,null,"Name","Abteilung",null,"Anzahl üNr.",null,"Zusammenfassung",null,null,"Abrechnung","Rest Nr."]
[null,null,null,"Datum","LN",null,null,"Namen","Nr. Gesamt","Urlaubstag","Monatsende","Mitnahme","U-Tag","Datum","U-Tag","Datum","U-Tag","Datum","U-Tag","Datum","U-Tag","Datum","U-Tag","Datum","U-Tag","Datum","U-Tag","Datum","U-Tag","Datum","U-Tag","Datum","Namen"]
[null,{"$f":"IF(C5=\"\",\"\",1)","v":1},"Baum","2025-02-01",4,{"$f":"IF(D5=\"\",\"\",E5-1)","v":3},null,"A",{"$f":"SUMIF($C$5:$C$1000,H5,$F$5:$F$1000)+L5","v":0},{"$f":"IF(I5>=60,1,0)","v":0},{"$f":"IF(J5>0,I5-60,IF(J5=0,I5,0))","v":0},0,null,null,null,null,null,null,null,null,null,null,null,null,null,null,null,null,null,null,null,null,{"$f":"IF(Lotsen!A2=\"\",\"zzz\",Lotsen!A2)","v":"A"}]
[null,{"$f":"IF(C6=\"\",\"\",B5+1)","v":2},"Bert","2025-02-01",3,{"$f":"IF(D6=\"\",\"\",E6-1)","v":2},null,"B",{"$f":"SUMIF($C$5:$C$1000,H6,$F$5:$F$1000)+L6","v":0},{"$f":"IF(I6>=60,1,0)","v":0},{"$f":"IF(J6>0,I6-60,IF(J6=0,I6,0))","v":0},0,null,null,null,null,null,null,null,null,null,null,null,null,null,null,null,null,null,null,null,null,{"$f":"IF(Lotsen!A3=\"\",\"zzz\",Lotsen!A3)","v":"B"}]
[null,{"$f":"IF(C7=\"\",\"\",B6+1)","v":3},"Blech","2025-02-01",3,2,null,"Baum",{"$f":"SUMIF($C$5:$C$1000,H7,$F$5:$F$1000)+L7","v":4},{"$f":"IF(I7>=60,1,0)","v":0},{"$f":"IF(J7>0,I7-60,IF(J7=0,I7,0))","v":4},0,4,"2025-05-05",null,null,null,null,null,null,null,null,null,null,null,null,null,null,null,null,null,null,{"$f":"IF(Lotsen!A4=\"\",\"zzz\",Lotsen!A4)","v":"Baum"}]
[null,4,"Claus","2025-02-01",2,1,null,"Bert",{"$f":"SUMIF($C$5:$C$1000,H8,$F$5:$F$1000)+L8","v":3},{"$f":"IF(I8>=60,1,0)","v":0},{"$f":"IF(J8>0,I8-60,IF(J8=0,I8,0))","v":3},0,5,"2025-08-05",null,null,null,null,null,null,null,null,null,null,null,null,null,null,null,null,null,null,{"$f":"IF(Lotsen!A5=\"\",\"zzz\",Lotsen!A5)","v":"Bert"}]
[null,5,"Clausi","2025-02-01",2,1,null,"Blech",{"$f":"SUMIF($C$5:$C$1000,H9,$F$5:$F$1000)+L9","v":3},{"$f":"IF(I9>=60,1,0)","v":0},{"$f":"IF(J9>0,I9-60,IF(J9=0,I9,0))","v":3},0,6,"2025-07-01",null,null,null,null,null,null,null,null,null,null,null,null,null,null,null,null,null,null,{"$f":"IF(Lotsen!A6=\"\",\"zzz\",Lotsen!A6)","v":"Blech"}]
[null,6,"Baum","2025-02-01",2,1,null,"C",{"$f":"SUMIF($C$5:$C$1000,H10,$F$5:$F$1000)+L10","v":0},{"$f":"IF(I10>=60,1,0)","v":0},{"$f":"IF(J10>0,I10-60,IF(J10=0,I10,0))","v":0},0,null,null,null,null,null,null,null,null,null,null,null,null,null,null,null,null,null,null,null,null,{"$f":"IF(Lotsen!A7=\"\",\"zzz\",Lotsen!A7)","v":"C"}]
[null,7,"Bert","2025-02-01",2,1,null,"Claus",{"$f":"SUMIF($C$5:$C$1000,H11,$F$5:$F$1000)+L11","v":3},{"$f":"IF(I11>=60,1,0)","v":0},{"$f":"IF(J11>0,I11-60,IF(J11=0,I11,0))","v":3},0,null,null,null,null,null,null,null,null,null,null,null,null,null,null,null,null,null,null,null,null,{"$f":"IF(Lotsen!A8=\"\",\"zzz\",Lotsen!A8)","v":"Claus"}]
[null,8,"Blech","2025-02-01",2,1,null,"Clausi",{"$f":"SUMIF($C$5:$C$1000,H12,$F$5:$F$1000)+L12","v":3},{"$f":"IF(I12>=60,1,0)","v":0},{"$f":"IF(J12>0,I12-60,IF(J12=0,I12,0))","v":3},0,null,null,null,null,null,null,null,null,null,null,null,null,null,null,null,null,null,null,null,null,{"$f":"IF(Lotsen!A9=\"\",\"zzz\",Lotsen!A9)","v":"Clausi"}]
[null,9,"Claus","2025-02-01",3,2,null,"D",{"$f":"SUMIF($C$5:$C$1000,H13,$F$5:$F$1000)+L13","v":0},{"$f":"IF(I13>=60,1,0)","v":0},{"$f":"IF(J13>0,I13-60,IF(J13=0,I13,0))","v":0},0,null,null,null,null,null,null,null,null,null,null,null,null,null,null,null,null,null,null,null,null,{"$f":"IF(Lotsen!A10=\"\",\"zzz\",Lotsen!A10)","v":"D"}]
[null,10,"Clausi","2025-02-01",3,2,null,"Dietmar",{"$f":"SUMIF($C$5:$C$1000,H14,$F$5:$F$1000)+L14","v":0},{"$f":"IF(I14>=60,1,0)","v":0},{"$f":"IF(J14>0,I14-60,IF(J14=0,I14,0))","v":0},0,null,null,null,null,null,null,null,null,null,null,null,null,null,null,null,null,null,null,null,null,{"$f":"IF(Lotsen!A11=\"\",\"zzz\",Lotsen!A11)","v":"Dietmar"}]
[null,"",null,"2025-02-01",2,1,null,"Dietter",{"$f":"SUMIF($C$5:$C$1000,H15,$F$5:$F$1000)+L15","v":0},{"$f":"IF(I15>=60,1,0)","v":0},{"$f":"IF(J15>0,I15-60,IF(J15=0,I15,0))","v":0},0,null,null,null,null,null,null,null,null,null,null,null,null,null,null,null,null,null,null,null,null,{"$f":"IF(Lotsen!A12=\"\",\"zzz\",Lotsen!A12)","v":"Dietter"}]
[null,"",null,"2025-02-01",4,3,null,"Dirk",{"$f":"SUMIF($C$5:$C$1000,H16,$F$5:$F$1000)+L16","v":0},{"$f":"IF(I16>=60,1,0)","v":0},{"$f":"IF(J16>0,I16-60,IF(J16=0,I16,0))","v":0},0,null,null,null,null,null,null,null,null,null,null,null,null,null,null,null,null,null,null,null,null,{"$f":"IF(Lotsen!A13=\"\",\"zzz\",Lotsen!A13)","v":"Dirk"}]
[null,"",null,"2025-02-01",4,3,null,"E",{"$f":"SUMIF($C$5:$C$1000,H17,$F$5:$F$1000)+L17","v":0},{"$f":"IF(I17>=60,1,0)","v":0},{"$f":"IF(J17>0,I17-60,IF(J17=0,I17,0))","v":0},0,null,null,null,null,null,null,null,null,null,null,null,null,null,null,null,null,null,null,null,null,{"$f":"IF(Lotsen!A14=\"\",\"zzz\",Lotsen!A14)","v":"E"}]
[null,"",null,"2025-02-01",3,2,null,"Elfi",{"$f":"SUMIF($C$5:$C$1000,H18,$F$5:$F$1000)+L18","v":0},{"$f":"IF(I18>=60,1,0)","v":0},{"$f":"IF(J18>0,I18-60,IF(J18=0,I18,0))","v":0},0,null,null,null,null,null,null,null,null,null,null,null,null,null,null,null,null,null,null,null,null,{"$f":"IF(Lotsen!A15=\"\",\"zzz\",Lotsen!A15)","v":"Elfi"}]
[null,"",null,"2025-02-01",3,2,null,"Erwin",{"$f":"SUMIF($C$5:$C$1000,H19,$F$5:$F$1000)+L19","v":0},{"$f":"IF(I19>=60,1,0)","v":0},{"$f":"IF(J19>0,I19-60,IF(J19=0,I19,0))","v":0},0,null,null,null,null,null,null,null,null,null,null,null,null,null,null,null,null,null,null,null,null,{"$f":"IF(Lotsen!A16=\"\",\"zzz\",Lotsen!A16)","v":"Erwin"}]
[null,"",null,"2025-02-01",2,1,null,"F",{"$f":"SUMIF($C$5:$C$1000,H20,$F$5:$F$1000)+L20","v":0},{"$f":"IF(I20>=60,1,0)","v":0},{"$f":"IF(J20>0,I20-60,IF(J20=0,I20,0))","v":0},0,null,null,null,null,null,null,null,null,null,null,null,null,null,null,null,null,null,null,null,null,{"$f":"IF(Lotsen!A17=\"\",\"zzz\",Lotsen!A17)","v":"F"}]
[null,"",null,"2025-02-01",2,1,null,"Frank",{"$f":"SUMIF($C$5:$C$1000,H21,$F$5:$F$1000)+L21","v":0},{"$f":"IF(I21>=60,1,0)","v":0},{"$f":"IF(J21>0,I21-60,IF(J21=0,I21,0))","v":0},0,null,null,null,null,null,null,null,null,null,null,null,null,null,null,null,null,null,null,null,null,{"$f":"IF(Lotsen!A18=\"\",\"zzz\",Lotsen!A18)","v":"Frank"}]
[null,"",null,"2025-02-01",2,1,null,"Fritz",{"$f":"SUMIF($C$5:$C$1000,H22,$F$5:$F$1000)+L22","v":0},{"$f":"IF(I22>=60,1,0)","v":0},{"$f":"IF(J22>0,I22-60,IF(J22=0,I22,0))","v":0},0,null,null,null,null,null,null,null,null,null,null,null,null,null,null,null,null,null,null,null,null,{"$f":"IF(Lotsen!A19=\"\",\"zzz\",Lotsen!A19)","v":"Fritz"}]
[null,"",null,"2025-02-02",2,1,null,"zzz",{"$f":"SUMIF($C$5:$C$1000,H23,$F$5:$F$1000)+L23","v":0},{"$f":"IF(I23>=60,1,0)","v":0},{"$f":"IF(J23>0,I23-60,IF(J23=0,I23,0))","v":0},0,null,null,null,null,null,null,null,null,null,null,null,null,null,null,null,null,null,null,null,null,{"$f":"IF(Lotsen!A20=\"\",\"zzz\",Lotsen!A20)","v":"zzz"}]
[null,"",null,"2025-02-02",2,1,null,"zzz",{"$f":"SUMIF($C$5:$C$1000,H24,$F$5:$F$1000)+L24","v":0},{"$f":"IF(I24>=60,1,0)","v":0},{"$f":"IF(J24>0,I24-60,IF(J24=0,I24,0))","v":0},0,null,null,null,null,null,null,null,null,null,null,null,null,null,null,null,null,null,null,null,null,{"$f":"IF(Lotsen!A21=\"\",\"zzz\",Lotsen!A21)","v":"zzz"}]
[null,"",null,"2025-02-02",3,2,null,"zzz",{"$f":"SUMIF($C$5:$C$1000,H25,$F$5:$F$1000)+L25","v":0},{"$f":"IF(I25>=60,1,0)","v":0},{"$f":"IF(J25>0,I25-60,IF(J25=0,I25,0))","v":0},0,null,null,null,null,null,null,null,null,null,null,null,null,null,null,null,null,null,null,null,null,{"$f":"IF(Lotsen!A22=\"\",\"zzz\",Lotsen!A22)","v":"zzz"}]
[null,"",null,"2025-02-02",5,4,null,"zzz",{"$f":"SUMIF($C$5:$C$1000,H26,$F$5:$F$1000)+L26","v":0},{"$f":"IF(I26>=60,1,0)","v":0},{"$f":"IF(J26>0,I26-60,IF(J26=0,I26,0))","v":0},0,null,null,null,null,null,null,null,null,null,null,null,null,null,null,null,null,null,null,null,null,{"$f":"IF(Lotsen!A23=\"\",\"zzz\",Lotsen!A23)","v":"zzz"}]
[null,"",null,"2025-02-02",5,4,null,"zzz",{"$f":"SUMIF($C$5:$C$1000,H27,$F$5:$F$1000)+L27","v":0},{"$f":"IF(I27>=60,1,0)","v":0},{"$f":"IF(J27>0,I27-60,IF(J27=0,I27,0))","v":0},0,null,null,null,null,null,null,null,null,null,null,null,null,null,null,null,null,null,null,null,null,{"$f":"IF(Lotsen!A24=\"\",\"zzz\",Lotsen!A24)","v":"zzz"}]
[null,"",null,"2025-02-02",2,1,null,"zzz",{"$f":"SUMIF($C$5:$C$1000,H28,$F$5:$F$1000)+L28","v":0},{"$f":"IF(I28>=60,1,0)","v":0},{"$f":"IF(J28>0,I28-60,IF(J28=0,I28,0))","v":0},0,null,null,null,null,null,null,null,null,null,null,null,null,null,null,null,null,null,null,null,null,{"$f":"IF(Lotsen!A25=\"\",\"zzz\",Lotsen!A25)","v":"zzz"}]
[null,"",null,"2025-02-02",5,4,null,"zzz",{"$f":"SUMIF($C$5:$C$1000,H29,$F$5:$F$1000)+L29","v":0},{"$f":"IF(I29>=60,1,0)","v":0},{"$f":"IF(J29>0,I29-60,IF(J29=0,I29,0))","v":0},0,null,null,null,null,null,null,null,null,null,null,null,null,null,null,null,null,null,null,null,null,{"$f":"IF(Lotsen!A26=\"\",\"zzz\",Lotsen!A26)","v":"zzz"}]
[null,"",null,"2025-02-02",3,2,null,"zzz",{"$f":"SUMIF($C$5:$C$1000,H30,$F$5:$F$1000)+L30","v":0},{"$f":"IF(I30>=60,1,0)","v":0},{"$f":"IF(J30>0,I30-60,IF(J30=0,I30,0))","v":0},0,null,null,null,null,null,null,null,null,null,null,null,null,null,null,null,null,null,null,null,null,{"$f":"IF(Lotsen!A27=\"\",\"zzz\",Lotsen!A27)","v":"zzz"}]
[null,"",null,"2025-02-02",2,1,null,"zzz",{"$f":"SUMIF($C$5:$C$1000,H31,$F$5:$F$1000)+L31","v":0},{"$f":"IF(I31>=60,1,0)","v":0},{"$f":"IF(J31>0,I31-60,IF(J31=0,I31,0))","v":0},0,null,null,null,null,null,null,null,null,null,null,null,null,null,null,null,null,null,null,null,null,{"$f":"IF(Lotsen!A28=\"\",\"zzz\",Lotsen!A28)","v":"zzz"}]
[null,"",null,"2025-02-02",5,4,null,"zzz",{"$f":"SUMIF($C$5:$C$1000,H32,$F$5:$F$1000)+L32","v":0},{"$f":"IF(I32>=60,1,0)","v":0},{"$f":"IF(J32>0,I32-60,IF(J32=0,I32,0))","v":0},0,null,null,null,null,null,null,null,null,null,null,null,null,null,null,null,null,null,null,null,null,{"$f":"IF(Lotsen!A29=\"\",\"zzz\",Lotsen!A29)","v":"zzz"}]
[null,"",null,"2025-02-02",2,1,null,"zzz",{"$f":"SUMIF($C$5:$C$1000,H33,$F$5:$F$1000)+L33","v":0},{"$f":"IF(I33>=60,1,0)","v":0},{"$f":"IF(J33>0,I33-60,IF(J33=0,I33,0))","v":0},0,null,null,null,null,null,null,null,null,null,null,null,null,null,null,null,null,null,null,null,null,{"$f":"IF(Lotsen!A30=\"\",\"zzz\",Lotsen!A30)","v":"zzz"}]
[null,"",null,"2025-02-02",2,1,null,"zzz",{"$f":"SUMIF($C$5:$C$1000,H34,$F$5:$F$1000)+L34","v":0},{"$f":"IF(I34>=60,1,0)","v":0},{"$f":"IF(J34>0,I34-60,IF(J34=0,I34,0))","v":0},0,null,null,null,null,null,null,null,null,null,null,null,null,null,null,null,null,null,null,null,null,{"$f":"IF(Lotsen!A31=\"\",\"zzz\",Lotsen!A31)","v":"zzz"}]
[null,"",null,"2025-02-02",5,4,null,"zzz",{"$f":"SUMIF($C$5:$C$1000,H35,$F$5:$F$1000)+L35","v":0},{"$f":"IF(I35>=60,1,0)","v":0},{"$f":"IF(J35>0,I35-60,IF(J35=0,I35,0))","v":0},0,null,null,null,null,null,null,null,null,null,null,null,null,null,null,null,null,null,null,null,null,{"$f":"IF(Lotsen!A32=\"\",\"zzz\",Lotsen!A32)","v":"zzz"}]
[null,"",null,"2025-02-02",6,5,null,"zzz",{"$f":"SUMIF($C$5:$C$1000,H36,$F$5:$F$1000)+L36","v":0},{"$f":"IF(I36>=60,1,0)","v":0},{"$f":"IF(J36>0,I36-60,IF(J36=0,I36,0))","v":0},0,null,null,null,null,null,null,null,null,null,null,null,null,null,null,null,null,null,null,null,null,{"$f":"IF(Lotsen!A33=\"\",\"zzz\",Lotsen!A33)","v":"zzz"}]
[null,"",null,"2025-02-02",3,2,null,"zzz",{"$f":"SUMIF($C$5:$C$1000,H37,$F$5:$F$1000)+L37","v":0},{"$f":"IF(I37>=60,1,0)","v":0},{"$f":"IF(J37>0,I37-60,IF(J37=0,I37,0))","v":0},0,null,null,null,null,null,null,null,null,null,null,null,null,null,null,null,null,null,null,null,null,{"$f":"IF(Lotsen!A34=\"\",\"zzz\",Lotsen!A34)","v":"zzz"}]
[null,"",null,"2025-02-02",4,3,null,"zzz",{"$f":"SUMIF($C$5:$C$1000,H38,$F$5:$F$1000)+L38","v":0},{"$f":"IF(I38>=60,1,0)","v":0},{"$f":"IF(J38>0,I38-60,IF(J38=0,I38,0))","v":0},0,null,null,null,null,null,null,null,null,null,null,null,null,null,null,null,null,null,null,null,null,{"$f":"IF(Lotsen!A35=\"\",\"zzz\",Lotsen!A35)","v":"zzz"}]
[null,"",null,"2025-02-02",5,4,null,"zzz",{"$f":"SUMIF($C$5:$C$1000,H39,$F$5:$F$1000)+L39","v":0},{"$f":"IF(I39>=60,1,0)","v":0},{"$f":"IF(J39>0,I39-60,IF(J39=0,I39,0))","v":0},0,null,null,null,null,null,null,null,null,null,null,null,null,null,null,null,null,null,null,null,null,{"$f":"IF(Lotsen!A36=\"\",\"zzz\",Lotsen!A36)","v":"zzz"}]
[null,"",null,"2025-02-02",2,1,null,"zzz",{"$f":"SUMIF($C$5:$C$1000,H40,$F$5:$F$1000)+L40","v":0},{"$f":"IF(I40>=60,1,0)","v":0},{"$f":"IF(J40>0,I40-60,IF(J40=0,I40,0))","v":0},0,null,null,null,null,null,null,null,null,null,null,null,null,null,null,null,null,null,null,null,null,{"$f":"IF(Lotsen!A37=\"\",\"zzz\",Lotsen!A37)","v":"zzz"}]
[null,"",null,"2025-02-03",2,1,null,"zzz",{"$f":"SUMIF($C$5:$C$1000,H41,$F$5:$F$1000)+L41","v":0},{"$f":"IF(I41>=60,1,0)","v":0},{"$f":"IF(J41>0,I41-60,IF(J41=0,I41,0))","v":0},0,null,null,null,null,null,null,null,null,null,null,null,null,null,null,null,null,null,null,null,null,{"$f":"IF(Lotsen!A38=\"\",\"zzz\",Lotsen!A38)","v":"zzz"}]
[null,"",null,"2025-02-03",2,1,null,"zzz",{"$f":"SUMIF($C$5:$C$1000,H42,$F$5:$F$1000)+L42","v":0},{"$f":"IF(I42>=60,1,0)","v":0},{"$f":"IF(J42>0,I42-60,IF(J42=0,I42,0))","v":0},0,null,null,null,null,null,null,null,null,null,null,null,null,null,null,null,null,null,null,null,null,{"$f":"IF(Lotsen!A39=\"\",\"zzz\",Lotsen!A39)","v":"zzz"}]
[null,"",null,"2025-02-03",2,1,null,"zzz",{"$f":"SUMIF($C$5:$C$1000,H43,$F$5:$F$1000)+L43","v":0},{"$f":"IF(I43>=60,1,0)","v":0},{"$f":"IF(J43>0,I43-60,IF(J43=0,I43,0))","v":0},0,null,null,null,null,null,null,null,null,null,null,null,null,null,null,null,null,null,null,null,null,{"$f":"IF(Lotsen!A40=\"\",\"zzz\",Lotsen!A40)","v":"zzz"}]
[null,"",null,"2025-02-03",2,1,null,"zzz",{"$f":"SUMIF($C$5:$C$1000,H44,$F$5:$F$1000)+L44","v":0},{"$f":"IF(I44>=60,1,0)","v":0},{"$f":"IF(J44>0,I44-60,IF(J44=0,I44,0))","v":0},0,null,null,null,null,null,null,null,null,null,null,null,null,null,null,null,null,null,null,null,null,{"$f":"IF(Lotsen!A41=\"\",\"zzz\",Lotsen!A41)","v":"zzz"}]
[null,"",null,"2025-02-03",2,1,null,"zzz",{"$f":"SUMIF($C$5:$C$1000,H45,$F$5:$F$1000)+L45","v":0},{"$f":"IF(I45>=60,1,0)","v":0},{"$f":"IF(J45>0,I45-60,IF(J45=0,I45,0))","v":0},0,null,null,null,null,null,null,null,null,null,null,null,null,null,null,null,null,null,null,null,null,{"$f":"IF(Lotsen!A42=\"\",\"zzz\",Lotsen!A42)","v":"zzz"}]
[null,"",null,"2025-02-03",4,3,null,"zzz",{"$f":"SUMIF($C$5:$C$1000,H46,$F$5:$F$1000)+L46","v":0},{"$f":"IF(I46>=60,1,0)","v":0},{"$f":"IF(J46>0,I46-60,IF(J46=0,I46,0))","v":0},0,null,null,null,null,null,null,null,null,null,null,null,null,null,null,null,null,null,null,null,null,{"$f":"IF(Lotsen!A43=\"\",\"zzz\",Lotsen!A43)","v":"zzz"}]
[null,"",null,"2025-03-03",8,7,null,"zzz",{"$f":"SUMIF($C$5:$C$1000,H47,$F$5:$F$1000)+L47","v":0},{"$f":"IF(I47>=60,1,0)","v":0},{"$f":"IF(J47>0,I47-60,IF(J47=0,I47,0))","v":0},0,null,null,null,null,null,null,null,null,null,null,null,null,null,null,null,null,null,null,null,null,{"$f":"IF(Lotsen!A44=\"\",\"zzz\",Lotsen!A44)","v":"zzz"}]
[null,"",null,"2025-02-03",8,7,null,"zzz",{"$f":"SUMIF($C$5:$C$1000,H48,$F$5:$F$1000)+L48","v":0},{"$f":"IF(I48>=60,1,0)","v":0},{"$f":"IF(J48>0,I48-60,IF(J48=0,I48,0))","v":0},0,null,null,null,null,null,null,null,null,null,null,null,null,null,null,null,null,null,null,null,null,{"$f":"IF(Lotsen!A45=\"\",\"zzz\",Lotsen!A45)","v":"zzz"}]
[null,"",null,"2025-02-03",8,7,null,"zzz",{"$f":"SUMIF($C$5:$C$1000,H49,$F$5:$F$1000)+L49","v":0},{"$f":"IF(I49>=60,1,0)","v":0},{"$f":"IF(J49>0,I49-60,IF(J49=0,I49,0))","v":0},0,null,null,null,null,null,null,null,null,null,null,null,null,null,null,null,null,null,null,null,null,{"$f":"IF(Lotsen!A46=\"\",\"zzz\",Lotsen!A46)","v":"zzz"}]
[null,"",null,"2025-02-03",2,1,null,"zzz",{"$f":"SUMIF($C$5:$C$1000,H50,$F$5:$F$1000)+L50","v":0},{"$f":"IF(I50>=60,1,0)","v":0},{"$f":"IF(J50>0,I50-60,IF(J50=0,I50,0))","v":0},0,null,null,null,null,null,null,null,null,null,null,null,null,null,null,null,null,null,null,null,null,{"$f":"IF(Lotsen!A47=\"\",\"zzz\",Lotsen!A47)","v":"zzz"}]
[null,"",null,"2025-02-03",4,3,null,"zzz",{"$f":"SUMIF($C$5:$C$1000,H51,$F$5:$F$1000)+L51","v":0},{"$f":"IF(I51>=60,1,0)","v":0},{"$f":"IF(J51>0,I51-60,IF(J51=0,I51,0))","v":0},0,null,null,null,null,null,null,null,null,null,null,null,null,null,null,null,null,null,null,null,null,{"$f":"IF(Lotsen!A48=\"\",\"zzz\",Lotsen!A48)","v":"zzz"}]
[null,"",null,"2025-02-03",4,3,null,"zzz",{"$f":"SUMIF($C$5:$C$1000,H52,$F$5:$F$1000)+L52","v":0},{"$f":"IF(I52>=60,1,0)","v":0},{"$f":"IF(J52>0,I52-60,IF(J52=0,I52,0))","v":0},0,null,null,null,null,null,null,null,null,null,null,null,null,null,null,null,null,null,null,null,null,{"$f":"IF(Lotsen!A49=\"\",\"zzz\",Lotsen!A49)","v":"zzz"}]
[null,"",null,"2025-02-03",5,4,null,"zzz",{"$f":"SUMIF($C$5:$C$1000,H53,$F$5:$F$1000)+L53","v":0},{"$f":"IF(I53>=60,1,0)","v":0},{"$f":"IF(J53>0,I53-60,IF(J53=0,I53,0))","v":0},0,null,null,null,null,null,null,null,null,null,null,null,null,null,null,null,null,null,null,null,null,{"$f":"IF(Lotsen!A50=\"\",\"zzz\",Lotsen!A50)","v":"zzz"}]
[null,"",null,"2025-02-03",7,6,null,"zzz",{"$f":"SUMIF($C$5:$C$1000,H54,$F$5:$F$1000)+L54","v":0},{"$f":"IF(I54>=60,1,0)","v":0},{"$f":"IF(J54>0,I54-60,IF(J54=0,I54,0))","v":0},0,null,null,null,null,null,null,null,null,null,null,null,null,null,null,null,null,null,null,null,null,{"$f":"IF(Lotsen!A51=\"\",\"zzz\",Lotsen!A51)","v":"zzz"}]
[null,"",null,"2025-02-03",6,5,null,"zzz",{"$f":"SUMIF($C$5:$C$1000,H55,$F$5:$F$1000)+L55","v":0},{"$f":"IF(I55>=60,1,0)","v":0},{"$f":"IF(J55>0,I55-60,IF(J55=0,I55,0))","v":0},0,null,null,null,null,null,null,null,null,null,null,null,null,null,null,null,null,null,null,null,null,{"$f":"IF(Lotsen!A52=\"\",\"zzz\",Lotsen!A52)","v":"zzz"}]
[null,"",null,"2025-02-03",6,5,null,"zzz",{"$f":"SUMIF($C$5:$C$1000,H56,$F$5:$F$1000)+L56","v":0},{"$f":"IF(I56>=60,1,0)","v":0},{"$f":"IF(J56>0,I56-60,IF(J56=0,I56,0))","v":0},0,null,null,null,null,null,null,null,null,null,null,null,null,null,null,null,null,null,null,null,null,{"$f":"IF(Lotsen!A53=\"\",\"zzz\",Lotsen!A53)","v":"zzz"}]
[null,"",null,"2025-02-03",7,6,null,"zzz",{"$f":"SUMIF($C$5:$C$1000,H57,$F$5:$F$1000)+L57","v":0},{"$f":"IF(I57>=60,1,0)","v":0},{"$f":"IF(J57>0,I57-60,IF(J57=0,I57,0))","v":0},0,null,null,null,null,null,null,null,null,null,null,null,null,null,null,null,null,null,null,null,null,{"$f":"IF(Lotsen!A54=\"\",\"zzz\",Lotsen!A54)","v":"zzz"}]
[null,"",null,"2025-02-03",8,7,null,"zzz",{"$f":"SUMIF($C$5:$C$1000,H58,$F$5:$F$1000)+L58","v":0},{"$f":"IF(I58>=60,1,0)","v":0},{"$f":"IF(J58>0,I58-60,IF(J58=0,I58,0))","v":0},0,null,null,null,null,null,null,null,null,null,null,null,null,null,null,null,null,null,null,null,null,{"$f":"IF(Lotsen!A55=\"\",\"zzz\",Lotsen!A55)","v":"zzz"}]
[null,"",null,"2025-02-03",8,7,null,"zzz",{"$f":"SUMIF($C$5:$C$1000,H59,$F$5:$F$1000)+L59","v":0},{"$f":"IF(I59>=60,1,0)","v":0},{"$f":"IF(J59>0,I59-60,IF(J59=0,I59,0))","v":0},0,null,null,null,null,null,null,null,null,null,null,null,null,null,null,null,null,null,null,null,null,{"$f":"IF(Lotsen!A56=\"\",\"zzz\",Lotsen!A56)","v":"zzz"}]
[null,"",null,"2025-02-03",6,5,null,"zzz",{"$f":"SUMIF($C$5:$C$1000,H60,$F$5:$F$1000)+L60","v":0},{"$f":"IF(I60>=60,1,0)","v":0},{"$f":"IF(J60>0,I60-60,IF(J60=0,I60,0))","v":0},0,null,null,null,null,null,null,null,null,null,null,null,null,null,null,null,null,null,null,null,null,{"$f":"IF(Lotsen!A57=\"\",\"zzz\",Lotsen!A57)","v":"zzz"}]
[null,"",null,"2025-02-03",2,1,null,"zzz",{"$f":"SUMIF($C$5:$C$1000,H61,$F$5:$F$1000)+L61","v":0},{"$f":"IF(I61>=60,1,0)","v":0},{"$f":"IF(J61>0,I61-60,IF(J61=0,I61,0))","v":0},0,null,null,null,null,null,null,null,null,null,null,null,null,null,null,null,null,null,null,null,null,{"$f":"IF(Lotsen!A58=\"\",\"zzz\",Lotsen!A58)","v":"zzz"}]
[null,"",null,"2025-02-04",2,1,null,"zzz",{"$f":"SUMIF($C$5:$C$1000,H62,$F$5:$F$1000)+L62","v":0},{"$f":"IF(I62>=60,1,0)","v":0},{"$f":"IF(J62>0,I62-60,IF(J62=0,I62,0))","v":0},0,null,null,null,null,null,null,null,null,null,null,null,null,null,null,null,null,null,null,null,null,{"$f":"IF(Lotsen!A59=\"\",\"zzz\",Lotsen!A59)","v":"zzz"}]
[null,"",null,"2025-02-04",4,3,null,"zzz",{"$f":"SUMIF($C$5:$C$1000,H63,$F$5:$F$1000)+L63","v":0},{"$f":"IF(I63>=60,1,0)","v":0},{"$f":"IF(J63>0,I63-60,IF(J63=0,I63,0))","v":0},0,null,null,null,null,null,null,null,null,null,null,null,null,null,null,null,null,null,null,null,null,{"$f":"IF(Lotsen!A60=\"\",\"zzz\",Lotsen!A60)","v":"zzz"}]
[null,"",null,"2025-02-04",4,3,null,"zzz",{"$f":"SUMIF($C$5:$C$1000,H64,$F$5:$F$1000)+L64","v":0},{"$f":"IF(I64>=60,1,0)","v":0},{"$f":"IF(J64>0,I64-60,IF(J64=0,I64,0))","v":0},0,null,null,null,null,null,null,null,null,null,null,null,null,null,null,null,null,null,null,null,null,{"$f":"IF(Lotsen!A61=\"\",\"zzz\",Lotsen!A61)","v":"zzz"}]
[null,"",null,"2025-02-04",3,2,null,"zzz",{"$f":"SUMIF($C$5:$C$1000,H65,$F$5:$F$1000)+L65","v":0},{"$f":"IF(I65>=60,1,0)","v":0},{"$f":"IF(J65>0,I65-60,IF(J65=0,I65,0))","v":0},0,null,null,null,null,null,null,null,null,null,null,null,null,null,null,null,null,null,null,null,null,{"$f":"IF(Lotsen!A62=\"\",\"zzz\",Lotsen!A62)","v":"zzz"}]
[null,"",null,"2025-02-04",3,2,null,"zzz",{"$f":"SUMIF($C$5:$C$1000,H66,$F$5:$F$1000)+L66","v":0},{"$f":"IF(I66>=60,1,0)","v":0},{"$f":"IF(J66>0,I66-60,IF(J66=0,I66,0))","v":0},0,null,null,null,null,null,null,null,null,null,null,null,null,null,null,null,null,null,null,null,null,{"$f":"IF(Lotsen!A63=\"\",\"zzz\",Lotsen!A63)","v":"zzz"}]
[null,"",null,"2025-02-04",2,1,null,"zzz",{"$f":"SUMIF($C$5:$C$1000,H67,$F$5:$F$1000)+L67","v":0},{"$f":"IF(I67>=60,1,0)","v":0},{"$f":"IF(J67>0,I67-60,IF(J67=0,I67,0))","v":0},0,null,null,null,null,null,null,null,null,null,null,null,null,null,null,null,null,null,null,null,null,{"$f":"IF(Lotsen!A64=\"\",\"zzz\",Lotsen!A64)","v":"zzz"}]
[null,"",null,"2025-02-04",2,1,null,"zzz",{"$f":"SUMIF($C$5:$C$1000,H68,$F$5:$F$1000)+L68","v":0},{"$f":"IF(I68>=60,1,0)","v":0},{"$f":"IF(J68>0,I68-60,IF(J68=0,I68,0))","v":0},0,null,null,null,null,null,null,null,null,null,null,null,null,null,null,null,null,null,null,null,null,{"$f":"IF(Lotsen!A65=\"\",\"zzz\",Lotsen!A65)","v":"zzz"}]
[null,"",null,"2025-02-04",3,2,null,"zzz",{"$f":"SUMIF($C$5:$C$1000,H69,$F$5:$F$1000)+L69","v":0},{"$f":"IF(I69>=60,1,0)","v":0},{"$f":"IF(J69>0,I69-60,IF(J69=0,I69,0))","v":0},0,null,null,null,null,null,null,null,null,null,null,null,null,null,null,null,null,null,null,null,null,{"$f":"IF(Lotsen!A66=\"\",\"zzz\",Lotsen!A66)","v":"zzz"}]
[null,"",null,"2025-02-04",3,{"$f":"IF(D70=\"\",\"\",E70-1)","v":2},null,"zzz",{"$f":"SUMIF($C$5:$C$1000,H70,$F$5:$F$1000)+L70","v":0},{"$f":"IF(I70>=60,1,0)","v":0},{"$f":"IF(J70>0,I70-60,IF(J70=0,I70,0))","v":0},0,null,null,null,null,null,null,null,null,null,null,null,null,null,null,null,null,null,null,null,null,{"$f":"IF(Lotsen!A67=\"\",\"zzz\",Lotsen!A67)","v":"zzz"}]
[null,{"$f":"IF(C71=\"\",\"\",B70+1)","v":""},null,"2025-02-04",2,1,null,"zzz",{"$f":"SUMIF($C$5:$C$1000,H71,$F$5:$F$1000)+L71","v":0},{"$f":"IF(I71>=60,1,0)","v":0},{"$f":"IF(J71>0,I71-60,IF(J71=0,I71,0))","v":0},0,null,null,null,null,null,null,null,null,null,null,null,null,null,null,null,null,null,null,null,null,{"$f":"IF(Lotsen!A68=\"\",\"zzz\",Lotsen!A68)","v":"zzz"}]
[null,"",null,"2025-02-04",2,1,null,"zzz",{"$f":"SUMIF($C$5:$C$1000,H72,$F$5:$F$1000)+L72","v":0},{"$f":"IF(I72>=60,1,0)","v":0},{"$f":"IF(J72>0,I72-60,IF(J72=0,I72,0))","v":0},0,null,null,null,null,null,null,null,null,null,null,null,null,null,null,null,null,null,null,null,null,{"$f":"IF(Lotsen!A69=\"\",\"zzz\",Lotsen!A69)","v":"zzz"}]
[null,"",null,"2025-02-04",2,1,null,"zzz",{"$f":"SUMIF($C$5:$C$1000,H73,$F$5:$F$1000)+L73","v":0},{"$f":"IF(I73>=60,1,0)","v":0},{"$f":"IF(J73>0,I73-60,IF(J73=0,I73,0))","v":0},0,null,null,null,null,null,null,null,null,null,null,null,null,null,null,null,null,null,null,null,null,{"$f":"IF(Lotsen!A70=\"\",\"zzz\",Lotsen!A70)","v":"zzz"}]
[null,"",null,"2025-02-05",2,1,null,"zzz",{"$f":"SUMIF($C$5:$C$1000,H74,$F$5:$F$1000)+L74","v":0},{"$f":"IF(I74>=60,1,0)","v":0},{"$f":"IF(J74>0,I74-60,IF(J74=0,I74,0))","v":0},0,null,null,null,null,null,null,null,null,null,null,null,null,null,null,null,null,null,null,null,null,{"$f":"IF(Lotsen!A71=\"\",\"zzz\",Lotsen!A71)","v":"zzz"}]
[null,"",null,"2025-02-05",2,1,null,"zzz",{"$f":"SUMIF($C$5:$C$1000,H75,$F$5:$F$1000)+L75","v":0},{"$f":"IF(I75>=60,1,0)","v":0},{"$f":"IF(J75>0,I75-60,IF(J75=0,I75,0))","v":0},0,null,null,null,null,null,null,null,null,null,null,null,null,null,null,null,null,null,null,null,null,{"$f":"IF(Lotsen!A72=\"\",\"zzz\",Lotsen!A72)","v":"zzz"}]
[null,"",null,"2025-02-05",4,3,null,"zzz",{"$f":"SUMIF($C$5:$C$1000,H76,$F$5:$F$1000)+L76","v":0},{"$f":"IF(I76>=60,1,0)","v":0},{"$f":"IF(J76>0,I76-60,IF(J76=0,I76,0))","v":0},0,null,null,null,null,null,null,null,null,null,null,null,null,null,null,null,null,null,null,null,null,{"$f":"IF(Lotsen!A73=\"\",\"zzz\",Lotsen!A73)","v":"zzz"}]
[null,"",null,"2025-02-05",5,4,null,"zzz",{"$f":"SUMIF($C$5:$C$1000,H77,$F$5:$F$1000)+L77","v":0},{"$f":"IF(I77>=60,1,0)","v":0},{"$f":"IF(J77>0,I77-60,IF(J77=0,I77,0))","v":0},0,null,null,null,null,null,null,null,null,null,null,null,null,null,null,null,null,null,null,null,null,{"$f":"IF(Lotsen!A74=\"\",\"zzz\",Lotsen!A74)","v":"zzz"}]
[null,"",null,"2025-02-05",8,7,null,"zzz",{"$f":"SUMIF($C$5:$C$1000,H78,$F$5:$F$1000)+L78","v":0},{"$f":"IF(I78>=60,1,0)","v":0},{"$f":"IF(J78>0,I78-60,IF(J78=0,I78,0))","v":0},0,null,null,null,null,null,null,null,null,null,null,null,null,null,null,null,null,null,null,null,null,{"$f":"IF(Lotsen!A75=\"\",\"zzz\",Lotsen!A75)","v":"zzz"}]
[null,"",null,"2025-02-05",3,2,null,"zzz",{"$f":"SUMIF($C$5:$C$1000,H79,$F$5:$F$1000)+L79","v":0},{"$f":"IF(I79>=60,1,0)","v":0},{"$f":"IF(J79>0,I79-60,IF(J79=0,I79,0))","v":0},0,null,null,null,null,null,null,null,null,null,null,null,null,null,null,null,null,null,null,null,null,{"$f":"IF(Lotsen!A76=\"\",\"zzz\",Lotsen!A76)","v":"zzz"}]
[null,"",null,"2025-02-05",3,2,null,"zzz",{"$f":"SUMIF($C$5:$C$1000,H80,$F$5:$F$1000)+L80","v":0},{"$f":"IF(I80>=60,1,0)","v":0},{"$f":"IF(J80>0,I80-60,IF(J80=0,I80,0))","v":0},0,null,null,null,null,null,null,null,null,null,null,null,null,null,null,null,null,null,null,null,null,{"$f":"IF(Lotsen!A77=\"\",\"zzz\",Lotsen!A77)","v":"zzz"}]
[null,"",null,"2025-02-05",3,2,null,"zzz",{"$f":"SUMIF($C$5:$C$1000,H81,$F$5:$F$1000)+L81","v":0},{"$f":"IF(I81>=60,1,0)","v":0},{"$f":"IF(J81>0,I81-60,IF(J81=0,I81,0))","v":0},0,null,null,null,null,null,null,null,null,null,null,null,null,null,null,null,null,null,null,null,null,{"$f":"IF(Lotsen!A78=\"\",\"zzz\",Lotsen!A78)","v":"zzz"}]
[null,"",null,"2025-02-05",4,3,null,"zzz",{"$f":"SUMIF($C$5:$C$1000,H82,$F$5:$F$1000)+L82","v":0},{"$f":"IF(I82>=60,1,0)","v":0},{"$f":"IF(J82>0,I82-60,IF(J82=0,I82,0))","v":0},0,null,null,null,null,null,null,null,null,null,null,null,null,null,null,null,null,null,null,null,null,{"$f":"IF(Lotsen!A79=\"\",\"zzz\",Lotsen!A79)","v":"zzz"}]
[null,"",null,"2025-02-05",4,3,null,"zzz",{"$f":"SUMIF($C$5:$C$1000,H83,$F$5:$F$1000)+L83","v":0},{"$f":"IF(I83>=60,1,0)","v":0},{"$f":"IF(J83>0,I83-60,IF(J83=0,I83,0))","v":0},0,null,null,null,null,null,null,null,null,null,null,null,null,null,null,null,null,null,null,null,null,{"$f":"IF(Lotsen!A80=\"\",\"zzz\",Lotsen!A80)","v":"zzz"}]
[null,"",null,"2025-02-05",4,3,null,"zzz",{"$f":"SUMIF($C$5:$C$1000,H84,$F$5:$F$1000)+L84","v":0},{"$f":"IF(I84>=60,1,0)","v":0},{"$f":"IF(J84>0,I84-60,IF(J84=0,I84,0))","v":0},0,null,null,null,null,null,null,null,null,null,null,null,null,null,null,null,null,null,null,null,null,{"$f":"IF(Lotsen!A81=\"\",\"zzz\",Lotsen!A81)","v":"zzz"}]
[null,"",null,"2025-02-05",3,2,null,"zzz",{"$f":"SUMIF($C$5:$C$1000,H85,$F$5:$F$1000)+L85","v":0},{"$f":"IF(I85>=60,1,0)","v":0},{"$f":"IF(J85>0,I85-60,IF(J85=0,I85,0))","v":0},0,null,null,null,null,null,null,null,null,null,null,null,null,null,null,null,null,null,null,null,null,{"$f":"IF(Lotsen!A82=\"\",\"zzz\",Lotsen!A82)","v":"zzz"}]
[null,"",null,"2025-02-05",3,2,null,"zzz",{"$f":"SUMIF($C$5:$C$1000,H86,$F$5:$F$1000)+L86","v":0},{"$f":"IF(I86>=60,1,0)","v":0},{"$f":"IF(J86>0,I86-60,IF(J86=0,I86,0))","v":0},0,null,null,null,null,null,null,null,null,null,null,null,null,null,null,null,null,null,null,null,null,{"$f":"IF(Lotsen!A83=\"\",\"zzz\",Lotsen!A83)","v":"zzz"}]
[null,"",null,"2025-02-05",2,1,null,"zzz",{"$f":"SUMIF($C$5:$C$1000,H87,$F$5:$F$1000)+L87","v":0},{"$f":"IF(I87>=60,1,0)","v":0},{"$f":"IF(J87>0,I87-60,IF(J87=0,I87,0))","v":0},0,null,null,null,null,null,null,null,null,null,null,null,null,null,null,null,null,null,null,null,null,{"$f":"IF(Lotsen!A84=\"\",\"zzz\",Lotsen!A84)","v":"zzz"}]
[null,"",null,"2025-02-05",2,1,null,"zzz",{"$f":"SUMIF($C$5:$C$1000,H88,$F$5:$F$1000)+L88","v":0},{"$f":"IF(I88>=60,1,0)","v":0},{"$f":"IF(J88>0,I88-60,IF(J88=0,I88,0))","v":0},0,null,null,null,null,null,null,null,null,null,null,null,null,null,null,null,null,null,null,null,null,{"$f":"IF(Lotsen!A85=\"\",\"zzz\",Lotsen!A85)","v":"zzz"}]
[null,"",null,"2025-02-06",2,1,null,"zzz",{"$f":"SUMIF($C$5:$C$1000,H89,$F$5:$F$1000)+L89","v":0},{"$f":"IF(I89>=60,1,0)","v":0},{"$f":"IF(J89>0,I89-60,IF(J89=0,I89,0))","v":0},0,null,null,null,null,null,null,null,null,null,null,null,null,null,null,null,null,null,null,null,null,{"$f":"IF(Lotsen!A86=\"\",\"zzz\",Lotsen!A86)","v":"zzz"}]
[null,"",null,"2025-02-06",2,1,null,"zzz",{"$f":"SUMIF($C$5:$C$1000,H90,$F$5:$F$1000)+L90","v":0},{"$f":"IF(I90>=60,1,0)","v":0},{"$f":"IF(J90>0,I90-60,IF(J90=0,I90,0))","v":0},0,null,null,null,null,null,null,null,null,null,null,null,null,null,null,null,null,null,null,null,null,{"$f":"IF(Lotsen!A87=\"\",\"zzz\",Lotsen!A87)","v":"zzz"}]
[null,"",null,"2025-02-06",2,1,null,"zzz",{"$f":"SUMIF($C$5:$C$1000,H91,$F$5:$F$1000)+L91","v":0},{"$f":"IF(I91>=60,1,0)","v":0},{"$f":"IF(J91>0,I91-60,IF(J91=0,I91,0))","v":0},0,null,null,null,null,null,null,null,null,null,null,null,null,null,null,null,null,null,null,null,null,{"$f":"IF(Lotsen!A88=\"\",\"zzz\",Lotsen!A88)","v":"zzz"}]
[null,"",null,"2025-02-06",3,2,null,"zzz",{"$f":"SUMIF($C$5:$C$1000,H92,$F$5:$F$1000)+L92","v":0},{"$f":"IF(I92>=60,1,0)","v":0},{"$f":"IF(J92>0,I92-60,IF(J92=0,I92,0))","v":0},0,null,null,null,null,null,null,null,null,null,null,null,null,null,null,null,null,null,null,null,null,{"$f":"IF(Lotsen!A89=\"\",\"zzz\",Lotsen!A89)","v":"zzz"}]
[null,"",null,"2025-02-06",3,2,null,"zzz",{"$f":"SUMIF($C$5:$C$1000,H93,$F$5:$F$1000)+L93","v":0},{"$f":"IF(I93>=60,1,0)","v":0},{"$f":"IF(J93>0,I93-60,IF(J93=0,I93,0))","v":0},0,null,null,null,null,null,null,null,null,null,null,null,null,null,null,null,null,null,null,null,null,{"$f":"IF(Lotsen!A90=\"\",\"zzz\",Lotsen!A90)","v":"zzz"}]
[null,"",null,"2025-02-06",3,2,null,"zzz",{"$f":"SUMIF($C$5:$C$1000,H94,$F$5:$F$1000)+L94","v":0},{"$f":"IF(I94>=60,1,0)","v":0},{"$f":"IF(J94>0,I94-60,IF(J94=0,I94,0))","v":0},0,null,null,null,null,null,null,null,null,null,null,null,null,null,null,null,null,null,null,null,null,{"$f":"IF(Lotsen!A91=\"\",\"zzz\",Lotsen!A91)","v":"zzz"}]
[null,"",null,"2025-02-06",3,2,null,"zzz",{"$f":"SUMIF($C$5:$C$1000,H95,$F$5:$F$1000)+L95","v":0},{"$f":"IF(I95>=60,1,0)","v":0},{"$f":"IF(J95>0,I95-60,IF(J95=0,I95,0))","v":0},0,null,null,null,null,null,null,null,null,null,null,null,null,null,null,null,null,null,null,null,null,{"$f":"IF(Lotsen!A92=\"\",\"zzz\",Lotsen!A92)","v":"zzz"}]
[null,"",null,"2025-02-06",3,2,null,"zzz",{"$f":"SUMIF($C$5:$C$1000,H96,$F$5:$F$1000)+L96","v":0},{"$f":"IF(I96>=60,1,0)","v":0},{"$f":"IF(J96>0,I96-60,IF(J96=0,I96,0))","v":0},0,null,null,null,null,null,null,null,null,null,null,null,null,null,null,null,null,null,null,null,null,{"$f":"IF(Lotsen!A93=\"\",\"zzz\",Lotsen!A93)","v":"zzz"}]
[null,"",null,"2025-02-06",2,1,null,"zzz",{"$f":"SUMIF($C$5:$C$1000,H97,$F$5:$F$1000)+L97","v":0},{"$f":"IF(I97>=60,1,0)","v":0},{"$f":"IF(J97>0,I97-60,IF(J97=0,I97,0))","v":0},0,null,null,null,null,null,null,null,null,null,null,null,null,null,null,null,null,null,null,null,null,{"$f":"IF(Lotsen!A94=\"\",\"zzz\",Lotsen!A94)","v":"zzz"}]
[null,"",null,"2025-02-06",4,3,null,"zzz",{"$f":"SUMIF($C$5:$C$1000,H98,$F$5:$F$1000)+L98","v":0},{"$f":"IF(I98>=60,1,0)","v":0},{"$f":"IF(J98>0,I98-60,IF(J98=0,I98,0))","v":0},0,null,null,null,null,null,null,null,null,null,null,null,null,null,null,null,null,null,null,null,null,{"$f":"IF(Lotsen!A95=\"\",\"zzz\",Lotsen!A95)","v":"zzz"}]
[null,"",null,"2025-02-06",4,3,null,"zzz",{"$f":"SUMIF($C$5:$C$1000,H99,$F$5:$F$1000)+L99","v":0},{"$f":"IF(I99>=60,1,0)","v":0},{"$f":"IF(J99>0,I99-60,IF(J99=0,I99,0))","v":0},0,null,null,null,null,null,null,null,null,null,null,null,null,null,null,null,null,null,null,null,null,{"$f":"IF(Lotsen!A96=\"\",\"zzz\",Lotsen!A96)","v":"zzz"}]
[null,"",null,"2025-02-06",4,3,null,"zzz",{"$f":"SUMIF($C$5:$C$1000,H100,$F$5:$F$1000)+L100","v":0},{"$f":"IF(I100>=60,1,0)","v":0},{"$f":"IF(J100>0,I100-60,IF(J100=0,I100,0))","v":0},0,null,null,null,null,null,null,null,null,null,null,null,null,null,null,null,null,null,null,null,null,{"$f":"IF(Lotsen!A97=\"\",\"zzz\",Lotsen!A97)","v":"zzz"}]
[null,"",null,"2025-02-06",2,1,null,"zzz",{"$f":"SUMIF($C$5:$C$1000,H101,$F$5:$F$1000)+L101","v":0},{"$f":"IF(I101>=60,1,0)","v":0},{"$f":"IF(J101>0,I101-60,IF(J101=0,I101,0))","v":0},0,null,null,null,null,null,null,null,null,null,null,null,null,null,null,null,null,null,null,null,null,{"$f":"IF(Lotsen!A98=\"\",\"zzz\",Lotsen!A98)","v":"zzz"}]
[null,"",null,"2025-02-06",2,1,null,"zzz",{"$f":"SUMIF($C$5:$C$1000,H102,$F$5:$F$1000)+L102","v":0},{"$f":"IF(I102>=60,1,0)","v":0},{"$f":"IF(J102>0,I102-60,IF(J102=0,I102,0))","v":0},0,null,null,null,null,null,null,null,null,null,null,null,null,null,null,null,null,null,null,null,null,{"$f":"IF(Lotsen!A99=\"\",\"zzz\",Lotsen!A99)","v":"zzz"}]
[null,"",null,"2025-02-06",2,1,null,"zzz",{"$f":"SUMIF($C$5:$C$1000,H103,$F$5:$F$1000)+L103","v":0},{"$f":"IF(I103>=60,1,0)","v":0},{"$f":"IF(J103>0,I103-60,IF(J103=0,I103,0))","v":0},0,null,null,null,null,null,null,null,null,null,null,null,null,null,null,null,null,null,null,null,null,{"$f":"IF(Lotsen!A100=\"\",\"zzz\",Lotsen!A100)","v":"zzz"}]
[null,"",null,"2025-02-06",2,1,null,"zzz",{"$f":"SUMIF($C$5:$C$1000,H104,$F$5:$F$1000)+L104","v":0},{"$f":"IF(I104>=60,1,0)","v":0},{"$f":"IF(J104>0,I104-60,IF(J104=0,I104,0))","v":0},0,null,null,null,null,null,null,null,null,null,null,null,null,null,null,null,null,null,null,null,null,{"$f":"IF(Lotsen!A101=\"\",\"zzz\",Lotsen!A101)","v":"zzz"}]
[null,"",null,"2025-02-06",2,1,null,"zzz",{"$f":"SUMIF($C$5:$C$1000,H105,$F$5:$F$1000)+L105","v":0},{"$f":"IF(I105>=60,1,0)","v":0},{"$f":"IF(J105>0,I105-60,IF(J105=0,I105,0))","v":0},0,null,null,null,null,null,null,null,null,null,null,null,null,null,null,null,null,null,null,null,null,{"$f":"IF(Lotsen!A102=\"\",\"zzz\",Lotsen!A102)","v":"zzz"}]
[null,"",null,"2025-02-06",2,1,null,"zzz",{"$f":"SUMIF($C$5:$C$1000,H106,$F$5:$F$1000)+L106","v":0},{"$f":"IF(I106>=60,1,0)","v":0},{"$f":"IF(J106>0,I106-60,IF(J106=0,I106,0))","v":0},0,null,null,null,null,null,null,null,null,null,null,null,null,null,null,null,null,null,null,null,null,{"$f":"IF(Lotsen!A103=\"\",\"zzz\",Lotsen!A103)","v":"zzz"}]
[null,"",null,"2025-02-06",3,2,null,"zzz",{"$f":"SUMIF($C$5:$C$1000,H107,$F$5:$F$1000)+L107","v":0},{"$f":"IF(I107>=60,1,0)","v":0},{"$f":"IF(J107>0,I107-60,IF(J107=0,I107,0))","v":0},0,null,null,null,null,null,null,null,null,null,null,null,null,null,null,null,null,null,null,null,null,{"$f":"IF(Lotsen!A104=\"\",\"zzz\",Lotsen!A104)","v":"zzz"}]
[null,"",null,"2025-02-06",2,1,null,"zzz",{"$f":"SUMIF($C$5:$C$1000,H108,$F$5:$F$1000)+L108","v":0},{"$f":"IF(I108>=60,1,0)","v":0},{"$f":"IF(J108>0,I108-60,IF(J108=0,I108,0))","v":0},0,null,null,null,null,null,null,null,null,null,null,null,null,null,null,null,null,null,null,null,null,{"$f":"IF(Lotsen!A105=\"\",\"zzz\",Lotsen!A105)","v":"zzz"}]
[null,"",null,"2025-02-06",2,1,null,"zzz",{"$f":"SUMIF($C$5:$C$1000,H109,$F$5:$F$1000)+L109","v":0},{"$f":"IF(I109>=60,1,0)","v":0},{"$f":"IF(J109>0,I109-60,IF(J109=0,I109,0))","v":0},0,null,null,null,null,null,null,null,null,null,null,null,null,null,null,null,null,null,null,null,null,{"$f":"IF(Lotsen!A106=\"\",\"zzz\",Lotsen!A106)","v":"zzz"}]
[null,"",null,"2025-02-06",3,2,null,"zzz",{"$f":"SUMIF($C$5:$C$1000,H110,$F$5:$F$1000)+L110","v":0},{"$f":"IF(I110>=60,1,0)","v":0},{"$f":"IF(J110>0,I110-60,IF(J110=0,I110,0))","v":0},0,null,null,null,null,null,null,null,null,null,null,null,null,null,null,null,null,null,null,null,null,{"$f":"IF(Lotsen!A107=\"\",\"zzz\",Lotsen!A107)","v":"zzz"}]
[null,"",null,"2025-02-06",3,2,null,"zzz",{"$f":"SUMIF($C$5:$C$1000,H111,$F$5:$F$1000)+L111","v":0},{"$f":"IF(I111>=60,1,0)","v":0},{"$f":"IF(J111>0,I111-60,IF(J111=0,I111,0))","v":0},0,null,null,null,null,null,null,null,null,null,null,null,null,null,null,null,null,null,null,null,null,{"$f":"IF(Lotsen!A108=\"\",\"zzz\",Lotsen!A108)","v":"zzz"}]
[null,"",null,"2025-02-06",3,2,null,"zzz",{"$f":"SUMIF($C$5:$C$1000,H112,$F$5:$F$1000)+L112","v":0},{"$f":"IF(I112>=60,1,0)","v":0},{"$f":"IF(J112>0,I112-60,IF(J112=0,I112,0))","v":0},0,null,null,null,null,null,null,null,null,null,null,null,null,null,null,null,null,null,null,null,null,{"$f":"IF(Lotsen!A109=\"\",\"zzz\",Lotsen!A109)","v":"zzz"}]
[null,"",null,"2025-02-06",5,4,null,"zzz",{"$f":"SUMIF($C$5:$C$1000,H113,$F$5:$F$1000)+L113","v":0},{"$f":"IF(I113>=60,1,0)","v":0},{"$f":"IF(J113>0,I113-60,IF(J113=0,I113,0))","v":0},0,null,null,null,null,null,null,null,null,null,null,null,null,null,null,null,null,null,null,null,null,{"$f":"IF(Lotsen!A110=\"\",\"zzz\",Lotsen!A110)","v":"zzz"}]
[null,"",null,"2025-02-06",3,2,null,"zzz",{"$f":"SUMIF($C$5:$C$1000,H114,$F$5:$F$1000)+L114","v":0},{"$f":"IF(I114>=60,1,0)","v":0},{"$f":"IF(J114>0,I114-60,IF(J114=0,I114,0))","v":0},0,null,null,null,null,null,null,null,null,null,null,null,null,null,null,null,null,null,null,null,null,{"$f":"IF(Lotsen!A111=\"\",\"zzz\",Lotsen!A111)","v":"zzz"}]
[null,"",null,"2025-02-06",3,2,null,"zzz",{"$f":"SUMIF($C$5:$C$1000,H115,$F$5:$F$1000)+L115","v":0},{"$f":"IF(I115>=60,1,0)","v":0},{"$f":"IF(J115>0,I115-60,IF(J115=0,I115,0))","v":0},0,null,null,null,null,null,null,null,null,null,null,null,null,null,null,null,null,null,null,null,null,{"$f":"IF(Lotsen!A112=\"\",\"zzz\",Lotsen!A112)","v":"zzz"}]
[null,"",null,"2025-02-07",3,2,null,"zzz",{"$f":"SUMIF($C$5:$C$1000,H116,$F$5:$F$1000)+L116","v":0},{"$f":"IF(I116>=60,1,0)","v":0},{"$f":"IF(J116>0,I116-60,IF(J116=0,I116,0))","v":0},0,null,null,null,null,null,null,null,null,null,null,null,null,null,null,null,null,null,null,null,null,{"$f":"IF(Lotsen!A113=\"\",\"zzz\",Lotsen!A113)","v":"zzz"}]
[null,"",null,"2025-02-07",3,2,null,"zzz",{"$f":"SUMIF($C$5:$C$1000,H117,$F$5:$F$1000)+L117","v":0},{"$f":"IF(I117>=60,1,0)","v":0},{"$f":"IF(J117>0,I117-60,IF(J117=0,I117,0))","v":0},0,null,null,null,null,null,null,null,null,null,null,null,null,null,null,null,null,null,null,null,null,{"$f":"IF(Lotsen!A114=\"\",\"zzz\",Lotsen!A114)","v":"zzz"}]
[null,"",null,"2025-02-07",4,3,null,"zzz",{"$f":"SUMIF($C$5:$C$1000,H118,$F$5:$F$1000)+L118","v":0},{"$f":"IF(I118>=60,1,0)","v":0},{"$f":"IF(J118>0,I118-60,IF(J118=0,I118,0))","v":0},0,null,null,null,null,null,null,null,null,null,null,null,null,null,null,null,null,null,null,null,null,{"$f":"IF(Lotsen!A115=\"\",\"zzz\",Lotsen!A115)","v":"zzz"}]
[null,"",null,"2025-02-07",2,1,null,"zzz",{"$f":"SUMIF($C$5:$C$1000,H119,$F$5:$F$1000)+L119","v":0},{"$f":"IF(I119>=60,1,0)","v":0},{"$f":"IF(J119>0,I119-60,IF(J119=0,I119,0))","v":0},0,null,null,null,null,null,null,null,null,null,null,null,null,null,null,null,null,null,null,null,null,{"$f":"IF(Lotsen!A116=\"\",\"zzz\",Lotsen!A116)","v":"zzz"}]
[null,"",null,"2025-02-07",2,1,null,"zzz",{"$f":"SUMIF($C$5:$C$1000,H120,$F$5:$F$1000)+L120","v":0},{"$f":"IF(I120>=60,1,0)","v":0},{"$f":"IF(J120>0,I120-60,IF(J120=0,I120,0))","v":0},0,null,null,null,null,null,null,null,null,null,null,null,null,null,null,null,null,null,null,null,null,{"$f":"IF(Lotsen!A117=\"\",\"zzz\",Lotsen!A117)","v":"zzz"}]
[null,"",null,"2025-02-07",2,1,null,"zzz",{"$f":"SUMIF($C$5:$C$1000,H121,$F$5:$F$1000)+L121","v":0},{"$f":"IF(I121>=60,1,0)","v":0},{"$f":"IF(J121>0,I121-60,IF(J121=0,I121,0))","v":0},0,null,null,null,null,null,null,null,null,null,null,null,null,null,null,null,null,null,null,null,null,{"$f":"IF(Lotsen!A118=\"\",\"zzz\",Lotsen!A118)","v":"zzz"}]
[null,"",null,"2025-02-07",5,4,null,"zzz",{"$f":"SUMIF($C$5:$C$1000,H122,$F$5:$F$1000)+L122","v":0},{"$f":"IF(I122>=60,1,0)","v":0},{"$f":"IF(J122>0,I122-60,IF(J122=0,I122,0))","v":0},0,null,null,null,null,null,null,null,null,null,null,null,null,null,null,null,null,null,null,null,null,{"$f":"IF(Lotsen!A119=\"\",\"zzz\",Lotsen!A119)","v":"zzz"}]
[null,"",null,"2025-02-07",3,2,null,"zzz",{"$f":"SUMIF($C$5:$C$1000,H123,$F$5:$F$1000)+L123","v":0},{"$f":"IF(I123>=60,1,0)","v":0},{"$f":"IF(J123>0,I123-60,IF(J123=0,I123,0))","v":0},0,null,null,null,null,null,null,null,null,null,null,null,null,null,null,null,null,null,null,null,null,{"$f":"IF(Lotsen!A120=\"\",\"zzz\",Lotsen!A120)","v":"zzz"}]
[null,"",null,"2025-02-07",2,1,null,"zzz",{"$f":"SUMIF($C$5:$C$1000,H124,$F$5:$F$1000)+L124","v":0},{"$f":"IF(I124>=60,1,0)","v":0},{"$f":"IF(J124>0,I124-60,IF(J124=0,I124,0))","v":0},0,null,null,null,null,null,null,null,null,null,null,null,null,null,null,null,null,null,null,null,null,{"$f":"IF(Lotsen!A121=\"\",\"zzz\",Lotsen!A121)","v":"zzz"}]
[null,"",null,"2025-02-07",2,1,null,"zzz",{"$f":"SUMIF($C$5:$C$1000,H125,$F$5:$F$1000)+L125","v":0},{"$f":"IF(I125>=60,1,0)","v":0},{"$f":"IF(J125>0,I125-60,IF(J125=0,I125,0))","v":0},0,null,null,null,null,null,null,null,null,null,null,null,null,null,null,null,null,null,null,null,null,{"$f":"IF(Lotsen!A122=\"\",\"zzz\",Lotsen!A122)","v":"zzz"}]
[null,"",null,"2025-02-07",2,1,null,"zzz",{"$f":"SUMIF($C$5:$C$1000,H126,$F$5:$F$1000)+L126","v":0},{"$f":"IF(I126>=60,1,0)","v":0},{"$f":"IF(J126>0,I126-60,IF(J126=0,I126,0))","v":0},0,null,null,null,null,null,null,null,null,null,null,null,null,null,null,null,null,null,null,null,null,{"$f":"IF(Lotsen!A123=\"\",\"zzz\",Lotsen!A123)","v":"zzz"}]
[null,"",null,"2025-02-07",2,1,null,"zzz",{"$f":"SUMIF($C$5:$C$1000,H127,$F$5:$F$1000)+L127","v":0},{"$f":"IF(I127>=60,1,0)","v":0},{"$f":"IF(J127>0,I127-60,IF(J127=0,I127,0))","v":0},0,null,null,null,null,null,null,null,null,null,null,null,null,null,null,null,null,null,null,null,null,{"$f":"IF(Lotsen!A124=\"\",\"zzz\",Lotsen!A124)","v":"zzz"}]
[null,"",null,"2025-02-07",2,1,null,"zzz",{"$f":"SUMIF($C$5:$C$1000,H128,$F$5:$F$1000)+L128","v":0},{"$f":"IF(I128>=60,1,0)","v":0},{"$f":"IF(J128>0,I128-60,IF(J128=0,I128,0))","v":0},0,null,null,null,null,null,null,null,null,null,null,null,null,null,null,null,null,null,null,null,null,{"$f":"IF(Lotsen!A125=\"\",\"zzz\",Lotsen!A125)","v":"zzz"}]
[null,"",null,"2025-02-07",2,1,null,"zzz",{"$f":"SUMIF($C$5:$C$1000,H129,$F$5:$F$1000)+L129","v":0},{"$f":"IF(I129>=60,1,0)","v":0},{"$f":"IF(J129>0,I129-60,IF(J129=0,I129,0))","v":0},0,null,null,null,null,null,null,null,null,null,null,null,null,null,null,null,null,null,null,null,null,{"$f":"IF(Lotsen!A126=\"\",\"zzz\",Lotsen!A126)","v":"zzz"}]
[null,"",null,"2025-02-07",2,1,null,"zzz",{"$f":"SUMIF($C$5:$C$1000,H130,$F$5:$F$1000)+L130","v":0},{"$f":"IF(I130>=60,1,0)","v":0},{"$f":"IF(J130>0,I130-60,IF(J130=0,I130,0))","v":0},0,null,null,null,null,null,null,null,null,null,null,null,null,null,null,null,null,null,null,null,null,{"$f":"IF(Lotsen!A127=\"\",\"zzz\",Lotsen!A127)","v":"zzz"}]
[null,"",null,"2025-02-07",2,1,null,"zzz",{"$f":"SUMIF($C$5:$C$1000,H131,$F$5:$F$1000)+L131","v":0},{"$f":"IF(I131>=60,1,0)","v":0},{"$f":"IF(J131>0,I131-60,IF(J131=0,I131,0))","v":0},0,null,null,null,null,null,null,null,null,null,null,null,null,null,null,null,null,null,null,null,null,{"$f":"IF(Lotsen!A128=\"\",\"zzz\",Lotsen!A128)","v":"zzz"}]
[null,"",null,"2025-02-07",2,1,null,"zzz",{"$f":"SUMIF($C$5:$C$1000,H132,$F$5:$F$1000)+L132","v":0},{"$f":"IF(I132>=60,1,0)","v":0},{"$f":"IF(J132>0,I132-60,IF(J132=0,I132,0))","v":0},0,null,null,null,null,null,null,null,null,null,null,null,null,null,null,null,null,null,null,null,null,{"$f":"IF(Lotsen!A129=\"\",\"zzz\",Lotsen!A129)","v":"zzz"}]
[null,"",null,"2025-02-07",3,2,null,"zzz",{"$f":"SUMIF($C$5:$C$1000,H133,$F$5:$F$1000)+L133","v":0},{"$f":"IF(I133>=60,1,0)","v":0},{"$f":"IF(J133>0,I133-60,IF(J133=0,I133,0))","v":0},0,null,null,null,null,null,null,null,null,null,null,null,null,null,null,null,null,null,null,null,null,{"$f":"IF(Lotsen!A130=\"\",\"zzz\",Lotsen!A130)","v":"zzz"}]
[null,"",null,"2025-02-07",2,{"$f":"IF(D134=\"\",\"\",E134-1)","v":1},null,"zzz",{"$f":"SUMIF($C$5:$C$1000,H134,$F$5:$F$1000)+L134","v":0},{"$f":"IF(I134>=60,1,0)","v":0},{"$f":"IF(J134>0,I134-60,IF(J134=0,I134,0))","v":0},0,null,null,null,null,null,null,null,null,null,null,null,null,null,null,null,null,null,null,null,null,{"$f":"IF(Lotsen!A131=\"\",\"zzz\",Lotsen!A131)","v":"zzz"}]
[null,{"$f":"IF(C135=\"\",\"\",B134+1)","v":""},null,"2025-02-07",2,1,null,"zzz",{"$f":"SUMIF($C$5:$C$1000,H135,$F$5:$F$1000)+L135","v":0},{"$f":"IF(I135>=60,1,0)","v":0},{"$f":"IF(J135>0,I135-60,IF(J135=0,I135,0))","v":0},0,null,null,null,null,null,null,null,null,null,null,null,null,null,null,null,null,null,null,null,null,{"$f":"IF(Lotsen!A132=\"\",\"zzz\",Lotsen!A132)","v":"zzz"}]
[null,"",null,"2025-02-07",2,1,null,"zzz",{"$f":"SUMIF($C$5:$C$1000,H136,$F$5:$F$1000)+L136","v":0},{"$f":"IF(I136>=60,1,0)","v":0},{"$f":"IF(J136>0,I136-60,IF(J136=0,I136,0))","v":0},0,null,null,null,null,null,null,null,null,null,null,null,null,null,null,null,null,null,null,null,null,{"$f":"IF(Lotsen!A133=\"\",\"zzz\",Lotsen!A133)","v":"zzz"}]
[null,"",null,"2025-02-07",2,1,null,"zzz",{"$f":"SUMIF($C$5:$C$1000,H137,$F$5:$F$1000)+L137","v":0},{"$f":"IF(I137>=60,1,0)","v":0},{"$f":"IF(J137>0,I137-60,IF(J137=0,I137,0))","v":0},0,null,null,null,null,null,null,null,null,null,null,null,null,null,null,null,null,null,null,null,null,{"$f":"IF(Lotsen!A134=\"\",\"zzz\",Lotsen!A134)","v":"zzz"}]
[null,"",null,"2025-02-07",3,2,null,"zzz",{"$f":"SUMIF($C$5:$C$1000,H138,$F$5:$F$1000)+L138","v":0},{"$f":"IF(I138>=60,1,0)","v":0},{"$f":"IF(J138>0,I138-60,IF(J138=0,I138,0))","v":0},0,null,null,null,null,null,null,null,null,null,null,null,null,null,null,null,null,null,null,null,null,{"$f":"IF(Lotsen!A135=\"\",\"zzz\",Lotsen!A135)","v":"zzz"}]
[null,"",null,"2025-02-08",2,1,null,"zzz",{"$f":"SUMIF($C$5:$C$1000,H139,$F$5:$F$1000)+L139","v":0},{"$f":"IF(I139>=60,1,0)","v":0},{"$f":"IF(J139>0,I139-60,IF(J139=0,I139,0))","v":0},0,null,null,null,null,null,null,null,null,null,null,null,null,null,null,null,null,null,null,null,null,{"$f":"IF(Lotsen!A136=\"\",\"zzz\",Lotsen!A136)","v":"zzz"}]
[null,"",null,"2025-02-08",2,1,null,"zzz",{"$f":"SUMIF($C$5:$C$1000,H140,$F$5:$F$1000)+L140","v":0},{"$f":"IF(I140>=60,1,0)","v":0},{"$f":"IF(J140>0,I140-60,IF(J140=0,I140,0))","v":0},0,null,null,null,null,null,null,null,null,null,null,null,null,null,null,null,null,null,null,null,null,{"$f":"IF(Lotsen!A137=\"\",\"zzz\",Lotsen!A137)","v":"zzz"}]
[null,"",null,"2025-02-08",2,1,null,"zzz",{"$f":"SUMIF($C$5:$C$1000,H141,$F$5:$F$1000)+L141","v":0},{"$f":"IF(I141>=60,1,0)","v":0},{"$f":"IF(J141>0,I141-60,IF(J141=0,I141,0))","v":0},0,null,null,null,null,null,null,null,null,null,null,null,null,null,null,null,null,null,null,null,null,{"$f":"IF(Lotsen!A138=\"\",\"zzz\",Lotsen!A138)","v":"zzz"}]
[null,"",null,"2025-02-08",2,1,null,"zzz",{"$f":"SUMIF($C$5:$C$1000,H142,$F$5:$F$1000)+L142","v":0},{"$f":"IF(I142>=60,1,0)","v":0},{"$f":"IF(J142>0,I142-60,IF(J142=0,I142,0))","v":0},0,null,null,null,null,null,null,null,null,null,null,null,null,null,null,null,null,null,null,null,null,{"$f":"IF(Lotsen!A139=\"\",\"zzz\",Lotsen!A139)","v":"zzz"}]
[null,"",null,"2025-02-08",2,1,null,"zzz",{"$f":"SUMIF($C$5:$C$1000,H143,$F$5:$F$1000)+L143","v":0},{"$f":"IF(I143>=60,1,0)","v":0},{"$f":"IF(J143>0,I143-60,IF(J143=0,I143,0))","v":0},0,null,null,null,null,null,null,null,null,null,null,null,null,null,null,null,null,null,null,null,null,{"$f":"IF(Lotsen!A140=\"\",\"zzz\",Lotsen!A140)","v":"zzz"}]
[null,"",null,"2025-02-08",3,2,null,"zzz",{"$f":"SUMIF($C$5:$C$1000,H144,$F$5:$F$1000)+L144","v":0},{"$f":"IF(I144>=60,1,0)","v":0},{"$f":"IF(J144>0,I144-60,IF(J144=0,I144,0))","v":0},0,null,null,null,null,null,null,null,null,null,null,null,null,null,null,null,null,null,null,null,null,{"$f":"IF(Lotsen!A141=\"\",\"zzz\",Lotsen!A141)","v":"zzz"}]
[null,"",null,"2025-02-08",2,1,null,"zzz",{"$f":"SUMIF($C$5:$C$1000,H145,$F$5:$F$1000)+L145","v":0},{"$f":"IF(I145>=60,1,0)","v":0},{"$f":"IF(J145>0,I145-60,IF(J145=0,I145,0))","v":0},0,null,null,null,null,null,null,null,null,null,null,null,null,null,null,null,null,null,null,null,null,{"$f":"IF(Lotsen!A142=\"\",\"zzz\",Lotsen!A142)","v":"zzz"}]
[null,"",null,"2025-02-08",2,1,null,"zzz",{"$f":"SUMIF($C$5:$C$1000,H146,$F$5:$F$1000)+L146","v":0},{"$f":"IF(I146>=60,1,0)","v":0},{"$f":"IF(J146>0,I146-60,IF(J146=0,I146,0))","v":0},0,null,null,null,null,null,null,null,null,null,null,null,null,null,null,null,null,null,null,null,null,{"$f":"IF(Lotsen!A143=\"\",\"zzz\",Lotsen!A143)","v":"zzz"}]
[null,"",null,"2025-02-08",3,2,null,"zzz",{"$f":"SUMIF($C$5:$C$1000,H147,$F$5:$F$1000)+L147","v":0},{"$f":"IF(I147>=60,1,0)","v":0},{"$f":"IF(J147>0,I147-60,IF(J147=0,I147,0))","v":0},0,null,null,null,null,null,null,null,null,null,null,null,null,null,null,null,null,null,null,null,null,{"$f":"IF(Lotsen!A144=\"\",\"zzz\",Lotsen!A144)","v":"zzz"}]
[null,"",null,"2025-02-08",2,1,null,"zzz",{"$f":"SUMIF($C$5:$C$1000,H148,$F$5:$F$1000)+L148","v":0},{"$f":"IF(I148>=60,1,0)","v":0},{"$f":"IF(J148>0,I148-60,IF(J148=0,I148,0))","v":0},0,null,null,null,null,null,null,null,null,null,null,null,null,null,null,null,null,null,null,null,null,{"$f":"IF(Lotsen!A145=\"\",\"zzz\",Lotsen!A145)","v":"zzz"}]
[null,"",null,"2025-02-08",3,2,null,"zzz",{"$f":"SUMIF($C$5:$C$1000,H149,$F$5:$F$1000)+L149","v":0},{"$f":"IF(I149>=60,1,0)","v":0},{"$f":"IF(J149>0,I149-60,IF(J149=0,I149,0))","v":0},0,null,null,null,null,null,null,null,null,null,null,null,null,null,null,null,null,null,null,null,null,{"$f":"IF(Lotsen!A146=\"\",\"zzz\",Lotsen!A146)","v":"zzz"}]
[null,"",null,"2025-02-08",2,1,null,"zzz",{"$f":"SUMIF($C$5:$C$1000,H150,$F$5:$F$1000)+L150","v":0},{"$f":"IF(I150>=60,1,0)","v":0},{"$f":"IF(J150>0,I150-60,IF(J150=0,I150,0))","v":0},0,null,null,null,null,null,null,null,null,null,null,null,null,null,null,null,null,null,null,null,null,{"$f":"IF(Lotsen!A147=\"\",\"zzz\",Lotsen!A147)","v":"zzz"}]
[null,"",null,"2025-02-09",3,2,null,"zzz",{"$f":"SUMIF($C$5:$C$1000,H151,$F$5:$F$1000)+L151","v":0},{"$f":"IF(I151>=60,1,0)","v":0},{"$f":"IF(J151>0,I151-60,IF(J151=0,I151,0))","v":0},0,null,null,null,null,null,null,null,null,null,null,null,null,null,null,null,null,null,null,null,null,{"$f":"IF(Lotsen!A148=\"\",\"zzz\",Lotsen!A148)","v":"zzz"}]
[null,"",null,"2025-02-09",3,2,null,"zzz",{"$f":"SUMIF($C$5:$C$1000,H152,$F$5:$F$1000)+L152","v":0},{"$f":"IF(I152>=60,1,0)","v":0},{"$f":"IF(J152>0,I152-60,IF(J152=0,I152,0))","v":0},0,null,null,null,null,null,null,null,null,null,null,null,null,null,null,null,null,null,null,null,null,{"$f":"IF(Lotsen!A149=\"\",\"zzz\",Lotsen!A149)","v":"zzz"}]
[null,"",null,"2025-02-09",2,1,null,"zzz",{"$f":"SUMIF($C$5:$C$1000,H153,$F$5:$F$1000)+L153","v":0},{"$f":"IF(I153>=60,1,0)","v":0},{"$f":"IF(J153>0,I153-60,IF(J153=0,I153,0))","v":0},0,null,null,null,null,null,null,null,null,null,null,null,null,null,null,null,null,null,null,null,null,{"$f":"IF(Lotsen!A150=\"\",\"zzz\",Lotsen!A150)","v":"zzz"}]
[null,"",null,"2025-02-09",2,1,null,"zzz",{"$f":"SUMIF($C$5:$C$1000,H154,$F$5:$F$1000)+L154","v":0},{"$f":"IF(I154>=60,1,0)","v":0},{"$f":"IF(J154>0,I154-60,IF(J154=0,I154,0))","v":0},0,null,null,null,null,null,null,null,null,null,null,null,null,null,null,null,null,null,null,null,null,{"$f":"IF(Lotsen!A151=\"\",\"zzz\",Lotsen!A151)","v":"zzz"}]
[null,"",null,"2025-02-09",4,3,null,"zzz",{"$f":"SUMIF($C$5:$C$1000,H155,$F$5:$F$1000)+L155","v":0},{"$f":"IF(I155>=60,1,0)","v":0},{"$f":"IF(J155>0,I155-60,IF(J155=0,I155,0))","v":0},0,null,null,null,null,null,null,null,null,null,null,null,null,null,null,null,null,null,null,null,null,{"$f":"IF(Lotsen!A152=\"\",\"zzz\",Lotsen!A152)","v":"zzz"}]
[null,"",null,"2025-02-09",4,3,null,"zzz",{"$f":"SUMIF($C$5:$C$1000,H156,$F$5:$F$1000)+L156","v":0},{"$f":"IF(I156>=60,1,0)","v":0},{"$f":"IF(J156>0,I156-60,IF(J156=0,I156,0))","v":0},0,null,null,null,null,null,null,null,null,null,null,null,null,null,null,null,null,null,null,null,null,{"$f":"IF(Lotsen!A153=\"\",\"zzz\",Lotsen!A153)","v":"zzz"}]
[null,"",null,"2025-02-09",3,2,null,"zzz",{"$f":"SUMIF($C$5:$C$1000,H157,$F$5:$F$1000)+L157","v":0},{"$f":"IF(I157>=60,1,0)","v":0},{"$f":"IF(J157>0,I157-60,IF(J157=0,I157,0))","v":0},0,null,null,null,null,null,null,null,null,null,null,null,null,null,null,null,null,null,null,null,null,{"$f":"IF(Lotsen!A154=\"\",\"zzz\",Lotsen!A154)","v":"zzz"}]
[null,"",null,"2025-02-09",3,2,null,"zzz",{"$f":"SUMIF($C$5:$C$1000,H158,$F$5:$F$1000)+L158","v":0},{"$f":"IF(I158>=60,1,0)","v":0},{"$f":"IF(J158>0,I158-60,IF(J158=0,I158,0))","v":0},0,null,null,null,null,null,null,null,null,null,null,null,null,null,null,null,null,null,null,null,null,{"$f":"IF(Lotsen!A155=\"\",\"zzz\",Lotsen!A155)","v":"zzz"}]
[null,"",null,"2025-02-09",3,2,null,"zzz",{"$f":"SUMIF($C$5:$C$1000,H159,$F$5:$F$1000)+L159","v":0},{"$f":"IF(I159>=60,1,0)","v":0},{"$f":"IF(J159>0,I159-60,IF(J159=0,I159,0))","v":0},0,null,null,null,null,null,null,null,null,null,null,null,null,null,null,null,null,null,null,null,null,{"$f":"IF(Lotsen!A156=\"\",\"zzz\",Lotsen!A156)","v":"zzz"}]
[null,"",null,"2025-02-09",4,3,null,"zzz",{"$f":"SUMIF($C$5:$C$1000,H160,$F$5:$F$1000)+L160","v":0},{"$f":"IF(I160>=60,1,0)","v":0},{"$f":"IF(J160>0,I160-60,IF(J160=0,I160,0))","v":0},0,null,null,null,null,null,null,null,null,null,null,null,null,null,null,null,null,null,null,null,null,{"$f":"IF(Lotsen!A157=\"\",\"zzz\",Lotsen!A157)","v":"zzz"}]
[null,"",null,"2025-02-09",4,3,null,"zzz",{"$f":"SUMIF($C$5:$C$1000,H161,$F$5:$F$1000)+L161","v":0},{"$f":"IF(I161>=60,1,0)","v":0},{"$f":"IF(J161>0,I161-60,IF(J161=0,I161,0))","v":0},0,null,null,null,null,null,null,null,null,null,null,null,null,null,null,null,null,null,null,null,null,{"$f":"IF(Lotsen!A158=\"\",\"zzz\",Lotsen!A158)","v":"zzz"}]
[null,"",null,"2025-02-09",2,1,null,"zzz",{"$f":"SUMIF($C$5:$C$1000,H162,$F$5:$F$1000)+L162","v":0},{"$f":"IF(I162>=60,1,0)","v":0},{"$f":"IF(J162>0,I162-60,IF(J162=0,I162,0))","v":0},0,null,null,null,null,null,null,null,null,null,null,null,null,null,null,null,null,null,null,null,null,{"$f":"IF(Lotsen!A159=\"\",\"zzz\",Lotsen!A159)","v":"zzz"}]
[null,"",null,"2025-02-09",4,3,null,"zzz",{"$f":"SUMIF($C$5:$C$1000,H163,$F$5:$F$1000)+L163","v":0},{"$f":"IF(I163>=60,1,0)","v":0},{"$f":"IF(J163>0,I163-60,IF(J163=0,I163,0))","v":0},0,null,null,null,null,null,null,null,null,null,null,null,null,null,null,null,null,null,null,null,null,{"$f":"IF(Lotsen!A160=\"\",\"zzz\",Lotsen!A160)","v":"zzz"}]
[null,"",null,"2025-02-09",4,3,null,"zzz",{"$f":"SUMIF($C$5:$C$1000,H164,$F$5:$F$1000)+L164","v":0},{"$f":"IF(I164>=60,1,0)","v":0},{"$f":"IF(J164>0,I164-60,IF(J164=0,I164,0))","v":0},0,null,null,null,null,null,null,null,null,null,null,null,null,null,null,null,null,null,null,null,null,{"$f":"IF(Lotsen!A161=\"\",\"zzz\",Lotsen!A161)","v":"zzz"}]
[null,"",null,"2025-02-09",5,4,null,"zzz",{"$f":"SUMIF($C$5:$C$1000,H165,$F$5:$F$1000)+L165","v":0},{"$f":"IF(I165>=60,1,0)","v":0},{"$f":"IF(J165>0,I165-60,IF(J165=0,I165,0))","v":0},0,null,null,null,null,null,null,null,null,null,null,null,null,null,null,null,null,null,null,null,null,{"$f":"IF(Lotsen!A162=\"\",\"zzz\",Lotsen!A162)","v":"zzz"}]
[null,"",null,"2025-02-09",4,3,null,"zzz",{"$f":"SUMIF($C$5:$C$1000,H166,$F$5:$F$1000)+L166","v":0},{"$f":"IF(I166>=60,1,0)","v":0},{"$f":"IF(J166>0,I166-60,IF(J166=0,I166,0))","v":0},0,null,null,null,null,null,null,null,null,null,null,null,null,null,null,null,null,null,null,null,null,{"$f":"IF(Lotsen!A163=\"\",\"zzz\",Lotsen!A163)","v":"zzz"}]
[null,"",null,"2025-02-09",4,3,null,"zzz",{"$f":"SUMIF($C$5:$C$1000,H167,$F$5:$F$1000)+L167","v":0},{"$f":"IF(I167>=60,1,0)","v":0},{"$f":"IF(J167>0,I167-60,IF(J167=0,I167,0))","v":0},0,null,null,null,null,null,null,null,null,null,null,null,null,null,null,null,null,null,null,null,null,{"$f":"IF(Lotsen!A164=\"\",\"zzz\",Lotsen!A164)","v":"zzz"}]
[null,"",null,"2025-02-09",2,1,null,"zzz",{"$f":"SUMIF($C$5:$C$1000,H168,$F$5:$F$1000)+L168","v":0},{"$f":"IF(I168>=60,1,0)","v":0},{"$f":"IF(J168>0,I168-60,IF(J168=0,I168,0))","v":0},0,null,null,null,null,null,null,null,null,null,null,null,null,null,null,null,null,null,null,null,null,{"$f":"IF(Lotsen!A165=\"\",\"zzz\",Lotsen!A165)","v":"zzz"}]
[null,"",null,"2025-02-10",2,1,null,"zzz",{"$f":"SUMIF($C$5:$C$1000,H169,$F$5:$F$1000)+L169","v":0},{"$f":"IF(I169>=60,1,0)","v":0},{"$f":"IF(J169>0,I169-60,IF(J169=0,I169,0))","v":0},0,null,null,null,null,null,null,null,null,null,null,null,null,null,null,null,null,null,null,null,null,{"$f":"IF(Lotsen!A166=\"\",\"zzz\",Lotsen!A166)","v":"zzz"}]
[null,"",null,"2025-02-10",3,2,null,"zzz",{"$f":"SUMIF($C$5:$C$1000,H170,$F$5:$F$1000)+L170","v":0},{"$f":"IF(I170>=60,1,0)","v":0},{"$f":"IF(J170>0,I170-60,IF(J170=0,I170,0))","v":0},0,null,null,null,null,null,null,null,null,null,null,null,null,null,null,null,null,null,null,null,null,{"$f":"IF(Lotsen!A167=\"\",\"zzz\",Lotsen!A167)","v":"zzz"}]
[null,"",null,"2025-02-10",3,2,null,"zzz",{"$f":"SUMIF($C$5:$C$1000,H171,$F$5:$F$1000)+L171","v":0},{"$f":"IF(I171>=60,1,0)","v":0},{"$f":"IF(J171>0,I171-60,IF(J171=0,I171,0))","v":0},0,null,null,null,null,null,null,null,null,null,null,null,null,null,null,null,null,null,null,null,null,{"$f":"IF(Lotsen!A168=\"\",\"zzz\",Lotsen!A168)","v":"zzz"}]
[null,"",null,"2025-02-10",3,2,null,"zzz",{"$f":"SUMIF($C$5:$C$1000,H172,$F$5:$F$1000)+L172","v":0},{"$f":"IF(I172>=60,1,0)","v":0},{"$f":"IF(J172>0,I172-60,IF(J172=0,I172,0))","v":0},0,null,null,null,null,null,null,null,null,null,null,null,null,null,null,null,null,null,null,null,null,{"$f":"IF(Lotsen!A169=\"\",\"zzz\",Lotsen!A169)","v":"zzz"}]
[null,"",null,"2025-02-10",5,4,null,"zzz",{"$f":"SUMIF($C$5:$C$1000,H173,$F$5:$F$1000)+L173","v":0},{"$f":"IF(I173>=60,1,0)","v":0},{"$f":"IF(J173>0,I173-60,IF(J173=0,I173,0))","v":0},0,null,null,null,null,null,null,null,null,null,null,null,null,null,null,null,null,null,null,null,null,{"$f":"IF(Lotsen!A170=\"\",\"zzz\",Lotsen!A170)","v":"zzz"}]
[null,"",null,"2025-02-10",5,4,null,"zzz",{"$f":"SUMIF($C$5:$C$1000,H174,$F$5:$F$1000)+L174","v":0},{"$f":"IF(I174>=60,1,0)","v":0},{"$f":"IF(J174>0,I174-60,IF(J174=0,I174,0))","v":0},0,null,null,null,null,null,null,null,null,null,null,null,null,null,null,null,null,null,null,null,null,{"$f":"IF(Lotsen!A171=\"\",\"zzz\",Lotsen!A171)","v":"zzz"}]
[null,"",null,"2025-02-10",3,2,null,"zzz",{"$f":"SUMIF($C$5:$C$1000,H175,$F$5:$F$1000)+L175","v":0},{"$f":"IF(I175>=60,1,0)","v":0},{"$f":"IF(J175>0,I175-60,IF(J175=0,I175,0))","v":0},0,null,null,null,null,null,null,null,null,null,null,null,null,null,null,null,null,null,null,null,null,{"$f":"IF(Lotsen!A172=\"\",\"zzz\",Lotsen!A172)","v":"zzz"}]
[null,"",null,"2025-02-10",2,1,null,"zzz",{"$f":"SUMIF($C$5:$C$1000,H176,$F$5:$F$1000)+L176","v":0},{"$f":"IF(I176>=60,1,0)","v":0},{"$f":"IF(J176>0,I176-60,IF(J176=0,I176,0))","v":0},0,null,null,null,null,null,null,null,null,null,null,null,null,null,null,null,null,null,null,null,null,{"$f":"IF(Lotsen!A173=\"\",\"zzz\",Lotsen!A173)","v":"zzz"}]
[null,"",null,"2025-02-10",2,1,null,"zzz",{"$f":"SUMIF($C$5:$C$1000,H177,$F$5:$F$1000)+L177","v":0},{"$f":"IF(I177>=60,1,0)","v":0},{"$f":"IF(J177>0,I177-60,IF(J177=0,I177,0))","v":0},0,null,null,null,null,null,null,null,null,null,null,null,null,null,null,null,null,null,null,null,null,{"$f":"IF(Lotsen!A174=\"\",\"zzz\",Lotsen!A174)","v":"zzz"}]
[null,"",null,"2025-02-10",2,1,null,"zzz",{"$f":"SUMIF($C$5:$C$1000,H178,$F$5:$F$1000)+L178","v":0},{"$f":"IF(I178>=60,1,0)","v":0},{"$f":"IF(J178>0,I178-60,IF(J178=0,I178,0))","v":0},0,null,null,null,null,null,null,null,null,null,null,null,null,null,null,null,null,null,null,null,null,{"$f":"IF(Lotsen!A175=\"\",\"zzz\",Lotsen!A175)","v":"zzz"}]
[null,"",null,"2025-02-10",2,1,null,"zzz",{"$f":"SUMIF($C$5:$C$1000,H179,$F$5:$F$1000)+L179","v":0},{"$f":"IF(I179>=60,1,0)","v":0},{"$f":"IF(J179>0,I179-60,IF(J179=0,I179,0))","v":0},0,null,null,null,null,null,null,null,null,null,null,null,null,null,null,null,null,null,null,null,null,{"$f":"IF(Lotsen!A176=\"\",\"zzz\",Lotsen!A176)","v":"zzz"}]
[null,"",null,"2025-02-10",3,2,null,"zzz",{"$f":"SUMIF($C$5:$C$1000,H180,$F$5:$F$1000)+L180","v":0},{"$f":"IF(I180>=60,1,0)","v":0},{"$f":"IF(J180>0,I180-60,IF(J180=0,I180,0))","v":0},0,null,null,null,null,null,null,null,null,null,null,null,null,null,null,null,null,null,null,null,null,{"$f":"IF(Lotsen!A177=\"\",\"zzz\",Lotsen!A177)","v":"zzz"}]
[null,"",null,"2025-02-10",2,1,null,"zzz",{"$f":"SUMIF($C$5:$C$1000,H181,$F$5:$F$1000)+L181","v":0},{"$f":"IF(I181>=60,1,0)","v":0},{"$f":"IF(J181>0,I181-60,IF(J181=0,I181,0))","v":0},0,null,null,null,null,null,null,null,null,null,null,null,null,null,null,null,null,null,null,null,null,{"$f":"IF(Lotsen!A178=\"\",\"zzz\",Lotsen!A178)","v":"zzz"}]
[null,"",null,"2025-02-10",2,1,null,"zzz",{"$f":"SUMIF($C$5:$C$1000,H182,$F$5:$F$1000)+L182","v":0},{"$f":"IF(I182>=60,1,0)","v":0},{"$f":"IF(J182>0,I182-60,IF(J182=0,I182,0))","v":0},0,null,null,null,null,null,null,null,null,null,null,null,null,null,null,null,null,null,null,null,null,{"$f":"IF(Lotsen!A179=\"\",\"zzz\",Lotsen!A179)","v":"zzz"}]
[null,"",null,"2025-02-10",2,1,null,"zzz",{"$f":"SUMIF($C$5:$C$1000,H183,$F$5:$F$1000)+L183","v":0},{"$f":"IF(I183>=60,1,0)","v":0},{"$f":"IF(J183>0,I183-60,IF(J183=0,I183,0))","v":0},0,null,null,null,null,null,null,null,null,null,null,null,null,null,null,null,null,null,null,null,null,{"$f":"IF(Lotsen!A180=\"\",\"zzz\",Lotsen!A180)","v":"zzz"}]
[null,"",null,"2025-02-10",3,2,null,"zzz",{"$f":"SUMIF($C$5:$C$1000,H184,$F$5:$F$1000)+L184","v":0},{"$f":"IF(I184>=60,1,0)","v":0},{"$f":"IF(J184>0,I184-60,IF(J184=0,I184,0))","v":0},0,null,null,null,null,null,null,null,null,null,null,null,null,null,null,null,null,null,null,null,null,{"$f":"IF(Lotsen!A181=\"\",\"zzz\",Lotsen!A181)","v":"zzz"}]
[null,"",null,"2025-02-10",4,3,null,"zzz",{"$f":"SUMIF($C$5:$C$1000,H185,$F$5:$F$1000)+L185","v":0},{"$f":"IF(I185>=60,1,0)","v":0},{"$f":"IF(J185>0,I185-60,IF(J185=0,I185,0))","v":0},0,null,null,null,null,null,null,null,null,null,null,null,null,null,null,null,null,null,null,null,null,{"$f":"IF(Lotsen!A182=\"\",\"zzz\",Lotsen!A182)","v":"zzz"}]
[null,"",null,"2025-02-10",2,1,null,"zzz",{"$f":"SUMIF($C$5:$C$1000,H186,$F$5:$F$1000)+L186","v":0},{"$f":"IF(I186>=60,1,0)","v":0},{"$f":"IF(J186>0,I186-60,IF(J186=0,I186,0))","v":0},0,null,null,null,null,null,null,null,null,null,null,null,null,null,null,null,null,null,null,null,null,{"$f":"IF(Lotsen!A183=\"\",\"zzz\",Lotsen!A183)","v":"zzz"}]
[null,"",null,"2025-02-10",2,1,null,"zzz",{"$f":"SUMIF($C$5:$C$1000,H187,$F$5:$F$1000)+L187","v":0},{"$f":"IF(I187>=60,1,0)","v":0},{"$f":"IF(J187>0,I187-60,IF(J187=0,I187,0))","v":0},0,null,null,null,null,null,null,null,null,null,null,null,null,null,null,null,null,null,null,null,null,{"$f":"IF(Lotsen!A184=\"\",\"zzz\",Lotsen!A184)","v":"zzz"}]
[null,"",null,"2025-02-10",5,4,null,"zzz",{"$f":"SUMIF($C$5:$C$1000,H188,$F$5:$F$1000)+L188","v":0},{"$f":"IF(I188>=60,1,0)","v":0},{"$f":"IF(J188>0,I188-60,IF(J188=0,I188,0))","v":0},0,null,null,null,null,null,null,null,null,null,null,null,null,null,null,null,null,null,null,null,null,{"$f":"IF(Lotsen!A185=\"\",\"zzz\",Lotsen!A185)","v":"zzz"}]
[null,"",null,"2025-02-11",5,4,null,"zzz",{"$f":"SUMIF($C$5:$C$1000,H189,$F$5:$F$1000)+L189","v":0},{"$f":"IF(I189>=60,1,0)","v":0},{"$f":"IF(J189>0,I189-60,IF(J189=0,I189,0))","v":0},0,null,null,null,null,null,null,null,null,null,null,null,null,null,null,null,null,null,null,null,null,{"$f":"IF(Lotsen!A186=\"\",\"zzz\",Lotsen!A186)","v":"zzz"}]
[null,"",null,"2025-02-11",2,1,null,"zzz",{"$f":"SUMIF($C$5:$C$1000,H190,$F$5:$F$1000)+L190","v":0},{"$f":"IF(I190>=60,1,0)","v":0},{"$f":"IF(J190>0,I190-60,IF(J190=0,I190,0))","v":0},0,null,null,null,null,null,null,null,null,null,null,null,null,null,null,null,null,null,null,null,null,{"$f":"IF(Lotsen!A187=\"\",\"zzz\",Lotsen!A187)","v":"zzz"}]
[null,"",null,"2025-02-11",5,4,null,"zzz",{"$f":"SUMIF($C$5:$C$1000,H191,$F$5:$F$1000)+L191","v":0},{"$f":"IF(I191>=60,1,0)","v":0},{"$f":"IF(J191>0,I191-60,IF(J191=0,I191,0))","v":0},0,null,null,null,null,null,null,null,null,null,null,null,null,null,null,null,null,null,null,null,null,{"$f":"IF(Lotsen!A188=\"\",\"zzz\",Lotsen!A188)","v":"zzz"}]
[null,"",null,"2025-02-11",5,4,null,"zzz",{"$f":"SUMIF($C$5:$C$1000,H192,$F$5:$F$1000)+L192","v":0},{"$f":"IF(I192>=60,1,0)","v":0},{"$f":"IF(J192>0,I192-60,IF(J192=0,I192,0))","v":0},0,null,null,null,null,null,null,null,null,null,null,null,null,null,null,null,null,null,null,null,null,{"$f":"IF(Lotsen!A189=\"\",\"zzz\",Lotsen!A189)","v":"zzz"}]
[null,"",null,"2025-02-11",4,3,null,"zzz",{"$f":"SUMIF($C$5:$C$1000,H193,$F$5:$F$1000)+L193","v":0},{"$f":"IF(I193>=60,1,0)","v":0},{"$f":"IF(J193>0,I193-60,IF(J193=0,I193,0))","v":0},0,null,null,null,null,null,null,null,null,null,null,null,null,null,null,null,null,null,null,null,null,{"$f":"IF(Lotsen!A190=\"\",\"zzz\",Lotsen!A190)","v":"zzz"}]
[null,"",null,null,null,"",null,"zzz",{"$f":"SUMIF($C$5:$C$1000,H194,$F$5:$F$1000)+L194","v":0},{"$f":"IF(I194>=60,1,0)","v":0},{"$f":"IF(J194>0,I194-60,IF(J194=0,I194,0))","v":0},0,null,null,null,null,null,null,null,null,null,null,null,null,null,null,null,null,null,null,null,null,{"$f":"IF(Lotsen!A191=\"\",\"zzz\",Lotsen!A191)","v":"zzz"}]
[null,"",null,null,null,"",null,"zzz",{"$f":"SUMIF($C$5:$C$1000,H195,$F$5:$F$1000)+L195","v":0},{"$f":"IF(I195>=60,1,0)","v":0},{"$f":"IF(J195>0,I195-60,IF(J195=0,I195,0))","v":0},0,null,null,null,null,null,null,null,null,null,null,null,null,null,null,null,null,null,null,null,null,{"$f":"IF(Lotsen!A192=\"\",\"zzz\",Lotsen!A192)","v":"zzz"}]
[null,"",null,null,null,"",null,"zzz",{"$f":"SUMIF($C$5:$C$1000,H196,$F$5:$F$1000)+L196","v":0},{"$f":"IF(I196>=60,1,0)","v":0},{"$f":"IF(J196>0,I196-60,IF(J196=0,I196,0))","v":0},0,null,null,null,null,null,null,null,null,null,null,null,null,null,null,null,null,null,null,null,null,{"$f":"IF(Lotsen!A193=\"\",\"zzz\",Lotsen!A193)","v":"zzz"}]
[null,"",null,null,null,"",null,"zzz",{"$f":"SUMIF($C$5:$C$1000,H197,$F$5:$F$1000)+L197","v":0},{"$f":"IF(I197>=60,1,0)","v":0},{"$f":"IF(J197>0,I197-60,IF(J197=0,I197,0))","v":0},0,null,null,null,null,null,null,null,null,null,null,null,null,null,null,null,null,null,null,null,null,{"$f":"IF(Lotsen!A194=\"\",\"zzz\",Lotsen!A194)","v":"zzz"}]
[null,"",null,null,null,{"$f":"IF(D198=\"\",\"\",E198-1)","v":""},null,"zzz",{"$f":"SUMIF($C$5:$C$1000,H198,$F$5:$F$1000)+L198","v":0},{"$f":"IF(I198>=60,1,0)","v":0},{"$f":"IF(J198>0,I198-60,IF(J198=0,I198,0))","v":0},0,null,null,null,null,null,null,null,null,null,null,null,null,null,null,null,null,null,null,null,null,{"$f":"IF(Lotsen!A195=\"\",\"zzz\",Lotsen!A195)","v":"zzz"}]
[null,{"$f":"IF(C199=\"\",\"\",B198+1)","v":""},null,null,null,"",null,"zzz",{"$f":"SUMIF($C$5:$C$1000,H199,$F$5:$F$1000)+L199","v":0},{"$f":"IF(I199>=60,1,0)","v":0},{"$f":"IF(J199>0,I199-60,IF(J199=0,I199,0))","v":0},0,null,null,null,null,null,null,null,null,null,null,null,null,null,null,null,null,null,null,null,null,{"$f":"IF(Lotsen!A196=\"\",\"zzz\",Lotsen!A196)","v":"zzz"}]
[null,"",null,null,null,"",null,"zzz",{"$f":"SUMIF($C$5:$C$1000,H200,$F$5:$F$1000)+L200","v":0},{"$f":"IF(I200>=60,1,0)","v":0},{"$f":"IF(J200>0,I200-60,IF(J200=0,I200,0))","v":0},0,null,null,null,null,null,null,null,null,null,null,null,null,null,null,null,null,null,null,null,null,{"$f":"IF(Lotsen!A197=\"\",\"zzz\",Lotsen!A197)","v":"zzz"}]
[null,"",null,null,null,"",null,"zzz",{"$f":"SUMIF($C$5:$C$1000,H201,$F$5:$F$1000)+L201","v":0},{"$f":"IF(I201>=60,1,0)","v":0},{"$f":"IF(J201>0,I201-60,IF(J201=0,I201,0))","v":0},0,null,null,null,null,null,null,null,null,null,null,null,null,null,null,null,null,null,null,null,null,{"$f":"IF(Lotsen!A198=\"\",\"zzz\",Lotsen!A198)","v":"zzz"}]
[null,"",null,null,null,"",null,"zzz",{"$f":"SUMIF($C$5:$C$1000,H202,$F$5:$F$1000)+L202","v":0},{"$f":"IF(I202>=60,1,0)","v":0},{"$f":"IF(J202>0,I202-60,IF(J202=0,I202,0))","v":0},0,null,null,null,null,null,null,null,null,null,null,null,null,null,null,null,null,null,null,null,null,{"$f":"IF(Lotsen!A199=\"\",\"zzz\",Lotsen!A199)","v":"zzz"}]
[null,"",null,null,null,"",null,"zzz",{"$f":"SUMIF($C$5:$C$1000,H203,$F$5:$F$1000)+L203","v":0},{"$f":"IF(I203>=60,1,0)","v":0},{"$f":"IF(J203>0,I203-60,IF(J203=0,I203,0))","v":0},0,null,null,null,null,null,null,null,null,null,null,null,null,null,null,null,null,null,null,null,null,{"$f":"IF(Lotsen!A200=\"\",\"zzz\",Lotsen!A200)","v":"zzz"}]
[null,"",null,null,null,"",null,"zzz",{"$f":"SUMIF($C$5:$C$1000,H204,$F$5:$F$1000)+L204","v":0},{"$f":"IF(I204>=60,1,0)","v":0},{"$f":"IF(J204>0,I204-60,IF(J204=0,I204,0))","v":0},0,null,null,null,null,null,null,null,null,null,null,null,null,null,null,null,null,null,null,null,null,{"$f":"IF(Lotsen!A201=\"\",\"zzz\",Lotsen!A201)","v":"zzz"}]
[null,"",null,null,null,"",null,"zzz",{"$f":"SUMIF($C$5:$C$1000,H205,$F$5:$F$1000)+L205","v":0},{"$f":"IF(I205>=60,1,0)","v":0},{"$f":"IF(J205>0,I205-60,IF(J205=0,I205,0))","v":0},0,null,null,null,null,null,null,null,null,null,null,null,null,null,null,null,null,null,null,null,null,{"$f":"IF(Lotsen!A202=\"\",\"zzz\",Lotsen!A202)","v":"zzz"}]
[null,"",null,null,null,"",null,"zzz",{"$f":"SUMIF($C$5:$C$1000,H206,$F$5:$F$1000)+L206","v":0},{"$f":"IF(I206>=60,1,0)","v":0},{"$f":"IF(J206>0,I206-60,IF(J206=0,I206,0))","v":0},0,null,null,null,null,null,null,null,null,null,null,null,null,null,null,null,null,null,null,null,null,{"$f":"IF(Lotsen!A203=\"\",\"zzz\",Lotsen!A203)","v":"zzz"}]
[null,"",null,null,null,"",null,"zzz",{"$f":"SUMIF($C$5:$C$1000,H207,$F$5:$F$1000)+L207","v":0},{"$f":"IF(I207>=60,1,0)","v":0},{"$f":"IF(J207>0,I207-60,IF(J207=0,I207,0))","v":0},0,null,null,null,null,null,null,null,null,null,null,null,null,null,null,null,null,null,null,null,null,{"$f":"IF(Lotsen!A204=\"\",\"zzz\",Lotsen!A204)","v":"zzz"}]
[null,"",null,null,null,"",null,"zzz",{"$f":"SUMIF($C$5:$C$1000,H208,$F$5:$F$1000)+L208","v":0},{"$f":"IF(I208>=60,1,0)","v":0},{"$f":"IF(J208>0,I208-60,IF(J208=0,I208,0))","v":0},0,null,null,null,null,null,null,null,null,null,null,null,null,null,null,null,null,null,null,null,null,{"$f":"IF(Lotsen!A205=\"\",\"zzz\",Lotsen!A205)","v":"zzz"}]
[null,"",null,null,null,"",null,"zzz",{"$f":"SUMIF($C$5:$C$1000,H209,$F$5:$F$1000)+L209","v":0},{"$f":"IF(I209>=60,1,0)","v":0},{"$f":"IF(J209>0,I209-60,IF(J209=0,I209,0))","v":0},0,null,null,null,null,null,null,null,null,null,null,null,null,null,null,null,null,null,null,null,null,{"$f":"IF(Lotsen!A206=\"\",\"zzz\",Lotsen!A206)","v":"zzz"}]
[null,"",null,null,null,"",null,"zzz",{"$f":"SUMIF($C$5:$C$1000,H210,$F$5:$F$1000)+L210","v":0},{"$f":"IF(I210>=60,1,0)","v":0},{"$f":"IF(J210>0,I210-60,IF(J210=0,I210,0))","v":0},0,null,null,null,null,null,null,null,null,null,null,null,null,null,null,null,null,null,null,null,null,{"$f":"IF(Lotsen!A207=\"\",\"zzz\",Lotsen!A207)","v":"zzz"}]
[null,"",null,null,null,"",null,"zzz",{"$f":"SUMIF($C$5:$C$1000,H211,$F$5:$F$1000)+L211","v":0},{"$f":"IF(I211>=60,1,0)","v":0},{"$f":"IF(J211>0,I211-60,IF(J211=0,I211,0))","v":0},0,null,null,null,null,null,null,null,null,null,null,null,null,null,null,null,null,null,null,null,null,{"$f":"IF(Lotsen!A208=\"\",\"zzz\",Lotsen!A208)","v":"zzz"}]
[null,"",null,null,null,"",null,"zzz",{"$f":"SUMIF($C$5:$C$1000,H212,$F$5:$F$1000)+L212","v":0},{"$f":"IF(I212>=60,1,0)","v":0},{"$f":"IF(J212>0,I212-60,IF(J212=0,I212,0))","v":0},0,null,null,null,null,null,null,null,null,null,null,null,null,null,null,null,null,null,null,null,null,{"$f":"IF(Lotsen!A209=\"\",\"zzz\",Lotsen!A209)","v":"zzz"}]
[null,{"$f":"IF(C213=\"\",\"\",B212+1)","v":""},null,null,null,{"$f":"IF(D213=\"\",\"\",E213-1)","v":""},null,"zzz",{"$f":"SUMIF($C$5:$C$1000,H213,$F$5:$F$1000)+L213","v":0},{"$f":"IF(I213>=60,1,0)","v":0},{"$f":"IF(J213>0,I213-60,IF(J213=0,I213,0))","v":0},0,null,null,null,null,null,null,null,null,null,null,null,null,null,null,null,null,null,null,null,null,{"$f":"IF(Lotsen!A210=\"\",\"zzz\",Lotsen!A210)","v":"zzz"}]
[null,"",null,null,null,""]
[null,"",null,null,null,""]
[null,"",null,null,null,""]
[null,"",null,null,null,""]
[null,"",null,null,null,""]
[null,"",null,null,null,""]
[null,"",null,null,null,""]
[null,"",null,null,null,""]
[null,"",null,null,null,""]
[null,"",null,null,null,""]
[null,"",null,null,null,""]
[null,"",null,null,null,""]
[null,"",null,null,null,""]
[null,"",null,null,null,""]
[null,"",null,null,null,""]
[null,"",null,null,null,""]
[null,"",null,null,null,""]
[null,"",null,null,null,""]
[null,"",null,null,null,""]
[null,"",null,null,null,""]
[null,"",null,null,null,""]
[null,"",null,null,null,""]
[null,"",null,null,null,""]
[null,"",null,null,null,""]
[null,"",null,null,null,""]
[null,"",null,null,null,""]
[null,"",null,null,null,""]
[null,"",null,null,null,""]
[null,"",null,null,null,""]
[null,"",null,null,null,""]
[null,"",null,null,null,""]
[null,"",null,null,null,""]
[null,"",null,null,null,""]
[null,"",null,null,null,""]
[null,"",null,null,null,""]
[null,"",null,null,null,""]
[null,"",null,null,null,""]
[null,"",null,null,null,""]
[null,"",null,null,null,""]
[null,"",null,null,null,""]
[null,"",null,null,null,""]
[null,"",null,null,null,""]
[null,"",null,null,null,""]
[null,"",null,null,null,""]
[null,"",null,null,null,""]
[null,"",null,null,null,""]
[null,"",null,null,null,""]
[null,"",null,null,null,""]
[null,"",null,null,null,""]
[null,"",null,null,null,""]
[null,"",null,null,null,""]
[null,"",null,null,null,""]
[null,"",null,null,null,""]
[null,"",null,null,null,""]
[null,"",null,null,null,""]
[null,"",null,null,null,""]
[null,"",null,null,null,""]
[null,"",null,null,null,""]
[null,"",null,null,null,""]
[null,"",null,null,null,""]
[null,"",null,null,null,""]
[null,"",null,null,null,""]
[null,"",null,null,null,""]
[null,{"$f":"IF(C277=\"\",\"\",B276+1)","v":""},null,null,null,{"$f":"IF(D277=\"\",\"\",E277-1)","v":""}]
[null,"",null,null,null,""]
[null,"",null,null,null,""]
[null,"",null,null,null,""]
[null,"",null,null,null,""]
[null,"",null,null,null,""]
[null,"",null,null,null,""]
[null,"",null,null,null,""]
[null,"",null,null,null,""]
[null,"",null,null,null,""]
[null,"",null,null,null,""]
[null,"",null,null,null,""]
[null,"",null,null,null,""]
[null,"",null,null,null,""]
[null,"",null,null,null,""]
[null,"",null,null,null,""]
[null,"",null,null,null,""]
[null,"",null,null,null,""]
[null,"",null,null,null,""]
[null,"",null,null,null,""]
[null,"",null,null,null,""]
[null,"",null,null,null,""]
[null,"",null,null,null,""]
[null,"",null,null,null,""]
[null,"",null,null,null,""]
[null,"",null,null,null,""]
[null,"",null,null,null,""]
[null,"",null,null,null,""]
[null,"",null,null,null,""]
[null,"",null,null,null,""]
[null,"",null,null,null,""]
[null,"",null,null,null,""]
[null,"",null,null,null,""]
[null,"",null,null,null,""]
[null,"",null,null,null,""]
[null,"",null,null,null,""]
[null,"",null,null,null,""]
[null,"",null,null,null,""]
[null,"",null,null,null,""]
[null,"",null,null,null,""]
[null,"",null,null,null,""]
[null,"",null,null,null,""]
[null,"",null,null,null,""]
[null,"",null,null,null,""]
[null,"",null,null,null,""]
[null,"",null,null,null,""]
[null,"",null,null,null,""]
[null,"",null,null,null,""]
[null,"",null,null,null,""]
[null,"",null,null,null,""]
[null,"",null,null,null,""]
[null,"",null,null,null,""]
[null,"",null,null,null,""]
[null,"",null,null,null,""]
[null,"",null,null,null,""]
[null,"",null,null,null,""]
[null,"",null,null,null,""]
[null,"",null,null,null,""]
[null,"",null,null,null,""]
[null,"",null,null,null,""]
[null,"",null,null,null,""]
[null,"",null,null,null,""]
[null,"",null,null,null,""]
[null,"",null,null,null,""]
[null,{"$f":"IF(C341=\"\",\"\",B340+1)","v":""},null,null,null,{"$f":"IF(D341=\"\",\"\",E341-1)","v":""}]
[null,"",null,null,null,""]
[null,"",null,null,null,""]
[null,"",null,null,null,""]
[null,"",null,null,null,""]
[null,"",null,null,null,""]
[null,"",null,null,null,""]
[null,"",null,null,null,""]
[null,"",null,null,null,""]
[null,"",null,null,null,""]
[null,"",null,null,null,""]
[null,"",null,null,null,""]
[null,"",null,null,null,""]
[null,"",null,null,null,""]
[null,"",null,null,null,""]
[null,"",null,null,null,""]
[null,"",null,null,null,""]
[null,"",null,null,null,""]
[null,"",null,null,null,""]
[null,"",null,null,null,""]
[null,"",null,null,null,""]
[null,"",null,null,null,""]
[null,"",null,null,null,""]
[null,"",null,null,null,""]
[null,"",null,null,null,""]
[null,"",null,null,null,""]
[null,"",null,null,null,""]
[null,"",null,null,null,""]
[null,"",null,null,null,""]
[null,"",null,null,null,""]
[null,"",null,null,null,""]
[null,"",null,null,null,""]
[null,"",null,null,null,""]
[null,"",null,null,null,""]
[null,"",null,null,null,""]
[null,"",null,null,null,""]
[null,"",null,null,null,""]
[null,"",null,null,null,""]
[null,"",null,null,null,""]
[null,"",null,null,null,""]
[null,"",null,null,null,""]
[null,"",null,null,null,""]
[null,"",null,null,null,""]
[null,"",null,null,null,""]
[null,"",null,null,null,""]
[null,"",null,null,null,""]
[null,"",null,null,null,""]
[null,"",null,null,null,""]
[null,"",null,null,null,""]
[null,"",null,null,null,""]
[null,"",null,null,null,""]
[null,"",null,null,null,""]
[null,"",null,null,null,""]
[null,"",null,null,null,""]
[null,"",null,null,null,""]
[null,"",null,null,null,""]
[null,"",null,null,null,""]
[null,"",null,null,null,""]
[null,"",null,null,null,""]
[null,"",null,null,null,""]
[null,"",null,null,null,""]
[null,"",null,null,null,""]
[null,"",null,null,null,""]
[null,"",null,null,null,""]
[null,{"$f":"IF(C405=\"\",\"\",B404+1)","v":""},null,null,null,{"$f":"IF(D405=\"\",\"\",E405-1)","v":""}]
[null,"",null,null,null,""]
[null,"",null,null,null,""]
[null,"",null,null,null,""]
[null,"",null,null,null,""]
[null,"",null,null,null,""]
[null,"",null,null,null,""]
[null,"",null,null,null,""]
[null,"",null,null,null,""]
[null,"",null,null,null,""]
[null,"",null,null,null,""]
[null,"",null,null,null,""]
[null,"",null,null,null,""]
[null,"",null,null,null,""]
[null,"",null,null,null,""]
[null,"",null,null,null,""]
[null,"",null,null,null,""]
[null,"",null,null,null,""]
[null,"",null,null,null,""]
[null,"",null,null,null,""]
[null,"",null,null,null,""]
[null,"",null,null,null,""]
[null,"",null,null,null,""]
[null,"",null,null,null,""]
[null,"",null,null,null,""]
[null,"",null,null,null,""]
[null,"",null,null,null,""]
[null,"",null,null,null,""]
[null,"",null,null,null,""]
[null,"",null,null,null,""]
[null,"",null,null,null,""]
[null,"",null,null,null,""]
[null,"",null,null,null,""]
[null,"",null,null,null,""]
[null,"",null,null,null,""]
[null,"",null,null,null,""]
[null,"",null,null,null,""]
[null,"",null,null,null,""]
[null,"",null,null,null,""]
[null,"",null,null,null,""]
[null,"",null,null,null,""]
[null,"",null,null,null,""]
[null,"",null,null,null,""]
[null,"",null,null,null,""]
[null,"",null,null,null,""]
[null,"",null,null,null,""]
[null,"",null,null,null,""]
[null,"",null,null,null,""]
[null,"",null,null,null,""]
[null,"",null,null,null,""]
[null,"",null,null,null,""]
[null,"",null,null,null,""]
[null,"",null,null,null,""]
[null,"",null,null,null,""]
[null,"",null,null,null,""]
[null,"",null,null,null,""]
[null,"",null,null,null,""]
[null,"",null,null,null,""]
[null,"",null,null,null,""]
[null,"",null,null,null,""]
[null,"",null,null,null,""]
[null,"",null,null,null,""]
[null,"",null,null,null,""]
[null,"",null,null,null,""]
[null,{"$f":"IF(C469=\"\",\"\",B468+1)","v":""},null,null,null,{"$f":"IF(D469=\"\",\"\",E469-1)","v":""}]
[null,"",null,null,null,""]
[null,"",null,null,null,""]
[null,"",null,null,null,""]
[null,"",null,null,null,""]
[null,"",null,null,null,""]
[null,"",null,null,null,""]
[null,"",null,null,null,""]
[null,"",null,null,null,""]
[null,"",null,null,null,""]
[null,"",null,null,null,""]
[null,"",null,null,null,""]
[null,"",null,null,null,""]
[null,"",null,null,null,""]
[null,"",null,null,null,""]
[null,"",null,null,null,""]
[null,"",null,null,null,""]
[null,"",null,null,null,""]
[null,"",null,null,null,""]
[null,"",null,null,null,""]
[null,"",null,null,null,""]
[null,"",null,null,null,""]
[null,"",null,null,null,""]
[null,"",null,null,null,""]
[null,"",null,null,null,""]
[null,"",null,null,null,""]
[null,"",null,null,null,""]
[null,"",null,null,null,""]
[null,"",null,null,null,""]
[null,"",null,null,null,""]
[null,"",null,null,null,""]
[null,{"$f":"IF(C500=\"\",\"\",B499+1)","v":""},null,null,null,{"$f":"IF(D500=\"\",\"\",E500-1)","v":""}]
[null,"",null,null,null,""]
[null,"",null,null,null,""]
[null,"",null,null,null,""]
[null,"",null,null,null,""]
[null,"",null,null,null,""]
[null,"",null,null,null,""]
[null,"",null,null,null,""]
[null,"",null,null,null,""]
[null,"",null,null,null,""]
[null,"",null,null,null,""]
[null,"",null,null,null,""]
[null,"",null,null,null,""]
[null,"",null,null,null,""]
[null,"",null,null,null,""]
[null,"",null,null,null,""]
[null,"",null,null,null,""]
[null,"",null,null,null,""]
[null,"",null,null,null,""]
[null,"",null,null,null,""]
[null,"",null,null,null,""]
[null,"",null,null,null,""]
[null,"",null,null,null,""]
[null,"",null,null,null,""]
[null,"",null,null,null,""]
[null,"",null,null,null,""]
[null,"",null,null,null,""]
[null,"",null,null,null,""]
[null,"",null,null,null,""]
[null,"",null,null,null,""]
[null,"",null,null,null,""]
[null,"",null,null,null,""]
[null,"",null,null,null,""]
[null,"",null,null,null,""]
[null,"",null,null,null,""]
[null,"",null,null,null,""]
[null,"",null,null,null,""]
[null,"",null,null,null,""]
[null,"",null,null,null,""]
[null,"",null,null,null,""]
[null,"",null,null,null,""]
[null,"",null,null,null,""]
[null,"",null,null,null,""]
[null,"",null,null,null,""]
[null,"",null,null,null,""]
[null,"",null,null,null,""]
[null,"",null,null,null,""]
[null,"",null,null,null,""]
[null,"",null,null,null,""]
[null,"",null,null,null,""]
[null,"",null,null,null,""]
[null,"",null,null,null,""]
[null,"",null,null,null,""]
[null,"",null,null,null,""]
[null,"",null,null,null,""]
[null,"",null,null,null,""]
[null,"",null,null,null,""]
[null,"",null,null,null,""]
[null,"",null,null,null,""]
[null,"",null,null,null,""]
[null,"",null,null,null,""]
[null,"",null,null,null,""]
[null,"",null,null,null,""]
[null,"",null,null,null,""]
[null,{"$f":"IF(C564=\"\",\"\",B563+1)","v":""},null,null,null,{"$f":"IF(D564=\"\",\"\",E564-1)","v":""}]
[null,"",null,null,null,""]
[null,"",null,null,null,""]
[null,"",null,null,null,""]
[null,"",null,null,null,""]
[null,"",null,null,null,""]
[null,"",null,null,null,""]
[null,"",null,null,null,""]
[null,"",null,null,null,""]
[null,"",null,null,null,""]
[null,"",null,null,null,""]
[null,"",null,null,null,""]
[null,"",null,null,null,""]
[null,"",null,null,null,""]
[null,"",null,null,null,""]
[null,"",null,null,null,""]
[null,"",null,null,null,""]
[null,"",null,null,null,""]
[null,"",null,null,null,""]
[null,"",null,null,null,""]
[null,"",null,null,null,""]
[null,"",null,null,null,""]
[null,"",null,null,null,""]
[null,"",null,null,null,""]
[null,"",null,null,null,""]
[null,"",null,null,null,""]
[null,"",null,null,null,""]
[null,"",null,null,null,""]
[null,"",null,null,null,""]
[null,"",null,null,null,""]
[null,"",null,null,null,""]
[null,"",null,null,null,""]
[null,"",null,null,null,""]
[null,"",null,null,null,""]
[null,"",null,null,null,""]
[null,"",null,null,null,""]
[null,"",null,null,null,""]
[null,"",null,null,null,""]
[null,"",null,null,null,""]
[null,"",null,null,null,""]
[null,"",null,null,null,""]
[null,"",null,null,null,""]
[null,"",null,null,null,""]
[null,"",null,null,null,""]
[null,"",null,null,null,""]
[null,"",null,null,null,""]
[null,"",null,null,null,""]
[null,"",null,null,null,""]
[null,"",null,null,null,""]
[null,"",null,null,null,""]
[null,"",null,null,null,""]
[null,"",null,null,null,""]
[null,"",null,null,null,""]
[null,"",null,null,null,""]
[null,"",null,null,null,""]
[null,"",null,null,null,""]
[null,"",null,null,null,""]
[null,"",null,null,null,""]
[null,"",null,null,null,""]
[null,"",null,null,null,""]
[null,"",null,null,null,""]
[null,"",null,null,null,""]
[null,"",null,null,null,""]
[null,"",null,null,null,""]
[null,{"$f":"IF(C628=\"\",\"\",B627+1)","v":""},null,null,null,{"$f":"IF(D628=\"\",\"\",E628-1)","v":""}]
[null,"",null,null,null,""]
[null,"",null,null,null,""]
[null,"",null,null,null,""]
[null,"",null,null,null,""]
[null,"",null,null,null,""]
[null,"",null,null,null,""]
[null,"",null,null,null,""]
[null,"",null,null,null,""]
[null,"",null,null,null,""]
[null,"",null,null,null,""]
[null,"",null,null,null,""]
[null,"",null,null,null,""]
[null,"",null,null,null,""]
[null,"",null,null,null,""]
[null,"",null,null,null,""]
[null,"",null,null,null,""]
[null,"",null,null,null,""]
[null,"",null,null,null,""]
[null,"",null,null,null,""]
[null,"",null,null,null,""]
[null,"",null,null,null,""]
[null,"",null,null,null,""]
[null,"",null,null,null,""]
[null,"",null,null,null,""]
[null,"",null,null,null,""]
[null,"",null,null,null,""]
[null,"",null,null,null,""]
[null,"",null,null,null,""]
[null,"",null,null,null,""]
[null,"",null,null,null,""]
[null,"",null,null,null,""]
[null,"",null,null,null,""]
[null,"",null,null,null,""]
[null,"",null,null,null,""]
[null,"",null,null,null,""]
[null,"",null,null,null,""]
[null,"",null,null,null,""]
[null,"",null,null,null,""]
[null,"",null,null,null,""]
[null,"",null,null,null,""]
[null,"",null,null,null,""]
[null,"",null,null,null,""]
[null,"",null,null,null,""]
[null,"",null,null,null,""]
[null,"",null,null,null,""]
[null,"",null,null,null,""]
[null,"",null,null,null,""]
[null,"",null,null,null,""]
[null,"",null,null,null,""]
[null,"",null,null,null,""]
[null,"",null,null,null,""]
[null,"",null,null,null,""]
[null,"",null,null,null,""]
[null,"",null,null,null,""]
[null,"",null,null,null,""]
[null,"",null,null,null,""]
[null,"",null,null,null,""]
[null,"",null,null,null,""]
[null,"",null,null,null,""]
[null,"",null,null,null,""]
[null,"",null,null,null,""]
[null,"",null,null,null,""]
[null,"",null,null,null,""]
[null,{"$f":"IF(C692=\"\",\"\",B691+1)","v":""},null,null,null,{"$f":"IF(D692=\"\",\"\",E692-1)","v":""}]
[null,"",null,null,null,""]
[null,"",null,null,null,""]
[null,"",null,null,null,""]
[null,"",null,null,null,""]
[null,"",null,null,null,""]
[null,"",null,null,null,""]
[null,"",null,null,null,""]
[null,"",null,null,null,""]
[null,"",null,null,null,""]
[null,"",null,null,null,""]
[null,"",null,null,null,""]
[null,"",null,null,null,""]
[null,"",null,null,null,""]
[null,"",null,null,null,""]
[null,"",null,null,null,""]
[null,"",null,null,null,""]
[null,"",null,null,null,""]
[null,"",null,null,null,""]
[null,"",null,null,null,""]
[null,"",null,null,null,""]
[null,"",null,null,null,""]
[null,"",null,null,null,""]
[null,"",null,null,null,""]
[null,"",null,null,null,""]
[null,"",null,null,null,""]
[null,"",null,null,null,""]
[null,"",null,null,null,""]
[null,"",null,null,null,""]
[null,"",null,null,null,""]
[null,"",null,null,null,""]
[null,"",null,null,null,""]
[null,"",null,null,null,""]
[null,"",null,null,null,""]
[null,"",null,null,null,""]
[null,"",null,null,null,""]
[null,"",null,null,null,""]
[null,"",null,null,null,""]
[null,"",null,null,null,""]
[null,"",null,null,null,""]
[null,"",null,null,null,""]
[null,"",null,null,null,""]
[null,"",null,null,null,""]
[null,"",null,null,null,""]
[null,"",null,null,null,""]
[null,"",null,null,null,""]
[null,"",null,null,null,""]
[null,"",null,null,null,""]
[null,"",null,null,null,""]
[null,"",null,null,null,""]
[null,"",null,null,null,""]
[null,"",null,null,null,""]
[null,"",null,null,null,""]
[null,"",null,null,null,""]
[null,"",null,null,null,""]
[null,"",null,null,null,""]
[null,"",null,null,null,""]
[null,"",null,null,null,""]
[null,"",null,null,null,""]
[null,"",null,null,null,""]
[null,"",null,null,null,""]
[null,"",null,null,null,""]
[null,"",null,null,null,""]
[null,"",null,null,null,""]
[null,{"$f":"IF(C756=\"\",\"\",B755+1)","v":""},null,null,null,{"$f":"IF(D756=\"\",\"\",E756-1)","v":""}]
[null,"",null,null,null,""]
[null,"",null,null,null,""]
[null,"",null,null,null,""]
[null,"",null,null,null,""]
[null,"",null,null,null,""]
[null,"",null,null,null,""]
[null,"",null,null,null,""]
[null,"",null,null,null,""]
[null,"",null,null,null,""]
[null,"",null,null,null,""]
[null,"",null,null,null,""]
[null,"",null,null,null,""]
[null,"",null,null,null,""]
[null,"",null,null,null,""]
[null,"",null,null,null,""]
[null,"",null,null,null,""]
[null,"",null,null,null,""]
[null,"",null,null,null,""]
[null,"",null,null,null,""]
[null,"",null,null,null,""]
[null,"",null,null,null,""]
[null,"",null,null,null,""]
[null,"",null,null,null,""]
[null,"",null,null,null,""]
[null,"",null,null,null,""]
[null,"",null,null,null,""]
[null,"",null,null,null,""]
[null,"",null,null,null,""]
[null,"",null,null,null,""]
[null,"",null,null,null,""]
[null,"",null,null,null,""]
[null,"",null,null,null,""]
[null,"",null,null,null,""]
[null,"",null,null,null,""]
[null,"",null,null,null,""]
[null,"",null,null,null,""]
[null,"",null,null,null,""]
[null,"",null,null,null,""]
[null,"",null,null,null,""]
[null,"",null,null,null,""]
[null,"",null,null,null,""]
[null,"",null,null,null,""]
[null,"",null,null,null,""]
[null,"",null,null,null,""]
[null,"",null,null,null,""]
[null,"",null,null,null,""]
[null,"",null,null,null,""]
[null,"",null,null,null,""]
[null,"",null,null,null,""]
[null,"",null,null,null,""]
[null,"",null,null,null,""]
[null,"",null,null,null,""]
[null,"",null,null,null,""]
[null,"",null,null,null,""]
[null,"",null,null,null,""]
[null,"",null,null,null,""]
[null,"",null,null,null,""]
[null,"",null,null,null,""]
[null,"",null,null,null,""]
[null,"",null,null,null,""]
[null,"",null,null,null,""]
[null,"",null,null,null,""]
[null,"",null,null,null,""]
[null,{"$f":"IF(C820=\"\",\"\",B819+1)","v":""},null,null,null,{"$f":"IF(D820=\"\",\"\",E820-1)","v":""}]
[null,"",null,null,null,""]
[null,"",null,null,null,""]
[null,"",null,null,null,""]
[null,"",null,null,null,""]
[null,"",null,null,null,""]
[null,"",null,null,null,""]
[null,"",null,null,null,""]
[null,"",null,null,null,""]
[null,"",null,null,null,""]
[null,"",null,null,null,""]
[null,"",null,null,null,""]
[null,"",null,null,null,""]
[null,"",null,null,null,""]
[null,"",null,null,null,""]
[null,"",null,null,null,""]
[null,"",null,null,null,""]
[null,"",null,null,null,""]
[null,"",null,null,null,""]
[null,"",null,null,null,""]
[null,"",null,null,null,""]
[null,"",null,null,null,""]
[null,"",null,null,null,""]
[null,"",null,null,null,""]
[null,"",null,null,null,""]
[null,"",null,null,null,""]
[null,"",null,null,null,""]
[null,"",null,null,null,""]
[null,"",null,null,null,""]
[null,"",null,null,null,""]
[null,"",null,null,null,""]
[null,"",null,null,null,""]
[null,"",null,null,null,""]
[null,"",null,null,null,""]
[null,"",null,null,null,""]
[null,"",null,null,null,""]
[null,"",null,null,null,""]
[null,"",null,null,null,""]
[null,"",null,null,null,""]
[null,"",null,null,null,""]
[null,"",null,null,null,""]
[null,"",null,null,null,""]
[null,"",null,null,null,""]
[null,"",null,null,null,""]
[null,"",null,null,null,""]
[null,"",null,null,null,""]
[null,"",null,null,null,""]
[null,"",null,null,null,""]
[null,"",null,null,null,""]
[null,"",null,null,null,""]
[null,"",null,null,null,""]
[null,"",null,null,null,""]
[null,"",null,null,null,""]
[null,"",null,null,null,""]
[null,"",null,null,null,""]
[null,"",null,null,null,""]
[null,"",null,null,null,""]
[null,"",null,null,null,""]
[null,"",null,null,null,""]
[null,"",null,null,null,""]
[null,"",null,null,null,""]
[null,"",null,null,null,""]
[null,"",null,null,null,""]
[null,"",null,null,null,""]
[null,{"$f":"IF(C884=\"\",\"\",B883+1)","v":""},null,null,null,{"$f":"IF(D884=\"\",\"\",E884-1)","v":""}]
[null,"",null,null,null,""]
[null,"",null,null,null,""]
[null,"",null,null,null,""]
[null,"",null,null,null,""]
[null,"",null,null,null,""]
[null,"",null,null,null,""]
[null,"",null,null,null,""]
[null,"",null,null,null,""]
[null,"",null,null,null,""]
[null,"",null,null,null,""]
[null,"",null,null,null,""]
[null,"",null,null,null,""]
[null,"",null,null,null,""]
[null,"",null,null,null,""]
[null,"",null,null,null,""]
[null,"",null,null,null,""]
[null,"",null,null,null,""]
[null,"",null,null,null,""]
[null,"",null,null,null,""]
[null,"",null,null,null,""]
[null,"",null,null,null,""]
[null,"",null,null,null,""]
[null,"",null,null,null,""]
[null,"",null,null,null,""]
[null,"",null,null,null,""]
[null,"",null,null,null,""]
[null,"",null,null,null,""]
[null,"",null,null,null,""]
[null,"",null,null,null,""]
[null,"",null,null,null,""]
[null,"",null,null,null,""]
[null,"",null,null,null,""]
[null,"",null,null,null,""]
[null,"",null,null,null,""]
[null,"",null,null,null,""]
[null,"",null,null,null,""]
[null,"",null,null,null,""]
[null,"",null,null,null,""]
[null,"",null,null,null,""]
[null,"",null,null,null,""]
[null,"",null,null,null,""]
[null,"",null,null,null,""]
[null,"",null,null,null,""]
[null,"",null,null,null,""]
[null,"",null,null,null,""]
[null,"",null,null,null,""]
[null,"",null,null,null,""]
[null,"",null,null,null,""]
[null,"",null,null,null,""]
[null,"",null,null,null,""]
[null,"",null,null,null,""]
[null,"",null,null,null,""]
[null,"",null,null,null,""]
[null,"",null,null,null,""]
[null,"",null,null,null,""]
[null,"",null,null,null,""]
[null,"",null,null,null,""]
[null,"",null,null,null,""]
[null,"",null,null,null,""]
[null,"",null,null,null,""]
[null,"",null,null,null,""]
[null,"",null,null,null,""]
[null,"",null,null,null,""]
[null,{"$f":"IF(C948=\"\",\"\",B947+1)","v":""},null,null,null,{"$f":"IF(D948=\"\",\"\",E948-1)","v":""}]
[null,"",null,null,null,""]
[null,"",null,null,null,""]
[null,"",null,null,null,""]
[null,"",null,null,null,""]
[null,"",null,null,null,""]
[null,"",null,null,null,""]
[null,"",null,null,null,""]
[null,"",null,null,null,""]
[null,"",null,null,null,""]
[null,"",null,null,null,""]
[null,"",null,null,null,""]
[null,"",null,null,null,""]
[null,"",null,null,null,""]
[null,"",null,null,null,""]
[null,"",null,null,null,""]
[null,"",null,null,null,""]
[null,"",null,null,null,""]
[null,"",null,null,null,""]
[null,"",null,null,null,""]
[null,"",null,null,null,""]
[null,"",null,null,null,""]
[null,"",null,null,null,""]
[null,"",null,null,null,""]
[null,"",null,null,null,""]
[null,"",null,null,null,""]
[null,"",null,null,null,""]
[null,"",null,null,null,""]
[null,"",null,null,null,""]
[null,"",null,null,null,""]
[null,"",null,null,null,""]
[null,"",null,null,null,""]
[null,"",null,null,null,""]
[null,"",null,null,null,""]
[null,"",null,null,null,""]
[null,"",null,null,null,""]
[null,"",null,null,null,""]
[null,"",null,null,null,""]
[null,"",null,null,null,""]
[null,"",null,null,null,""]
[null,"",null,null,null,""]
[null,"",null,null,null,""]
[null,"",null,null,null,""]
[null,"",null,null,null,""]
[null,"",null,null,null,""]
[null,"",null,null,null,""]
[null,"",null,null,null,""]
[null,"",null,null,null,""]
[null,"",null,null,null,""]
[null,"",null,null,null,""]
[null,"",null,null,null,""]
[null,"",null,null,null,""]
[null,"",null,null,null,""]

{"sheet":"Tipps","index":1,"n_rows":19,"n_cols":2,"rows_kept":19,"cut":false,"hidden":false,"merged":[[0,0,1,2]]}
["Ein paar kleine Tipps"]
[]
["üNr"]
[" - die Tabelle in üNr wurde überarbeitet und funktioniert jetzt fehlerfrei"]
[" - die Kalendereingabe wurde hinzugefügt"]
[" - bei Namen funktioniert jetzt wieder die einzel Buchstabenauswahl"]
[" - nach erreichen von 60 Nr. wird die Berechnung ausgelöst und alle Einträge der Tabelle werden übernommen und löschen sich danach"]
[]
["Urlaubsauswertung"]
[" - zwei Knöpfe stehen zur Verfügung \"Daten holen\" und \"Daten zurück\""]
[" - \"Daten holen\" - kopiert die Urlaubsdaten von üNr nach Urlaubsauswertung"]
[" - bei Abgeltung eines KU - in den grau markierten Spalten neben dem gewünschten Datum klicken und die Entf Taste drücken"]
[" - danach \"Daten zurück\" nutzen um die bearbeiteten Urlaubsdaten wieder an üNr zu übergeben"]
[]
["Lotsen"]
[" - sicherlich schon bekannt aus der bereits genutzten Datei von mir, allerdings mit einem kleinen Update"]
[" - \"Name finden\" - 3 bis 4 Buschstaben reichen zum finden (ausser es gibt mehrere Möglichkeiten), dann kommt eine Abfrage ob der Name gelöscht werden soll"," + bei ja = gelöscht"]
[null," + bei nein = springt der Bildschirm zum Namen und zeigt ihn oben links an - bei gleichen Namen ggf. den richtigen Namen auswählen und von Hand löschen"]
[" - Name lösche geht, aber BITTE nicht sortieren"]

{"sheet":"Urlaubsauswertung","index":2,"n_rows":212,"n_cols":30,"rows_kept":212,"cut":false,"hidden":false,"merged":[]}
[]
[{"$f":"TODAY()","v":"2025-02-14"}]
["Namen","U-Tag","Datum",null,"U-Tag","Datum",null,"U-Tag","Datum",null,"U-Tag","Datum",null,"U-Tag","Datum",null,"U-Tag","Datum",null,"U-Tag","Datum",null,"U-Tag","Datum",null,"U-Tag","Datum",null,"U-Tag","Datum"]
[{"$f":"Lotsen!A2","v":"A"}]
[{"$f":"Lotsen!A3","v":"B"}]
[{"$f":"Lotsen!A4","v":"Baum"}]
[{"$f":"Lotsen!A5","v":"Bert"}]
[{"$f":"Lotsen!A6","v":"Blech"}]
[{"$f":"Lotsen!A7","v":"C"}]
[{"$f":"Lotsen!A8","v":"Claus"}]
[{"$f":"Lotsen!A9","v":"Clausi"}]
[{"$f":"Lotsen!A10","v":"D"}]
[{"$f":"Lotsen!A11","v":"Dietmar"}]
[{"$f":"Lotsen!A12","v":"Dietter"}]
[{"$f":"Lotsen!A13","v":"Dirk"}]
[{"$f":"Lotsen!A14","v":"E"}]
[{"$f":"Lotsen!A15","v":"Elfi"}]
[{"$f":"Lotsen!A16","v":"Erwin"}]
[{"$f":"Lotsen!A17","v":"F"}]
[{"$f":"Lotsen!A18","v":"Frank"}]
[{"$f":"Lotsen!A19","v":"Fritz"}]
[{"$f":"Lotsen!A20","v":0}]
[{"$f":"Lotsen!A21","v":0}]
[{"$f":"Lotsen!A22","v":0}]
[{"$f":"Lotsen!A23","v":0}]
[{"$f":"Lotsen!A24","v":0}]
[{"$f":"Lotsen!A25","v":0}]
[{"$f":"Lotsen!A26","v":0}]
[{"$f":"Lotsen!A27","v":0}]
[{"$f":"Lotsen!A28","v":0}]
[{"$f":"Lotsen!A29","v":0}]
[{"$f":"Lotsen!A30","v":0}]
[{"$f":"Lotsen!A31","v":0}]
[{"$f":"Lotsen!A32","v":0}]
[{"$f":"Lotsen!A33","v":0}]
[{"$f":"Lotsen!A34","v":0}]
[{"$f":"Lotsen!A35","v":0}]
[{"$f":"Lotsen!A36","v":0}]
[{"$f":"Lotsen!A37","v":0}]
[{"$f":"Lotsen!A38","v":0}]
[{"$f":"Lotsen!A39","v":0}]
[{"$f":"Lotsen!A40","v":0}]
[{"$f":"Lotsen!A41","v":0}]
[{"$f":"Lotsen!A42","v":0}]
[{"$f":"Lotsen!A43","v":0}]
[{"$f":"Lotsen!A44","v":0}]
[{"$f":"Lotsen!A45","v":0}]
[{"$f":"Lotsen!A46","v":0}]
[{"$f":"Lotsen!A47","v":0}]
[{"$f":"Lotsen!A48","v":0}]
[{"$f":"Lotsen!A49","v":0}]
[{"$f":"Lotsen!A50","v":0}]
[{"$f":"Lotsen!A51","v":0}]
[{"$f":"Lotsen!A52","v":0}]
[{"$f":"Lotsen!A53","v":0}]
[{"$f":"Lotsen!A54","v":0}]
[{"$f":"Lotsen!A55","v":0}]
[{"$f":"Lotsen!A56","v":0}]
[{"$f":"Lotsen!A57","v":0}]
[{"$f":"Lotsen!A58","v":0}]
[{"$f":"Lotsen!A59","v":0}]
[{"$f":"Lotsen!A60","v":0}]
[{"$f":"Lotsen!A61","v":0}]
[{"$f":"Lotsen!A62","v":0}]
[{"$f":"Lotsen!A63","v":0}]
[{"$f":"Lotsen!A64","v":0}]
[{"$f":"Lotsen!A65","v":0}]
[{"$f":"Lotsen!A66","v":0}]
[{"$f":"Lotsen!A67","v":0}]
[{"$f":"Lotsen!A68","v":0}]
[{"$f":"Lotsen!A69","v":0}]
[{"$f":"Lotsen!A70","v":0}]
[{"$f":"Lotsen!A71","v":0}]
[{"$f":"Lotsen!A72","v":0}]
[{"$f":"Lotsen!A73","v":0}]
[{"$f":"Lotsen!A74","v":0}]
[{"$f":"Lotsen!A75","v":0}]
[{"$f":"Lotsen!A76","v":0}]
[{"$f":"Lotsen!A77","v":0}]
[{"$f":"Lotsen!A78","v":0}]
[{"$f":"Lotsen!A79","v":0}]
[{"$f":"Lotsen!A80","v":0}]
[{"$f":"Lotsen!A81","v":0}]
[{"$f":"Lotsen!A82","v":0}]
[{"$f":"Lotsen!A83","v":0}]
[{"$f":"Lotsen!A84","v":0}]
[{"$f":"Lotsen!A85","v":0}]
[{"$f":"Lotsen!A86","v":0}]
[{"$f":"Lotsen!A87","v":0}]
[{"$f":"Lotsen!A88","v":0}]
[{"$f":"Lotsen!A89","v":0}]
[{"$f":"Lotsen!A90","v":0}]
[{"$f":"Lotsen!A91","v":0}]
[{"$f":"Lotsen!A92","v":0}]
[{"$f":"Lotsen!A93","v":0}]
[{"$f":"Lotsen!A94","v":0}]
[{"$f":"Lotsen!A95","v":0}]
[{"$f":"Lotsen!A96","v":0}]
[{"$f":"Lotsen!A97","v":0}]
[{"$f":"Lotsen!A98","v":0}]
[{"$f":"Lotsen!A99","v":0}]
[{"$f":"Lotsen!A100","v":0}]
[{"$f":"Lotsen!A101","v":0}]
[{"$f":"Lotsen!A102","v":0}]
[{"$f":"Lotsen!A103","v":0}]
[{"$f":"Lotsen!A104","v":0}]
[{"$f":"Lotsen!A105","v":0}]
[{"$f":"Lotsen!A106","v":0}]
[{"$f":"Lotsen!A107","v":0}]
[{"$f":"Lotsen!A108","v":0}]
[{"$f":"Lotsen!A109","v":0}]
[{"$f":"Lotsen!A110","v":0}]
[{"$f":"Lotsen!A111","v":0}]
[{"$f":"Lotsen!A112","v":0}]
[{"$f":"Lotsen!A113","v":0}]
[{"$f":"Lotsen!A114","v":0}]
[{"$f":"Lotsen!A115","v":0}]
[{"$f":"Lotsen!A116","v":0}]
[{"$f":"Lotsen!A117","v":0}]
[{"$f":"Lotsen!A118","v":0}]
[{"$f":"Lotsen!A119","v":0}]
[{"$f":"Lotsen!A120","v":0}]
[{"$f":"Lotsen!A121","v":0}]
[{"$f":"Lotsen!A122","v":0}]
[{"$f":"Lotsen!A123","v":0}]
[{"$f":"Lotsen!A124","v":0}]
[{"$f":"Lotsen!A125","v":0}]
[{"$f":"Lotsen!A126","v":0}]
[{"$f":"Lotsen!A127","v":0}]
[{"$f":"Lotsen!A128","v":0}]
[{"$f":"Lotsen!A129","v":0}]
[{"$f":"Lotsen!A130","v":0}]
[{"$f":"Lotsen!A131","v":0}]
[{"$f":"Lotsen!A132","v":0}]
[{"$f":"Lotsen!A133","v":0}]
[{"$f":"Lotsen!A134","v":0}]
[{"$f":"Lotsen!A135","v":0}]
[{"$f":"Lotsen!A136","v":0}]
[{"$f":"Lotsen!A137","v":0}]
[{"$f":"Lotsen!A138","v":0}]
[{"$f":"Lotsen!A139","v":0}]
[{"$f":"Lotsen!A140","v":0}]
[{"$f":"Lotsen!A141","v":0}]
[{"$f":"Lotsen!A142","v":0}]
[{"$f":"Lotsen!A143","v":0}]
[{"$f":"Lotsen!A144","v":0}]
[{"$f":"Lotsen!A145","v":0}]
[{"$f":"Lotsen!A146","v":0}]
[{"$f":"Lotsen!A147","v":0}]
[{"$f":"Lotsen!A148","v":0}]
[{"$f":"Lotsen!A149","v":0}]
[{"$f":"Lotsen!A150","v":0}]
[{"$f":"Lotsen!A151","v":0}]
[{"$f":"Lotsen!A152","v":0}]
[{"$f":"Lotsen!A153","v":0}]
[{"$f":"Lotsen!A154","v":0}]
[{"$f":"Lotsen!A155","v":0}]
[{"$f":"Lotsen!A156","v":0}]
[{"$f":"Lotsen!A157","v":0}]
[{"$f":"Lotsen!A158","v":0}]
[{"$f":"Lotsen!A159","v":0}]
[{"$f":"Lotsen!A160","v":0}]
[{"$f":"Lotsen!A161","v":0}]
[{"$f":"Lotsen!A162","v":0}]
[{"$f":"Lotsen!A163","v":0}]
[{"$f":"Lotsen!A164","v":0}]
[{"$f":"Lotsen!A165","v":0}]
[{"$f":"Lotsen!A166","v":0}]
[{"$f":"Lotsen!A167","v":0}]
[{"$f":"Lotsen!A168","v":0}]
[{"$f":"Lotsen!A169","v":0}]
[{"$f":"Lotsen!A170","v":0}]
[{"$f":"Lotsen!A171","v":0}]
[{"$f":"Lotsen!A172","v":0}]
[{"$f":"Lotsen!A173","v":0}]
[{"$f":"Lotsen!A174","v":0}]
[{"$f":"Lotsen!A175","v":0}]
[{"$f":"Lotsen!A176","v":0}]
[{"$f":"Lotsen!A177","v":0}]
[{"$f":"Lotsen!A178","v":0}]
[{"$f":"Lotsen!A179","v":0}]
[{"$f":"Lotsen!A180","v":0}]
[{"$f":"Lotsen!A181","v":0}]
[{"$f":"Lotsen!A182","v":0}]
[{"$f":"Lotsen!A183","v":0}]
[{"$f":"Lotsen!A184","v":0}]
[{"$f":"Lotsen!A185","v":0}]
[{"$f":"Lotsen!A186","v":0}]
[{"$f":"Lotsen!A187","v":0}]
[{"$f":"Lotsen!A188","v":0}]
[{"$f":"Lotsen!A189","v":0}]
[{"$f":"Lotsen!A190","v":0}]
[{"$f":"Lotsen!A191","v":0}]
[{"$f":"Lotsen!A192","v":0}]
[{"$f":"Lotsen!A193","v":0}]
[{"$f":"Lotsen!A194","v":0}]
[{"$f":"Lotsen!A195","v":0}]
[{"$f":"Lotsen!A196","v":0}]
[{"$f":"Lotsen!A197","v":0}]
[{"$f":"Lotsen!A198","v":0}]
[{"$f":"Lotsen!A199","v":0}]
[{"$f":"Lotsen!A200","v":0}]
[{"$f":"Lotsen!A201","v":0}]
[{"$f":"Lotsen!A202","v":0}]
[{"$f":"Lotsen!A203","v":0}]
[{"$f":"Lotsen!A204","v":0}]
[{"$f":"Lotsen!A205","v":0}]
[{"$f":"Lotsen!A206","v":0}]
[{"$f":"Lotsen!A207","v":0}]
[{"$f":"Lotsen!A208","v":0}]
[{"$f":"Lotsen!A209","v":0}]
[{"$f":"Lotsen!A210","v":0}]

{"sheet":"Lotsen","index":3,"n_rows":19,"n_cols":5,"rows_kept":19,"cut":false,"hidden":false,"merged":[[5,4,6,5]]}
[]
["A"]
["B"]
["Baum"]
["Bert"]
["Blech",null,null,null,"die ersten 3 Buchstaben reichen"]
["C"]
["Claus"]
["Clausi"]
["D"]
["Dietmar"]
["Dietter"]
["Dirk"]
["E"]
["Elfi"]
["Erwin"]
["F"]
["Frank"]
["Fritz"]