{"text_format":"1","workbook":"xlsx","n_sheets":23,"sheets":["Auswahl","Offene Punkte","Suche","Bauteile","211","Teuerung","Baupreisindex_NPK","MS1_B","MS1_Basisdaten","BKPListe","eBKP-H","BKPListe_A","eBKP-H_A","Sheet3","Baupreisindex","Listenfelder_T","Listenfelder","Listenfelder_211","Nutzer","Bauteile (2)","Bauteile (3)","Bauteile (4)","Bauteile_B"],"not_rendered":{"charts":0,"images":5,"macros":1,"external_links":0,"defined_names":38,"comments":1,"pivot_tables":1},"unopened":[],"bounds":{"document_bytes":16777216,"sheet_cells":100000,"rows_first":2000,"rows_last":500,"rows_between":2000,"halvings":0,"cell_chars":16384,"cell_head_chars":4096},"cells_cut":0,"cells_raw":0,"read":"whole","date_system":"1900"}

{"sheet":"Auswahl","index":0,"n_rows":0,"n_cols":0,"rows_kept":0,"cut":false,"hidden":false,"merged":[]}

{"sheet":"Offene Punkte","index":1,"n_rows":12,"n_cols":2,"rows_kept":12,"cut":false,"hidden":false,"merged":[]}
["Bauteilsuche, Baupreisindex überarbeiten"]
["Button über Tab ansteuern"]
[]
[]
["Bauteilkatalog","Neue Einträge"]
[null,"Einträge Bearbeiten"]
[null,"Einträge Löschen"]
[]
[]
["MS1 Basisdaten","Einträge anpassbar"]
{"$rows_left_out":3}
{"sheet":"Suche","index":2,"n_rows":14,"n_cols":6,"rows_kept":14,"cut":false,"hidden":false,"merged":[]}
[]
[]
[null,null,null,null,"BKP","eBKP-H"]
[null,null,null,null,"212.2"]
["Bauteil","Untertitel","Einheit","2024 "]
["Balkonbrüstungen Beton.","Aussen liegende Absturzsicherung","m",250]
["Erdverbundene Treppe, Rampe","(Leer)","m2",500]
["Erdverbundenes Podest.","(Leer)","m2",300]
["Vorfabrizierte aussen Podest in Beton.","Aussen liegendes Podest","m2",590]
["Vorfabrizierte aussen Treppen in Beton.","Aussen liegende Treppe, Rampe","m2",650]
{"$rows_left_out":5}
{"sheet":"Bauteile","index":3,"n_rows":276,"n_cols":9,"rows_kept":276,"cut":false,"hidden":false,"merged":[]}
["BKP","eBKP-H","Beschreibung","Untertitel","Bauteil","Einheit","2024 ","2023 ","2022 "]
["101","B 01.02","Bestandesaufnahmen","","Gebäudeaufnahme Rissprotokolle","gl","  ","  ","  "]
["102","B 01.01",{"$f":"IF(A3=0,\"\",LOOKUP(A3,BKP,Baukostenplan))","v":"Baugrunduntersuchungen"},null,"Untersuchung","gl"]
["102","B 01.03","Baugrunduntersuchungen","Umweltmessungen","Materialanalysen (falls Schadstoffe).","gl"]
["287","G 06.03","287 Baureinigung","Test 7000","Spülen der Schmutz- und Meteorleitungen.","gl",1500]
["111","B 05.01","Rodungen",null,"Roden bestehender Sträucher und Bäume.","m2",3.5]
["112",null,"Abbrüche","Rückbau nicht kontaminiertes Bauwerk","Budgetbetrag für Entrümpelung. Verrechung nach effektivem Aufwand.","gl"]
["112","B 05.02","Abbrüche","Rückbau nicht kontaminiertes Bauwerk","Abbrüche /  Demontagen","m3",40]
["119","B 05.03","Übriges","Rückbau kontaminiertes Bauwerk","Abbruch","m3",42]
["119","B 05.03","Übriges","Rückbau kontaminiertes Bauwerk","Zusätzliche Entsorgungsgebühren.","m3",32]
{"$rows_left_out":267}
{"sheet":"211","index":4,"n_rows":23,"n_cols":11,"rows_kept":23,"cut":false,"hidden":false,"merged":[]}
[]
[null,"Bewehrung CHF/Kg: ",1.7,null,null,"2024-09-01"]
[]
[null,{"$f":"\"EP: \"&\"  \" & ROUND(SUM(F7:F17),2) &\" \"&\"CHF\"&\"  \"& C7&\" \"&C8&\" m\"","v":"EP:   198.92 CHF  3.Bodenplatte 0.45 m"}]
[]
["BKP",null,null,"Kosten/Einheit","Index","Kosten pro Bauteil"]
[211.5,"Bauteil","3.Bodenplatte"]
[211.5,"Bauteildicke in m",0.45]
[211.5,"Bauteil Umfang in m",0]
[211.5,"Unterbau",null,{"$f":"IF(C10=\"\",\"\",INDEX(Listenfelder_211!H:H,MATCH('211'!C10,Beton),1))","v":""},1,{"$f":"+D10","v":""}]
{"$rows_left_out":14}
{"sheet":"Teuerung","index":5,"n_rows":17,"n_cols":14,"rows_kept":17,"cut":false,"hidden":false,"merged":[[1,1,2,1],[1,2,2,2],[1,6,2,6],[1,7,2,7],[2,3,2,5]]}
[]
[null,"Veränderungsrate","=","( Index neu","-","Index alt )","x",100,null,null,"Region","Nordwestschweiz"]
[null,null,null,"Index alt",null,null,null,null,null,null,"Objektart","Neubau Mehrfamilienhaus"]
[null,null,null,null,null,null,null,null,null,null,null,"Jahr","Monat","Indexwert"]
[null,null,null,null,null,null,null,null,null,null,"Index alt",2005,"Oktober",{"$f":"_xlfn.AGGREGATE(15,6,Baupreisindex!E$9:BD$1150/(Baupreisindex!B$9:B$1150=L$2)/(Baupreisindex!C$9:C$1150=L$3)/(Baupreisindex!E$6:BZ$6=--L5)/(Baupreisindex!E$5:BZ$5=M5),1)","v":89.9}]
[null,null,null,null,null,null,null,null,null,null,"Index neu",2024,"April",{"$f":"_xlfn.AGGREGATE(15,6,Baupreisindex!E$9:BD$1150/(Baupreisindex!B$9:B$1150=L$2)/(Baupreisindex!C$9:C$1150=L$3)/(Baupreisindex!E$6:BZ$6=--L6)/(Baupreisindex!E$5:BZ$5=M6),1)","v":118.1}]
[]
[null,null,null,null,null,null,null,null,null,null,null,{"$f":"Baupreisindex!C4","v":"Basis Oktober 2020 = 100"}]
[null,null,null,null,null,null,null,null,null,null,"Berechnungsbasis","Preisstand, Total KV Original",{"$f":"Baupreisindex!C4","v":"Basis Oktober 2020 = 100"},100000000]
[null,null,null,null,null,null,null,null,null,null,null,"Index KV Original (alt)",{"$f":"TEXT(M5,)&\" \"&TEXT(L5,0)","v":"Oktober 2005"},{"$f":"N5","v":89.9}]
{"$rows_left_out":8}
{"sheet":"Baupreisindex_NPK","index":6,"n_rows":225,"n_cols":11,"rows_kept":225,"cut":false,"hidden":false,"merged":[]}
["NPK Position","BKP","Beschreibung","Menge","Einheit","Schweiz","Mittelland","Nordwestschweiz","Zürich","Ostschweiz","Zentralschweiz"]
["1 Erdarbeiten",201]
["'211.111.111",201,"Oberboden maschinell abtragen. Flächen horizontal oder mit Neigung bis 1:4. Volumen fest. Inkl. direkter Auflad auf Transportmittel oder seitlicher Lagerung. Schichtdicke bis m 0,20",100,"m3",7.4173999999999998,6.5792999999999999,5.7024999999999997,7.6285999999999996,5.63,5.4]
["'211.211.101",201,"Baugrubenaushub maschinell. Inkl. Auflad auf Transportmittel oder seitlicher Lagerung. Offene Baugruben. Aushubtiefe bis m 5,00",1500,"m3",6.5472000000000001,5.5487000000000002,5.4442000000000004,6.3228999999999997,6.2028999999999996,5.1021999999999998]
["'211.523.104",201,"Primärmaterial: Kies, Geröll. Kiessand I",25,"m3",54.975200000000001,51.983600000000003,48.906700000000001,52.04,65.432900000000004,55.335599999999999]
["'211.651.111",201,"Auffüllungen mit seitlich gelagertem oder zugeführtem Material. Maschinell. Volumen fest",700,"m3",12.349399999999999,11.565300000000001,11.7158,9.5985999999999994,10.9414,10.2111]
["'211.282.112",201,"Fundationsschichten auf Planum, Schichtdicke m 0,26 bis 0,30",25,"m3",14.8687,12.4579,12.3992,14.52,12.197100000000001,11.3422]
[null,null,null,""]
["2 Tiefbauarbeiten",null,null,""]
["'221.411.132","211.3","Fundationsschichten einbauen. Ausmass: Volumen fest. Einbaubreite über m 3,0. Fertig eingebaute Schicht, d m 0,21 bis 0,40.",1350,"m3",10.9986,11.2133,8.6738,10.722200000000001,10.645799999999999,11.4056]
{"$rows_left_out":216}
{"sheet":"MS1_B","index":7,"n_rows":52,"n_cols":36,"rows_kept":52,"cut":false,"hidden":false,"merged":[[20,31,23,31],[20,32,23,32],[20,33,23,33],[20,34,23,34],[20,35,23,35]]}
[]
[null,null,null,null,null,null,null,null,null,null,null,null,null,null,null,null,null,null,null,null,null,null,null,null,null,"Nur dort wo rot \"manipulieren\""]
[]
[null,null,null,null,null,null,null,null,null,null,null,null,null,null,null,null,null,null,null,null,null,null,null,null,null,"GSF","BUF","GF Total","Whg","GU / TU","DB 2","Reserven"]
[null,null,null,null,null,null,null,null,null,null,null,null,null,null,null,null,null,null,null,null,null,null,null,null,null,1000,5600,15000,30,0.05,0.04,0.02]
[]
[]
[]
[]
["eBKP-H","Element","EL2","EL1","TO","EL3 TO","EL2 TO","EL1 TO","TE","EL2 TO TE","BKP","TO BKP ","BKP(3st)","TO BKP 3 ","BKP(2st)","TO BKP 2 ","BKP(1st)","TO BKP 1 ","TO Menge","Menge Element","Beschreibung","EH","Menge","Preis","Total"]
{"$rows_left_out":43}
{"sheet":"MS1_Basisdaten","index":8,"n_rows":15,"n_cols":9,"rows_kept":15,"cut":false,"hidden":false,"merged":[]}
[{"$f":"MS1_B!A10","v":"eBKP-H"},{"$f":"MS1_B!K10","v":"BKP"},{"$f":"MS1_B!U10","v":"Beschreibung"},{"$f":"MS1_B!V10","v":"EH"},{"$f":"MS1_B!AA11","v":"Sehr Tief"},{"$f":"MS1_B!AB11","v":"Tief"},{"$f":"MS1_B!AC11","v":"Mittel"},{"$f":"MS1_B!AD11","v":"Hoch"},{"$f":"MS1_B!AE11","v":"Sehr Hoch"}]
[{"$f":"MS1_B!A14","v":"  A"},{"$f":"MS1_B!K14","v":"0"},{"$f":"MS1_B!U14","v":"Grundstück"},{"$f":"MS1_B!V14","v":"GSF"},{"$f":"E10","v":0},{"$f":"F10","v":0},0,0,0]
[{"$f":"MS1_B!A15","v":"  B"},{"$f":"MS1_B!K15","v":"1"},{"$f":"MS1_B!U15","v":"Vorbereitung"},{"$f":"MS1_B!V15","v":"GSF"},170,260,380,520,750]
[{"$f":"MS1_B!A16","v":"  C"},{"$f":"MS1_B!K16","v":"2"},{"$f":"MS1_B!U16","v":"Konstruktion Gebäude"},{"$f":"MS1_B!V16","v":"GF"},350,390,420,550,700]
[{"$f":"MS1_B!A17","v":"  D"},{"$f":"MS1_B!K17","v":"2"},{"$f":"MS1_B!U17","v":"Technik Gebäude"},{"$f":"MS1_B!V17","v":"GF"},300,340,400,500,600]
[{"$f":"MS1_B!A18","v":"  E"},{"$f":"MS1_B!K18","v":"2"},{"$f":"MS1_B!U18","v":"Äussere Wandbekleidung Gebäude"},{"$f":"MS1_B!V18","v":"FAW"},230,300,400,600,850]
[{"$f":"MS1_B!A19","v":"  F"},{"$f":"MS1_B!K19","v":"2"},{"$f":"MS1_B!U19","v":"Bedachung Gebäude"},{"$f":"MS1_B!V19","v":"FB"},60,90,130,160,220]
[{"$f":"MS1_B!A20","v":"  G"},{"$f":"MS1_B!K20","v":"2"},{"$f":"MS1_B!U20","v":"Ausbau Gebäude"},{"$f":"MS1_B!V20","v":"GF"},220,260,350,480,560]
[{"$f":"MS1_B!A21","v":"  I"},{"$f":"MS1_B!K21","v":"4"},{"$f":"MS1_B!U21","v":"Umgebung Gebäude"},{"$f":"MS1_B!V21","v":"BUF"},80,110,150,190,280]
[{"$f":"MS1_B!A22","v":"  V"},{"$f":"MS1_B!K22","v":"6"},{"$f":"MS1_B!U22","v":"Planungskosten"},{"$f":"MS1_B!V22","v":"BBJ"},{"$f":"E12","v":0},{"$f":"F12","v":0},0,0,0]
{"$rows_left_out":6}
{"sheet":"BKPListe","index":9,"n_rows":1384,"n_cols":3,"rows_kept":1384,"cut":false,"hidden":false,"merged":[]}
["0 Grundstück","BKP-Nr.","Bezeichnung"]
[null,"0","Grundstück"]
["0 Grundstück","00","Vorstudien"]
["0 Grundstück","000","Übergangsposition"]
["0 Grundstück","001","Studien zur Grundstückbeurteilung, Machbarkeitsstudie"]
["0 Grundstück","002","Vermessung, Vermarchung"]
["0 Grundstück","003","Geotechnische Gutachten"]
["0 Grundstück","004","Quartierplankosten, Richtplankosten"]
["0 Grundstück","005","Provisorische Baugespanne"]
["0 Grundstück","006","Umweltverträglichkeitsprüfung"]
{"$rows_left_out":1375}
{"sheet":"eBKP-H","index":10,"n_rows":361,"n_cols":3,"rows_kept":361,"cut":false,"hidden":false,"merged":[]}
[null,"eBKP-H","Bez. eBKP-H"]
["Spalte1","Spalte2","Spalte3"]
["A","A","Grundstück"]
["A","A0"]
["A","A1","Grundstück Baurecht"]
["A","A1.1","Grundstückserwerb"]
["A","A1.2","Baurechtserwerb"]
["A","A1.3","Bauwerkserwerb"]
["A","A1.4","Perimeterbeitrag"]
["A","A2","Nebenkosten zu Grundstück Baurecht"]
{"$rows_left_out":352}
{"sheet":"BKPListe_A","index":11,"n_rows":1384,"n_cols":3,"rows_kept":1384,"cut":false,"hidden":true,"merged":[]}
["0 Grundstück","BKP-Nr.","Bezeichnung"]
[null,"0","Grundstück"]
["0 Grundstück","00","Vorstudien"]
["0 Grundstück","000","Übergangsposition"]
["0 Grundstück","001","Studien zur Grundstückbeurteilung, Machbarkeitsstudie"]
["0 Grundstück","002","Vermessung, Vermarchung"]
["0 Grundstück","003","Geotechnische Gutachten"]
["0 Grundstück","004","Quartierplankosten, Richtplankosten"]
["0 Grundstück","005","Provisorische Baugespanne"]
["0 Grundstück","006","Umweltverträglichkeitsprüfung"]
{"$rows_left_out":1375}
{"sheet":"eBKP-H_A","index":12,"n_rows":361,"n_cols":3,"rows_kept":361,"cut":false,"hidden":true,"merged":[]}
[null,"eBKP-H","Bez. eBKP-H"]
[]
["A","A","Grundstück"]
["A","A0"]
["A","A1","Grundstück Baurecht"]
["A","A1.1","Grundstückserwerb"]
["A","A1.2","Baurechtserwerb"]
["A","A1.3","Bauwerkserwerb"]
["A","A1.4","Perimeterbeitrag"]
["A","A2","Nebenkosten zu Grundstück Baurecht"]
{"$rows_left_out":352}
{"sheet":"Sheet3","index":13,"n_rows":8,"n_cols":9,"rows_kept":8,"cut":false,"hidden":true,"merged":[]}
[]
[{"$f":"SUM($B$2:$I$2)","v":212},25,33,55,1,66,7,13,12]
[{"$f":"SUM($B2:$I2)","v":212}]
[{"$f":"SUM($B4:$I4)","v":0}]
[{"$f":"SUM($B5:$I5)","v":0}]
[{"$f":"SUM($B6:$I6)","v":0}]
[{"$f":"SUM($B7:$I7)","v":0}]
[0]

{"sheet":"Baupreisindex","index":14,"n_rows":155,"n_cols":56,"rows_kept":155,"cut":false,"hidden":false,"merged":[]}
[null,null,null,"<POND_02>","<Date_Mois_Octobre>","<Date_Mois_Avril>"]
["<cc-05.05.01_Titre>",null,"Schweizerischer Baupreisindex - Entwicklung der Baupreise"]
["<cc-05.05.01_Sous-tItre>",null,"Indexwerte pro Grossregion und pro Objekttyp"]
["<BASE_2020>",null,"Basis Oktober 2020 = 100"]
[null,null,null,"Gewicht in %","Oktober","April","Oktober","April","Oktober","April","Oktober","April","Oktober","April","Oktober","April","Oktober","April","Oktober","April","Oktober","April","Oktober","April","Oktober","April","Oktober","April","Oktober","April","Oktober","April","Oktober","April","Oktober","April","Oktober","April","Oktober","April","Oktober","April","Oktober","April","Oktober","April","Oktober","April","Oktober","April","Oktober","April","Oktober","April","Oktober","April"]
[null,null,null,null,1998,1999,1999,2000,2000,2001,2001,2002,2002,2003,2003,2004,2004,2005,2005,2006,2006,2007,2007,2008,2008,2009,2009,2010,2010,2011,2011,2012,2012,2013,2013,2014,2014,2015,2015,2016,2016,2017,2017,2018,2018,2019,2019,2020,2020,2021,2021,2022,2022,2023,2023,2024]
[]
["<REG_01>","Schweiz","Schweiz"]
["<OBJ_02>","Schweiz","Baugewerbe : Total",100,78.7,79.5,81.599999999999994,83.1,85,87,86.9,86.3,85.5,84.6,84.9,85.2,86.9,87.4,88.6,89.6,91.9,93.5,95.3,97,98.7,96.8,96.9,96.9,97.6,99.1,99.7,99.7,99.9,100.1,100.7,100.5,100.4,99.8,100.3,99.7,99.3,98.9,98.9,99.3,99.6,100,100,100.2,100,101.4,104.1,109.2,112.7,113.9,114.5,115]
["<OBJ_03>","Schweiz","Hochbau",77.67,80.400000000000006,80.900000000000006,82.8,84.2,86,87.6,87.8,87.5,86.8,85.7,85.8,85.8,87.3,88.1,88.9,90,92.2,93.9,95.6,97.6,99.2,97.9,97.8,97.5,98.6,99.9,100.4,100.3,100.4,100.6,101.1,101.1,100.8,100.2,100.7,100.1,99.4,99,99.1,99.5,99.7,100.3,100.1,100.3,100,101.5,104.6,109.7,113.2,114.3,114.8,115.2]
{"$rows_left_out":146}
{"sheet":"Listenfelder_T","index":15,"n_rows":28,"n_cols":4,"rows_kept":28,"cut":false,"hidden":false,"merged":[]}
["Region","Objektart","Jahr","Monat"]
["Schweiz","Baugewerbe : Total","1998","April"]
["Genferseeregion","Hochbau","1999","Oktober"]
["Espace Mittelland","Neubau","2000"]
["Nordwestschweiz","Neubau Mehrfamilienhaus","2001"]
["Zürich","Neubau Mehrfamilienhaus aus Holz","2002"]
["Ostschweiz","Neubau Einfamilienhaus","2003"]
["Zentralschweiz","Neubau Bürogebäude","2004"]
["Tessin","Neubau Lagerhalle","2005"]
[null,"Renovation, Umbau","2006"]
{"$rows_left_out":19}
{"sheet":"Listenfelder","index":16,"n_rows":6,"n_cols":1,"rows_kept":6,"cut":false,"hidden":false,"merged":[]}
["Schätzung"]
["Sehr Tief"]
["Tief"]
["Mittel"]
["Hoch"]
["Sehr Hoch"]

{"sheet":"Listenfelder_211","index":17,"n_rows":8,"n_cols":11,"rows_kept":8,"cut":false,"hidden":false,"merged":[]}
["Bauteil","Schalungsfläche","Zuschläge (B)","Schalung","Schalung CHF/m2","Höhe","Beton","Beton CHF/m2","Stein","Mauerwerk CHF/m2","Zuschläge (M)"]
["1.Einzelfundament",{"$f":"IF('211'!C9=\"\",(4*1)*'211'!C8,'211'!C9*'211'!C8)","v":0},0.05,"1.Stirn- und Abschalung",167,null,"1.Unterlagsbeton",15,"1.Backstein / Aussenwand, 17.5cm",105,0.15]
["2.Streifenfundament",{"$f":"2*'211'!C8","v":0.9},0.05,"2.Typ 2, Schalung direkt. Abstellm. Schalhöhe bis 280cm",40,null,"2.Sauberkeitsschicht ",12.5,"2.Backstein / Innenwand, 12.5cm",90,0.15]
["3.Bodenplatte",{"$f":"IF('211'!C9=\"\",(4*1)*'211'!C8,'211'!C9*'211'!C8)","v":0},0.05,"3.Typ 4.1",null,null,"3.PC kg/m3 300",200,"3.Backstein / Innenwand, 15cm",95,0.15]
["4.Geschossdecke",1,0.15,null,null,null,null,null,"4.Dämmbackstein / Aussenwand"]
["5.Dachdecke",1,0.1,null,null,null,null,null,"5.Kalksandstein / Aussenwand"]
["6.Aussenwand",2,0.2,null,null,null,null,null,"6.Kalksandstein / Innenwand, 15cm",105,0.15]
["7.Innenwand",2,0.2]

{"sheet":"Nutzer","index":18,"n_rows":29,"n_cols":2,"rows_kept":29,"cut":false,"hidden":false,"merged":[]}
["Bearbeiter","Datum / Uhrzeit"]
["LindeA","2024-10-29T17:23:56"]
["LindeA","2024-10-30T08:12:11"]
["LindeA","2024-10-31T14:33:43"]
["LindeA","2024-10-31T14:58:03"]
["LindeA","2024-11-06T13:03:34"]
["LindeA","2024-11-25T15:20:56"]
["LindeA","2024-11-26T08:21:12"]
["LindeA","2024-11-26T08:26:14"]
["LindeA","2024-11-26T12:19:02"]
{"$rows_left_out":20}
{"sheet":"Bauteile (2)","index":19,"n_rows":501,"n_cols":27,"rows_kept":501,"cut":false,"hidden":true,"merged":[]}
["Lfd.-Nr.","eBKP-H","BKP","Beschreibung","Untertitel","Bauteil","Einheit","EP",null,null,null,null,"Bauteildicke","Unterlagsbeton.","Sauberkeitsschicht ","Schalung","Schalung direkt. Abstellm. Typ 2 Schalhöhe bis 280cm.","PC kg/m3 300.","Bewehrungsanteil KG/m3","Bewehrung kg","Anschlussbewehrung / Durchstanzarmierung und dgl.","Stein","Gleitlager","Sturz","Zuschläge.",null,"Gelb muss geprüft werden"]
[null,null,null,null,null,null,null,"INTERN","2024-01-01"]
[]
[1,"B 01.02","101",{"$f":"IF(C4=0,\"\",LOOKUP(C4,BKP,Baukostenplan))","v":"Bestandesaufnahmen"},null,"Gebäudeaufnahme Rissprotokolle","gl"]
[{"$f":"IF(C5=0,\"\",A4+1)","v":2},"B 01.01","102","Baugrunduntersuchungen",null,"Untersuchung","gl"]
[3,"B 01.03","102","Baugrunduntersuchungen","Umweltmessungen","Materialanalysen (falls Schadstoffe).","gl"]
[4,"B 01.04","102","Baugrunduntersuchungen","Überwachungen","Regelmässige Kontrollen (z.B. Gleis und dgl.).","h",120]
[5,"B 05.01","111","Rodungen",null,"Roden bestehender Sträucher und Bäume.","m2",3.5]
[6,null,"112","Abbrüche","Rückbau nicht kontaminiertes Bauwerk","Budgetbetrag für Entrümpelung. Verrechung nach effektivem Aufwand.","gl"]
[7,"B 05.02","112","Abbrüche","Rückbau nicht kontaminiertes Bauwerk","Abbrüche /  Demontagen","m3",40]
{"$rows_left_out":492}
{"sheet":"Bauteile (3)","index":20,"n_rows":501,"n_cols":11,"rows_kept":501,"cut":false,"hidden":true,"merged":[]}
["Lfd.-Nr.","BKP","eBKP-H","Beschreibung","Untertitel","Bauteil","Einheit",2024,2023,2022,{"$f":"COUNTIF(A:A,\">0\")","v":276}]
[1,"101","B 01.02",{"$f":"IF(B2=0,\"\",LOOKUP(B2,BKP,Baukostenplan))","v":"Bestandesaufnahmen"},null,"Gebäudeaufnahme Rissprotokolle","gl"]
[{"$f":"IF(B3=0,\"\",A2+1)","v":2},"102","B 01.01","Baugrunduntersuchungen",null,"Untersuchung","gl"]
[3,"102","B 01.03","Baugrunduntersuchungen","Umweltmessungen","Materialanalysen (falls Schadstoffe).","gl"]
[4,"102","B 01.04","Baugrunduntersuchungen","Überwachungen","Regelmässige Kontrollen (z.B. Gleis und dgl.).","h",120]
[5,"111","B 05.01","Rodungen",null,"Roden bestehender Sträucher und Bäume.","m2",3.5]
[6,"112",null,"Abbrüche","Rückbau nicht kontaminiertes Bauwerk","Budgetbetrag für Entrümpelung. Verrechung nach effektivem Aufwand.","gl"]
[7,"112","B 05.02","Abbrüche","Rückbau nicht kontaminiertes Bauwerk","Abbrüche /  Demontagen","m3",40]
[8,"119","B 05.03","Übriges","Rückbau kontaminiertes Bauwerk","Abbruch","m3",42]
[9,"119","B 05.03","Übriges","Rückbau kontaminiertes Bauwerk","Zusätzliche Entsorgungsgebühren.","m3",32]
{"$rows_left_out":492}
{"sheet":"Bauteile (4)","index":21,"n_rows":500,"n_cols":10,"rows_kept":500,"cut":false,"hidden":true,"merged":[]}
["ID","BKP","eBKP-H","Beschreibung","Untertitel","Bauteil","Einheit","2024 ","2023 ","2022 "]
[1,"101","B 01.02",{"$f":"IF(B2=0,\"\",LOOKUP(B2,BKP,Baukostenplan))","v":"Bestandesaufnahmen"},null,"Gebäudeaufnahme Rissprotokolle","gl"]
[2,"102","B 01.01","Baugrunduntersuchungen",null,"Untersuchung","gl"]
[3,"102","B 01.03","Baugrunduntersuchungen","Umweltmessungen","Materialanalysen (falls Schadstoffe).","gl"]
[4,"287","G 06.03","287 Baureinigung","Test 7000","Spülen der Schmutz- und Meteorleitungen.","gl",1500]
[5,"111","B 05.01","Rodungen",null,"Roden bestehender Sträucher und Bäume.","m2",3.5]
[6,"112",null,"Abbrüche","Rückbau nicht kontaminiertes Bauwerk","Budgetbetrag für Entrümpelung. Verrechung nach effektivem Aufwand.","gl"]
[7,"112","B 05.02","Abbrüche","Rückbau nicht kontaminiertes Bauwerk","Abbrüche /  Demontagen","m3",40]
[8,"119","B 05.03","Übriges","Rückbau kontaminiertes Bauwerk","Abbruch","m3",42]
[9,"119","B 05.03","Übriges","Rückbau kontaminiertes Bauwerk","Zusätzliche Entsorgungsgebühren.","m3",32]
{"$rows_left_out":491}
{"sheet":"Bauteile_B","index":22,"n_rows":277,"n_cols":9,"rows_kept":277,"cut":false,"hidden":true,"merged":[]}
["BKP","eBKP-H","Beschreibung","Untertitel","Bauteil","Einheit","2024 ","2023 ","2022 "]
["101","B 01.02","Bestandesaufnahmen",null,"Gebäudeaufnahme Rissprotokolle","gl",10,"    ","    "]
["102","B 01.01",{"$f":"IF(A3=0,\"\",LOOKUP(A3,BKP,Baukostenplan))","v":"Baugrunduntersuchungen"},null,"Untersuchung","gl",11]
["102","B 01.03","Baugrunduntersuchungen","Umweltmessungen","Materialanalysen (falls Schadstoffe).","gl",12,5,6]
["287","G 06.03","287 Baureinigung",null,"Spülen der Schmutz- und Meteorleitungen.","gl",13]
["111","B 05.01","Rodungen",null,"Roden bestehender Sträucher und Bäume.","m2",14]
["112",null,"Abbrüche","Rückbau nicht kontaminiertes Bauwerk","Budgetbetrag für Entrümpelung. Verrechung nach effektivem Aufwand.","gl",15]
["112","B 05.02","Abbrüche","Rückbau nicht kontaminiertes Bauwerk","Abbrüche /  Demontagen","m3",16]
["119","B 05.03","Übriges","Rückbau kontaminiertes Bauwerk","Abbruch","m3",17]
["119","B 05.03","Übriges","Rückbau kontaminiertes Bauwerk","Zusätzliche Entsorgungsgebühren.","m3",18]
{"$rows_left_out":267}