{"text_format":"1","workbook":"xlsx","n_sheets":23,"sheets":["Auswahl","Offene Punkte","Suche","Bauteile","211","Teuerung","Baupreisindex_NPK","MS1_B","MS1_Basisdaten","BKPListe","eBKP-H","BKPListe_A","eBKP-H_A","Sheet3","Baupreisindex","Listenfelder_T","Listenfelder","Listenfelder_211","Nutzer","Bauteile (2)","Bauteile (3)","Bauteile (4)","Bauteile_B"],"not_rendered":{"charts":0,"images":5,"macros":1,"external_links":0,"defined_names":38,"comments":1,"pivot_tables":1},"unopened":[],"bounds":{"document_bytes":16777216,"sheet_cells":100000,"rows_first":2000,"rows_last":500,"rows_between":2000,"halvings":0,"cell_chars":16384,"cell_head_chars":4096},"cells_cut":0,"cells_raw":0,"read":"whole","date_system":"1900"}

{"sheet":"Auswahl","index":0,"n_rows":0,"n_cols":0,"rows_kept":0,"cut":false,"hidden":false,"merged":[]}

{"sheet":"Offene Punkte","index":1,"n_rows":12,"n_cols":2,"rows_kept":12,"cut":false,"hidden":false,"merged":[]}
["Bauteilsuche, Baupreisindex überarbeiten"]
["Button über Tab ansteuern"]
[]
[]
["Bauteilkatalog","Neue Einträge"]
[null,"Einträge Bearbeiten"]
[null,"Einträge Löschen"]
[]
[]
["MS1 Basisdaten","Einträge anpassbar"]
[]
[211,"Stahlpreis"]

{"sheet":"Suche","index":2,"n_rows":14,"n_cols":6,"rows_kept":14,"cut":false,"hidden":false,"merged":[]}
[]
[]
[null,null,null,null,"BKP","eBKP-H"]
[null,null,null,null,"212.2"]
["Bauteil","Untertitel","Einheit","2024 "]
["Balkonbrüstungen Beton.","Aussen liegende Absturzsicherung","m",250]
["Erdverbundene Treppe, Rampe","(Leer)","m2",500]
["Erdverbundenes Podest.","(Leer)","m2",300]
["Vorfabrizierte aussen Podest in Beton.","Aussen liegendes Podest","m2",590]
["Vorfabrizierte aussen Treppen in Beton.","Aussen liegende Treppe, Rampe","m2",650]
["Vorfabrizierte Betonstützen 20x20cm.","Aussenstütze vorfabriziert","m",500]
[null,"Innenstütze vorfabriziert","m",500]
["Vorfabrizierte innen Podest in Beton.","Innen liegendes Podest","m2",590]
["Vorfabrizierte innen Treppen in Beton. \n(Gemessene Aufsichtsfläche)","Innen liegende Treppen, Rampe","m2",650]

{"sheet":"Bauteile","index":3,"n_rows":276,"n_cols":9,"rows_kept":276,"cut":false,"hidden":false,"merged":[]}
["BKP","eBKP-H","Beschreibung","Untertitel","Bauteil","Einheit","2024 ","2023 ","2022 "]
["101","B 01.02","Bestandesaufnahmen","","Gebäudeaufnahme Rissprotokolle","gl","  ","  ","  "]
["102","B 01.01",{"$f":"IF(A3=0,\"\",LOOKUP(A3,BKP,Baukostenplan))","v":"Baugrunduntersuchungen"},null,"Untersuchung","gl"]
["102","B 01.03","Baugrunduntersuchungen","Umweltmessungen","Materialanalysen (falls Schadstoffe).","gl"]
["287","G 06.03","287 Baureinigung","Test 7000","Spülen der Schmutz- und Meteorleitungen.","gl",1500]
["111","B 05.01","Rodungen",null,"Roden bestehender Sträucher und Bäume.","m2",3.5]
["112",null,"Abbrüche","Rückbau nicht kontaminiertes Bauwerk","Budgetbetrag für Entrümpelung. Verrechung nach effektivem Aufwand.","gl"]
["112","B 05.02","Abbrüche","Rückbau nicht kontaminiertes Bauwerk","Abbrüche /  Demontagen","m3",40]
["119","B 05.03","Übriges","Rückbau kontaminiertes Bauwerk","Abbruch","m3",42]
["119","B 05.03","Übriges","Rückbau kontaminiertes Bauwerk","Zusätzliche Entsorgungsgebühren.","m3",32]
["119",null,"Übriges","Rückbau kontaminiertes Bauwerk","Schadstoffsanierung. \nVerrechung nach effektivem Aufwand.","gl"]
["120","B 03","Übergangsposition",null,"Sicherung und Provisorien.","gl"]
["13","B 02.01","Gemeinsame Baustelleneinrichtung",null,"Prozentsatz von BKP 2-4","%"]
["131","B 02.01","Abschrankungen",null,"Signalisation u.d.gl.","gl"]
["132","B 02.01","Zufahrten, Plätze",null,"Zufahrten und Plätze","m2"]
["132","B 02.01","Zufahrten, Plätze",null,"Provisorische Parkplätze","Stk.",150]
["133","B 02.03","Büro Bauleitung",null,"Einr. + Vorh. Bauleitungscontainer (LE=St x Mt).","LE",650]
["135.0","B 02.02","Kanalisationen","Provisorische Installationen",null,"gl"]
["135.1","B 02.02","Elektro","Provisorische Installationen","Einr. + Vorh. Baustromverteiler 2 Stk","Mnt.",535]
["135.1","B 02.02","Elektro","Provisorische Installationen","Längeres Vorh. Baustromv. 2 Stk","Mnt.",344]
["135.3","B 02.02","Wasser","Provisorische Installationen",null,"gl"]
["136","B 02.02","Kosten für Energie, Wasser und dgl      .",null,"Verbr.+Ents. Baustrom, -wasser, -heizung","Mnt.",3750]
["139","B 02.06","Übriges",null,"Winterbaumassnahmen.","m2"]
["150",null,"Übergangsposition","Telekommunikationsleitung","Nur Kabel.","m"]
["150",null,"Übergangsposition","Wasserleitung",null,"m"]
["151","B 04","Erdarbeiten","Aushub und Hinterfüllung","Für sämtliche Werkleitungen (Wasser, Elektro, Medien).","m3",50]
["152",null,"Kanalisationsleitungen",null,"Kanalisation inkl. Schächte, Grabarbeiten und Spülung.","pl"]
["153",null,"Elektroleitungen",null,"Hüllrohre inkl. Schächte.","m"]
["153",null,"Elektroleitungen",null,"Stark.- Schwachstrom","m",95]
["153",null,"Elektroleitungen",null,"Bestehende Leitungen umlegen inkl. Grabarbeiten.","m"]
["154","B 04","Heizungs-, Lüftungs-, Klima-, Kälteleitungen","Fernwärme, Fernbkälte","Heizungs- und Kälteleitung.","m",500]
["154","B 04.08","Heizungs-, Lüftungs-, Klima-, Kälteleitungen","Gasleitung",null,"m",80]
["172","B 06.03","Baugrubenabschlüsse","Böschungssicherung","Spritzbeton.","m2",180]
["172","B 06.03","Baugrubenabschlüsse","Böschungssicherung","Nagelwände.","m2",360]
["172","B 06.04","Baugrubenabschlüsse",null,"Spundwand.","m2",470]
["172","B 06.04","Baugrubenabschlüsse",null,"Rühlwand.","m2",560]
["172","B 06.04","Baugrubenabschlüsse",null,"Bohrpfahlwand.","m2",920]
["175","C 01.01","Grundwasserabdichtungen",null,"Feuchtigkeitsabdichtung DK 2.","GGF",35]
["175","C 01.01","Grundwasserabdichtungen",null,"Feuchtigkeitsabdichtung DK 1.","GGF",60]
["175","E 01.01","Grundwasserabdichtungen","Abdichtung, Beschichtung unter Terrain","Abdichtung DK 2 Wände UG.","m2",35]
["175","E 01.01","Grundwasserabdichtungen","Abdichtung, Beschichtung unter Terrain","Abdichtung DK 1 Wände UG.","m2",75]
["176","B 06.06","Wasserhaltung",null,"Wasserhaltung für Oberflächenwasser.","gl"]
["176","B 06.06","Wasserhaltung",null,"Gebühren für Einleitung Meteorwasser in Kanalisation.","m3",0.65]
["176","B 06.06","Wasserhaltung",null,"Grundwasserabsenkung","m3"]
["201.1","B 06.01","Erdarbeiten","Nicht kontaminierter Aushub","Oberboden maschinell mit seitlicher Lagerung.","m3",3.05]
["201.1","B 06.01","Erdarbeiten","Nicht kontaminierter Aushub","Aushub maschinell mit seitlicher Lagerung.","m3",3.65]
["201.1","B 06.01","Erdarbeiten","Nicht kontaminierter Aushub","Sohlenaushub letzte 20cm.","m3",4]
["201.1","B 06.01","Erdarbeiten","Nicht kontaminierter Aushub","Transport Oberboden auf Deponie Baustelle.","m3",4]
["201.1","B 06.01","Erdarbeiten","Nicht kontaminierter Aushub","Transport Oberboden auf Deponie Unternehmer.","m3",6.7]
["201.1","B 06.01","Erdarbeiten","Nicht kontaminierter Aushub","Transport Aushub auf Deponie Unternehmer.","m3",10.6,12,11]
["201.1","B 06.01","Erdarbeiten","Nicht kontaminierter Aushub","Gebühren Oberboden (Lagerung oder Abgabe).","m3",0.55000000000000004]
["201.1","B 06.01","Erdarbeiten","Nicht kontaminierter Aushub","Gebühren Aushub (Lagerung oder Abgabe).","m3",5.6]
["201.1","B 06.02","Erdarbeiten","Kontaminierter Aushub","Kontaminierter Aushub baggerfähig.","m3",36]
["201.1","B 06.02","Erdarbeiten","Kontaminierter Aushub","Zusätzliche Gebühren.","m3"]
["201.1","B 06.03","Erdarbeiten","Böschungssicherung","Einfache Baugrubensicherung mit PE-Folie.","m2",5.5]
["201.1","B 06.05","Erdarbeiten","Materialeinbau","Einbringen Hinterfüllung von Deponie Baustelle.","m3",6.5]
["201.1","B 06.05","Erdarbeiten","Materialeinbau","Hinderfüllung maschinell Verdichten.","m3",2.5]
["201.1","B 06.05","Erdarbeiten","Materialeinbau","Liefern und Einbringen von Sickerkies 32-45mm.","m3",83]
["211.0","B 02.01","Baustelleneinrichtung","Allgemeine Baustelleneinrichtung","Prozentsatz von BKP 2","%"," 6-8"]
["211.0","B 02.03","Baustelleneinrichtung",null,"Bau-WC (LE=St x Mt)","LE",200]
["211.0","B 02.03","Baustelleneinrichtung",null,"Längeres Vorh. Bau-WC (LE=St x Mt)","LE",200]
["211.0","B 02.04","Baustelleneinrichtung",null,"Baukran (LE=St x Mt)","LE",5500]
["211.0","B 02.04","Baustelleneinrichtung",null,"Kranbetrieb für dritte inkl. Bedinung","h"]
["211.0","B 02.04","Baustelleneinrichtung",null,"Radwaschanlage (LE=St x Mt).","LE",2640]
["211.1","B 08.01","Gerüste",null,"Fassadengerüst.","m2",36]
["211.1","B 08.02",{"$f":"IF(A66=0,\"\",LOOKUP(A66,BKP,Baukostenplan))","v":"Gerüste"},null,"Innengerüst.","GF",2]
["211.1","B 08.02","Gerüste",null,"Liftschachtgerüste.","Stk",410]
["211.4","D 09.04","Kanalisationen im Gebäude",null,"Kanalisation unter/in Bodenplatte inkl. Aushub.","GGF",65]
["211.4","D 09.04","Kanalisationen im Gebäude",null,"Versickerungsanlage","GGF",8]
["211.4","D 09.04","Kanalisationen im Gebäude","Abwassersammlung","Kanalisation.","GGF",40]
["211.5","C 01.02","Beton- und Stahlbetonarbeiten",null,"Einzelfundament, Beton horizontal oder im Gefalle bis 3%,","m2","Link",1000,800]
["211.5","C 01.03","Beton- und Stahlbetonarbeiten",null,"Bodenplatte, Beton horizontal oder im Gefalle bis 3%,","m2","Link"]
["211.5","C 02.01","Beton- und Stahlbetonarbeiten","Aussenwand","Aussenwandkonstruktion Betonwände","m2","Link"]
["211.5","C 02.02","Beton- und Stahlbetonarbeiten","Innenwand","Innenwandkonstruktion Betonwände","m2","Link"]
["211.5","C 04.01","Beton- und Stahlbetonarbeiten",null,"Geschossdecke in Beton","m2","Link"]
["211.5","C 04.04","Beton- und Stahlbetonarbeiten",null,"Flachdachkonstruktion in Beton","m2","Link"]
["211.5","C 04.08","Beton- und Stahlbetonarbeiten","Aussen liegende  Konstruktion, Vordach","Kragplattenanschlüsse gedämmt.","m",320]
["211.5","C 04.08","Beton- und Stahlbetonarbeiten","Aussen liegende  Konstruktion, Vordach","Balkone","m2",230]
["211.5","C 05.01","Beton- und Stahlbetonarbeiten","Durchbruch, Schlitz zu Konstruktion","Regie Baumeister, Prozent von BKP 23, 24, 25, 26","%",2.2999999999999998]
["211.5","C 05.01","Beton- und Stahlbetonarbeiten","Durchbruch, Schlitz zu Konstruktion","Durchbruch, Schlitz zu Konstruktion, Prozent von BKP 23, 24, 25, 26","%",2.2999999999999998]
["211.5","C 01 03","Beton- und Stahlbetonarbeiten",null,"Bodenplatte aus Stahlfaserbeton (ca. 35Kg/m3)","m2","Link"]
["211.6","C 02.01","Maurerarbeiten","Backstein","Aussenwandkonstruktion Backstein","m2","Link"]
["211.6","C 02.01","Maurerarbeiten","Dämmbackstein","Aussenwand Dämmbackstein Imbrex z7 inkl. Leibungen und Stürze","m2","Link"]
["211.6","C 02.02","Maurerarbeiten",null,"Innenwandkonstruktion Backstein","m2","Link"]
["211.6","C 02.02","Maurerarbeiten",null,"Innenwandkonstruktion Backstein","m2","Link"]
["211.6","C 02.02","Maurerarbeiten",null,"Innenwandkonstruktion Kalksandstein","m2","Link"]
["211.6","C 02.02","Maurerarbeiten",null,"Stürze zu Mauerwerke","m","Link"]
["211.6","C 05.02","Maurerarbeiten","Ergänzende Leistungen","Zu Maurerarbeiten wie Mörtel Stahlzargen und dgl, Prozent von BKP 27+28","%",4.5]
["211.9","C 01.01",0,"Abdichtung, Dämmung Bodenplatte","Perimeterdämmung XPS 500, 160mm.","m2",75]
["211.9","E 01.02",0,"Aussenwärmedämmung unter Terrain","Perimeterdämmung.","m2",60]
["211.9","E 01.03",0,null,"Schutzschicht unter Terrain.","m2",15]
["212.2","C 03.01","Elemente aus Beton","Aussenstütze vorfabriziert","Vorfabrizierte Betonstützen 20x20cm.","m",500]
["212.2","C 03.02","Elemente aus Beton","Innenstütze vorfabriziert","Vorfabrizierte Betonstützen 20x20cm.","m",500]
["212.2","C 04.02","Elemente aus Beton","Innen liegende Treppen, Rampe","Vorfabrizierte innen Treppen in Beton. \n(Gemessene Aufsichtsfläche)","m2",650]
["212.2","C 04.03","Elemente aus Beton","Innen liegendes Podest","Vorfabrizierte innen Podest in Beton.","m2",590]
["212.2","C 04.06","Elemente aus Beton","Aussen liegende Treppe, Rampe","Vorfabrizierte aussen Treppen in Beton.","m2",650]
["212.2","C 04.07","Elemente aus Beton","Aussen liegendes Podest","Vorfabrizierte aussen Podest in Beton.","m2",590]
["212.2","E 02.06","Elemente aus Beton","Aussen liegende Absturzsicherung","Balkonbrüstungen Beton.","m",250]
["212.2","C 01.04","Elemente aus Beton",null,"Erdverbundene Treppe, Rampe","m2",500]
["212.2","C 01.05","Elemente aus Beton",null,"Erdverbundenes Podest.","m2",300]
["214.1","C 04.05","Traggerippe (Zimmermanns- konstruktionen)","Konstruktion geneigtes Dach","Konstruktion geneigtes Dach in Holz.","m2",160]
["215.2","E 02.03","Fassadenbau","Hinterlüftete Fassadensysteme","Lattenrost ausgedämmt, hinterl. Faserzementplatten.","m2",450]
["217","C 05.02","Schutzraumabschlüsse","Schutzraumbauteile","Panzertüre.","Stk.",1200]
["217","C 05.02","Schutzraumabschlüsse","Schutzraumbauteile","Fluchtröhre.","m1"]
["221.1","E 03.01","Fenster aus Holz/Metall","Fenster Test","Hebeschiebe in Holz/Metall (mit SIGAB).","m2","800","800",650]
["221.1","E 03.01","Fenster aus Holz/Metall","Fenster","Hebeschiebe in Holz/Metall (mit SIGAB).","m2",800]
["221.1","E 03.01","Fenster aus Holz/Metall","Fenster Test","Hebeschiebe in Holz/Metall (mit SIGAB).","m2","800",150]
["221.2","E 03.01","Fenster aus Kunststoff","Fenster","Fenster und Fenstertüren in Kunststoff (mit SIGAB).","m2",500]
["221.2","E 03.01","Fenster aus Kunststoff","Fenster","Hebeschiebe in Kunststoff (mit SIGAB).","m2",560]
["221.3","E 03.01","Fenster aus Stahl","Fenster","Fenster und Fenstertüren in Kunststoff/Metall (mit SIGAB).","m2",560]
["221.3","E 03.01","Fenster aus Stahl","Fenster","Hebeschiebe in Kunststoff/Metall (mit SIGAB).","m2",680]
["221.6","E 03.02","Aussentüren, Tore aus Metall","Aussentüre","Aluminium Haustüre.","m2",1500]
["221.6","E 03.03","Aussentüren, Tore aus Metall","Aussentor","Kipptor aus Metall.","m2",1200]
["221.6","E 03.03","Aussentüren, Tore aus Metall","Aussentor","Handsender zu Tor","Stk",90]
["221.7","E 02.04","Schaufensteranlagen","Systemfassade","Pfosten-/Riegel ohne Konstruktion max. über 1 Gechoss.","m2",1050]
["222","F 01.01","Spenglerarbeiten","Dachabdichtung","Spenglerarbeiten, pro m2 Dachfläche","m2",35]
["223","F 02.03","Blitzschutz","Schutzanlage zu Dach","Blitzschutz.Pro m2 Dachfläche","m2",13]
["224.1","F 01.01","Plastische und elastische Dichtungsbeläge (Flachdächer)","Dachabdichtung unter Terrain","Vorarbeiten und Arbeiten.","m2",2.5]
["224.1","F 01.01","Plastische und elastische Dichtungsbeläge (Flachdächer)","Dachabdichtung unter Terrain","Bitumenvoranstrich.","m2",3]
["224.1","F 01.01","Plastische und elastische Dichtungsbeläge (Flachdächer)","Dachabdichtung unter Terrain","1cm Abdichtung bituminös 2-lagig.","m2",25]
["224.1","F 01.01","Plastische und elastische Dichtungsbeläge (Flachdächer)","Dachabdichtung unter Terrain","Drain WS20.","m2",9]
["224.1","F 01.01","Plastische und elastische Dichtungsbeläge (Flachdächer)","Dachabdichtung unter Terrain","Service pro Jahr. 5 x Kosten Dachabdichtung unter Terrain","Stk",0.75]
["224.1","F 01.01","Plastische und elastische Dichtungsbeläge (Flachdächer)","Dachabdichtung","Zuschläge, Prozentsatz auf Adichtungsarbeiten","%",10]
["224.1","F 01.02","Plastische und elastische Dichtungsbeläge (Flachdächer)","Flachdach begrünt","Dampfsperre.","m2",13]
["224.1","F 01.02","Plastische und elastische Dichtungsbeläge (Flachdächer)","Flachdach begrünt","Wärmedämmung.","m2",60]
["224.1","F 01.02","Plastische und elastische Dichtungsbeläge (Flachdächer)","Flachdach begrünt","Bitumendichtungsbahn 2-lagig.","m2",30]
["224.1","F 01.02","Plastische und elastische Dichtungsbeläge (Flachdächer)","Flachdach begrünt","Schutz-/Entwässerungsschicht.","m2",15]
["224.1","F 01.02","Plastische und elastische Dichtungsbeläge (Flachdächer)","Flachdach begrünt","Extensive Begrünung.","m2",30]
["224.1","F 01.02","Plastische und elastische Dichtungsbeläge (Flachdächer)","Flachdach Balkon ungedämmt","Abdichtung.","m2",20]
["224.1","F 01.02",{"$f":"IF(A130=0,\"\",LOOKUP(A130,BKP,Baukostenplan))","v":"Plastische und elastische Dichtungsbeläge (Flachdächer)"},"Flachdach Balkon ungedämmt","Zementüberzug.","m2",35]
["224.1","F 01.02","Plastische und elastische Dichtungsbeläge (Flachdächer)","Flachdach Balkon gedämmt","Zementplatten inkl. Kiesschicht.","m2",65]
["224.1","F 01.02","Plastische und elastische Dichtungsbeläge (Flachdächer)","Absturzsicherung Flachdach","Anschlagpunkte mit Grundplatten auf Beton. 5 Stück pro m","m",240]
["224.1","F 01.02","Plastische und elastische Dichtungsbeläge (Flachdächer)","Absturzsicherung Flachdach","Führungsseil.","m",14]
["224.1","F 01.02","Plastische und elastische Dichtungsbeläge (Flachdächer)","Absturzsicherung Flachdach","Eckverbindung.","Stk",25]
["224.1","F 01.02","Plastische und elastische Dichtungsbeläge (Flachdächer)","Absturzsicherung Flachdach","Sicherheitstest.","Stk",375]
["224.1","F 01.02","Plastische und elastische Dichtungsbeläge (Flachdächer)","Absturzsicherung Flachdach","Auffanggurt.","Stk",170]
["224.1","F 01.02","Plastische und elastische Dichtungsbeläge (Flachdächer)","Absturzsicherung Flachdach","Sicherungsseil.","Stk",160]
["224.2","F 02.02","Glaseinbauten in Steildächern","Element zu geneigtem Dach","Dachfenster z.B. Velux","Stk",2000]
["224.3","F 02.01","Glaseinbauten in Flachdächern","Element zu Flachdach","RWA 1.2x1.2m ohne Sonnenschutz.","Stk",3500]
["224.3","F 02.01","Glaseinbauten in Flachdächern","Element zu Flachdach","Dachausstieg 1.5x0.75m.","Stk",2500]
["225.1","G 06.01","      .1 Fugendichtungen","Durchbruch, Schlitz zu Ausbau","Fugendichtungen.","GF",5]
["225.2","G 03.01","      .2 Spezielle Dämmungen","Unterkonstruktion zu Wandbekleidung","Wanddämmung z.B. Unitex gestrichen UG.","m2",65]
["225.2","G 04.01","      .2 Spezielle Dämmungen","Fertige Bekleidung Decke","Deckendämmung z.B. Unitex gestrichen UG.","m2",65]
["225.4","G 06.02","      .4 Brandschutzbekleidungen und dgl      .","Abschottung","Brandschutzbekleidungen.","GF",6]
["225.4","G 06.02","      .4 Brandschutzbekleidungen und dgl      .","Abschottung","Ausflocken von GIS-Elemente.","m3",210]
["226.2","E 02.01","      .2 Verputzte Aussenwärmedämmungen","Äussere Beschichtung","Kunststoffnetz-Armierung.","m2",9]
["226.2","E 02.01","      .2 Verputzte Aussenwärmedämmungen","Äussere Beschichtung","Grundputz.","m2",18]
["226.2","E 02.01","      .2 Verputzte Aussenwärmedämmungen","Äussere Beschichtung","Deckputz.","m2",30]
["226.2","E 02.01","      .2 Verputzte Aussenwärmedämmungen","Äussere Beschichtung","Zuschläge für Anschlüsse, Durchdringungen, etc., \nProzentsatz auf Aussenwärmedämmung","%",12]
["226.2","E 02.02","      .2 Verputzte Aussenwärmedämmungen","Aussendämmung ","Klebemörtel 0.5cm.","m2",12]
["226.2","E 02.02","      .2 Verputzte Aussenwärmedämmungen","Aussendämmung ","EPS-Dämmplatte 20.0cm.","m2",72]
["226.2","E 02.02","      .2 Verputzte Aussenwärmedämmungen","Aussendämmung ","Sturzelemente.","m",60]
["226.2","E 02.02","      .2 Verputzte Aussenwärmedämmungen","Aussendämmung ","Alu-Fensterbänke inkl. Winkel.","m",130]
["226.2","E 02.02","      .2 Verputzte Aussenwärmedämmungen","Aussendämmung ","Zuschläge für Leibungen. Prozentsatz auf Aussenwärmedämmung","%",3]
["226.2","E 02.02","      .2 Verputzte Aussenwärmedämmungen","Aussendämmung ","Zuschläge für Trawik in Leibungen (zur Handlaufbef.). Prozentsatz auf Aussenwärmedämmung","%",8]
["226.2","E 02.02","      .2 Verputzte Aussenwärmedämmungen","Aussendämmung ","Zuschläge für Anschlüsse, Durchdringungen, etc. Prozentsatz auf Aussenwärmedämmung","%",10]
["227.1","E 02.01","      .1 Äussere Malerarbeiten","Äussere Beschichtung","Anstrich auf Deckputz.","m2",12]
["227.1","E 02.05","      .1 Äussere Malerarbeiten","Fassadenbekleidung Untersicht","Anstrich auf Balkonuntersichten.","m2",10]
["228.2","E 03.04","      .2 Lamellenstoren","Sonnenschutz ","Verbundraffstoren mit Handkurbel.","m2",110]
["228.3","E 03.04","      .3 Sonnenstoren","Sonnenschutz ","Gelenkarmmarkisen mit Handkurbel.","m2",130]
["228.3","E 03.04","      .3 Sonnenstoren","Sonnenschutz ","Balkon / Loggia Vertikalmarkise Seilführung. Elektrisch.","m2",190]
["228.3","E 03.04","      .3 Sonnenstoren","Sonnenschutz ","Balkon / Loggia Vertikalmarkise Seilführung. Manuell","m2",170]
["231","D 01.01","Apparate Starkstrom","Anlage Erzeugung Starkstrom","EG-OG.","GF",90]
["231","D 01.01","Apparate Starkstrom","Anlage Erzeugung Starkstrom","UG/Keller.","GF",25]
["231","D 01.01","Apparate Starkstrom","Anlage Erzeugung Starkstrom","Photovoltaikanlagen","m2",280]
["233","D 01.05","Leuchten und Lampen","Verbraucher Starkstrom: Leuchten","EG-OG.","GF",12]
["233","D 01.05","Leuchten und Lampen","Verbraucher Starkstrom: Leuchten","UG/Keller.","GF",8]
["236","D 04.01","Schwachstrominstallationen","Brandmeldeanlage","Brandmeldeanlage EG-AG.","GF",25]
["236","D 04.01","Schwachstrominstallationen","Brandmeldeanlage","Brandmeldeanlage ESH.","GF",7]
["236","D 04.02","Schwachstrominstallationen",null,"Gaswarnanlage.","GF",15]
["237.1","D 02.01","      .1 Automationsebene","Managementebene","Elektro.","GF",7]
["237.1","D 02.01","      .1 Automationsebene","Managementebene","HLKS","GF",12]
["242","D 05.02","242 Wärmeerzeugung",null,"Wärmepumpe Erdsonde/Wasser & Bohrung ca. 200m.","EBF",60]
["243","D 05.04","243 Wärmeverteilung",null,"Wärmehauptverteilung.","EBF",60]
["244","D 04.06","244 Lüftungsanlagen",null,"Rauch- und Wärmeabzugsanlage ESH.","GF",20]
["244","D 07.01","244 Lüftungsanlagen","Aussenluftversorgung, Fortluftführung","Lüftungsanalgen UG/Keller.","GF",35]
["244","D 07.01","244 Lüftungsanlagen","Aussenluftversorgung, Fortluftführung","Lüftungsanalgen ESH.","GF",40]
["244","D 07.02","244 Lüftungsanlagen","Luftaufbereitung","Kontrollierte Wohnungslüftung.","Whg.",11000]
["244","D 07.02","244 Lüftungsanlagen",null,"Einzelne Abluftanlagen.","Stk",1800]
["244","D 07.03","244 Lüftungsanlagen",null,"Luftwärmespeicherung.","GF",500]
["246","D 06.02","246 Kälteanlagen",null,"Freecooling.","EBF",2.5]
["251","D 08.05","251 Allgemeine Sanitärapparate","Wasser: Armatur, Apparat","Lieferung Sanitärapparate 2.5-Zimmerwohnung.","Whg",7000]
["251","D 08.05","251 Allgemeine Sanitärapparate","Wasser: Armatur, Apparat","Lieferung Sanitärapparate 3.5-Zimmerwohnung.","Whg",7000]
["251","D 08.05","251 Allgemeine Sanitärapparate","Wasser: Armatur, Apparat","Lieferung Sanitärapparate 4.5-Zimmerwohnung.","Whg",13000]
["251","D 08.05","251 Allgemeine Sanitärapparate","Wasser: Armatur, Apparat","Lieferung Sanitärapparate 5.5-Zimmerwohnung.","Whg",13000]
["251","D 08.05","251 Allgemeine Sanitärapparate","Wasser: Armatur, Apparat","Montage Sanitärapparate, Prozentsatz auf Apparatelieferung","%",30]
["253","D 08.02","253 Sanitäre Ver- und Entsorgungsapparate",null,"Wasserbehandlung.","GF",555]
["254","D 08.04","254 Sanitärleitungen","Wasserverteilung    ","Leitungen über GF.","GF",38]
["255","D 08.04","255 Dämmungen Sanitärinstallationen","Wasserverteilung    ","Dämmungen Leitungen über GF.","GF",18]
["256","D 08.06","256 Sanitärinstallationselemente","Wasser: Installationselemente","Installationselemente.","Stk",1600]
["257","D 04.05","257 Elektro- und Pneumatiktafeln","Löschgerät","Handfeuerlöscher.","Stk.",550]
["257","D 04.05","257 Elektro- und Pneumatiktafeln","Löschgerät","Feuerlöschposten.","Stk.",2600]
["257","D 04.03","257 Elektro- und Pneumatiktafeln",null,"Sprinkleranlage ESH","GF",15]
["258","G 05.02",{"$f":"IF(A194=0,\"\",LOOKUP(A194,BKP,Baukostenplan))","v":"258 Kücheneinrichtungen"},null,"Küche für 2.5-Zimmerwohnung (5 Elemente).","Stk",7500]
["258","G 05.02","258 Kücheneinrichtungen",null,"Küche für 3.5-Zimmerwohnung (6 Elemente).","Stk",9000]
["258","G 05.02","258 Kücheneinrichtungen",null,"Küche für 4.5-Zimmerwohnung (7 Elemente).","Stk",10500]
["258","G 05.02","258 Kücheneinrichtungen",null,"Küche für 5.5-Zimmerwohnung (7 Elemente).","Stk",10500]
["261","D 12.01","261 Aufzüge","Personenaufzug ","Aufzüge (8 Pers.) mit xy Haltestellen (pro Haltestelle Hst).","Hst",8200]
["261","D 12.02","261 Aufzüge","Lasten- und Serviceaufzug","Lasten- und Serviceaufzüge.","Hst",20000]
["263","D 12.03","263 Fassadenreinigungsanlagen","Spezialaufzüge","Befahranlage für Fassade","Stk",150000]
["271.0","G 03.02","      .0 Verputzarbeiten (innere)",null,"Grundputz.","m2",9]
["271.0","G 03.02","      .0 Verputzarbeiten (innere)",null,"Abrieb 1.5mm auf GP.","m2",15]
["271.0","G 03.02","      .0 Verputzarbeiten (innere)",null,"Abrieb 1.5mm auf GKP ohne GP.","m2",18]
["271.0","G 04.02","      .0 Verputzarbeiten (innere)","Fertige Bekleidung Decke","Weissputz Q3 inkl. Haftgrund.","m2",18]
["271.0","G 04.02","      .0 Verputzarbeiten (innere)","Fertige Bekleidung Decke","Weissputz Q4 inkl. Haftgrund.","m2",25]
["271.1","G 01.01","      .1 Spezielle Gipserarbeiten","Feststehende Trennwand","Gipsständer 10.5cm.","m2",95]
["271.1","G 01.01","      .1 Spezielle Gipserarbeiten","Feststehende Trennwand","Gipsständer 12.5cm.","m2",120]
["271.1","G 01.01","      .1 Spezielle Gipserarbeiten","Feststehende Trennwand","Gipsständer 15cm.","m2",130]
["271.1","G 01.03","      .1 Spezielle Gipserarbeiten","Schachfront","Beplankung (nur Platten 2x125mm) auf GIS.","m2",60]
["271.1","G 01.03","      .1 Spezielle Gipserarbeiten","Schachfront","Vorsatzschale.","m2",95]
["272.0","G 01.06","      .0 Innentüren aus Metall","Innentor","Brandschutztor.","m2",2500]
["272.1","G 05.07","      .1 Metallbaufertigteile","Kleinbauteil, Schutzraumeinrichtung","Briefkasten.","Stk",520]
["272.1","G 05.07","      .1 Metallbaufertigteile","Kleinbauteil, Schutzraumeinrichtung","Kleinbauteile wie z.B. Abschlusswinkel und dgl.","GF",1.5]
["272.2","E 02.06","      .2 Allgemeine Metallbauarbeiten (Schlosserarbeiten)","Aussen liegende Absturzsicherung","Staketengeländer.","m",380]
["272.2","E 02.06","      .2 Allgemeine Metallbauarbeiten (Schlosserarbeiten)","Aussen liegende Absturzsicherung","Glasgeländer.","m",860]
["272.2","E 02.06","      .2 Allgemeine Metallbauarbeiten (Schlosserarbeiten)","Aussen liegende Absturzsicherung","Handlauf.","m",170]
["272.2","E 03.05","      .2 Allgemeine Metallbauarbeiten (Schlosserarbeiten)","Absturzsicherung","Staketengeländer duplexiert.","m",390]
["272.2","E 03.05","      .2 Allgemeine Metallbauarbeiten (Schlosserarbeiten)","Absturzsicherung","Staketengeländer feuerverzinkt.","m",330]
["272.2","E 03.05","      .2 Allgemeine Metallbauarbeiten (Schlosserarbeiten)","Absturzsicherung","Glasgeländer.","m",860]
["272.2","E 03.05","      .2 Allgemeine Metallbauarbeiten (Schlosserarbeiten)","Absturzsicherung","Handlauf.","m",180]
["272.2","G 05.05","      .2 Allgemeine Metallbauarbeiten (Schlosserarbeiten)","Absturz-, Ansprallschutzeinrichtung","Staketengeländer Treppenhaus.","m",360]
["272.2","G 05.06","      .2 Allgemeine Metallbauarbeiten (Schlosserarbeiten)","Sonderbauteil","Cheminées.","Stk"]
["272.2","G 05.06","      .2 Allgemeine Metallbauarbeiten (Schlosserarbeiten)","Sonderbauteil","Pflanztröge.","Stk"]
["272.4","G 05.07","      .4 Schutzraumteile","Schutzraumbauteile","Ausstattung wie Trockenklosett, Betten und dgl.","GF",7]
["272.4","G 05.07","      .4 Schutzraumteile","Kleinbauteil, Schutzraumeinrichtung","Schutzraumeinrichtung wie z.B. Trockenklosett, Bett und dgl.","GF",7]
["273.0","G 01.05","      .0 Innentüren aus Holz",null,"Wohnungseingangstüre EI30 KH-belegt 1x2.1m Stahlzarge.","m2",960]
["273.0","G 01.05","      .0 Innentüren aus Holz",null,"Zimmertüre KH-belegt 0.8x2.1m Stahlzarge.","m2",380]
["273.0","G 01.05","      .0 Innentüren aus Holz",null,"Zimmertüre KH-belegt 0.8x2.1m Blockfutter.","m2",460]
["273.0","G 01.05","      .0 Innentüren aus Holz",null,"Türe KH-belegt 0.8x2.1m Blockfutter EI30.","m2",560]
["273.0","G 01.05","      .0 Innentüren aus Holz",null,"Türe zu TRH KH-belegt 0.9x2.1m Stahlzargen EI30 inkl. Türschl.","m2",960]
["273.0","G 01.05","      .0 Innentüren aus Holz",null,"Türe UG KH-belegt 0.9x2.1m Stahlzargen EI30.","m2",550]
["273.1","G 05.01","      .1 Wandschränke, Gestelle und dgl      .","Garderobe","Einbauschränke 3-teilig (2x Hochschr. mit Kleiderst.).","Stk",1300]
["273.3","G 05.03","      .3 Allgemeine Schreinerarbeiten","Innerer Fensterausbau","VS 57 Vorhangschiene 1 x.","m",26]
["273.3","G 05.03","      .3 Allgemeine Schreinerarbeiten","Innerer Fensterausbau","Fenstersims gestrichen.","m",70]
["274","G 01.04","274 Spezialverglasungen (innen)",null,"Innenfenster.","m2",650]
["275","D 03.04","275 Schliessanlagen",null,"Schliessanlage.","GF",5]
["276","G 05.04","276 Innere Abschlüsse","Innerer Abschluss","Vorhang.","m2",200]
["277.1","G 01.02","      .1 Schieb- und Faltwände","Bewegliche Trennwand","Elementschiebewände.","m2",1400]
["277.2","G 01.01","      .2 Feststehende Elementwände","Feststehende Trennwand","WC-Trennwände inkl. Türen.","m2",450]
["277.2","G 01.01","      .2 Feststehende Elementwände","Feststehende Trennwand","Holzlattenverschlag Keller inkl. Türen.","m2",45]
["281.0","G 02.01","      .0 Unterlagsböden",null,"Trittschalldämmung 20mm.","m2",10.5]
["281.0","G 02.01","      .0 Unterlagsböden",null,"Wärmedämmung 40mm.","m2",22]
["281.0","G 02.01","      .0 Unterlagsböden",null,"PE-Folie.","m2",1.5]
["281.0","G 02.01","      .0 Unterlagsböden",null,"Zementunterlagsboden.","m2",26]
["281.0","G 02.01","      .0 Unterlagsböden",null,"Zuschläge für Anschüsse, etc. Prozentsatz auf UB Kosten","%",5]
["281.1","G 02.02","      .1 Fugenlose Bodenbeläge",null,"Hartbetonbelag ohne Anforderungen ungeschliffen.","m2",35]
["281.1","G 02.02","      .1 Fugenlose Bodenbeläge",null,"Hartbetonbelag mit 2K-Anstrich.","m2",50]
["281.1","G 02.02","      .1 Fugenlose Bodenbeläge",null,"Hartbetonbelag imprägniert.","m2",55]
["281.2","G 02.02","      .2 Bodenbeläge aus Kunststoffen, Textilien und dgl      .",null,"Epoxi-Kunstflessbelag.","m2",180]
["281.2","G 02.02","      .2 Bodenbeläge aus Kunststoffen, Textilien und dgl      .",null,"Linoleum.","m2",70]
["281.2","G 02.02","      .2 Bodenbeläge aus Kunststoffen, Textilien und dgl      .",null,"Parkdeckbelag Triflex.","m2",80]
["281.2","G 02.02","      .2 Bodenbeläge aus Kunststoffen, Textilien und dgl      .",null,"Kugelgarn z.B. Fabromont fertig verlegt.","m2",55]
["281.2","G 02.02","      .2 Bodenbeläge aus Kunststoffen, Textilien und dgl      .",null,"Schmutzschleusen z.B. Coral fertig verlegt.","m2",80]
["281.6","G 02.02","      .6 Bodenbeläge Plattenarbeiten",null,"Keramischer Plattenboden 30x60cm z.B. Colby-Classic Material.","m2",80]
["281.6","G 02.02","      .6 Bodenbeläge Plattenarbeiten",null,"Verlegearbeit zu Plattenboden.","m2",45]
["281.6","G 02.02","      .6 Bodenbeläge Plattenarbeiten",null,"Sockel aus Platten zu Plattenboden.","m1",20]
["281.6","G 02.02","      .6 Bodenbeläge Plattenarbeiten",null,"Vorarbeit wie Abdichtungen und dgl. inkl. Zuschläge zu Bodenplatten.","%",20]
["281.7","G 02.02",{"$f":"IF(A258=0,\"\",LOOKUP(A258,BKP,Baukostenplan))","v":"      .7 Bodenbeläge aus Holz"},null,"Parkettboden z.B. Scheucher Bilaflor Material.","m2",58]
["281.7","G 02.02","      .7 Bodenbeläge aus Holz",null,"Verlegearbeit inkl. Spachtelung und Zuschläge zu Parkettboden.","m2",40]
["281.7","G 02.02","      .7 Bodenbeläge aus Holz",null,"Sockel in Holz zu Parkettboden.","m1",10]
["281.8","G 02.02","      .8 Doppelböden",null,"Doppelböden inkl. vorgängiger Anstrich.","m2",75]
["281.9","G 02.02","      .9 Sockel",null,"Sockel Alu.","m1",18]
["282.4","G 03.02","      .4 Wandbeläge Plattenarbeiten",null,"Keramische Wandplatten 30x60cm z.B. Coby-Classic Material.","m2",80]
["282.4","G 03.02","      .4 Wandbeläge Plattenarbeiten",null,"Verlegearbeit zu Wandplatten.","m2",45]
["282.4","G 03.02","      .4 Wandbeläge Plattenarbeiten",null,"Vorarbeit wie Abdichtungen und dgl. inkl. Zuschläge zu Wandplatten.","%",25]
["285.1","G 01.05","      .1 Innere Malerarbeiten",null,"Anstrich auf Innentüren (beidseitig).","m2",25]
["285.1","G 02.02","      .1 Innere Malerarbeiten",null,"Anstrich auf Boden roh.","m2",12]
["285.1","G 02.02","      .1 Innere Malerarbeiten",null,"Bodenmarkierung ESH.","Ehp",150]
["285.1","G 03.02","      .1 Innere Malerarbeiten",null,"Anstrich auf Abrieb.","m2",6]
["285.1","G 03.02","      .1 Innere Malerarbeiten",null,"Anstrich auf Wand roh.","m2",5]
["285.1","G 04.02","      .1 Innere Malerarbeiten","Fertige Bekleidung Decke","Anstrich auf Weissputz.","m2",6]
["285.1","G 04.02","      .1 Innere Malerarbeiten","Fertige Bekleidung Decke","Anstrich auf Decke roh.","m2",5]
["285.1","G 05.07","      .1 Innere Malerarbeiten","Kleinbauteil, Schutzraumeinrichtung","Anstriche auf Metall- und Kleinteile.","GF",2]
["286","G 06.03","286 Bauaustrocknung",null,"Gebäudeaustrocknung.","GF",3.5]
["287","G 06.03","287 Baureinigung","Reinigung","Bau- und Endreinigung.","GF",10.5]
["287","G 06.03","287 Baureinigung",null,"Spülen der Schmutz- und Meteorleitungen.","gl",1500]

{"sheet":"211","index":4,"n_rows":23,"n_cols":11,"rows_kept":23,"cut":false,"hidden":false,"merged":[]}
[]
[null,"Bewehrung CHF/Kg: ",1.7,null,null,"2024-09-01"]
[]
[null,{"$f":"\"EP: \"&\"  \" & ROUND(SUM(F7:F17),2) &\" \"&\"CHF\"&\"  \"& C7&\" \"&C8&\" m\"","v":"EP:   198.92 CHF  3.Bodenplatte 0.45 m"}]
[]
["BKP",null,null,"Kosten/Einheit","Index","Kosten pro Bauteil"]
[211.5,"Bauteil","3.Bodenplatte"]
[211.5,"Bauteildicke in m",0.45]
[211.5,"Bauteil Umfang in m",0]
[211.5,"Unterbau",null,{"$f":"IF(C10=\"\",\"\",INDEX(Listenfelder_211!H:H,MATCH('211'!C10,Beton),1))","v":""},1,{"$f":"+D10","v":""}]
[211.5,"Schalung","1.Stirn- und Abschalung",{"$f":"INDEX(Listenfelder_211!E:E,MATCH('211'!C11,Schalung),1)","v":167},{"$f":"INDEX(Listenfelder_211!B:B,MATCH('211'!C7,Bauteil),1)","v":0},{"$f":"+D11*E11","v":0}]
[211.5,"Beton","3.PC kg/m3 300",{"$f":"INDEX(Listenfelder_211!H:H,MATCH('211'!C12,Beton),1)","v":200},{"$f":"IF(C9=0,1*C8,C9*C8)","v":0.45},{"$f":"+D12*E12","v":90},null,null,null,"Bodenplatte","ca. 100-115 Kg/m3"]
[211.5,"Bewehrungsanteil KG/m3",100,null,{"$f":"IF(C9=0,1*C8*C13,C9*C8*C13)","v":45},{"$f":"+E13*C15","v":76.5},null,null,"Durchschnittliche Bewehrungsgehalte","Decken","ca. 100-135 Kg/m3"]
[211.5,"Anschlussbewehrung / Durchstanzarmierung und dgl.",0.3,null,{"$f":"+E13*C14","v":13.5},{"$f":"+E14*C15","v":22.95},null,null,"Durchschnittswert 30%","Wände","ca. 80-95 Kg/m3"]
[211.5,"Bewehrung kg",{"$f":"+C2","v":1.7},null,null,null,null,null,null,"Stützen","ca. 100 Kg/m3"]
[211.5,"Zuschlage",{"$f":"INDEX(Listenfelder_211!C:C,MATCH('211'!C7,Bauteil),1)","v":0.05},null,null,{"$f":"SUM(F7:F15)*C16","v":9.4725000000000001}]
[]
[null,{"$f":"\"EP: \"&\"  \" & ROUND(SUM(F20:F24),2) &\" \"&\"CHF\"&\"  \"& C20","v":"EP:   1220.75 CHF  6.Kalksandstein / Innenwand, 15cm"}]
[]
[211.6,"Stein","6.Kalksandstein / Innenwand, 15cm",{"$f":"INDEX(Listenfelder_211!J:J,MATCH('211'!C20,Stein),1)","v":105},null,{"$f":"+D20","v":105}]
[211.6,"Gleitlager in m",100,11,null,{"$f":"+C21*D21","v":1100}]
[211.6,"Sturz"]
[211.6,"Zuschläge.",{"$f":"INDEX(Listenfelder_211!K:K,MATCH('211'!C20,Stein),1)","v":0.15},null,null,{"$f":"+F20*C23","v":15.75}]

{"sheet":"Teuerung","index":5,"n_rows":17,"n_cols":14,"rows_kept":17,"cut":false,"hidden":false,"merged":[[1,1,2,1],[1,2,2,2],[1,6,2,6],[1,7,2,7],[2,3,2,5]]}
[]
[null,"Veränderungsrate","=","( Index neu","-","Index alt )","x",100,null,null,"Region","Nordwestschweiz"]
[null,null,null,"Index alt",null,null,null,null,null,null,"Objektart","Neubau Mehrfamilienhaus"]
[null,null,null,null,null,null,null,null,null,null,null,"Jahr","Monat","Indexwert"]
[null,null,null,null,null,null,null,null,null,null,"Index alt",2005,"Oktober",{"$f":"_xlfn.AGGREGATE(15,6,Baupreisindex!E$9:BD$1150/(Baupreisindex!B$9:B$1150=L$2)/(Baupreisindex!C$9:C$1150=L$3)/(Baupreisindex!E$6:BZ$6=--L5)/(Baupreisindex!E$5:BZ$5=M5),1)","v":89.9}]
[null,null,null,null,null,null,null,null,null,null,"Index neu",2024,"April",{"$f":"_xlfn.AGGREGATE(15,6,Baupreisindex!E$9:BD$1150/(Baupreisindex!B$9:B$1150=L$2)/(Baupreisindex!C$9:C$1150=L$3)/(Baupreisindex!E$6:BZ$6=--L6)/(Baupreisindex!E$5:BZ$5=M6),1)","v":118.1}]
[]
[null,null,null,null,null,null,null,null,null,null,null,{"$f":"Baupreisindex!C4","v":"Basis Oktober 2020 = 100"}]
[null,null,null,null,null,null,null,null,null,null,"Berechnungsbasis","Preisstand, Total KV Original",{"$f":"Baupreisindex!C4","v":"Basis Oktober 2020 = 100"},100000000]
[null,null,null,null,null,null,null,null,null,null,null,"Index KV Original (alt)",{"$f":"TEXT(M5,)&\" \"&TEXT(L5,0)","v":"Oktober 2005"},{"$f":"N5","v":89.9}]
[null,null,null,null,null,null,null,null,null,null,null,"Index mitte Bauzeit (neu)",{"$f":"TEXT(M6,)&\" \"&TEXT(L6,0)","v":"April 2024"},{"$f":"N6","v":118.1}]
[]
[null,null,null,null,null,null,null,null,null,null,"Veränderungsrate","((Index neu – Index alt)/Index alt)*100 ",null,{"$f":"((N11-N10)/N10)*100","v":31.368186874304772}]
[]
[null,null,null,null,null,null,null,null,null,null,"Ergebnis","Total KV Original, Preisstand",{"$f":"M9","v":"Basis Oktober 2020 = 100"},{"$f":"+N9","v":100000000}]
[null,null,null,null,null,null,null,null,null,null,null,"Teuerung",null,{"$f":"ROUND((N9*N13%),0)","v":31368187}]
[null,null,null,null,null,null,null,null,null,null,null,"Total KV indexiert",null,{"$f":"+N15+N16","v":131368187}]

{"sheet":"Baupreisindex_NPK","index":6,"n_rows":225,"n_cols":11,"rows_kept":225,"cut":false,"hidden":false,"merged":[]}
["NPK Position","BKP","Beschreibung","Menge","Einheit","Schweiz","Mittelland","Nordwestschweiz","Zürich","Ostschweiz","Zentralschweiz"]
["1 Erdarbeiten",201]
["'211.111.111",201,"Oberboden maschinell abtragen. Flächen horizontal oder mit Neigung bis 1:4. Volumen fest. Inkl. direkter Auflad auf Transportmittel oder seitlicher Lagerung. Schichtdicke bis m 0,20",100,"m3",7.4173999999999998,6.5792999999999999,5.7024999999999997,7.6285999999999996,5.63,5.4]
["'211.211.101",201,"Baugrubenaushub maschinell. Inkl. Auflad auf Transportmittel oder seitlicher Lagerung. Offene Baugruben. Aushubtiefe bis m 5,00",1500,"m3",6.5472000000000001,5.5487000000000002,5.4442000000000004,6.3228999999999997,6.2028999999999996,5.1021999999999998]
["'211.523.104",201,"Primärmaterial: Kies, Geröll. Kiessand I",25,"m3",54.975200000000001,51.983600000000003,48.906700000000001,52.04,65.432900000000004,55.335599999999999]
["'211.651.111",201,"Auffüllungen mit seitlich gelagertem oder zugeführtem Material. Maschinell. Volumen fest",700,"m3",12.349399999999999,11.565300000000001,11.7158,9.5985999999999994,10.9414,10.2111]
["'211.282.112",201,"Fundationsschichten auf Planum, Schichtdicke m 0,26 bis 0,30",25,"m3",14.8687,12.4579,12.3992,14.52,12.197100000000001,11.3422]
[null,null,null,""]
["2 Tiefbauarbeiten",null,null,""]
["'221.411.132","211.3","Fundationsschichten einbauen. Ausmass: Volumen fest. Einbaubreite über m 3,0. Fertig eingebaute Schicht, d m 0,21 bis 0,40.",1350,"m3",10.9986,11.2133,8.6738,10.722200000000001,10.645799999999999,11.4056]
["'221.421.103","211.3","Rohplanie erstellen auf Fundationsschicht. Toleranz ab Sollhöhe + mm 0, - mm 50. Ohne Verwendung von Planiematerial. Rohplaniebreite über m 3,0.",3000,"m2",1.8678999999999999,1.5642,1.6744000000000001,1.5522,1.5024999999999999,1.9411]
["'221.423.123","211.3","Planie erstellen auf Fundationsschichten für Strassen mit Belag. Toleranz ab Sollhöhe +/- mm 10. Ohne Verwendung von Material. Planiebreite über m 3,0.",3000,"m2",5.2403000000000004,4.8083,5.4843999999999999,5.9767000000000001,5.1783000000000001,4.9156000000000004]
["'223.441.313","211.3","Tragschichten AC T Typ N maschinell einbauen und verdichten. AC T 22 N. Ausmass: Masse. d mm 80.",620,"t",157.59229999999999,138.82749999999999,150.5889,158.02780000000001,172.27500000000001,162.5333]
["'223.442.212","211.3","Deckschichten AC Typ N maschinell einbauen und verdichten. AC 11 N. Ausmass: Masse. d mm 40.",310,"t",201.02510000000001,172.36750000000001,190.98,217.5856,230.14750000000001,213.44110000000001]
["'237.231.101","211.3","Aushub V-Gräben oder -Gruben. Normal baggerbares Material. Maschinell. t bis m 1,50.",180,"m3",19.6645,15.8308,18.88,20.8889,19.362500000000001,20.472200000000001]
["'237.451.112","211.4","Polyethylenrohre PE-R liefern und verlegen.. PE-R mit STM, elastisch dichten. Nenn-Ringsteifigkeit SN 2, Rohrreihe S 16. DN/OD 160",210,"m",23.206199999999999,22.7042,23.441099999999999,25.158899999999999,22.465,24.934999999999999]
["'237.611.123","211.4","Kontrollschächte KS aus Betonfertigteilen liefern und erstellen. DN 800 mit Konus DN 800/600. Festigkeitsklasse 60. Schachttiefe m 1,01 bis 1,50 inkl. Durchlaufrinne und Schachtdeckel Guss 15 t Radlast",4,"Stk",1832.7701,1762.9757999999999,2362.1855999999998,2005.1,1748.7333000000001,1830.6]
["'237.821.201","211.3","Material für Rohrumhüllungen einbringen und verdichten. Materiallieferungen in U'abschnitt 810. Ausmass: Volumen fest. Feine Gesteinskörnung und rezyklierte Gesteinskörnungsgemische.",65,"m3",21.869800000000001,20.789200000000001,20.67,23.816700000000001,22.212499999999999,22.461099999999998]
["'237.851.212","211.3","Einfüllen, inkl. leichtes Verdichten von seitlich gelagertem oder zugeführtem Material. Ausmass: Volumen fest. Maschinell. Natürliche Gesteinskörnung.",80,"m3",17.3703,16.182500000000001,15.7333,18.124400000000001,15.630800000000001,18.574400000000001]
["'241.216.112","211.5","Schalungen für Bodenplatten. Typ 1. Konstante Höhe. Schalhöhe bis m 0,50",30,"m2",61.218000000000004,66.400899999999993,59.797499999999999,59.5717,56.122999999999998,57.675699999999999]
["'241.231.105","211.5","Schalungen für Wände und Stützmauern, vertikal. Doppelhäuptig. Typ 2. Schalhöhe m 4,51 bis 5,00",600,"m2",56.143599999999999,58.105499999999999,56.218800000000002,56.02,48.677,50.41]
["'241.232.115","211.5","Schalungen für Wände und Stützmauern geneigt. Doppelhäuptig, einseitig geneigt bis 1:5. Typ 2. Schalhöhe m 4,51 bis 5,00.",240,"m2",64.803700000000006,66.922700000000006,54.0229,63.061700000000002,58.712000000000003,65.81]
["'241.261.301","211.5","Schalungen für horizontale Deckenplatten-Untersichten. Typ 3-1 Plattendicke m 0.36 bis 0.45 Spriesshöhe m 3.51 - 5.50. Ohne Ueberhöhung. LE = m2",300,"m2",74.531300000000002,69.563599999999994,75.587100000000007,81.474999999999994,82.58,70.028599999999997]
["'241.271.301","211.5","Schalungen für gerade Ueberzüge und Brüstungen. Typ 3-1. Bauteildicke m 0.25. Schalhöhe m 1.01 bis 1.50. LE =m2",50,"m2",102.1983,97.943600000000004,109.30710000000001,92.611699999999999,106.97199999999999,96.36]
["'241.511.123","211.5","Stabstähle. Stahl B500A, liefern und verlegen. BG 1 (1). d mm 16 bis 22.",15000,"kg",2.0573000000000001,1.9173,2.0924999999999998,2.0916999999999999,1.9790000000000001,2.3357000000000001]
["'241.613.112","211.5","Beton für Bodenplatten. Beton Typ NPK A. Plattendicke m 0,21 bis 0,30. Dimension Bodenplatte m 10,00x50,00",100,"m3",246.07050000000001,260.38819999999998,241.66499999999999,226.19499999999999,224.30699999999999,239.8886]
["'241.632.144","211.5","Beton für Wände und Stützmauern ohne Anzug, liefern, einbauen und verdichten. Wand- oder Mauerhöhe über m 3,50. Beton Typ NPK A Wand- oder Mauerhöhe m 3.51 bis 4.50 Wanddicke m 0.31 bis 0.35",150,"m3",265.4008,288.69819999999999,254.55879999999999,244.7533,248.33199999999999,259.81709999999998]
["'241.661.113","211.5","Beton für Deckenplatten, liefern, einbauen und verdichten. Beton Typ NPK A. Horizontal oder einseitig geneigt bis % 5,0. Plattendicke m 0,31 bis 0,40.",150,"m3",249.63550000000001,273.29360000000003,247.50749999999999,226.19499999999999,228.83699999999999,239.27430000000001]
["'241.671.132","211.5","Beton für gerade Ueberzüge und Brüstungen, liefern, einbauen und verdichten. Ueberzugs- und Brüstungshöhe m 0,51 bis 1,50. Beton Typ NPK A. d m 0,21 bis 0,25.",10,"m3",307.96170000000001,339.92090000000002,306.13749999999999,270.08670000000001,286.637,297.92430000000002]
[null,null,null,""]
["3 Maurer- und Stahlbetonarbeiten",null,null,""]
["'237.231.101.m","211.3","Aushub V-Gräben oder -Gruben. Normal baggerbares Material. Maschinell. t bis m 1,50.",150,"m3",23.0123,19.756900000000002,22.242000000000001,24.434999999999999,23.34,21.164400000000001]
["'237.472.101.m","211.4","Sickerrohre PVC-U-S liefern und verlegen. PVC-U-S mit STM. Nenn-Ringsteifigkeit SN 2, Rohrreihe SDR 51. DN/OD 125",70,"m",17.514099999999999,16.770800000000001,16.948,19.487500000000001,15.82,15.911099999999999]
["'237.611.123.m","211.4","Kontrollschächte KS aus Betonfertigteilen liefern und erstellen. DN 800 mit Konus DN 800/600. Festigkeitsklasse 60. Schachttiefe m 1,01 bis 1,50 inkl. Durchlaufrinne und Schachtdeckel Guss 15 t Radlast",5,"Stk",1795.1976999999999,1952.1768999999999,1890.88,2129.65,1752.2,1619.5555999999999]
["'237.831.301.m","211.3","Unterlags-, Sohlen- und Hüllbeton liefern, einbringen und verdichten. Ausmass: Volumen fest. Beton mit natürlicher Gesteinskörnung. CEM I 42,5 kg/m3 250.",45,"m3",214.4194,245.14619999999999,186.14599999999999,174.7475,201.08,201.56]
["'237.851.211.m","211.3","Einfüllen, inkl. leichtes Verdichten von seitlich gelagertem oder zugeführtem Material. Ausmass: Volumen fest. Maschinell. Aushubmaterial.",255,"m3",17.7227,17.450800000000001,16.803999999999998,18.758800000000001,17.210999999999999,15.8667]
["'241.231.103","211.5","Schalungen für Wände und Stützmauern, vertikal. Doppelhäuptig. Typ 2. Schalhöhe m 2,51 bis 3,50",820,"m2",36.843600000000002,38.049199999999999,33.496000000000002,31.642499999999998,35.42,29.9056]
["'241.261.113","211.5","Schalungen für horizontale Deckenplatten-Untersichten. Typ 2. Plattendicke bis m 0,35 ohne Ueberhöhung. Spriesshöhe m 1,51 bis 3,50",1100,"m2",36.914900000000003,36.542299999999997,36.99,32.270000000000003,36.729999999999997,30.357800000000001]
["'241.511.112.m.g","211.5","Stabstähle. Stahl B500A, liefern und verlegen. Fixlängen (1). d mm 16 bis 22.",12000,"kg",1.5774999999999999,1.6076999999999999,1.458,1.54,1.6439999999999999,1.3922000000000001]
["'241.521.111","211.5","Bewehrungsmatten. Stahl B500A, liefern und verlegen  Lagermatten unverschnitten, für statische Verwendung. Alle Mattentypen.",21500,"kg",2.0773999999999999,2.3191999999999999,2.1920000000000002,1.8488,1.9970000000000001,1.9089]
["'241.613.112.m","211.5","Beton für Bodenplatten mit konstanter Dicke, liefern, einbauen und verdichten. Oberfläche horizontal oder einseitig geneigt bis % 5,0. Beton Typ NPK A. Plattendicke m 0,21 bis 0,30",66,"m3",214.84909999999999,236.74619999999999,186.17,177.53880000000001,220.33,192.91669999999999]
["'241.631.132.g","211.5","Beton für Wände und Stützmauern ohne Anzug liefern, einbauen und verdichten. Wand- oder Mauerhöhe m 2,51 bis 3,50. Beton Typ NPK A. Wanddicke m 0,21 bis 0,25",85,"m3",235.73689999999999,262.86540000000002,202.654,206.85380000000001,231.96,219.6189]
["'241.661.112","211.5","Beton für Deckenplatten liefern, einbauen und verdichten. Beton Typ NPK A. Horizontal oder einseitig geneigt bis % 5,0. Plattendicke m 0,21 bis 0,30. ",275,"m3",211.55289999999999,233.98079999999999,177.988,175.28749999999999,216.38,186.5633]
["'314.111.132g","211.6","Einsteinmauerwerk aus Backstein ohne besondere Eigenschaften MB. Gleichzeitig mit Rohbau erstellen. Vollfugig vermauern. d mm 140 bis 160. h m 1,51 bis 3,00",760,"m2",80.838399999999993,83.350800000000007,69.426000000000002,71.841200000000001,74.97,75.9011]
["'314.131.122","211.6","Einsteinmauerwerk aus Kalksandstein ohne besondere Eigenschaften MK. Gleichzeitig mit Rohbau erstellen. Vollfugig vermauern. d mm 115 bis 135. h m 1,51 bis 3,00.",40,"m2",102.1533,104.64619999999999,76.245999999999995,84.321200000000005,103.35,85.006699999999995]
["'314.621.125","211.6","Dämmplatten an Mauerwerk befestigen. Mineralwollplatten. Steinwolle, deklarierter Wert der Wärmeleitfähigkeit lambda_D max. W/mK 0,034, Rohdichte ca. kg/m3 60. d mm 180.",580,"m2",61.1494,65.215400000000002,54.317999999999998,63.102499999999999,60.45,54.411099999999998]
[null,null,null,""]
["4 Estriche ",null,null,""]
["'661.433.112","281.0","Trittschall-Dämmplatten aus expandiertem Polystyrol gewalkt EPS-T. Einlagig mit Randstreifen. Platten unbelegt, d mm 22/20",900,"m2",6.6445999999999996,6.24,6.5171000000000001,6.7756999999999996,6.5438000000000001,6.3250000000000002]
["'661.511.101","281.0","Trenn- und Gleitschichten aus Kunststofffolien verlegen und\nan Wänden mindestens bis OK fertiger Bodenbelag hochziehen. Bahnen min. mm 150 überlappen. Lose verlegen. Polyethylenfolien PE, d mm 0,2.",900,"m2",1.6348,1.7471000000000001,1.52,1.3471,1.62,1.6375]
["'661.611.113","281.0","Zementestriche CT. Beanspruchskategorie A, Festigkeitsklasse C20 - F4, auf Trennschicht. d mm 60",900,"m2",22.317399999999999,25.293299999999999,20.491399999999999,19.724299999999999,20.420000000000002,20.8675]
["'661.711.111","281.0","Zementestrich CT. Mit Bodenheizung. Beanspruchungskategorie A, Festigkeitsklasse C20 - F4, auf Dämmschicht. d mm 75",900,"m2",24.301400000000001,27.215,22.942900000000002,22.1,22.716200000000001,23.2425]
["'661.741.132","281.0","Variante: Calciumsulfat-Fliessestrich CAF. Beanspruchungskategorie A, Festigkeitsklasse C35 - F7, auf Dämmschicht. d mm 55",900,"m2",29.686,29.09,27.0929,27.504300000000001,28.841200000000001,29.037500000000001]
[null,null,null,""]
["5 Plattenarbeiten",null,null,""]
["'645.211.181","282.4","Wandbeläge Gruppe A I. Keramikplatten stranggepresst, Wasseraufnahme E bis % 3. Farbton weiss, Abmessung mm 200x300, Einsatzort Küche. Nur verlegen.",30,"m2",57.171500000000002,63.413800000000002,63.0871,59.112499999999997,53.161999999999999,59.118000000000002]
["'645.221.112","28.4","Wandbeläge Gruppe B I a. Keramikplatten trockengepresst, Wasseraufnahme E bis % 0,5. Farbton pastellfarben, Abmessung mm bis 200x300, Einsatzort Sanitärräume. Nur verlegen",400,"m2",54.723999999999997,61.333799999999997,58.831400000000002,56.344999999999999,50.362000000000002,58.338000000000001]
["'645.311.212","281.6","Bodenbeläge Gruppe A I. Keramikplatten stranggepresst, Wasseraufnahme E bis % 3. Unglasiert. Grösse bis mm 300x600. Einsatzort Wohnen. Nur verlegen.",500,"m2",52.791899999999998,57.413800000000002,54.458599999999997,54.777500000000003,49.362000000000002,56.573999999999998]
["'645.321.122","281.6","Bodenbeläge Gruppe B I a. Keramikplatten trockengepresst, Wasseraufnahme E bis % 0,5. Glasiert. Abmessung mm bis 300 x 300. Einsatzort Bad / Küche. Nur verlegen.",160,"m2",52.9026,58.5212,56.165700000000001,54.8125,51.161999999999999,56.585999999999999]
[null,null,null,""]
["6 Gerüste",null,null,""]
["'114.211.112","211.1","Fassadengerüste, Lastklasse 3. Einrichten. Abstellbasis fester, tragfähiger Boden. Gerüsthöhe von m 8,01 bis m 16,00",1000,"m2",8.5122,8.6712000000000007,7.3773,7.7,7.7874999999999996,8.0889000000000006]
["'114.221.112","211.1","Fassadengerüste, Lastklasse 4. Einrichten. Abstellbasis fester, tragfähiger Boden. Gerüsthöhe m 8,01 bis 16,00.",1500,"m2",11.071999999999999,10.486700000000001,9.2181999999999995,11.064,11.7158,11.0938]
["'114.311.114","211.1","Spenglergänge für dynamische Beanspruchung. Einrichten. Unter Rinne oder Dachrand. Durchgangsbreite min. m 0,60. Abstand von Fassade bis Aussenkante Rinne oder Dachrand: m 0,91 bis 1,20.",80,"m2",25.3127,23.248100000000001,21.116399999999999,22.847300000000001,22.545000000000002,27.087800000000001]
["'114.341.111","211.1","Gerüstbekleidungen. Einrichten. Ohne besondere Anforderungen. Aus Gerüstschutznetzen.",1000,"m2",3.3403999999999998,3.0706000000000002,2.7545000000000002,3.306,3.5142000000000002,4.0567000000000002]
[null,null,null,""]
["9 Metallbauarbeiten",null,null,""]
["'612.411.102","272.2","Gerade Treppen mit Wangen. Treppenlauf b mm 901 bis 1'000. Mit Befestigungsplatten. Wangen Breitflachstahl mm 250x10. Trittstufen: b mm 300; Gitterrost mm 30. Maschenweite mm 33x33. Anzahl Trittstufen 15.",1,"Stk",5917.3633,5818.04,5608.4216999999999,5847.54,5989.7267000000002,5267.97]
["'612.611.202","272.2","Feste Stabgitter. Fenster oder Türen, nicht demontierbar. Zwischenräume unter mm 120. Vertik..Stäben und Traversen. Rahmen, Traversen Flachstahl mm 30x10. Stäbe Flachstahl mm 25x10. bxh mm 1400 x 1010.",49,"Stk",811.83960000000002,738.2133,809.52710000000002,749.86429999999996,817.7,669.03]
["'622.431.001","272.0","Innentüren aus Stahl. Feuerwiderstandsklasse EI 30. Rahmen- und Flügelprofile; Eckverbindungen luftdicht. Türflügel mit Falzleisten für Verglasung. Mit Glasfüllung Schwellenwinkel Stahl DMBxDMH mm 900 x 2'000",1,"Stk",4328.384,4368.3958000000002,4149.5,3498.5628999999999,3755.835,4919.03]
["'622.431.003","272.0","Innentüren aus Stahl. Rahmen und Flügelprofile; Eckverbindungen luftdicht. Türflügel mit Falzleisten für Verglasung oder Füllung. Mit Brandschutzglas EI 30 Schwellenwinkel aus Stahl DMBxDMH mm 900 x 2'000",1,"Stk",6470.5618999999997,6196.3657999999996,6508.0429000000004,6378.3343000000004,5615.3766999999998,7954.616]
["","221.4","Alufenster. Fenstertyp. IV-Fenster. Fenstersystem. Aluprofil gedämmt. Blendrahmen. Abmessungen. Rahmendicke mm 60, Rahmen b mm 70. Falzdichtungen. An Ecken umlaufend dicht. Glasart. 3-fach IV. U_g-Wert nach Norm SN EN 673 W/m2K 0,6. Glasverbund \"warme Kante\". Schalldämmass R_w dB 32. Oberflächenbehandlung. Pulverbeschichtung. Vorbehandlung durch Entfetten, Beizen und Chromatieren. Super-durable-Polyester. Montage. Anschlag innen. Abdichten mit Dichtungsband. Rahmenkanten verdeckt. Befestigung verdeckt. Hohlräume gestopft","",""]
["'al.371.211.102","221.4","Fenstertyp. IV-Fenster. Fenstersystem. Aluprofil gedämmt. Blendrahmen. Abmessungen. Rahmendicke mm 60, Rahmen b mm 70. Falzdichtungen. An Ecken umlaufend dicht. Glasart. 3-fach IV. U_g-Wert nach Norm SN EN 673 W/m2K 0,6. Glasverbund \"warme Kante\". Schalldämmass R_w dB 32. Oberflächenbehandlung. Pulverbeschichtung. Vorbehandlung durch Entfetten, Beizen und Chromatieren. Super-durable-Polyester. Montage. Anschlag innen. Abdichten mit Dichtungsband. Rahmenkanten verdeckt. Befestigung verdeckt. Hohlräume gestopft. Alufenster 1-flüglig festverglast mm 1'200 x 1'500",3,"Stk",1797.0546999999999,1885.067,1760.4449999999999,1960.0128999999999,1886.7,1450.3420000000001]
["'al.371.212.102","221.4","Variante: Alufenster 1-flüglig mm 600 x 1'250",19,"Stk",1814.1469999999999,1868.8710000000001,1741.3067000000001,1768.3742999999999,1913.43,2162.402]
["'al.371.213.102","221.4","Variante: Alufenster 2-flüglig mm 1'400 x 1'250",20,"Stk",3013.1370999999999,2771.1469999999999,3119.1149999999998,3335.05,3318.7217000000001,3296.5659999999998]
["'al.371.412.102","221.6","Variante: Alufenstertüre 2-flüglig mm 1'400 x 2'000",49,"Stk",4455.1318000000001,4124.3149999999996,4577.3850000000002,4627.3850000000002,4515.5167000000001,4665.4359999999997]
[null,null,null,""]
["10 Spenglerarbeiten",null,null,""]
["'351.211.112","222","Dachrinnen Halbrund vorgehängt. Standarddicke. Abwicklung mm 330. Werkstoff: CrNi Stahlblech",60,"m",32.661999999999999,35.194400000000002,30.565000000000001,29.4787,35.661099999999998,23.604500000000002]
["'351.211.312","222","Rinnenhalter mit Schrauben befestigen. Flach oder profiliert. Zu Abwicklung mm 330. Werkstoff: CrNi Stahlblech",90,"Stk",17.498999999999999,20.324400000000001,17.4575,15.428000000000001,20.1389,12.1464]
["'351.251.112","222","Ablaufrohre rund. Standarddicke. DN 100. Werkstoff: CrNi Stahlblech",60,"m",32.905299999999997,36.5456,29.594999999999999,29.012,34.903300000000002,24.681799999999999]
["'351.251.222","222","Rohrschellen. Mit Schraube, l bis mm 120. DN 100. Werkstoff: CrNi Stahlblech",20,"Stk",32.820300000000003,33.943300000000001,27.555,26.349299999999999,37.506700000000002,27.1082]
["'351.311.113","222","Einlaufbleche für geneigte Dächer. Standarddicke. Bis 3x abgekantet. Abwicklung mm 250. Werkstoff: CrNi Stahlblech",60,"m",29.086200000000002,33.174399999999999,22.052499999999998,25.992699999999999,35.941099999999999,22.3918]
["'351.381.113","222","Einfassung rund. Dachneigung bis Grad 40. Hintere Höhe bis mm 300. Oberer Abschluss horizontal. Einteilig, d bis mm 300. Werkstoff: CrNi Stahlblech",6,"Stk",189.8091,213.73439999999999,147.04499999999999,157.542,209.0044,137.78450000000001]
["'351.382.117","222","Eckige Einfassungen auf geneigten Dächern. Dachneigung bis Grad 40, oberer Abschluss parallel zur Dachfläche. Seitliche Höhe bis mm 200. Umfang m 3.01 bis 3.50. Werkstoff: CrNi Stahlblech",2,"Stk",447.0883,477.995,405.53250000000003,383.43270000000001,426.8938,343.20819999999998]
["'351.431.114","222","Dachrandbleche mit Mauerabdeckung oder Kiesanschlag bei Flachdächern. Standarddicke. Bis 5x abgekantet, zugeschnitten. Abwicklung mm 500.",50,"m",53.688400000000001,56.558900000000001,46.307499999999997,50.186,60.121099999999998,41.161799999999999]
["'351.451.123","222","Dachwassereinläufe auf Flachdächern. Dachwassereinläufe, mit Rollring oder Lippendichtung dicht anschliessen. Dachwassereinlauf mit Trichter. Abgang vertikal. DN 100.",5,"Stk",126.65170000000001,130.69,116.17749999999999,118.5843,114.60120000000001,95.701800000000006]
["'351.471.124","222","Deckstreifen bei Flachdächern. Standarddicke. Mit Dichtungsfalz, bis 6x abgekantet. Abwicklung mm 200. CrNi Stahlblech",50,"m",44.099899999999998,45.918900000000001,35.962499999999999,40.058700000000002,51.1389,34.584499999999998]
["'352.411.113","222","Blechbahnen mit Falzen. Geformte Blechbahnen auf Dach verlegen. Falzbild vertikal. Falzhöhe mm 25. Neigung Grad 3 bis 25. Achsmass mm 500. Werkstoff CrNi Stahlblech",30,"m2",109.7307,120.8411,92.567499999999995,114.246,83.53,80.485500000000002]
["'352.413.211","222","Falze ausbilden und schliessen, inkl. Befestigen der Blechbahnen. Winkelstehfalze. Falzhöhe mm 25, gerade. Werkstoff: Kupferblech",60,"m",17.994599999999998,19.301100000000002,12.362500000000001,18.7713,22.173300000000001,9.4527000000000001]
[null,null,null,""]
["11 Deckungen",null,null,""]
["'363.421.111","224.0","Unterdachplatten schuppenförmig überlappt. Faserzementplatten. Auf Sparren verlegen. Mit Montageklammern. Flächenbezogene Masse der Platten ca. kg/m2 10,4. d mm 6 bis 7.",350,"m2",26.689299999999999,25.371700000000001,22.48,24.3,29.05,22.85]
["'363.431.111","224.0","Unterdächer aus Dichtungsbahnen, für erhöhte Beanspruchung. Kunststoff-Dichtungsbahnen, einschichtig. Auf Verlegeunterlage verlegen. Stösse überlappen und wasserdicht verkleben. Auf Verlegeunterlage.",350,"m2",19.380700000000001,18.243300000000001,20.807500000000001,19.765000000000001,18.18,19.245000000000001]
["'363.441.111","224.0","Konterlattungen Fichte/Tanne auf Holz nageln. Inkl. Abdichten der Nagellöcher. Lattenabstand mm 600 bis 700. Lattenquerschnitt. mm 45x50.",350,"m2",10.4283,8.5050000000000008,9.06,10.64,10.831799999999999,9.3849999999999998]
["'363.512.113","224.0","Lattungen Fichte/Tanne für Ton-Falz- oder -Pfannenziegel. Auf Holz nageln. Für Flach-, Mulden-, Herz-, Glatt- oder Pfannenziegel. Lattenquerschnitt mm 24x48. Lattenabstand mm 341 bis 370.",350,"m2",9.0195000000000007,8.1950000000000003,7.3220000000000001,10.4886,8.8089999999999993,7.43]
["'363.522.132","224.0","Ton-Falzziegel verlegen. Flach- oder Flach-Schiebeziegel in Linie verlegen. Lattenabstand mm 341 bis 370. Standardfarbton.",350,"m2",47.807899999999997,43.98,44.381999999999998,50.004300000000001,48.445500000000003,42.697499999999998]
["'363.562.122","224.0","Ortausbildung mit Ortgangziegeln. Ton-Ortgangziegel liefern, verlegen und befestigen, als Mehrleistung. Zu Flachziegeln. Standardfarbton.",30,"m",52.3277,48.984000000000002,51.414999999999999,53.275700000000001,56.719099999999997,49.844999999999999]
["'363.572.132","224.0","Ton-First- und -Gratziegel. Halbrunde Firstziegel. Mit verzinkten Firstklammern und verzinkten Nägeln oder verzinkten Schrauben befestigen. Ziegellänge mm 400 bis 450. Standardfarbton.",25,"m",54.799900000000001,46.426699999999997,53.227499999999999,60.537100000000002,61.016399999999997,52.295000000000002]
["'363.611.114","224.0","Lattungen Fichte/Tanne für Faserzementschiefer. Auf Holz nageln. Für Rechteckschiefer. Doppeldeckung. Lattenquerschnitt mm 24x48. Lattenabstand bis mm 250. Lattenabstand mm 240.",350,"m2",12.8833,10.35,11.227499999999999,14.074999999999999,12.53,11.467499999999999]
[null,null,null,""]
["12 Dichtungsbeläge",null,null,""]
["'364.321.224","224.1","Wärmedämmung mit Platten aus expandiertem Polystyrol EPS. Zweischichtig, lose verlegen. Stösse versetzt. Lambda_D max. W/mK 0,036. Platten gefälzt, ohne Beschichtung, d über mm 160. d mm 240 (2x mm 120).",500,"m2",50.078800000000001,47.973300000000002,41.235999999999997,49.22,56.792499999999997,48.487499999999997]
["'364.421.114","224.1","Abdichtungen aus Polymerbitumen-Dichtungsbahnen verlegen. Einschichtig. Ueberlappungen mm 100. Vollflächig aufschweissen. E-P-5,0-af-WF.",500,"m2",17.779499999999999,15.734999999999999,15.8483,16.719000000000001,19.9575,19.684999999999999]
["'364.421.212","224.1","Abdichtungen aus Polymerbitumen-Dichtungsbahnen verlegen. Zweischichtig. Ueberlappungen mm 100. 1. Schicht lose verlegen. 2. Schicht vollflächig aufschweissen.1. Schicht E-G-3,0-tt, 2. Schicht E-P-4,0-tf-WF.",500,"m2",26.515499999999999,23.4117,24.923300000000001,26.251000000000001,27.905000000000001,27.5]
["'364.531.112","224.1","Kunststoffabdichtungen für Flachdach mit Begrünung. Lose verlegen. Einschichtig. Ueberlappungen thermisch verschweissen. Thermoplastische Polyolefine TPO, glasvliesbewehrt. d mm 1,6.",500,"m2",25.026,23.866700000000002,24.484000000000002,22.284400000000002,25.827500000000001,27.476199999999999]
["'364.911.124","224.1","Zwischenschichten lose auf Abdichtung verlegen. Trennschicht. Ueberlappungen mm 100. Kunstfaservlies. Flächenbezogene Masse g/m2 400.",500,"m2",4.7000999999999999,3.8083,4.9379999999999997,4.8940000000000001,4.4550000000000001,5.7388000000000003]
["'364.912.111","224.1","Schutzbahnen. Lose auf Abdichtung verlegen. Schutzbahnen aus Kunststoff. Ueberlappungen mm 100, thermisch verschweissen. Kunststoff. d ca. mm 1,3.",500,"m2",13.6486,11.815,13.044,13.0311,13.5725,14.425000000000001]
["'364.921.111","224.1","Beschwerungs- und Schutzschichten. Lose aufbringen. Rundkies gewaschen (Betonkies ungebrochen, gewaschen), Korngruppe 8/16. d mm 50.",500,"m2",12.0793,11.1767,10.795999999999999,12.688000000000001,12.425000000000001,13.217499999999999]
["'364.932.111","224.1","Variante: Gehbelag aus Betonplatten. Platten mm 30, unbewährt, gestossen. In Splitt, Rundkies oder auf Stelzlager verlegen. Oberfläche glatt, zementgrau. lxb mm 400 x 400",100,"m2",73.358599999999996,67.168300000000002,71.174000000000007,68.588899999999995,68.64,65.525000000000006]
["'364.944.312","224.1","Variante: Vegetationsschichten. Mineralisches Substrat aus gebrochenem Blähschiefer. Lose aufbringen. Dicke verdichtet mm 90",500,"m2",21.2559,20.574999999999999,17.824000000000002,18.702200000000001,17.274999999999999,21.122499999999999]
["'364.948.212","224.1","Variante: Extensive Dachbegrünung. Nasssaat. Sedum und Kräuter. Saatgutklasse 1",500,"m2",5.5792999999999999,4.6632999999999996,3.6160000000000001,5.0967000000000002,5.8825000000000003,5.8150000000000004]
[null,null,null,""]
["13 Gipserarbeiten",null,null,""]
["'342.451.131.p","271.1","Leibungen oder Stürze mit Wärmedämmung aus Mineralwollplatten,\nrechtwinklig. Deckputz abgerieben, Korngrösse mm 2,\nweiss. Grundputz mit Bewehrungsgewebe. 1 Kante, mit stumpfem Anschluss an Fensterrahmen und auf Fensterbank. Trennschnitt in allen Putzschichten. Rohdichte ca. kg/m3 90. Mit Klebemörtel auf tragfähigen Untergrund kleben. t mm 260 bis 300. Dämmdicke mm 80.",150,"m",50.553199999999997,46.477800000000002,43.063800000000001,63.942900000000002,48.102499999999999,45.508899999999997]
["'643.213.211","271.1","Einfaches Ständerwerk aus Metall, Beplankung aus je 2 Lagen Gipskartonplatten 1 Lage Dämmstoff, Dicke mm 75 Gipskarton-Bauplatten mm 12,5 Feuerwiderstandklasse EI 90 Höhe m 1,51 bis 3,00",150,"m2",106.479,100.9645,101.343,113.97,118.224,105.2373]
["'643.217.111","271.1","Installationswände, doppeltes Ständerwerk aus Metall. Beplankung beidseitig je 2 Lagen Gipsplatten. 1 Lage Mineralwolle. Gipsplatten Typ H2, d mm 12,5. Ständerwand d mm 330. R_w dB 54. EI 90. h m 1,51 bis 3,00. ",70,"m2",143.50839999999999,132.91200000000001,148.00899999999999,147.636,156.298,143.7064]
["'651.212.311","283.2","Deckenbekleidung aus Gipskartonplatten abgehängt mit Unterkonstruktion. Ohne Brandschutz Abhängehöhe mm 150 bis 500. Konstruktionshöhe mm 67. 1 Lage Gipskartonplatten mm 12,5",125,"m2",92.536699999999996,76.929100000000005,89.64,98.778000000000006,109.88200000000001,91.538200000000003]
["'651.911.111","271.1","Oberfläche zur Aufnahme von Deckputz über mm 1,0, mit zusätzlicher Verspachtelung, lichte Raumhöhe bis m 3,00",125,"m2",14.9262,13.6227,13.4078,15.857799999999999,19.952200000000001,14.558999999999999]
["'671.311.111","271.1","Wände mit Gips-, Gipskalk-, Gipszement- oder Kalkgips-Einschichtputz. Putzdicke mm 10,0. Ebene Wandflächen. Zur Aufnahme von mittel bis grob strukturierten Wandbekleidungen. Q2 - geglättet.",2000,"m2",18.928699999999999,14.374000000000001,21.747800000000002,21.064399999999999,22.728999999999999,18.335999999999999]
["'671.314.112","283.2","Weissputz auf Decken mit Gips- oder Gipskalk-Einschichtputz. Putzdicke mm 5,0. Ebene Flächen, hor. oder bis % 25 geneigt. Zur Aufnahme von matten Beschicht. oder fein struktur. Wandbekleidungen.Q3 - geglättet. ",900,"m2",22.973800000000001,21.565999999999999,23.105599999999999,25.171099999999999,25.024999999999999,23.61]
[null,null,null,""]
["14 Malerarbeiten",null,null,""]
["675.312.801","285.1","Beschichtungen auf Decken mit Deckputz mineralisch mit Altbeschichtung. Innen. Dispersionsfarbe. Beschichtung deckend, matt. 1x Zwischenbeschichtung. 1x Schlussbeschichtung. Rollen. Korngrösse bis mm 2,0.",900,"m2",10.605399999999999,10.844200000000001,8.2959999999999994,7.79,8.4600000000000009,6.0808999999999997]
["675.212.115","285.1","Beschichtungen auf Wänden mit Deckputz mineralisch mit Altbeschichtung. Innen. Dispersionsfarbe. Beschichtung deckend, matt. 1x Zwischenbeschichtung. 1x Schlussbeschichtung. Rollen. Korngrösse bis mm 2,0.",2000,"m2",9.3938000000000006,9.8442000000000007,6.9211,6.5006000000000004,7.7236000000000002,5.6245000000000003]
["675.231.115","285.1","Beschichtungen auf Wänden aus Holz und Holzwerkstoffen, deckender Altbeschichtung. Innen. Alkydharz-Decklack lv, innen. 1x Zwischenbeschichtung. 1x Schlussbeschichtung. Applikationsart: Streichen. Flächen glatt.",100,"m2",28.342700000000001,27.888300000000001,26.059000000000001,26.006499999999999,30.882899999999999,31.148199999999999]
["675.241.001","285.1","Beschichtungen auf Wänden aus Stahl, Stahl verzinkt, Alu. Innen. Alkydharz-Decklack lv, innen. Beschichtung deckend, mittlerer Glanz. 1x Zwischenbeschichtung. 1x Schlussbeschichtung. Streichen. Flächen glatt.",90,"m2",29.728899999999999,29.404199999999999,25.381,25.305900000000001,31.961400000000001,32.369100000000003]
["675.712.111","282.1","Raufaser-Wandbekleidungen. Mit feiner Struktur. Applikation inkl. Lieferung. Untergrund Weissputz Q2. Applikationsart: ansatzfrei. Auf plane Wände.",900,"m2",14.6928,15.654999999999999,11.037000000000001,9.9474999999999998,13.9323,11.789099999999999]
[null,null,null,""]
["15 Storen",null,null,""]
["'347.211.301","228.2","Rollläden aus Alu, selbsttragendes System mit Welle auf den Führungsschienen montiert. Manueller Antrieb. Mit Führungsschienenkeder.Gelenkkurbel. Einzelrollläden. (bk)x(hl) mm 1'400x1'250",5,"Stk",590.60990000000004,718.26379999999995,627.80600000000004,613.21090000000004,506.77,468.26600000000002]
["'347.211.302","228.2","Variante: Rollläden aus Alu (bk)x(hl) mm 1'400x2'000",5,"Stk",705.07680000000005,841.71619999999996,751.91399999999999,763.08270000000005,597.56669999999997,568.46]
["'347.311.301","228.2","Variante: Lamellenstoren (Verbundlamellenstoren) aus Alu (bk)x(hl) mm 1'400x1'250",20,"Stk",416.86810000000003,448.48880000000003,453.39600000000002,410.75639999999999,378.66329999999999,371.40800000000002]
["'347.311.302","228.2","Lamellenstoren (Verbundlamellenstoren) aus Alu, Lamellenbreite ca. mm 90. Manueller Antrieb. Mit Endanschlag, Gelenkkurbel. Einzelstoren. (bk)x(hl) mm 1'400 x 2'000",29,"Stk",479.8272,511.375,518.29200000000003,477.70269999999999,434.08330000000001,439.16199999999998]
["'347.311.303","228.2","Lamellenstoren (Verbundlamellenstoren) aus Alu (bk)x(hl) mm 2'800 x 2'000.",8,"Stk",693.59540000000004,720.97500000000002,729.33799999999997,722.41729999999995,630.04669999999999,668.63800000000003]
["'347.512.301","228.3","Gelenkarmmarkisen ohne Tragrohr auf Fassade oder Deckenuntersicht auf tragfähigen Untergrund montieren. Manueller Antrieb. Armlänge mm 2'000. bk mm 4'000.",8,"Stk",1250.8577,1360.4549999999999,1343.8040000000001,1382.5944999999999,985.01329999999996,1024.75]
["'347.512.501","228.3","Gelenkarmmarkisen ohne Tragrohr. Armlänge mm 2'500. bk mm 5'500.",1,"Stk",1766.3725999999999,1991.31,1847.002,1814.1936000000001,1411.12,1651.502]
[null,null,null,""]
["22 Aufzüge",null,null,""]
["'742.911.002","261","Aufzugsanlage mit Aufzugtyp N3, Nenntragfähigkeit kg 630, Personenzahl 8, Einzelaufzug, Haltestellen 4, Zugänge gleichseitig Antrieb Motor, Frequenzumrichter, Nenngeschwindigkeit m/s 1.0, Fahrtenzahl/h 90 bis 120. Ohne Maschinenraum, Motor: Drehstrom V 380/220, Hz 50 Einzelfahrtsteuerung ohne Speicherung der Stockwerkrufe Kabine mit Beleuchtung, Handlauf, Sockelleisten uns Spiegel, vollautomatischen Teleskopschiebetüre ",1,"Stk",38497.263700000003,39961.928599999999,37955.583299999998,37955.583299999998,37955.583299999998,39378.7857]
[null,null,null,""]
["23 Bodenbeläge",null,null,""]
["'663.111.101","281.1","Demontagen. Textiler Bodenbelag, vollflächig geklebt, mit Sockel. Keine Wiederverwendung. Abtransport in Lager Unternehmer, inkl. Gebühren. LE = m2.",300,"LE",12.4725,12.074400000000001,12.4208,11.789099999999999,10.772,12.864000000000001]
["'663.142.107","281.1","Untergrund vorbereiten. Ausebnen, Spachteln und dgl. Zement- oder anhydritgebundener Untergrund. Vollflächiges Ueberziehen von ebenem Untergrund mit Spachtelmasse. d mm 2.",300,"m2",12.9238,11.8619,11.2546,10.6473,10.593,11.305999999999999]
["'663.181.116","281.1","Arbeiten nach Aufwand. Nach Aufwand. Personal. Nach Regieansatz. Berufskategorie Bodenleger.",10,"Std",96.843299999999999,96.889399999999995,97.7577,102.7891,96.896000000000001,100.84]
["'663.211.114","281.2","Elastische Bodenbeläge aus Linoleum liefern und verlegen auf gereinigten, vorbereiteten Untergrund d mm 2,5. Bahnen, Bahnenbreite m 2,00. Vollflächig kleben, Dessin marmoriert. In rechtwinkligen Räumen.",300,"m2",54.152799999999999,48.247500000000002,48.7577,51.577300000000001,49.914000000000001,49.508000000000003]
["'663.611.121","281.9","Variante: Sockel liefern und montieren auf vorbereiteten Untergrund. Sockel aus Holz oder Holzwerkstoffen auf gerade Wände schrauben. Profil keilförmig, klarlackiert, h mm 60, d mm 8/12. Eiche. Massiv.",100,"m",16.252300000000002,15.175000000000001,15.701499999999999,16.1709,15.396000000000001,15.768000000000001]
["'663.621.001","281.9","Sockel liefern und montieren auf vorbereiteten Untergrund. Sockel aus Weichkunststoff. Sockel auf gerade Wände mit feinem Abrieb kleben. h mm 60.",360,"m",13.0068,12.0662,12.0654,11.666399999999999,11.243,13.782]
["'664.181.113","281.7","Arbeiten nach Aufwand. Arbeitszeit. Personal, inkl. Hand- und Kleinmaschinen. Parkettleger.",10,"Std",96.816400000000002,96.015299999999996,97.7577,102.7891,96.896000000000001,100.84]
["'664.321.121","281.7","Klebeparkett auf zementgebundene Unterlagsböden geklebt. d mm 8. Paralelldessin, Lamellen mm 120x24, Eiche Standart",300,"m2",69.413200000000003,63.271299999999997,68.316900000000004,70.3964,64.070999999999998,70.457999999999998]
["'664.822.111","281.7","Oberflächenbehandlungen: Schleifen und Spachteln. Spachtelung als Verfeinerung der Oberfläche. Grundieren und Versiegeln, inkl. Zwischenschliff, mit Wasserlack",300,"m2",32.262,32.977899999999998,32.1492,32.0227,28.506,35.997999999999998]
["'664.951.111","281.7","Sockelleisten montieren. Massivholz behandelt. An ebene Wände schrauben. Keilförmig. h mm 60, d mm 8/12. Eiche. Inkl. Lieferung.",360,"m",16.397300000000001,15.186,15.798500000000001,16.558199999999999,15.744,16.760000000000002]
[null,null,null,""]
["24 Baureinigung",null,null,""]
["'682.214.201","287","4 bis 4 1/2-Zimmer-Wohnungen reinigen; Hauptnutzfläche bis m2 120. Einbauschrank bis vierteilig. Bodenbeläge aus Teppich, Keramikplatten, Kunststoff, Linoleum, versiegeltem Parkett. Ausmass: Anzahl Wohnungen.",1,"Stk",1038.0954999999999,1088.1524999999999,987.04819999999995,1015.85,988.53899999999999,945.69219999999996]
[null,null,null,""]
["25 Gärtnerarbeiten",null,null,""]
["'181.251.002","400","Geländegestaltung und Rohplaniearbeiten nach Aufwand. LE = h. Regiestunden. Gärtner mit Fähigkeitsausweis.",10,"LE",83.270200000000003,85.492999999999995,84.04,86.611400000000003,86.526200000000003,82.195999999999998]
["'181.422.313","400","Beton- und Kunststeine für Abschlüsse liefern. Stellplatten Typ SB, Frost-Tausalz-beständig. Ohne Vorsatz, grau. Gerade Platten, l m 1,00. SB 8, mm 80x250.",90,"m",20.411899999999999,18.038900000000002,17.006699999999999,21.82,22.7286,17.558]
["'181.425.112","400","Stellplatten versetzen. In Geraden und Kurven mit r über m 30,00. In Beton, auf Fundationsschicht aus ungebundenem Gemisch. Exkl. Ausfugen. Nach Schemazeichnung Typ 07 oder 18. In Splitt- oder Rundkornbeton 8/16, CEM 42,5 kg/m3 200, w/z-Wert 0,37, Betonbedarf m3/m 0,079 bis 0,091. SN oder SB 8, mm 80x min. mm 250.",90,"m",39.788400000000003,39.128999999999998,39.894399999999997,35.119999999999997,36.3962,29.07]
["'181.441.111","400","Verbund- und Formsteine aus Beton liefern. Verbundsteine. Mit Seiten-, Anfangs- und Endsteinen. Frost-Tausalz-beständig. Nicht wasserdurchlässig. Steindicke mm 60, grau, Kanten gefast.",200,"m2",26.64,27.164999999999999,22.993300000000001,24.2957,27.155000000000001,22.911999999999999]
["'181.445.111","400","Beläge aus Verbund- oder Formsteinen erstellen. Ungebundene Bauweise. Inkl. Bettung in Sand oder Splitt. Ausfugen mit bindigem Sand. Inkl. Lieferung Bettungs- und Fugenmaterial. Verkehrslastklasse ZP. Steindicke mm 60.",200,"m2",32.350299999999997,31.338999999999999,28.475000000000001,27.1386,27.795000000000002,22.998000000000001]
["'181.451.202","400","Mergelbeläge einbauen, verdichten und Wässern. Mergel gebrochen, wasserdurchlässig. Verdichtete Schicht mm 60. Planiergenauigkeit +/- mm 10.",100,"m2",17.807400000000001,17.544,18.931100000000001,16.0886,19.135000000000002,9.7439999999999998]
["'181.551.111","400","Blockstufen liefern und versetzen. Aus Beton. Versetzen in Beton. Zementgrau. Oberfläche abgerieben. In Splitt- oder Rundkornbeton 8/16, CEM 42,5 kg/m3 200, w/z-Wert 0,37. Betonbedarf m3/m 0,1. Stufenhöhe mm 150. Elementlänge m 1,0.",30,"m",153.1678,136.51900000000001,146.42670000000001,133.66,127.5262,119.30800000000001]
["'181.726.102","400","Grobplanie erstellen. Flächen mit Neigung bis 1:3. Bodenbearbeitung. Auflockern von gewachsenen oder hergerichteten Flächen, die durch Dritte verdichtet worden sind. Bearbeitungstiefe cm 15 bis 20.",500,"m2",1.4433,1.0967,0.89429999999999998,1.17,1.0929,0.67200000000000004]
["'181.727.212","400","Bodenflächen fräsen. Flächen mit Neigung bis 1:3. Bearbeitungstiefe m 0,08 bis 0,10. 2 Durchgänge. Ausmass: bearbeitete Fläche.",500,"m2",1.4206000000000001,1.1111,1.33,0.99570000000000003,0.75670000000000004,0.67200000000000004]
["'181.738.102","400","Reinplanie auf gelockerter Bodenfläche erstellen. Pflanzflächen. Flächen mit Neigung bis 1:3. Planiergenauigkeit +/- mm 20.",500,"m2",2.1432000000000002,1.647,2.1522000000000001,1.6286,1.6561999999999999,1.36]
["'181.834.111","400","Rollrasen liefern. Gartenrasen.",500,"m2",14.2776,13.573,15.331099999999999,12.707100000000001,12.7157,12.666]
["'181.834.121","400","Verlegen Rollrasen.  Auf Oberboden, inkl. Ausbilden der Ränder. Konz. Pos. 834.111",500,"m2",12.7623,12.551,11.0756,14.1286,11.7575,13.26]
["'181.852.211","400","Mähen maschinell oder von Hand. 1. Schnitt der Ansaat. Bei Rasenflächen. Zu Pos. 834.",500,"m2",0.96719999999999995,0.81559999999999999,0.7944,0.95,0.73499999999999999,0.91800000000000004]
["'181.853.003","400","Mähen maschinell oder von Hand. 1. Schnitt der Ansaat. Düngen nach 1. Schnitt. Zu Pos. 834.",25,"kg",5.98,5.6280000000000001,6.3025000000000002,7.9629000000000003,5.2649999999999997,5.1840000000000002]
[]
["87 Zimmerarbeiten",null,null,""]
["'335.721.141","214.1","Sparrenlage aus Vollholz. Sattel oder Pultdach. Auf bauseitiges, genaues Auflager. Gehobelt. Querschnitte: Sparren mm 80x140 bis 100x180, Schwellen, Pfetten mm 100x120 bis 160x260.",22,"m3",1358.0433,1281.2714000000001,1203.298,1333.3475000000001,1282.4938,1298.8137999999999]
["'335.721.262","214.1","Pfetten aus Brettschichtholz. Sattel oder Pultdach. Auf bauseitiges, genaues Auflager. Erscheinungsklasse I. Breite mm 140.",5,"m3",1573.2279000000001,1475.6821,1288.2449999999999,1483.7311999999999,1492.1188,1373.8308]
["'335.311.111","214.1","Aussenwande mit verdeckten Standern,  Konstruktion, Leimholz, Duo- oder Triobalken, mm 60x200",1035,"m2",60.4925,61.4557,51.509,56.07,52.458799999999997,51.639200000000002]
["'335.311.422","214.1","Innere Beplankung, Kronoply OSB 3, Stärke mm 15. ",1035,"m2",32.114100000000001,28.808599999999998,30.808,31.377500000000001,33.575000000000003,28.2]
["'335.771.442","214.1","Verlegeunterlage aus Brettern mit Nut und Kamm mm 20 gehobel",560,"m2",59.485700000000001,50.2179,49.109000000000002,54.997500000000002,66.844999999999999,46.726199999999999]
["'335.531.114","214.1","Geschossdecke aus Brettstapeln, Konstruktion, sagerohen Lamellen, h mm 240",1065,"m2",251.26150000000001,258.99360000000001,224.10300000000001,232.2525,245.2825,216.20689999999999]
["'335.361.415","215.2","Fassadenbekleidung aus besäumten Brettern. Auf Holz sichtbar befestigen. Fichte/Tanne. Erscheinungsklasse N1, d ca. mm 20, Breite einheitlich mm 120 bis 200. Gehobelt.",450,"m2",91.670400000000001,89.359300000000005,87.768000000000001,89.842500000000001,94.717500000000001,79.863799999999998]
["'335.721.323","215.2","Mineralwollplatten, selbstklemmend, nicht belastbar, Rohdichte kg/m3 18 bis 33, Wärmeleitfähigkeit ca. W/mK 0,040. Zwischen Konstrukt. einpassen. Boden- oder Dachflächen, hor. oder geneigt bis Grad 35. d mm 200.",560,"m2",37.5854,37.502899999999997,31.306999999999999,34.015000000000001,36.781199999999998,35.236199999999997]
["'335.451.481","215.2","Innentäfer aus Brettern mit Nut und Kamm. Auf Holz verdeckt befestigen. Wände. Erscheinungsklasse N1, d ca. mm 14, Breite einheitlich mm 90 bis 115.",560,"m2",81.001499999999993,77.928600000000003,76.403000000000006,81.246200000000002,84.383799999999994,69.9846]
[null,null,null,""]
["88 Fenster",null,null,""]
[null,"221.0","Holzfenster. Fenstertyp. IV-Fenster. Ausführungsvarianten, Flügel durch Rahmen abgedeckt. Blendrahmen. Rahmenwetterschenkel, Alu farblos anodisiert. Falzdichtungen, an Ecken umlaufend dicht. Beschläge. Verschlüsse, einseitig bedienbar. Drehflügelverschluss mit Drehgriff. Glasart. 3-fach IV. U_g-Wert nach Norm SN EN 673 W/m2K 0,6. Glasverbund Alu. Schalldämmass R_w dB 32. Oberflächenbehandlung, deckende Beschichtung. Farbton weiss. Montage, Anschlag innen. Abdichten mit Dichtungsband. Rahmenkanten verdeckt. Befestigung verdeckt. Hohlräume gestopft.","",""]
["'b.371.211.102","221.0","Variante: Holzfenster 1-flüglig festverglast mm 1'200 x 1'500",3,"Stk",1191.2933,1099.5254,1140.6986999999999,1166.2083,1338.8856000000001,1134.5844999999999]
["'b.371.212.102","221.0","Fenstertyp. IV-Fenster. Ausführungsvarianten, Flügel durch Rahmen abgedeckt. Blendrahmen. Rahmenwetterschenkel, Alu farblos anodisiert. Falzdichtungen, an Ecken umlaufend dicht. Beschläge. Verschlüsse, einseitig bedienbar. Drehflügelverschluss mit Drehgriff. Glasart. 3-fach IV. U_g-Wert nach Norm SN EN 673 W/m2K 0,6. Glasverbund Alu. Schalldämmass R_w dB 32. Oberflächenbehandlung, deckende Beschichtung. Farbton weiss. Montage, Anschlag innen. Abdichten mit Dichtungsband. Rahmenkanten verdeckt. Befestigung verdeckt. Hohlräume gestopft. Holzfenster 1-flüglig mm 600 x 1'250",19,"Stk",888.85760000000005,828.11850000000004,871.39670000000001,887.74329999999998,996.52440000000001,842.14639999999997]
["'b.371.213.102","221.0","Variante: Holzfenster 2-flüglig mm 1'400 x 1'250",20,"Stk",1490.3779,1413.2408,1465.9760000000001,1473.1016999999999,1634.18,1446.8381999999999]
["'b.371.213.103","221.0","Variante: Holzfenster 2-flüglig Renovation mm 1'400 x 1'250",20,"Stk",1797.9041,1729.2508,1764.3552999999999,1781.75,1929.4567,1751.9327000000001]
["'b.371.412.102","221.0","Variante: Holzfenstertüre 2-flüglig mm 1'400 x 2'000",49,"Stk",2112.6961000000001,1956.9722999999999,2058.2220000000002,2135.1367,2327.2211000000002,2099.5909000000001]
["'b.371.641.101","221.0","Variante: Holzhebeschiebetüre mm 4'000 x 2'000",8,"Stk",7093.4912000000004,6912.4492,7252.7852999999996,7152.3167000000003,7921.4178000000002,6912.1745000000001]
[null,"221.2","Kunststofffenster. Fenstertyp. IV-Fenster. Blendrahmen, Typ Vollrahmen. Rahmenwetterschenkel. Alu farblos anodisiert. Falzdichtungen. An Ecken umlaufend dicht. Beschläge. Verschlüsse einseitig bedienbar. Drehkippflügel: Erstöffender Flügel mit Drehkippverschlus und Drehgriff. Zweitöffnender Flügel mit 1 Schnäpper. Glasart. 3-fach IV. U_g-Wert nach Norm SN EN 673 W/m2K 0,6. Glasverbund \"warme Kante\". Schalldämmass R_w dB 32. Oberflächen von Kunststofffenstern. Weiss. Montage. Anschlag innen. Abdichten mit Dichtungsband. Rahmenkanten verdeckt. Befestigung verdeckt. Hohlräume gestopft.","",""]
["'p.371.211.102","221.2","Variante: Kunststofffenster 1-flüglig festverglast mm 1'200 x 1'500",3,"Stk",848.49680000000001,852.47860000000003,872.18290000000002,882.03859999999997,854.77599999999995,714.95500000000004]
["'p.371.212.102","221.2","Variante: Kunststofffenster 1-flüglig mm 600 x 1'250",19,"Stk",674.85469999999998,652.27570000000003,697.0086,704.14430000000004,718.12199999999996,552.66750000000002]
["'p.371.213.102","221.2","Variante: Kunststofffenster 2-flüglig mm 1'400 x 1'250",20,"Stk",1126.2313999999999,1129.4985999999999,1149.7113999999999,1168.0528999999999,1179.3620000000001,960.58]
["'p.371.213.103","221.2","Fenstertyp. IV-Fenster. Blendrahmen, Typ Vollrahmen. Rahmenwetterschenkel. Alu farblos anodisiert. Falzdichtungen. An Ecken umlaufend dicht. Beschläge. Verschlüsse einseitig bedienbar. Drehkippflügel: Erstöffender Flügel mit Drehkippverschlus und Drehgriff. Zweitöffnender Flügel mit 1 Schnäpper. Glasart. 3-fach IV. U_g-Wert nach Norm SN EN 673 W/m2K 0,6. Glasverbund \"warme Kante\". Schalldämmass R_w dB 32. Oberflächen von Kunststofffenstern. Weiss. Montage. Anschlag innen. Abdichten mit Dichtungsband. Rahmenkanten verdeckt. Befestigung verdeckt. Hohlräume gestopft. Kunststofffenster 2-flüglig Renovation mm 1'400 x 1'250",20,"Stk",1395.8037999999999,1361.1229000000001,1440.3986,1427.9829,1476.99,1245.5274999999999]
["'p.371.412.102","221.2","Fenstertyp. IV-Fenster. Blendrahmen, Typ Vollrahmen. Rahmenwetterschenkel, Alu farblos anodisiert. Falzdichtungen, an Ecken umlaufend dicht. Beschläge. Verschlüsse, einseitig bedienbar. Erstöffnender Flügel mit Drehkippverschluss und Drehgriff. Glasart. 3-fach IV. U_g-Wert nach Norm SN EN 673 W/m2K 0,6. Glasverbund Alu. Schalldämmass R_w dB 32. Oberflächen von Kunststofffenstern, Weiss. Montage, Anschlag innen. Abdichten mit Dichtungsband. Rahmenkanten verdeckt. Befestigung verdeckt. Hohlräume gestopft. Kunststofffenstertüre 2-flüglig mm 1'400 x 2'000",49,"Stk",1629.462,1648.7229,1661.0986,1682.5743,1665.2860000000001,1412.075]
["'p.371.641.101","221.2","Variante: Kunststoff-Hebeschiebetüre mm 4'000 x 2'000",8,"Stk",6199.5581000000002,6614.0014000000001,6216.4771000000001,6338.5329000000002,6454.95,5259.7475000000004]
[null,null,null,""]
["91 Kücheneinrichtungen",null,null,""]
["'625.211.001","258","5 x 1/1 Elemente mit Unter- und Oberbau mit Eckausnutzung 2 x 1/2 Elemente mit Unter- und Oberbau 1 x 1/1 Schrankelement (Kühlschrank). 1 x 1/1 Schrankelement (Backofen). 1 x 1/2 Schrankelement mit Auszug Spültisch mit Batterie, Einbauherd, Glaskeramikkochfeld, Dampfabzug, Kühlschrank, Geschirrspüler, Wettergittereinheit und Lüftungsgitter",8,"Stk",22480.896799999999,23031.9833,20630.638299999999,20910.4738,20520.284299999999,23010.777999999998]
[null,null,null,""]
["98 Deckenbekleidungen",null,null,""]
["'653.211.112","283.1","Deckenverkleidung aus rechteckigen Metallplatten, aus Stahlblech verzinkt, pulverbeschichtet. Blech d mm 0,6 bis 0,7 Mit Fugenband schwarz. Platten b mm 400, l mm 2'001 bis 2'50",500,"m2",91.674199999999999,94.024000000000001,85.372,87.087999999999994,101.5067,85.306700000000006]
["'653.311.121","283.1","Metallpaneelen, Alu beschichtet, Fugen geschlossen mit angeformter Fugenabdeckung Blech d mm 0,4 bis 0,5, Paneele h bis mm 20. Abhängehöhe mm 201 bis 500 Achsmass mm 100. Paneele b mm 80 bis 85",500,"m2",134.62219999999999,141.2167,112.396,118.9,152.38329999999999,128.625]
["'653.611.121","283.1","Lochung rund parallel Abhängehöhe mm 201 bis 500",500,"m2",5.0801999999999996,7.0117000000000003,4.6580000000000004,4.0540000000000003,3.7833000000000001,3.8917000000000002]
["'653.612.101","283.1","Perforationen in Paneelen, als Mehrpreis. Lochung rund, Anordnung diagonal. Lochdurchmesser mm 1,0. Lochflächenanteil ca. % 23.",500,"m2",5.7458,7.3,5.2133000000000003,5.76,"...",5.4050000000000002]
["'653.621.121","283.3","Akustikhinterlagen zu Deckenbekleidungen mit Platten. Vollflächig in Deckenplatten. Mineralwollplatten, Rohdichte kg/m3 12 bis 25, unten schwarzes Vlies. In Platten einlegen. d mm 20.",500,"m2",15.673999999999999,15.05,11.994999999999999,13.945,"...",14.686]
["'653.622.111","283.3","Akustikhinterlagen zu Deckenbekleidungen mit Paneelen. Vollflächig zwischen Tragprofilen. Mineralwollplatten, Rohdichte kg/m3 12 bis 25, unten schwarzes Vlies. Lose verlegen. d mm 20.",500,"m2",18.380600000000001,19.6417,15.65,17.216000000000001,21.883299999999998,17.638300000000001]
[]
["99 Allgemeine Schreinerarbeiten",null,null,""]
["'621.215.001","273.1","Tablarschränke, 5 verstellbaren Tablaren, Zweiflüglig. Aussenflächen Kanten mit Schichtpressstoffplatte mm 0,7 bis 1,0 Innenflächern Kunstharz mm 0,15. H mm 1'950 bis 2'200, T mm 560 bis 600, B mm 901 bis 1'040",8,"Stk",1580.5322000000001,1627.1,1506.8067000000001,1443.654,1300.404,1209.8533]
["'621.215.002","273.1","Variante: Garderobenschränke ohne Türen, mit Huttablar und Kleiderstange. Grundelemente. b mm 901 bis 1'040.",8,"Stk",1344.6881000000001,1425.05,1362.605,1375.5382999999999,1170.75,1294.5957000000001]
["'622.211.311","273.0","Schlagregendichtigkeit, Klasse 4A. Klimaklasse 3d. Wärmeschutz U-d-Wert W/m2K 1,2. Luftdurchlässigkeit, Klasse 1. Grundiert. Türflügel glatt mit Schwellenprofil DMBxDMH mm 900 x 2'000",1,"Stk",3964.7642000000001,3622.26,3578.8114,4135.2956999999997,4195.1099999999997,4240.6957000000002]
["'622.211.211","273.0","Witterungsgeschützt. Klimaklasse 3d. Wärmeschutz U-d-Wert W/m2K 1,2. Luftdurchlässigkeit, Klasse 1. Grundiert für deckende Oberflächenbehandlung. Türflügel glatt mit Schwellenprofil DMBxDMH mm 900x2'000",8,"Stk",3745.8868000000002,3426.52,3861.1686,4261.2286000000004,3733.4580000000001,3887.8571000000002]
["'652.312.121.b","283.4","Deckenbekleidungen aus Tafer",500,"m2",194.93459999999999,190.67500000000001,226.52799999999999,164.93199999999999,238.73500000000001,159.24799999999999]
["'622.411.312","273.0","Innentüren aus Holz und Holzwerkstoffe Rahmentür. Brandschutztür. Feuerwiderstandsklasse EI 30. Grundiert für deckende Oberflächenbehandlung. Türflügel glatt. Ohne Schwelle DMBxDMH mm 900x2'000 ",2,"Stk",1964.7132999999999,1853.42,1865.1129000000001,1835.7257,1835.0740000000001,2147.2257]
["'622.413.112","273.0","Innentüren aus Holz und Holzwerkstoffe. Futter, Verkleidung und Türflügel grundiert für deckende Oberflächenbehandlung. Türflügel glatt. Ohne Schwelle DMBxDMH mm 900x2'000",36,"Stk",1092.0383999999999,934.5,1246.8056999999999,1039.72,1028.6400000000001,942.06140000000005]
["'622.412.112","273.0","Innentüren aus Holz und Holzwerkstoffe. Futter, Verkleidung und Türflügel grundiert für deckende Oberflächenbehandlung. Türflügel glatt. Ohne Schwelle DMBxDMH mm 900x2'000",6,"Stk",1250.9251999999999,1255.72,1196.2714000000001,1079.25,1039.675,1135.5667000000001]
["'622.412.212","273.0","Variante: Schallschutztür. Bauschalldämmass R'_w+C dB 39. Grundiert. Eingiesszarge aus korrosiongeschütztem Stahlblech. Türflügel glatt. Ohne Schwelle mit Absenkdichtung. DMBxDMH mm 900 x 2'000 ",10,"Stk",1880.5347999999999,1990.2,1558.7371000000001,1650.9543000000001,1725.4974999999999,1624.1786]
[]
["Drei Punkte (…) bedeuten, dass der Wert nicht vorhanden, nicht genügend repräsentativ oder unter Datenschutz ist."]
["Bundesamt für Statistik, Baupreisindex"]
["Auskunft: Hotline BAP, 058 463 63 06, bap@bfs.admin.ch"]
["© BFS"]

{"sheet":"MS1_B","index":7,"n_rows":52,"n_cols":36,"rows_kept":52,"cut":false,"hidden":false,"merged":[[20,31,23,31],[20,32,23,32],[20,33,23,33],[20,34,23,34],[20,35,23,35]]}
[]
[null,null,null,null,null,null,null,null,null,null,null,null,null,null,null,null,null,null,null,null,null,null,null,null,null,"Nur dort wo rot \"manipulieren\""]
[]
[null,null,null,null,null,null,null,null,null,null,null,null,null,null,null,null,null,null,null,null,null,null,null,null,null,"GSF","BUF","GF Total","Whg","GU / TU","DB 2","Reserven"]
[null,null,null,null,null,null,null,null,null,null,null,null,null,null,null,null,null,null,null,null,null,null,null,null,null,1000,5600,15000,30,0.05,0.04,0.02]
[]
[]
[]
[]
["eBKP-H","Element","EL2","EL1","TO","EL3 TO","EL2 TO","EL1 TO","TE","EL2 TO TE","BKP","TO BKP ","BKP(3st)","TO BKP 3 ","BKP(2st)","TO BKP 2 ","BKP(1st)","TO BKP 1 ","TO Menge","Menge Element","Beschreibung","EH","Menge","Preis","Total"]
[null,null,null,null,null,null,null,null,null,null,null,null,null,null,null,null,null,null,null,null,null,null,null,null,null,null,"Sehr Tief","Tief","Mittel","Hoch","Sehr Hoch","Sehr Tief","Tief","Mittel","Hoch","Sehr Hoch"]
["Total Kosten exkl. MwSt. nach eBKP-H",null,null,null,null,{"$f":"B12&\" \"&E12","v":" "},{"$f":"B12&\" \"&E12","v":" "},{"$f":"C12&\" \"&F12","v":"  "},null,{"$f":"G12&\" \"&LEFT(I12,1)","v":"  "},null,null,{"$f":"LEFT($K12,3)","v":""},null,{"$f":"LEFT($K12,2)","v":""},null,{"$f":"LEFT($K12,1)","v":""},null,{"$f":"E12&V12","v":"GF"},{"$f":"F12&W12","v":" 15000"},null,"GF",{"$f":"$AB$5","v":15000},{"$f":"IF(W12=0,0,Y12/W12)","v":2513.3333333333335},{"$f":"ROUND(SUM(Y15:Y28),-5)","v":37700000}]
[]
[{"$f":"CONCATENATE(\"  \",B14)","v":"  A"},"A",{"$f":"LEFT(B14,3)","v":"A"},{"$f":"LEFT(C14,1)","v":"A"},null,{"$f":"B14&\" \"&E14","v":"A "},{"$f":"B14&\" \"&E14","v":"A "},"A A ",null,{"$f":"G14&\" \"&LEFT(I14,1)","v":"A  "},"0",null,{"$f":"LEFT($K14,3)","v":"0"},null,{"$f":"LEFT($K14,2)","v":"0"},null,{"$f":"LEFT($K14,1)","v":"0"},null,{"$f":"E14&V14","v":"GSF"},{"$f":"F14","v":"A "},"Grundstück","GSF",{"$f":"$Z$5","v":1000},0,{"$f":"W14*X14","v":0},"Tief",{"$f":"MS1_Basisdaten!E3","v":170},{"$f":"MS1_Basisdaten!F3","v":260},{"$f":"MS1_Basisdaten!G3","v":380},{"$f":"MS1_Basisdaten!H3","v":520},{"$f":"MS1_Basisdaten!I3","v":750},"Kein Provisorium, kein Baugrubenaushub, kein Abbruch, keine Baugrundverbesserung.","Kein Provisorium, normaler Baugrubenaushub, kein Abbruch, keine Baugrunverbesserung.","Baugrubenaushub mit einfache Baugrubenabschluss, einfacher Abbruch, Materialersatz","Baugrubenaushub mit aufwendige Baugrubenabschluss, Abbruch, Materialersatz, Pfähle","Monitoring, sehr komplizierte Baugrubenabschluss, Pfähle und Materialersatz, Abbruch und kontaminierte Abbruch, Provirorium"]
["  B","B","B",{"$f":"LEFT(C15,1)","v":"B"},null,"B ","B ","B B ",null,"B  ","1",null,"1",null,"1",null,"1",null,"GSF","B ","Vorbereitung","GSF",{"$f":"$Z$5","v":1000},{"$f":"HLOOKUP($Z14,$AA$11:AE24,4,0)","v":260},{"$f":"ROUND(W15*X15,-4)","v":260000},"Mittel",{"$f":"MS1_Basisdaten!E4","v":350},{"$f":"MS1_Basisdaten!F4","v":390},{"$f":"MS1_Basisdaten!G4","v":420},{"$f":"MS1_Basisdaten!H4","v":550},{"$f":"MS1_Basisdaten!I4","v":700},"Bodenplatte flachfundiert, sehr niedrige Anteile Betonwände, Sichtbeton, Stützen und Armierungsgehalt, keine Kragplatten.","Bodenplatte flachfundiert, niedrige Anteile Betonwände, Sichtbeton, Stützen und Armierungsgehalt.","Bodenplatte mit Einzelfundamenten, normaler Anteil Betonwände, Sichtbeton, Stützen und Armierungsgehalt.","Komplexe Kanaliation mit Hebeanlage unter Bodenplatte mit Einzelfundamenten, wasserdichter Beton UG, hohe Anteile Betonwände, Sichtbeton, Stützen und Armierungsgehalt.","Komplexe Kanaliation mit Hebeanlage, spez. Fundamente, wasserdichte Beton, Sichtbeton, Spannbeton, spez. Gebäudeform, Auskrakungen"]
["  C","C","C","C",null,"C ","C ","C C ",null,"C  ","2",null,"2",null,"2",null,"2",null,"GF","C ","Konstruktion Gebäude","GF",{"$f":"$AB$5","v":15000},{"$f":"HLOOKUP($Z15,$AA$11:AE24,5,0)","v":420},6300000,"Mittel",{"$f":"MS1_Basisdaten!E5","v":300},{"$f":"MS1_Basisdaten!F5","v":340},{"$f":"MS1_Basisdaten!G5","v":400},{"$f":"MS1_Basisdaten!H5","v":500},{"$f":"MS1_Basisdaten!I5","v":600},"Tiefer Standard Elektro, Fernwärme, nur Abluft Küchen, Tiefer Standard Sanitär, Niedrige Anzahl Nasszellen.","Tiefer Standard Elektro, Fernwärme, nur Abluft Küchen und Nasszellen, Tiefer Standard Sanitär, Niedrige Anzahl Nasszellen","Mittlere Standard Elektro, Wärmepumpe Luft, kontrollierte Lüftung, Mittlere Standard Sanitärapparate, WM/TU pro WHG","Höhe Standard Elektro, PV-Anlage, Wärmepumpe Grundwasser, kontrollierte Lüftung und UG belüftet,höhe Standard Sanitärapparate","Höhe Standard Elektro, PV-Anlage, Wärmepumpe Grundwasser, kontrollierte Lüftung und UG belüftet und entlüftet,sehr höhe Standard Sanitärapparate"]
["  D","D","D","D",null,"D ","D ","D D ",null,"D  ","2",null,"2",null,"2",null,"2",null,"GF","D ","Technik Gebäude","GF",{"$f":"$AB$5","v":15000},{"$f":"HLOOKUP($Z16,$AA$11:AE26,6,0)","v":400},6000000,"Sehr Hoch",{"$f":"MS1_Basisdaten!E6","v":230},{"$f":"MS1_Basisdaten!F6","v":300},{"$f":"MS1_Basisdaten!G6","v":400},{"$f":"MS1_Basisdaten!H6","v":600},{"$f":"MS1_Basisdaten!I6","v":850},"Sehr hoher Anteil Fassade unterirdisch, nur Schwarzanstrich, WDVS, Kunststofffenster, VRAF und Markise mit Kurbel.","Höhe Anteil Fassade unterirdisch, nur Schwarzanstrich, Verputze Aussendämmung, Kunststofffenster, Sonneschutz mit Kürbel","Fassade unterirdisch teilweise gedämmt, Fassade oberirdisch hinterlüftet, Fenster Kunststoffmetall, Sonnenschutz elektrisch","Fassade unterirdisch komplett gedämmt, Fassade oberirdisch hinterlüftet, höhe Anteil Holzfenster, Hebeschieber, Sonnenschutz elektrisch","Höhe Dichtigkeit unterirdisch, Fassade oberirdisch hochwertig, sehr höhe Anteil Holzfenster, Hebeschieber, Sonnenschutz elektrisch"]
["  E","E","E","E",null,"E ","E ","E E ",null,"E  ","2",null,"2",null,"2",null,"2",null,"FAW","E ","Äussere Wandbekleidung Gebäude","FAW",{"$f":"$AB$5*0.7","v":10500},{"$f":"HLOOKUP($Z17,$AA$11:AE26,7,0)","v":850},8930000,"Sehr Hoch",{"$f":"MS1_Basisdaten!E7","v":60},{"$f":"MS1_Basisdaten!F7","v":90},{"$f":"MS1_Basisdaten!G7","v":130},{"$f":"MS1_Basisdaten!H7","v":160},{"$f":"MS1_Basisdaten!I7","v":220},"Sehr hoher Anteil Dach unterirdisch, keine Dacheinbauten, keine PV.","Höhe Anteil Dach unterirdisch, Balkone nur mit Abdichtung, keine Dacheinbauten","Balkone mit Zementplatten, Begrünte Dach, kleine Einbauten","Balkone mit Holzrost, Retentiondach, viele Einbauten.","Balkone und Dachterrasse mit Holzrost, Retentiondach, unterkonstrk. PV-Anlage, viele Einbauten aus Glas."]
["  F","F","F","F",null,"F ","F ","F F ",null,"F  ","2",null,"2",null,"2",null,"2",null,"FB","F ","Bedachung Gebäude","FB",{"$f":"$AB$5*0.4","v":6000},{"$f":"HLOOKUP($Z18,$AA$11:AE26,8,0)","v":220},1320000,"Sehr Hoch",{"$f":"MS1_Basisdaten!E8","v":220},{"$f":"MS1_Basisdaten!F8","v":260},{"$f":"MS1_Basisdaten!G8","v":350},{"$f":"MS1_Basisdaten!H8","v":480},{"$f":"MS1_Basisdaten!I8","v":560},"Keine Trennwände in Gips, Stahlzargentüren in Holz, sehr tiefer Standard Ausbau, Decken roh.","Sehr wenig Trennwände, Innentüren aus Holz mit Zargen, tiefe Standard Ausbau, Decken gestrichen","Trennwände aus Gips, Innentüren aus Holz mit Zargen, mittlere Standard Ausbau, Decken mit Gipsglattstrich","Trennwände aus Gips und Glas, Holzrahmentüren, höhe Standard Ausbau, abgehängte Decken, Schutzraumausstattung","Trennwände aus Gips und Glas, Glastüren, sehr höhe Standard Ausbau, abgehängte Decken, Schutzraumausstattung, erhörte Schallschutz"]
["  G","G","G","G",null,"G ","G ","G G ",null,"G  ","2",null,"2",null,"2",null,"2",null,"GF","G ","Ausbau Gebäude","GF",{"$f":"$AB$5","v":15000},{"$f":"HLOOKUP($Z19,$AA$11:AE28,9,0)","v":560},8400000,"Sehr Hoch",{"$f":"MS1_Basisdaten!E9","v":80},{"$f":"MS1_Basisdaten!F9","v":110},{"$f":"MS1_Basisdaten!G9","v":150},{"$f":"MS1_Basisdaten!H9","v":190},{"$f":"MS1_Basisdaten!I9","v":280},"Sehr höhe Anteil Grünfläche, kein Bauwerke, keine Bäume, Hartfläche in Kies oder Mergel, keine Schutzeinrichtung oder Ausstattung","Höhe Anteil Grünfläche, wenig Bauwerke, wenig Bäume, Hartfläche in Kies oder Asphaltl, keine Schutzeinrichtung oder Ausstattung","Grünfläche ca 60%, Bauwerke wie Stützmauern und Treppen, Hartfläche Asphalt, Absturzsicherung und mittlerer Ausstattung ","Anteil Hartfläche über 50 %, viele Stütz- und Freiwände, Hartfläche in Asphalt und Beton, viele Absturzsicherung und Ausstattungen","Anteil Hartfläche ca 80%,viele Stütz- und Freiwände, Hartfläche in Beton, sehr viele Absturzsicherung und Ausstattungen"]
["  I","I","I","I",null,"I ","I ","I I ",null,"I  ","4",null,"4",null,"4",null,"4",null,"BUF","I ","Umgebung Gebäude","BUF",{"$f":"$AA$5","v":5600},{"$f":"HLOOKUP($Z20,$AA$11:AE32,10,0)","v":280},1570000,null,null,null,null,null,null,"Nur TU-Honorare, DB2 und keine Planungshonorare.","TU-Honorar inkl. Nebenkosten","Planerhonorare Phase 41-51, TU-Honorar inkl. Nebenkosten","Planerhonorare Phase 31-51, TU-Honorar inkl. Nebenkosten","Honorare Entwicklung, Planerhonorare Phase 31-51, TU-Honorar inkl. Nebenkosten"]
["  V","V","V","V",null,"V ","V ","V V ",null,"V  ","6",null,"6",null,"6",null,"6",null,"BBJ","V ","Planungskosten","BBJ",{"$f":"SUM($Y$15:$Y$21)","v":32780000},null,null,"Sehr Tief",{"$f":"MS1_Basisdaten!E11","v":0},{"$f":"MS1_Basisdaten!F11","v":0.05},{"$f":"MS1_Basisdaten!G11","v":0.08},{"$f":"MS1_Basisdaten!H11","v":0.1},{"$f":"MS1_Basisdaten!I11","v":0.12}]
[null,"V","V","V",null,"V ","V ","V V ",null,"V  ",null,null,"",null,"",null,"",null,"BBJ","V ","Honorare Planer","BBJ",{"$f":"SUM($Y$15:$Y$21)","v":32780000},{"$f":"HLOOKUP(Z22,AA11:AE28,12,0)","v":0},{"$f":"ROUND(W23*X23,-4)","v":0}]
[null,"V","V","V",null,"V ","V ","V V ",null,"V  ",null,null,"",null,"",null,"",null,"BBJ","V ","Honorare GU/TU","BBJ",{"$f":"SUM($Y$15:$Y$23)","v":32780000},{"$f":"$AD$5","v":0.05},{"$f":"ROUND(W24*X24,-4)","v":1640000}]
[null,"V","V","V",null,"V ","V ","V V ",null,"V  ",null,null,"",null,"",null,"",null,"BBJ","V ","DB 2 GU/TU","BBJ",{"$f":"SUM($Y$15:$Y$23)","v":32780000},{"$f":"$AE$5","v":0.04},{"$f":"ROUND(W25*X25,-4)","v":1310000},"Mittel",{"$f":"MS1_Basisdaten!E14","v":10},{"$f":"MS1_Basisdaten!F14","v":35},{"$f":"MS1_Basisdaten!G14","v":80},{"$f":"MS1_Basisdaten!H14","v":140},{"$f":"MS1_Basisdaten!I14","v":180},"Garantie, Baureklame, Aufrichte, Muster, Modelle, keine Baubewilligungs- und Anschlussgebühren.","Bewilligeungen, Versicherungen, Garantie, Baureklame, Aufrichte, Muster, Modelle, keine Gebühren","Bewilligeungen, Anschlussgebühren,  Versicherungen, Garantie, Baureklame, Aufrichte, Muster, Modelle","Bewilligeungen, Anschlussgebühren, Ersatzbeitrag Zivilschutz, Versicherungen, Garantie, Baureklame, Aufrichte, Muster, Modelle, Bewachung, ","Bewillig., Anschlussgeb., Ersatzbeitrag Zivilschutz, Versicherungen, Garantie, Baureklame, Aufrichte, Muster, Modelle, Bewachung, Entschädigung"]
["  W","W","W","W",null,"W ",{"$f":"B26&\" \"&E26","v":"W "},{"$f":"C26&\" \"&F26","v":"W W "},null,"W  ","5",null,"5",null,"5",null,"5",null,"GF","W ",{"$f":"\"Nebenkosten \"&Z26*100&\"%\"","v":"Nebenkosten 3.4%"},"GF",{"$f":"$AB$5","v":15000},{"$f":"HLOOKUP($Z25,$AA$11:AE37,15,0)","v":80},{"$f":"ROUND(W26*X26,-4)","v":1200000},{"$f":"IF(W22=0,0,ROUND(Y26/(W22+Y23+Y24+Y25),3))","v":3.4000000000000002E-2}]
["  Y","Y","Y","Y",null,{"$f":"B27&\" \"&E27","v":"Y "},{"$f":"B27&\" \"&E27","v":"Y "},{"$f":"C27&\" \"&F27","v":"Y Y "},null,"Y  ","7",null,"7",null,"7",null,"7",null,"BBW","Y ","Reserve, Teuerung","BBW",{"$f":"SUM($Y$15:$Y$26)","v":36930000},{"$f":"$AF$5","v":0.02},{"$f":"ROUND(W27*X27,-4)","v":740000}]
[null,null,null,null,null,null,null,null,null,null,null,null,null,null,null,null,null,null,null,null,null,null,null,null,null,null,null,null,null,null,null,null,"Kennwert","Sehr Tief","Sehr Hoch"]
[]
["Total Kosten exkl. MwSt. nach BKP",null,null,null,null,null,null,null,null,null,null,null,null,null,null,null,null,null,null,null,null,null,null,{"$f":"SUM(X34:X43)","v":0.99131578947368415},{"$f":"ROUND(SUM(Y31:Y43),-6)","v":38000000},null,null,null,null,null,null,"B",{"$f":"$X$15","v":260},{"$f":"$AA$14","v":170},{"$f":"$AE$14","v":750}]
[null,null,null,null,null,null,null,null,null,null,null,null,null,null,null,null,null,null,null,null,null,null,null,null,null,null,null,null,null,null,null,"C",{"$f":"$X$16","v":420},{"$f":"$AA$15","v":350},{"$f":"$AE$15","v":700}]
[null,null,null,null,null,null,null,null,null,null,null,null,null,null,null,null,null,null,null,null,"Rundung",null,null,0,0,null,null,null,null,null,null,"D",{"$f":"$X$17","v":400},{"$f":"$AA$16","v":300},{"$f":"$AE$16","v":600}]
[null,null,null,null,null,null,null,null,null,null,null,null,null,null,null,null,null,null,null,null,"BKP",null,null,"Anteil","Total",null,null,null,null,null,null,"E",{"$f":"$X$18","v":850},{"$f":"$AA$17","v":230},{"$f":"$AE$17","v":850}]
[null,null,null,null,null,null,null,null,null,null,"0",null,null,null,null,null,null,null,null,null,"Grundstück",null,null,{"$f":"IF(Y34=0,0,Y34/$Y$30)","v":0},{"$f":"MS1_B!$Y$14","v":0},null,null,null,null,null,null,"F",{"$f":"$X$19","v":220},{"$f":"$AA$18","v":60},{"$f":"$AE$18","v":220}]
[null,null,null,null,null,null,null,null,null,null,"1",null,null,null,null,null,null,null,null,null,"Vorbereitungsarbeiten",null,null,{"$f":"IF(Y35=0,0,Y35/$Y$30)","v":6.842105263157895E-3},{"$f":"MS1_B!$Y$15","v":260000},null,null,null,null,null,null,"G",{"$f":"$X$20","v":560},{"$f":"$AA$19","v":220},{"$f":"$AE$19","v":560}]
[null,null,null,null,null,null,null,null,null,null,"2",null,null,null,null,null,null,null,null,null,"Gebäude",null,null,0.81447368421052635,{"$f":"SUM(MS1_B!$Y$16:$Y$20)","v":30950000},null,null,null,null,null,null,"I",{"$f":"$X$21","v":280},{"$f":"$AA$20","v":80},{"$f":"$AE$20","v":280}]
[null,null,null,null,null,null,null,null,null,null,"3",null,null,null,null,null,null,null,null,null,"Betriebseinrichtungen",null,null,0,0]
[null,null,null,null,null,null,null,null,null,null,"4",null,null,null,null,null,null,null,null,null,"Umgebung",null,null,4.1315789473684209E-2,{"$f":"MS1_B!$Y$21","v":1570000}]
[null,null,null,null,null,null,null,null,null,null,"5",null,null,null,null,null,null,null,null,null,"Baunebenkosten",null,null,3.1578947368421054E-2,{"$f":"MS1_B!$Y$26","v":1200000}]
[null,null,null,null,null,null,null,null,null,null,"6",null,null,null,null,null,null,null,null,null,"Honorare Planer",null,null,0,{"$f":"MS1_B!$Y$23","v":0}]
[null,null,null,null,null,null,null,null,null,null,"7",null,null,null,null,null,null,null,null,null,"Reserven",null,null,1.9473684210526317E-2,{"$f":"MS1_B!$Y$27","v":740000}]
[null,null,null,null,null,null,null,null,null,null,"8",null,null,null,null,null,null,null,null,null,"GU/TU Honorare, Nebenkosten und DB 2",null,null,7.7631578947368426E-2,{"$f":"MS1_B!$Y$24+MS1_B!$Y$25","v":2950000}]
[null,null,null,null,null,null,null,null,null,null,"9",null,null,null,null,null,null,null,null,null,"Ausstattung",null,null,0,0]
[]
[null,null,null,null,null,null,null,null,null,null,null,null,null,null,null,null,null,null,null,null,null,{"$f":"V12","v":"GF"},{"$f":"W12","v":15000},2513.3333333333335,37700000]
["Kostenkennwerte BKP exkl. MwSt."]
[]
[null,null,null,null,null,null,null,null,null,null,null,null,null,null,null,null,null,null,null,null,null,"GF / Whg","GF","GV","Whg"]
[null,null,null,null,null,null,null,null,null,null,null,null,null,null,null,null,null,null,null,null,"Mengen nach SIA 416",{"$f":"IF(W49=0,0,MS1_B!$AB$5/MS1_B!$AC$5)","v":500},{"$f":"MS1_B!$AB$5","v":15000},{"$f":"MS1_B!$AB$5*3.2","v":48000},{"$f":"MS1_B!$AC$5","v":30}]
[]
[null,null,null,null,null,null,null,null,null,null,"0-9",null,null,null,null,null,null,null,null,null,"Gesamtkosten inkl. Honorare",null,{"$f":"ROUND(IF(W49=0,0,$Y$30/W49),-1)","v":2530},{"$f":"ROUND(IF(X49=0,0,$Y$30/X49),-1)","v":790},{"$f":"ROUND(IF(Y49=0,0,$Y$30/Y49),-4)","v":1270000}]
[null,null,null,null,null,null,null,null,null,null,2,null,null,null,null,null,null,null,null,null,"Gebäude exkl. Honorare",null,{"$f":"ROUND(IF(W49=0,0,$Y$36/W49),-1)","v":2060},{"$f":"ROUND(IF(X49=0,0,$Y$36/X49),-1)","v":640},{"$f":"ROUND(IF(Y49=0,0,$Y$36/Y49),-4)","v":1030000}]

{"sheet":"MS1_Basisdaten","index":8,"n_rows":15,"n_cols":9,"rows_kept":15,"cut":false,"hidden":false,"merged":[]}
[{"$f":"MS1_B!A10","v":"eBKP-H"},{"$f":"MS1_B!K10","v":"BKP"},{"$f":"MS1_B!U10","v":"Beschreibung"},{"$f":"MS1_B!V10","v":"EH"},{"$f":"MS1_B!AA11","v":"Sehr Tief"},{"$f":"MS1_B!AB11","v":"Tief"},{"$f":"MS1_B!AC11","v":"Mittel"},{"$f":"MS1_B!AD11","v":"Hoch"},{"$f":"MS1_B!AE11","v":"Sehr Hoch"}]
[{"$f":"MS1_B!A14","v":"  A"},{"$f":"MS1_B!K14","v":"0"},{"$f":"MS1_B!U14","v":"Grundstück"},{"$f":"MS1_B!V14","v":"GSF"},{"$f":"E10","v":0},{"$f":"F10","v":0},0,0,0]
[{"$f":"MS1_B!A15","v":"  B"},{"$f":"MS1_B!K15","v":"1"},{"$f":"MS1_B!U15","v":"Vorbereitung"},{"$f":"MS1_B!V15","v":"GSF"},170,260,380,520,750]
[{"$f":"MS1_B!A16","v":"  C"},{"$f":"MS1_B!K16","v":"2"},{"$f":"MS1_B!U16","v":"Konstruktion Gebäude"},{"$f":"MS1_B!V16","v":"GF"},350,390,420,550,700]
[{"$f":"MS1_B!A17","v":"  D"},{"$f":"MS1_B!K17","v":"2"},{"$f":"MS1_B!U17","v":"Technik Gebäude"},{"$f":"MS1_B!V17","v":"GF"},300,340,400,500,600]
[{"$f":"MS1_B!A18","v":"  E"},{"$f":"MS1_B!K18","v":"2"},{"$f":"MS1_B!U18","v":"Äussere Wandbekleidung Gebäude"},{"$f":"MS1_B!V18","v":"FAW"},230,300,400,600,850]
[{"$f":"MS1_B!A19","v":"  F"},{"$f":"MS1_B!K19","v":"2"},{"$f":"MS1_B!U19","v":"Bedachung Gebäude"},{"$f":"MS1_B!V19","v":"FB"},60,90,130,160,220]
[{"$f":"MS1_B!A20","v":"  G"},{"$f":"MS1_B!K20","v":"2"},{"$f":"MS1_B!U20","v":"Ausbau Gebäude"},{"$f":"MS1_B!V20","v":"GF"},220,260,350,480,560]
[{"$f":"MS1_B!A21","v":"  I"},{"$f":"MS1_B!K21","v":"4"},{"$f":"MS1_B!U21","v":"Umgebung Gebäude"},{"$f":"MS1_B!V21","v":"BUF"},80,110,150,190,280]
[{"$f":"MS1_B!A22","v":"  V"},{"$f":"MS1_B!K22","v":"6"},{"$f":"MS1_B!U22","v":"Planungskosten"},{"$f":"MS1_B!V22","v":"BBJ"},{"$f":"E12","v":0},{"$f":"F12","v":0},0,0,0]
[{"$f":"MS1_B!A23","v":0},{"$f":"MS1_B!K23","v":0},{"$f":"MS1_B!U23","v":"Honorare Planer"},{"$f":"MS1_B!V23","v":"BBJ"},0,0.05,0.08,0.1,0.12]
[{"$f":"MS1_B!A24","v":0},{"$f":"MS1_B!K24","v":0},{"$f":"MS1_B!U24","v":"Honorare GU/TU"},{"$f":"MS1_B!V24","v":"BBJ"},{"$f":"MS1_B!AA24","v":0},{"$f":"MS1_B!AB24","v":0},{"$f":"MS1_B!AC24","v":0},{"$f":"MS1_B!AD24","v":0},{"$f":"MS1_B!AE24","v":0}]
[{"$f":"MS1_B!A25","v":0},{"$f":"MS1_B!K25","v":0},{"$f":"MS1_B!U25","v":"DB 2 GU/TU"},{"$f":"MS1_B!V25","v":"BBJ"},{"$f":"E12","v":0},{"$f":"F12","v":0},0,0,0]
[{"$f":"MS1_B!A26","v":"  W"},{"$f":"MS1_B!K26","v":"5"},{"$f":"MS1_B!U26","v":"Nebenkosten 3.4%"},{"$f":"MS1_B!V26","v":"GF"},10,35,80,140,180]
[{"$f":"MS1_B!A27","v":"  Y"},{"$f":"MS1_B!K27","v":"7"},{"$f":"MS1_B!U27","v":"Reserve, Teuerung"},{"$f":"MS1_B!V27","v":"BBW"},{"$f":"MS1_B!AA27","v":0},{"$f":"MS1_B!AB27","v":0},{"$f":"MS1_B!AC27","v":0},{"$f":"MS1_B!AD27","v":0},{"$f":"MS1_B!AE27","v":0}]

{"sheet":"BKPListe","index":9,"n_rows":1384,"n_cols":3,"rows_kept":1384,"cut":false,"hidden":false,"merged":[]}
["0 Grundstück","BKP-Nr.","Bezeichnung"]
[null,"0","Grundstück"]
["0 Grundstück","00","Vorstudien"]
["0 Grundstück","000","Übergangsposition"]
["0 Grundstück","001","Studien zur Grundstückbeurteilung, Machbarkeitsstudie"]
["0 Grundstück","002","Vermessung, Vermarchung"]
["0 Grundstück","003","Geotechnische Gutachten"]
["0 Grundstück","004","Quartierplankosten, Richtplankosten"]
["0 Grundstück","005","Provisorische Baugespanne"]
["0 Grundstück","006","Umweltverträglichkeitsprüfung"]
[null,"007"]
[null,"008"]
["0 Grundstück","009","Übriges"]
["0 Grundstück"]
["0 Grundstück","01","Grundstück- bzw. Baurechterwerb"]
["0 Grundstück","010","Übergangsposition"]
["0 Grundstück","011","Grundstückerwerb"]
["0 Grundstück","012","Baurechterwerb"]
["0 Grundstück","013","Brandmauereinkauf"]
[null,"014"]
[null,"015"]
[null,"016"]
[null,"017"]
["0 Grundstück","018","Sanierung Altlasten"]
["0 Grundstück","019","Übriges"]
["0 Grundstück"]
["0 Grundstück","02","Nebenkosten zu Grundstück- resp. Baurechterwerb"]
["0 Grundstück","020","Übergangsposition"]
["0 Grundstück","021","Handänderungssteuer"]
["0 Grundstück","022","Notariatskosten"]
["0 Grundstück","023","Grundbuchgebühren"]
["0 Grundstück","024","Anwaltskosten, Gerichtskosten"]
["0 Grundstück","025","Vermittlungsprovisionen"]
[null,"026"]
[null,"027"]
[null,"028"]
["0 Grundstück","029","Übriges"]
["0 Grundstück"]
["0 Grundstück","03","Abfindungen, Servitute, Beiträge"]
["0 Grundstück","030","Übergangsposition"]
["0 Grundstück","031","Inkonvenienzentschädigungen"]
["0 Grundstück","032","Abfindungen an Mieter und Pächter"]
["0 Grundstück","033","Errichtung von Servituten"]
["0 Grundstück","034","Ablösung von Servituten"]
["0 Grundstück","035","Wirtschaftspatente"]
["0 Grundstück","036","Beiträge Melioration"]
["0 Grundstück","037","Beiträge Güterzusammenlegung"]
["0 Grundstück","038","Perimeterbeiträge"]
["0 Grundstück","039","Übriges"]
["0 Grundstück"]
["0 Grundstück","04","Finanzierung vor Baubeginn"]
["0 Grundstück","040","Übergangsposition"]
["0 Grundstück","041","Errichten von Hypotheken auf Grundstück"]
["0 Grundstück","042","Hypothekarzinsen"]
["0 Grundstück","043","Baurechtszinsen"]
["0 Grundstück","044","Bankzinsen"]
["0 Grundstück","045","Eigenkapitalzinsen"]
["0 Grundstück","046","Grundstücksteuern"]
[null,"047"]
["0 Grundstück","048","Versicherungen bis Baubeginn"]
["0 Grundstück","049","Übriges"]
["0 Grundstück"]
["0 Grundstück","05","Erschliessung durch Leitungen (ausserhalb Grundstück)"]
["0 Grundstück","050","Übergangsposition"]
["0 Grundstück","051","Erdarbeiten"]
["0 Grundstück","052","Kanalisationsleitungen"]
["0 Grundstück","053","Elektroleitungen"]
["0 Grundstück","054","Heizungs-, Lüftungs-, Klima-, Kälteleitungen"]
["0 Grundstück","055","Sanitärleitungen"]
["0 Grundstück","056","Nebenarbeiten"]
[null,"057"]
[null,"058"]
["0 Grundstück","059","Übriges"]
["0 Grundstück"]
["0 Grundstück","06","Erschliessung durch Verkehrsanlagen ausserhalb Grundstück"]
["0 Grundstück","060","Übergangsposition"]
["0 Grundstück","061","Strassen"]
["0 Grundstück","062","Bahn"]
["0 Grundstück","063","Schiff"]
[null,"064"]
[null,"065"]
[null,"066"]
[null,"067"]
[null,"068"]
["0 Grundstück","069","Übriges"]
["0 Grundstück"]
["0 Grundstück","07","Reserve"]
[null,"070"]
[null,"071"]
[null,"072"]
[null,"073"]
[null,"074"]
[null,"075"]
[null,"076"]
[null,"077"]
[null,"078"]
[null,"079"]
["0 Grundstück"]
["0 Grundstück","08","Reserve"]
[null,"080"]
[null,"081"]
[null,"082"]
[null,"083"]
[null,"084"]
[null,"085"]
[null,"086"]
[null,"087"]
[null,"088"]
[null,"089"]
["0 Grundstück"]
["0 Grundstück","09","Honorare"]
["0 Grundstück","090","Übergangsposition"]
["0 Grundstück","091","Architekt"]
["0 Grundstück","092","Bauingenieur"]
["0 Grundstück","093","Elektroingenieur"]
["0 Grundstück","094","HLK-Ingenieur"]
["0 Grundstück","095","Sanitäringenieur"]
["0 Grundstück","096","Spezialisten"]
["0 Grundstück","096.0","Geometer"]
["0 Grundstück","096.1","Geologe, Geotechniker"]
[null,"096.2"]
[null,"096.3"]
[null,"096.4"]
[null,"096.5"]
["0 Grundstück","096.6","Bauökonom"]
[null,"096.7"]
["0 Grundstück","096.8","Makler"]
[null,"096.9"]
[null,"097"]
[null,"098"]
["0 Grundstück","099","Übriges"]
["0 Grundstück"]
["0 Grundstück"]
["0 Grundstück"]
[]
["1 Vorbereitungsarbeiten"]
[null,"1","Vorbereitungsarbeiten"]
["1 Vorbereitungsarbeiten","10","Bestandesaufnahmen, Baugrunduntersuchungen"]
["1 Vorbereitungsarbeiten","100","Übergangsposition"]
["1 Vorbereitungsarbeiten","101","Bestandesaufnahmen"]
["1 Vorbereitungsarbeiten","102","Baugrunduntersuchungen"]
["1 Vorbereitungsarbeiten","103","Grundwassererhebungen"]
[null,"104"]
[null,"105"]
[null,"106"]
[null,"107"]
[null,"108"]
["1 Vorbereitungsarbeiten","109","Übriges"]
["1 Vorbereitungsarbeiten"]
["1 Vorbereitungsarbeiten","11","Räumungen, Terrainvorbereitungen"]
["1 Vorbereitungsarbeiten","110","Übergangsposition"]
["1 Vorbereitungsarbeiten","111","Rodungen"]
["1 Vorbereitungsarbeiten","112","Abbrüche"]
["1 Vorbereitungsarbeiten","113","Demontagen"]
["1 Vorbereitungsarbeiten","114","Erdbewegungen"]
["1 Vorbereitungsarbeiten","115","Bohr- und Schneidarbeiten"]
["1 Vorbereitungsarbeiten","115.0","Baustelleneinrichtung"]
["1 Vorbereitungsarbeiten","115.1","Erdarbeiten"]
[null,"115.2"]
[null,"115.3"]
[null,"115.4"]
[null,"115.5"]
[null,"115.6"]
[null,"115.7"]
[null,"115.8"]
[null,"115.9"]
[null,"116"]
[null,"117"]
[null,"118"]
["1 Vorbereitungsarbeiten","119","Übriges"]
["1 Vorbereitungsarbeiten"]
["1 Vorbereitungsarbeiten","12","Sicherungen, Provisorien"]
["1 Vorbereitungsarbeiten","120","Übergangsposition"]
["1 Vorbereitungsarbeiten","121","Sicherung vorhandener Anlagen"]
["1 Vorbereitungsarbeiten","122","Provisorien"]
["1 Vorbereitungsarbeiten","123","Unterfangungen"]
["1 Vorbereitungsarbeiten","123.0","Baustelleneinrichtung"]
["1 Vorbereitungsarbeiten","123.1","Gerüste"]
["1 Vorbereitungsarbeiten","123.2","Spezielle Unterfangungsarbeiten"]
["1 Vorbereitungsarbeiten","123.3","Erdarbeiten"]
["1 Vorbereitungsarbeiten","123.4","Kanalisationen"]
["1 Vorbereitungsarbeiten","123.5","Beton- und Stahlbetonarbeiten"]
["1 Vorbereitungsarbeiten","123.6","Maurerarbeiten"]
[null,"123.7"]
[null,"123.8"]
[null,"123.9"]
["1 Vorbereitungsarbeiten","124","Instandsetzungsarbeiten"]
[null,"125"]
[null,"126"]
[null,"127"]
[null,"128"]
["1 Vorbereitungsarbeiten","129","Übriges"]
["1 Vorbereitungsarbeiten"]
["1 Vorbereitungsarbeiten","13","Gemeinsame Baustelleneinrichtung"]
["1 Vorbereitungsarbeiten","130","Übergangsposition"]
["1 Vorbereitungsarbeiten","131","Abschrankungen"]
["1 Vorbereitungsarbeiten","132","Zufahrten, Plätze"]
["1 Vorbereitungsarbeiten","133","Büro Bauleitung"]
["1 Vorbereitungsarbeiten","134","Unterkünfte, Verpflegungseinrichtungen"]
["1 Vorbereitungsarbeiten","135","Provisorische Installationen"]
["1 Vorbereitungsarbeiten","135.0","Kanalisationen"]
["1 Vorbereitungsarbeiten","135.1","Elektro"]
["1 Vorbereitungsarbeiten","135.2","Heizung, Lüftung, Klima, Kälte"]
["1 Vorbereitungsarbeiten","135.3","Wasser"]
["1 Vorbereitungsarbeiten","135.4","Übermittlung"]
[null,"135.5"]
[null,"135.6"]
[null,"135.7"]
[null,"135.8"]
[null,"135.9"]
["1 Vorbereitungsarbeiten","136","Kosten für Energie, Wasser und dgl      ."]
["1 Vorbereitungsarbeiten","137","Provisorische Abschlüsse und Abdeckungen"]
["1 Vorbereitungsarbeiten","138","Bauabfälle Sortierung"]
["1 Vorbereitungsarbeiten","139","Übriges"]
["1 Vorbereitungsarbeiten"]
["1 Vorbereitungsarbeiten","14","Anpassungen an bestehende Bauten"]
["1 Vorbereitungsarbeiten","140","Übergangsposition"]
["1 Vorbereitungsarbeiten","141","Terraingestaltung, Rohbau 1"]
["1 Vorbereitungsarbeiten","141.0","Erdarbeiten"]
["1 Vorbereitungsarbeiten","141.1","Baumeisterarbeiten"]
["1 Vorbereitungsarbeiten","141.2","Montagebau in Beton und vorfabriziertem Mauerwerk"]
["1 Vorbereitungsarbeiten","141.3","Montagebau in Stahl"]
["1 Vorbereitungsarbeiten","141.4","Montagebau in Holz"]
["1 Vorbereitungsarbeiten","141.5","Montagebau als Leichtkonstruktion"]
["1 Vorbereitungsarbeiten","141.6","Natur- und Kunststeinarbeiten"]
["1 Vorbereitungsarbeiten","141.7","Schutzraumabschlüsse"]
[null,"141.8"]
[null,"141.9"]
["1 Vorbereitungsarbeiten","142","Rohbau 2"]
["1 Vorbereitungsarbeiten","142.1","Fenster, Aussentüren, Tore"]
["1 Vorbereitungsarbeiten","142.2","Spenglerarbeiten"]
["1 Vorbereitungsarbeiten","142.3","Blitzschutz"]
["1 Vorbereitungsarbeiten","142.4","Bedachungsarbeiten"]
["1 Vorbereitungsarbeiten","142.5","Spezielle Dichtungen und Dämmungen"]
["1 Vorbereitungsarbeiten","142.6","Fassadenputze"]
["1 Vorbereitungsarbeiten","142.7","Äussere Oberflächenbehandlungen"]
["1 Vorbereitungsarbeiten","142.8","Äussere Abschlüsse, Sonnenschutz"]
[null,"142.9"]
["1 Vorbereitungsarbeiten","143","Elektroanlagen"]
["1 Vorbereitungsarbeiten","144","Heizungs-, Lüftungs-, Klima- und Kälteanlagen"]
["1 Vorbereitungsarbeiten","145","Sanitäranlagen"]
["1 Vorbereitungsarbeiten","146","Transportanlagen"]
["1 Vorbereitungsarbeiten","147","Ausbau 1"]
["1 Vorbereitungsarbeiten","147.1","Gipserarbeiten"]
["1 Vorbereitungsarbeiten","147.2","Metallbauarbeiten"]
["1 Vorbereitungsarbeiten","147.3","Schreinerarbeiten"]
["1 Vorbereitungsarbeiten","147.4","Spezialverglasungen (innere)"]
["1 Vorbereitungsarbeiten","147.5","Schliessanlagen"]
["1 Vorbereitungsarbeiten","147.6","Innere Abschlüsse"]
["1 Vorbereitungsarbeiten","147.7","Elementwände"]
[null,"147.8"]
[null,"147.9"]
["1 Vorbereitungsarbeiten","148","Ausbau 2"]
["1 Vorbereitungsarbeiten","148.1","Bodenbeläge"]
["1 Vorbereitungsarbeiten","148.2","Wandbeläge, Wandbekleidungen"]
["1 Vorbereitungsarbeiten","148.3","Deckenbekleidungen"]
["1 Vorbereitungsarbeiten","148.4","Hafnerarbeiten"]
["1 Vorbereitungsarbeiten","148.5","Innere Oberflächenbehandlungen"]
["1 Vorbereitungsarbeiten","148.6","Bauaustrocknung"]
["1 Vorbereitungsarbeiten","148.7","Baureinigung"]
["1 Vorbereitungsarbeiten","148.8","Gärtnerarbeiten"]
[null,"148.9"]
["1 Vorbereitungsarbeiten","149","Übriges"]
["1 Vorbereitungsarbeiten"]
["1 Vorbereitungsarbeiten","15","Anpassungen an bestehende Erschliessungsleitungen"]
["1 Vorbereitungsarbeiten","150","Übergangsposition"]
["1 Vorbereitungsarbeiten","151","Erdarbeiten"]
["1 Vorbereitungsarbeiten","152","Kanalisationsleitungen"]
["1 Vorbereitungsarbeiten","153","Elektroleitungen"]
["1 Vorbereitungsarbeiten","154","Heizungs-, Lüftungs-, Klima-, Kälteleitungen"]
["1 Vorbereitungsarbeiten","155","Sanitärleitungen"]
["1 Vorbereitungsarbeiten","156","Nebenarbeiten"]
[null,"157"]
[null,"158"]
["1 Vorbereitungsarbeiten","159","Übriges"]
["1 Vorbereitungsarbeiten"]
["1 Vorbereitungsarbeiten","16","Anpassungen an bestehende Verkehrsanlagen"]
["1 Vorbereitungsarbeiten","160","Übergangsposition"]
["1 Vorbereitungsarbeiten","161","Strassen"]
["1 Vorbereitungsarbeiten","162","Bahn"]
["1 Vorbereitungsarbeiten","163","Schiff"]
[null,"164"]
[null,"165"]
[null,"166"]
[null,"167"]
[null,"168"]
["1 Vorbereitungsarbeiten","169","Übriges"]
["1 Vorbereitungsarbeiten"]
["1 Vorbereitungsarbeiten","17","Spezielle Fundationen, Baugrubensicherung, Grundwasserabdichtung"]
["1 Vorbereitungsarbeiten","170","Übergangsposition"]
["1 Vorbereitungsarbeiten","171","Pfähle"]
["1 Vorbereitungsarbeiten","172","Baugrubenabschlüsse"]
["1 Vorbereitungsarbeiten","173","Aussteifungen"]
["1 Vorbereitungsarbeiten","174","Anker"]
["1 Vorbereitungsarbeiten","175","Grundwasserabdichtungen"]
["1 Vorbereitungsarbeiten","176","Wasserhaltung"]
["1 Vorbereitungsarbeiten","176.0","Offene Wasserhaltung"]
["1 Vorbereitungsarbeiten","176.1","Grundwasserabsenkungen"]
[null,"176.2"]
[null,"176.3"]
[null,"176.4"]
[null,"176.5"]
[null,"176.6"]
[null,"176.7"]
[null,"176.8"]
[null,"176.9"]
["1 Vorbereitungsarbeiten","177","Baugrundverbesserungen"]
["1 Vorbereitungsarbeiten","178","Nebenarbeiten"]
["1 Vorbereitungsarbeiten","179","Übriges"]
["1 Vorbereitungsarbeiten"]
["1 Vorbereitungsarbeiten","18","Reserve"]
[null,"180"]
[null,"181"]
[null,"182"]
[null,"183"]
[null,"184"]
[null,"185"]
[null,"186"]
[null,"187"]
[null,"188"]
[null,"189"]
["1 Vorbereitungsarbeiten"]
["1 Vorbereitungsarbeiten","19","Honorare"]
["1 Vorbereitungsarbeiten","190","Übergangsposition"]
["1 Vorbereitungsarbeiten","191","Architekt"]
["1 Vorbereitungsarbeiten","192","Bauingenieur"]
["1 Vorbereitungsarbeiten","193","Elektroingenieur"]
["1 Vorbereitungsarbeiten","194","HLK-Ingenieur"]
["1 Vorbereitungsarbeiten","195","Sanitäringenieur"]
["1 Vorbereitungsarbeiten","196","Spezialisten"]
["1 Vorbereitungsarbeiten","196.0","Geometer"]
["1 Vorbereitungsarbeiten","196.1","Geologe, Geotechniker"]
[null,"196.2"]
[null,"196.3"]
[null,"196.4"]
[null,"196.5"]
["1 Vorbereitungsarbeiten","196.6","Bauökonom"]
[null,"196.7"]
[null,"196.8"]
[null,"196.9"]
[null,"197"]
[null,"198"]
["1 Vorbereitungsarbeiten","199","Übriges"]
["1 Vorbereitungsarbeiten"]
["1 Vorbereitungsarbeiten"]
[]
["2 Gebäude"]
[null,"2","Gebäude"]
["2 Gebäude","20","Baugrube"]
["2 Gebäude","200","Übergangsposition"]
["2 Gebäude","201","Baugrubenaushub"]
["2 Gebäude","201.0","Baustelleneinrichtung"]
["2 Gebäude","201.1","Erdarbeiten"]
[null,"201.2"]
[null,"201.3"]
[null,"201.4"]
[null,"201.5"]
[null,"201.6"]
[null,"201.7"]
[null,"201.8"]
[null,"201.9"]
[null,"202"]
[null,"203"]
[null,"204"]
[null,"205"]
[null,"206"]
[null,"207"]
[null,"208"]
["2 Gebäude","209","Übriges"]
["2 Gebäude"]
["2 Gebäude","21","Rohbau 1"]
["2 Gebäude","210","Übergangsposition"]
["2 Gebäude","211","Baumeisterarbeiten"]
["2 Gebäude","211.0","Baustelleneinrichtung"]
["2 Gebäude","211.1","Gerüste"]
[null,"211.2"]
["2 Gebäude","211.3","Baumeisteraushub"]
["2 Gebäude","211.4","Kanalisationen im Gebäude"]
["2 Gebäude","211.5","Beton- und Stahlbetonarbeiten"]
["2 Gebäude","211.6","Maurerarbeiten"]
["2 Gebäude","211.7","Instandsetzungsarbeiten"]
[null,"211.8"]
[null,"211.9"]
["2 Gebäude","212","Montagebau in Beton und vorfabriziertem Mauerwerk"]
["2 Gebäude","212.0","Baustelleneinrichtung"]
["2 Gebäude","212.1","Gerüste"]
["2 Gebäude","212.2","Elemente aus Beton"]
["2 Gebäude","212.3","Elemente in vorfabriziertem Mauerwerk"]
["2 Gebäude","212.4","Elemente in Porenbeton"]
[null,"212.5"]
[null,"212.6"]
[null,"212.7"]
[null,"212.8"]
[null,"212.9"]
["2 Gebäude","213","Montagebau in Stahl"]
["2 Gebäude","213.0","Baustelleneinrichtung"]
["2 Gebäude","213.1","Gerüste"]
["2 Gebäude","213.2","Stahlkonstruktion"]
[null,"213.3"]
[null,"213.4"]
["2 Gebäude","213.5","Äussere Bekleidungen"]
[null,"213.6"]
[null,"213.7"]
[null,"213.8"]
[null,"213.9"]
["2 Gebäude","214","Montagebau in Holz"]
["2 Gebäude","214.0","Baustelleneinrichtung"]
["2 Gebäude","214.1","Traggerippe (Zimmermanns- konstruktionen)"]
["2 Gebäude","214.2","Traggerippe (Ingenieurholzbau)"]
["2 Gebäude","214.3","Holztafelbau"]
["2 Gebäude","214.4","Äussere Bekleidungen, Gesimse, Treppen"]
["2 Gebäude","214.5","Gerüste"]
["2 Gebäude","214.6","Steildächer, Unterkonstruktion"]
[null,"214.7"]
[null,"214.8"]
[null,"214.9"]
["2 Gebäude","215","Montagebau als Leichtkonstruktionen"]
["2 Gebäude","215.0","Baustelleneinrichtung"]
["2 Gebäude","215.1","Gerüste"]
["2 Gebäude","215.2","Fassadenbau"]
[null,"215.3"]
["2 Gebäude","215.4","Traggerippe"]
["2 Gebäude","215.5","Äussere Bekleidungen"]
[null,"215.6"]
[null,"215.7"]
[null,"215.8"]
[null,"215.9"]
["2 Gebäude","216","Natur- und Kunststeinarbeiten"]
["2 Gebäude","216.0","Natursteinarbeiten"]
["2 Gebäude","216.1","Kunststeinarbeiten"]
[null,"216.2"]
[null,"216.3"]
[null,"216.4"]
[null,"216.5"]
[null,"216.6"]
[null,"216.7"]
[null,"216.8"]
[null,"216.9"]
["2 Gebäude","217","Schutzraumabschlüsse"]
[null,"218"]
["2 Gebäude","219","Übriges"]
["2 Gebäude"]
["2 Gebäude","22","Rohbau 2"]
["2 Gebäude","220","Übergangsposition"]
["2 Gebäude","221","Fenster, Aussentüren, Tore"]
["2 Gebäude","221.0","Fenster aus Holz"]
["2 Gebäude","221.1","Fenster aus Holz/Metall"]
["2 Gebäude","221.2","Fenster aus Kunststoff"]
["2 Gebäude","221.3","Fenster aus Stahl"]
["2 Gebäude","221.4","Fenster aus Aluminium"]
["2 Gebäude","221.5","Aussentüren, Tore aus Holz"]
["2 Gebäude","221.6","Aussentüren, Tore aus Metall"]
["2 Gebäude","221.7","Schaufensteranlagen"]
["2 Gebäude","221.8","Spezielle lichtdurchlässige Bauteile (äussere)"]
["2 Gebäude","221.9","Metallbaufertigteile"]
["2 Gebäude","222","Spenglerarbeiten"]
["2 Gebäude","223","Blitzschutz"]
["2 Gebäude","224","Bedachungsarbeiten"]
["2 Gebäude","224.0","Deckungen (Steildächer)"]
["2 Gebäude","224.1","Plastische und elastische Dichtungsbeläge (Flachdächer)"]
["2 Gebäude","224.2","Glaseinbauten in Steildächern"]
["2 Gebäude","224.3","Glaseinbauten in Flachdächern"]
[null,"224.4"]
[null,"224.5"]
[null,"224.6"]
[null,"224.7"]
[null,"224.8"]
[null,"224.9"]
["2 Gebäude","225","Spezielle Dichtungen und Dämmungen"]
["2 Gebäude","225.0","      .0 Gerüste"]
["2 Gebäude","225.1","      .1 Fugendichtungen"]
["2 Gebäude","225.2","      .2 Spezielle Dämmungen"]
["2 Gebäude","225.3","      .3 Spezielle Feuchtigkeitsabdichtungen"]
["2 Gebäude","225.4","      .4 Brandschutzbekleidungen und dgl      ."]
[null,"225.5"]
[null,"225.6"]
[null,"225.7"]
[null,"225.8"]
[null,"225.9"]
["2 Gebäude","226","Fassadenputze"]
["2 Gebäude","226.0","      .0 Gerüste"]
["2 Gebäude","226.1","      .1 Verputzarbeiten (äussere)"]
["2 Gebäude","226.2","      .2 Verputzte Aussenwärmedämmungen"]
[null,"226.3","      .3 Wärmedämmung im Erdreich"]
[null,"226.4"]
[null,"226.5"]
[null,"226.6"]
[null,"226.7"]
[null,"226.8"]
[null,"226.9"]
["2 Gebäude","227","Äussere Oberflächenbehandlungen"]
["2 Gebäude","227.0","      .0 Gerüste"]
["2 Gebäude","227.1","      .1 Äussere Malerarbeiten"]
["2 Gebäude","227.2","      .2 Holzschutzarbeiten (äussere)"]
["2 Gebäude","227.3","      .3 Holz-Beizarbeiten und -Naturbehandlungen (äussere)"]
[null,"227.4"]
[null,"227.5"]
[null,"227.6"]
[null,"227.7"]
[null,"227.8"]
[null,"227.9"]
["2 Gebäude","228","Äussere Abschlüsse, Sonnenschutz"]
["2 Gebäude","228.0","      .0 Fenster- und Fenstertürläden"]
["2 Gebäude","228.1","      .1 Rollläden"]
["2 Gebäude","228.2","      .2 Lamellenstoren"]
["2 Gebäude","228.3","      .3 Sonnenstoren"]
["2 Gebäude","228.4","      .4 Blendschutzanlagen"]
[null,"228.5"]
["2 Gebäude","228.6","      .6 Bewegliche Gitterabschlüsse (äussere)"]
[null,"228.7"]
[null,"228.8"]
[null,"228.9"]
["2 Gebäude","229","Übriges"]
["2 Gebäude"]
["2 Gebäude","23","Elektroanlagen"]
["2 Gebäude","230","Übergangsposition"]
["2 Gebäude","231","Apparate Starkstrom"]
["2 Gebäude","232","Starkstrominstallationen"]
["2 Gebäude","233","Leuchten und Lampen"]
["2 Gebäude","234","Energieverbraucher"]
["2 Gebäude","235","Apparate Schwachstrom"]
["2 Gebäude","236","Schwachstrominstallationen"]
["2 Gebäude","237","Gebäudeautomation"]
["2 Gebäude","237.0","      .0 Managementebene"]
["2 Gebäude","237.1","      .1 Automationsebene"]
[null,"237.2"]
["2 Gebäude","237.3","      .3 Feldebene"]
[null,"237.4"]
[null,"237.5"]
[null,"237.6"]
["2 Gebäude","237.7","      .7 Schaltgerätekombination SGK"]
[null,"237.8"]
[null,"237.9"]
["2 Gebäude","238","238 Bauprovisorien"]
["2 Gebäude","239","239 Übriges"]
["2 Gebäude"]
["2 Gebäude","24","24 Heizungs-, Lüftungs-, Klimaanlagen"]
["2 Gebäude","240","240 Übergangsposition"]
["2 Gebäude","241","241 Zulieferung Energieträger, Lagerung"]
["2 Gebäude","242","242 Wärmeerzeugung"]
["2 Gebäude","243","243 Wärmeverteilung"]
["2 Gebäude","244","244 Lüftungsanlagen"]
["2 Gebäude","245","245 Klimaanlagen"]
["2 Gebäude","246","246 Kälteanlagen"]
["2 Gebäude","247","247 Spezialanlagen"]
["2 Gebäude","247.0","      .0 Wasseraufbereitung"]
["2 Gebäude","247.1","      .1 Druckluft für Regulierungen"]
["2 Gebäude","247.2","      .2 Spezialfilter"]
["2 Gebäude","247.3","      .2 Energierückgewinnung"]
["2 Gebäude","247.4","      .4 Schutzraumbelüftungen"]
["2 Gebäude","247.5","      .5 Spezielle Kaminanlagen"]
["2 Gebäude","247.6","      .6 Spezielle Energieerzeugung"]
[null,"247.7"]
[null,"247.8"]
[null,"247.9"]
["2 Gebäude","248","248 Dämmungen HLK-Installationen"]
["2 Gebäude","249","249 Übriges"]
["2 Gebäude"]
["2 Gebäude","25","25 Sanitäranlagen"]
["2 Gebäude","250","250 Übergangsposition"]
["2 Gebäude","251","251 Allgemeine Sanitärapparate"]
["2 Gebäude","251.0","      .0 Lieferung"]
["2 Gebäude","251.1","      .1 Montage"]
[null,"251.2"]
[null,"251.3"]
[null,"251.4"]
[null,"251.5"]
[null,"251.6"]
[null,"251.7"]
[null,"251.8"]
[null,"251.9"]
["2 Gebäude","252","252 Spezielle Sanitärapparate"]
["2 Gebäude","253","253 Sanitäre Ver- und Entsorgungsapparate"]
["2 Gebäude","254","254 Sanitärleitungen"]
["2 Gebäude","255","255 Dämmungen Sanitärinstallationen"]
["2 Gebäude","256","256 Sanitärinstallationselemente"]
["2 Gebäude","257","257 Elektro- und Pneumatiktafeln"]
["2 Gebäude","258","258 Kücheneinrichtungen"]
["2 Gebäude","259","259 Übriges"]
["2 Gebäude"]
["2 Gebäude","26","26 Transportanlagen"]
["2 Gebäude","260","260 Übergangsposition"]
["2 Gebäude","261","261 Aufzüge"]
["2 Gebäude","262","262 Fahrtreppen, Fahrsteige"]
["2 Gebäude","263","263 Fassadenreinigungsanlagen"]
["2 Gebäude","264","264 Sonstige Förderanlagen"]
["2 Gebäude","265","265 Hebeeinrichtungen"]
["2 Gebäude","266","266 Parkieranlagen"]
[null,"267"]
[null,"268"]
["2 Gebäude","269","269 Übriges"]
["2 Gebäude"]
["2 Gebäude","27","27 Ausbau 1"]
["2 Gebäude","270","270 Übergangsposition"]
["2 Gebäude","271","271 Gipserarbeiten"]
["2 Gebäude","271.0","      .0 Verputzarbeiten (innere)"]
["2 Gebäude","271.1","      .1 Spezielle Gipserarbeiten"]
["2 Gebäude","271.2","      .2 Gerüste"]
[null,"271.3"]
[null,"271.4"]
[null,"271.5"]
[null,"271.6"]
[null,"271.7"]
[null,"271.8"]
[null,"271.9"]
["2 Gebäude","272","272 Metallbauarbeiten"]
["2 Gebäude","272.0","      .0 Innentüren aus Metall"]
["2 Gebäude","272.1","      .1 Metallbaufertigteile"]
["2 Gebäude","272.2","      .2 Allgemeine Metallbauarbeiten (Schlosserarbeiten)"]
["2 Gebäude","272.3","      .3 Innere Verglasungen aus Metall"]
["2 Gebäude","272.4","      .4 Schutzraumteile"]
[null,"272.5"]
[null,"272.6"]
[null,"272.7"]
[null,"272.8"]
[null,"272.9"]
["2 Gebäude","273","273 Schreinerarbeiten"]
["2 Gebäude","273.0","      .0 Innentüren aus Holz"]
["2 Gebäude","273.1","      .1 Wandschränke, Gestelle und dgl      ."]
["2 Gebäude","273.2","      .2 Innere Verglasungen aus Holz"]
["2 Gebäude","273.3","      .3 Allgemeine Schreinerarbeiten"]
[null,"273.4"]
[null,"273.5"]
[null,"273.6"]
[null,"273.7"]
[null,"273.8"]
[null,"273.9"]
["2 Gebäude","274","274 Spezialverglasungen (innen)"]
["2 Gebäude","275","275 Schliessanlagen"]
["2 Gebäude","276","276 Innere Abschlüsse"]
["2 Gebäude","276.0","      .0 Verdunkelungseinrichtungen"]
["2 Gebäude","276.1","      .1 Bewegliche Gitterabschlüsse (innere)"]
[null,"276.2"]
[null,"276.3"]
[null,"276.4"]
[null,"276.5"]
[null,"276.6"]
[null,"276.7"]
[null,"276.8"]
[null,"276.9"]
["2 Gebäude","277","277 Elementwände"]
["2 Gebäude","277.0","      .0 Versetzbare Elementwände"]
["2 Gebäude","277.1","      .1 Schieb- und Faltwände"]
["2 Gebäude","277.2","      .2 Feststehende Elementwände"]
[null,"277.3"]
[null,"277.4"]
[null,"277.5"]
[null,"277.6"]
[null,"277.7"]
[null,"277.8"]
[null,"277.9"]
["2 Gebäude","279","279 Übriges"]
["2 Gebäude"]
["2 Gebäude","28","28 Ausbau 2"]
["2 Gebäude","280","280 Übergangsposition"]
["2 Gebäude","281","281 Bodenbeläge"]
["2 Gebäude","281.0","      .0 Unterlagsböden"]
["2 Gebäude","281.1","      .1 Fugenlose Bodenbeläge"]
["2 Gebäude","281.2","      .2 Bodenbeläge aus Kunststoffen, Textilien und dgl      ."]
[null,"281.3"]
["2 Gebäude","281.4","      .4 Bodenbeläge aus Naturstein"]
["2 Gebäude","281.5","      .5 Bodenbeläge aus Kunststein"]
["2 Gebäude","281.6","      .6 Bodenbeläge Plattenarbeiten"]
["2 Gebäude","281.7","      .7 Bodenbeläge aus Holz"]
["2 Gebäude","281.8","      .8 Doppelböden"]
["2 Gebäude","281.9","      .9 Sockel"]
["2 Gebäude","282","282 Wandbeläge, Wandbekleidungen"]
["2 Gebäude","282.0","      .0 Fugenlose Wandbeläge"]
["2 Gebäude","282.1","      .1 Tapezierarbeiten"]
["2 Gebäude","282.2","      .2 Wandbekleidungen aus Naturstein"]
["2 Gebäude","282.3","      .3 Wandbekleidungen aus Kunststein"]
["2 Gebäude","282.4","      .4 Wandbeläge Plattenarbeiten"]
["2 Gebäude","282.5","      .5 Wandbekleidungen aus Holz und Holzwerkstoffen"]
["2 Gebäude","282.6","      .6 Wandbekleidungen aus Kunststoffen, Textilien und dgl      ."]
["2 Gebäude","282.7","      .7 Gerüste"]
[null,"282.8"]
[null,"282.9"]
["2 Gebäude","283","283 Deckenbekleidungen"]
["2 Gebäude","283.0","      .0 Gerüste"]
["2 Gebäude","283.1","      .1 Deckenbekleidungen aus Metall: Platten"]
["2 Gebäude","283.2","      .2 Deckenbekleidungen aus Gips"]
["2 Gebäude","283.3","      .3 Deckenbekleidungen aus Mineralfasern"]
["2 Gebäude","283.4","      .4 Deckenbekleidungen aus Holz und Holzwerkstoffen"]
["2 Gebäude","283.5","      .5 Deckenbekleidungen aus Kunststoffen, Textilien und dgl      ."]
["2 Gebäude","283.6","      .6 Deckenbekleidungen aus Metall: Paneele und Lamellen"]
["2 Gebäude","283.7","      .7 Deckenbekleidungen aus Metall: Raster"]
[null,"283.8"]
[null,"283.9"]
["2 Gebäude","284","284 Hafnerarbeiten"]
["2 Gebäude","285","285 Innere Oberflächenbehandlungen"]
["2 Gebäude","285.0","      .0 Gerüste"]
["2 Gebäude","285.1","      .1 Innere Malerarbeiten"]
["2 Gebäude","285.2","      .2 Holzschutzarbeiten (innere)"]
["2 Gebäude","285.3","      .3 Holz-Beizarbeiten und -Naturbehandlungen (innere)"]
[null,"285.4"]
[null,"285.5"]
[null,"285.6"]
[null,"285.7"]
[null,"285.8"]
[null,"285.9"]
["2 Gebäude","286","286 Bauaustrocknung"]
["2 Gebäude","287","287 Baureinigung"]
["2 Gebäude","288","288 Gärtnerarbeiten (Gebäude)"]
["2 Gebäude","289","289 Übriges"]
["2 Gebäude"]
["2 Gebäude","29","29 Honorare"]
["2 Gebäude","290","290 Übergangsposition"]
["2 Gebäude","291","291 Architekt"]
["2 Gebäude","292","292 Bauingenieur"]
["2 Gebäude","293","293 Elektroingenieur"]
["2 Gebäude","294","294 HLK-Ingenieur"]
["2 Gebäude","295","295 Sanitäringenieur"]
["2 Gebäude","296","296 Spezialisten"]
["2 Gebäude","296.0","      .0 Geometer"]
[null,"296.1"]
["2 Gebäude","296.2","      .2 Innenarchitekt"]
["2 Gebäude","296.3","      .3 Bauphysiker"]
["2 Gebäude","296.4","      .4 Akustiker"]
["2 Gebäude","296.5","      .5 Landschaftsarchitekt"]
["2 Gebäude","296.6","      .6 Bauökonom"]
["2 Gebäude","296.7","      .7 Prüfingenieur"]
[null,"296.8"]
[null,"296.9"]
[null,"297"]
["2 Gebäude","298","298 Gebäudeautomationsingenieur"]
["2 Gebäude","299","299 Übriges"]
["2 Gebäude"]
[]
["3 Betriebseinrichtungen"]
[null,"3","Betriebseinrichtungen"]
["3 Betriebseinrichtungen","30","30 Baugrube"]
["3 Betriebseinrichtungen","300","300 Übergangsposition"]
["3 Betriebseinrichtungen","301","301 Baugrubenaushub"]
[null,"302"]
[null,"303"]
[null,"304"]
[null,"305"]
[null,"306"]
[null,"307"]
[null,"308"]
["3 Betriebseinrichtungen","309","309 Übriges"]
["3 Betriebseinrichtungen"]
["3 Betriebseinrichtungen","31","31 Rohbau 1"]
[null,"310"]
["3 Betriebseinrichtungen","311","311 Baumeisterarbeiten"]
["3 Betriebseinrichtungen","311.0","      .0 Baustelleneinrichtung"]
["3 Betriebseinrichtungen","311.1","      .1 Gerüste"]
[null,"311.2"]
["3 Betriebseinrichtungen","311.3","      .3 Baumeisteraushub"]
["3 Betriebseinrichtungen","311.4","      .4 Kanalisationen im Gebäude"]
["3 Betriebseinrichtungen","311.5","      .5 Beton- und Stahlbetonarbeiten"]
["3 Betriebseinrichtungen","311.6","      .6 Maurerarbeiten"]
["3 Betriebseinrichtungen","311.7","      .7 Instandsetzungsarbeiten"]
[null,"311.8"]
[null,"311.9"]
["3 Betriebseinrichtungen","312","312 Montagebau in Beton und vorfabriziertem Mauerwerk"]
["3 Betriebseinrichtungen","313","313 Montagebau in Stahl"]
["3 Betriebseinrichtungen","314","314 Montagebau in Holz"]
["3 Betriebseinrichtungen","315","315 Montagebau als Leichtkonstruktionen"]
["3 Betriebseinrichtungen","316","316 Natur- und Kunststeinarbeiten"]
["3 Betriebseinrichtungen","317","317 Schutzraumabschlüsse"]
[null,"318"]
["3 Betriebseinrichtungen","319","319 Übriges"]
["3 Betriebseinrichtungen"]
["3 Betriebseinrichtungen","32","32 Rohbau 2"]
["3 Betriebseinrichtungen","320","320 Übergansposition"]
["3 Betriebseinrichtungen","321","321 Fenster, Aussentüren, Tore"]
["3 Betriebseinrichtungen","322","322 Spenglerarbeiten"]
["3 Betriebseinrichtungen","323","323 Blitzschutz"]
["3 Betriebseinrichtungen","324","324 Bedachungsarbeiten"]
["3 Betriebseinrichtungen","325","325 Spezielle Dichtungen und Dämmungen"]
["3 Betriebseinrichtungen","326","326 Fassadenputze"]
["3 Betriebseinrichtungen","327","327 Äussere Oberflächenbehandlungen"]
["3 Betriebseinrichtungen","328","328 Äussere Abschlüsse, Sonnenschutz"]
["3 Betriebseinrichtungen","329","329 Übriges"]
["3 Betriebseinrichtungen"]
["3 Betriebseinrichtungen","33","33 Elektroanlagen"]
["3 Betriebseinrichtungen","330","330 Übergangsposition"]
["3 Betriebseinrichtungen","331","331 Apparate Starkstrom"]
["3 Betriebseinrichtungen","332","332 Starkstrominstallationen"]
["3 Betriebseinrichtungen","333","333 Leuchten und Lampen"]
["3 Betriebseinrichtungen","334","334 Energieverbraucher"]
["3 Betriebseinrichtungen","335","335 Apparate Schwachstrom"]
["3 Betriebseinrichtungen","336","336 Schwachstrominstallationen"]
["3 Betriebseinrichtungen","337","337 Gebäudeautomation"]
["3 Betriebseinrichtungen","338","338 Bauprovisorium"]
["3 Betriebseinrichtungen","339","339 Übriges"]
["3 Betriebseinrichtungen"]
["3 Betriebseinrichtungen","34","34 Heizungs-, Lüftungs-, Klima- und Kälteanlagen"]
["3 Betriebseinrichtungen","340","340 Übergangsposition"]
["3 Betriebseinrichtungen","341","341 Zulieferung Energieträger, Lagerung"]
["3 Betriebseinrichtungen","342","342 Wärmeerzeugung"]
["3 Betriebseinrichtungen","343","343 Wärmeverteilung"]
["3 Betriebseinrichtungen","344","344 Lüftungsanlagen"]
["3 Betriebseinrichtungen","345","345 Klimaanlagen"]
["3 Betriebseinrichtungen","346","346 Kälteanlagen"]
["3 Betriebseinrichtungen","347","347 Spezialanlagen"]
["3 Betriebseinrichtungen","348","348 Dämmungen HLK-Installationen"]
["3 Betriebseinrichtungen","349","349 Übriges"]
["3 Betriebseinrichtungen"]
["3 Betriebseinrichtungen","35","35 Sanitäranlagen"]
["3 Betriebseinrichtungen","350","350 Übergangsposition"]
["3 Betriebseinrichtungen","351","351 Allgemeine Sanitärapparate"]
["3 Betriebseinrichtungen","352","352 Spezielle Sanitärapparate"]
["3 Betriebseinrichtungen","353","353 Sanitäre Ver- und Entsorgungsapparate"]
["3 Betriebseinrichtungen","354","354 Sanitärleitungen"]
["3 Betriebseinrichtungen","355","355 Dämmungen Sanitärinstallationen"]
["3 Betriebseinrichtungen","356","356 Sanitärinstallationselemente"]
["3 Betriebseinrichtungen","357","357 Elektro- und Pneumatiktafeln"]
["3 Betriebseinrichtungen","358","358 Kücheneinrichtungen"]
["3 Betriebseinrichtungen","359","359 Übriges"]
["3 Betriebseinrichtungen"]
["3 Betriebseinrichtungen","36","36 Transportanlagen, Lageranlagen"]
["3 Betriebseinrichtungen","360","360 Übergangsposition"]
["3 Betriebseinrichtungen","361","361 Aufzüge"]
["3 Betriebseinrichtungen","362","362 Fahrtreppen, Fahrsteige"]
[null,"363"]
["3 Betriebseinrichtungen","364","364 Sonstige Förderanlagen"]
["3 Betriebseinrichtungen","365","365 Hebeeinrichtungen"]
["3 Betriebseinrichtungen","366","366 Parkieranlagen"]
[null,"367"]
["3 Betriebseinrichtungen","368","368 Sonstige Lageranlagen"]
["3 Betriebseinrichtungen","369","369 Übriges"]
["3 Betriebseinrichtungen"]
["3 Betriebseinrichtungen","37","37 Ausbau 1"]
["3 Betriebseinrichtungen","370","370 Übergangsposition"]
["3 Betriebseinrichtungen","371","371 Gipserarbeiten"]
["3 Betriebseinrichtungen","372","372 Metallbauarbeiten"]
["3 Betriebseinrichtungen","373","373 Schreinerarbeiten"]
["3 Betriebseinrichtungen","374","374 Spezialverglasungen (innere)"]
["3 Betriebseinrichtungen","375","375 Schliessanlagen"]
["3 Betriebseinrichtungen","376","376 Innere Abschlüsse"]
["3 Betriebseinrichtungen","377","377 Elementwände"]
[null,"378"]
["3 Betriebseinrichtungen","379","379 Übriges"]
["3 Betriebseinrichtungen"]
["3 Betriebseinrichtungen","38","38 Ausbau 2"]
["3 Betriebseinrichtungen","380","380 Übergangsposition"]
["3 Betriebseinrichtungen","381","381 Bodenbeläge"]
["3 Betriebseinrichtungen","382","382 Wandbeläge, Wandbekleidungen"]
["3 Betriebseinrichtungen","383","383 Deckenbekleidungen"]
["3 Betriebseinrichtungen","384","384 Hafnerarbeiten"]
["3 Betriebseinrichtungen","385","385 Innere Oberflächenbehandlungen"]
["3 Betriebseinrichtungen","386","386 Bauaustrocknung"]
["3 Betriebseinrichtungen","387","387 Baureinigung"]
["3 Betriebseinrichtungen","388","388 Gärtnerarbeiten (Betriebseinrichtungen)"]
["3 Betriebseinrichtungen","389","389 Übriges"]
["3 Betriebseinrichtungen"]
["3 Betriebseinrichtungen","39","39 Honorare"]
["3 Betriebseinrichtungen","390","390 Übergangsposition"]
["3 Betriebseinrichtungen","391","391 Architekt"]
["3 Betriebseinrichtungen","392","392 Bauingenieur"]
["3 Betriebseinrichtungen","393","393 Elektroingenieur"]
["3 Betriebseinrichtungen","394","394 HLK-Ingenieur"]
["3 Betriebseinrichtungen","395","395 Sanitäringenieur"]
["3 Betriebseinrichtungen","396","396 Spezialisten"]
[null,"397"]
["3 Betriebseinrichtungen","398","398 Gebäudeautomationsingenieur"]
["3 Betriebseinrichtungen","399","399 Übriges"]
["3 Betriebseinrichtungen"]
[]
["4 Umgebung"]
[null,"4","Umgebung"]
["4 Umgebung","40","40 Terraingestaltung"]
["4 Umgebung","400","400 Übergangsposition"]
["4 Umgebung","401","401 Erdbewegungen"]
["4 Umgebung","401.0","      .0 Baustelleneinrichtung"]
["4 Umgebung","401.1","      .1 Erdarbeiten"]
[null,"401.2"]
[null,"401.3"]
[null,"401.4"]
[null,"401.5"]
[null,"401.6"]
[null,"401.7"]
[null,"401.8"]
[null,"401.9"]
[null,"402"]
[null,"403"]
[null,"404"]
[null,"405"]
[null,"406"]
[null,"407"]
[null,"408"]
["4 Umgebung","409","409 Übriges"]
["4 Umgebung"]
["4 Umgebung","41","41 Roh- und Ausbauarbeiten"]
["4 Umgebung","410","410 Übergangsposition"]
["4 Umgebung","411","411 Baumeisterarbeiten"]
["4 Umgebung","411.0","      .0 Baustelleneinrichtung"]
["4 Umgebung","411.1","      .1 Gerüste"]
["4 Umgebung","411.2","      .2 Böschungs-, Uferverbauungen"]
["4 Umgebung","411.3","      .3 Baumeisteraushub"]
["4 Umgebung","411.4","      .4 Kanalisationen ausserhalb Gebäude"]
["4 Umgebung","411.5","      .5 Beton- und Stahlbetonarbeiten"]
["4 Umgebung","411.6","      .6 Maurerarbeiten"]
["4 Umgebung","411.7","      .7 Instandsetzungsarbeiten"]
[null,"411.8"]
[null,"411.9"]
[null,"412"]
["4 Umgebung","413","413 Übriger Rohbau 1"]
[null,"413.1"]
["4 Umgebung","413.2","      .2 Montagebau in Beton und vorfabriziertem Mauerwerk"]
["4 Umgebung","413.3","      .3 Montagebau in Stahl"]
["4 Umgebung","413.4","      .4 Montagebau in Holz"]
["4 Umgebung","413.5","      .5 Montagebau als Leichtkonstruktion"]
["4 Umgebung","413.6","      .6 Natur- und Kunststeinarbeiten"]
["4 Umgebung","413.7","      .7 Schutzraumteile"]
[null,"413.8"]
[null,"413.9"]
["4 Umgebung","414","414 Rohbau 2"]
["4 Umgebung","414.1","      .1 Fenster, Aussentüren, Tore"]
["4 Umgebung","414.2","      .2 Spenglerarbeiten"]
["4 Umgebung","414.3","      .3 Blitzschutz"]
["4 Umgebung","414.4","      .4 Bedachungsarbeiten"]
["4 Umgebung","414.5","      .5 Spezielle Dichtungen und Dämmungen"]
["4 Umgebung","414.6","      .6 Fassadenputze"]
["4 Umgebung","414.7","      .7 Äussere Oberflächenbehandlungen"]
["4 Umgebung","414.8","      .8 Äussere Abschlüsse, Sonnenschutz"]
["4 Umgebung","414.9","      .9 Arealabschlüsse"]
["4 Umgebung","415","415 Ausbau 1"]
["4 Umgebung","415.1","      .1 Gipserarbeiten"]
["4 Umgebung","415.2","      .2 Metallbauarbeiten"]
["4 Umgebung","415.3","      .3 Schreinerarbeiten"]
["4 Umgebung","415.4","      .4 Spezialverglasungen"]
["4 Umgebung","415.5","      .5 Schliessanlagen"]
["4 Umgebung","415.6","      .6 Innere Abschlüsse"]
["4 Umgebung","415.7","      .7 Elementwände"]
[null,"415.8"]
[null,"415.9"]
["4 Umgebung","416","416 Ausbau 2"]
["4 Umgebung","416.1","      .1 Bodenbeläge"]
["4 Umgebung","416.2","      .2 Wandbeläge, Wandbekleidungen"]
["4 Umgebung","416.3","      .3 Deckenbekleidungen"]
["4 Umgebung","416.4","      .4 Hafnerarbeiten"]
["4 Umgebung","416.5","      .5 Innere Oberflächenbehandlungen"]
[null,"416.6"]
[null,"416.7"]
[null,"416.8"]
[null,"416.9"]
[null,"417"]
[null,"418"]
["4 Umgebung","419","419 Übriges"]
["4 Umgebung"]
["4 Umgebung","42","42 Gartenanlagen"]
["4 Umgebung","420","420 Übergangsposition"]
["4 Umgebung","421","421 Gärtnerarbeiten"]
["4 Umgebung","422","422 Einfriedungen"]
["4 Umgebung","423","423 Ausstattungen, Geräte"]
["4 Umgebung","424","424 Spiel- und Sportplätze"]
[null,"425"]
[null,"426"]
[null,"427"]
[null,"428"]
["4 Umgebung","429","429 Übriges"]
["4 Umgebung"]
["4 Umgebung","43","43 Reserve"]
[null,"430"]
[null,"431"]
[null,"432"]
[null,"433"]
[null,"434"]
[null,"435"]
[null,"436"]
[null,"437"]
[null,"438"]
[null,"439"]
["4 Umgebung"]
["4 Umgebung","44","44 Installationen"]
["4 Umgebung","440","440 Übergangsposition"]
[null,"441"]
[null,"442"]
["4 Umgebung","443","443 Elektroanlagen"]
["4 Umgebung","444","444 Heizungs-, Lüftungs-, Klima-, Kälteanlagen"]
["4 Umgebung","445","445 Sanitäranlagen"]
["4 Umgebung","446","446 Transportanlagen"]
[null,"447"]
[null,"448"]
["4 Umgebung","449","449 Übriges"]
["4 Umgebung"]
["4 Umgebung","45","45 Erschliessung durch Leitungen (innerhalb Grundstück)"]
["4 Umgebung","450","450 Übergangsposition"]
["4 Umgebung","451","451 Erdarbeiten"]
["4 Umgebung","452","452 Kanalisationsleitungen"]
["4 Umgebung","453","453 Elektroleitungen"]
["4 Umgebung","454","454 Heizungs-, Lüftungs-, Klima-, Kälteleitungen"]
["4 Umgebung","455","455 Sanitärleitungen"]
["4 Umgebung","456","456 Nebenarbeiten"]
[null,"457"]
[null,"458"]
["4 Umgebung","459","459 Übriges"]
["4 Umgebung"]
["4 Umgebung","46","46 Kleinere Trassenbauten"]
["4 Umgebung","460","460 Übergangsposition"]
["4 Umgebung","461","461 Erd- und Unterbau"]
["4 Umgebung","462","462 Kleine Kunstbauten"]
["4 Umgebung","463","463 Oberbau"]
["4 Umgebung","464","464 Entwässerung"]
["4 Umgebung","465","465 Werkleitungen und Kanalisationen"]
[null,"466"]
[null,"467"]
["4 Umgebung","468","468 Ausbau"]
[null,"469"]
["4 Umgebung"]
["4 Umgebung","47","47 Kleinere Kunstbauten"]
["4 Umgebung","470","470 Übergangsposition"]
["4 Umgebung","471","471 Baugrube"]
["4 Umgebung","472","472 Tragkonstruktion"]
["4 Umgebung","473","473 Oberbau"]
["4 Umgebung","474","474 Entwässerung"]
["4 Umgebung","475","475 Werkleitungen und Kanalisationen"]
[null,"476"]
["4 Umgebung","477","477 Transportanlagen"]
["4 Umgebung","478","478 Ausbau"]
[null,"479"]
["4 Umgebung"]
["4 Umgebung","48","48 Kleinere Untertagbauten"]
["4 Umgebung","480","480 Übergangsposition"]
["4 Umgebung","481","481 Vortrieb"]
["4 Umgebung","482","482 Auskleidung, Gewölbe"]
["4 Umgebung","483","483 Oberbau"]
["4 Umgebung","484","484 Entwässerung und Wasserversorgung"]
["4 Umgebung","485","485 Werkleitungen und Kanalisationen"]
[null,"486"]
["4 Umgebung","487","487 Transportanlagen"]
["4 Umgebung","488","488 Ausbau"]
[null,"489"]
["4 Umgebung"]
["4 Umgebung","49","49 Honorare"]
["4 Umgebung","490","490 Übergangsposition"]
["4 Umgebung","491","491 Architekt"]
["4 Umgebung","492","492 Bauingenieur"]
["4 Umgebung","493","493 Elektroingenieur"]
["4 Umgebung","494","494 HLK-Ingenieur"]
["4 Umgebung","495","495 Sanitäringenieur"]
["4 Umgebung","496","496 Spezialisten"]
["4 Umgebung","496.0","      .0 Geometer"]
["4 Umgebung","496.1","      .1 Geologe, Geotechniker"]
["4 Umgebung","496.2","      .2 Innenarchitekt"]
["4 Umgebung","496.3","      .3 Bauphysiker"]
["4 Umgebung","496.4","      .4 Akustiker"]
["4 Umgebung","496.5","      .5 Landschaftsarchitekt"]
["4 Umgebung","496.6","      .6 Bauökonom"]
[null,"496.7"]
[null,"496.8"]
[null,"496.9"]
[null,"497"]
["4 Umgebung","498","498 Gebäudeautomationsingenieur"]
["4 Umgebung","499","499 Übriges"]
["4 Umgebung"]
[]
["5 Baunebenkosten und Übergangskonten"]
[null,"5","Baunebenkosten und Übergangskonten"]
["5 Baunebenkosten und Übergangskonten","50","50 Wettbewerbskosten"]
["5 Baunebenkosten und Übergangskonten","500","500 Übergangsposition"]
["5 Baunebenkosten und Übergangskonten","501","501 Architekturwettbewerbe"]
["5 Baunebenkosten und Übergangskonten","502","502 Ingenieurwettbewerbe"]
["5 Baunebenkosten und Übergangskonten","503","503 Wettbewerbe für Umgebungsgestaltung"]
["5 Baunebenkosten und Übergangskonten","504","504 Wettbewerbe für künstlerische Gestaltung"]
["5 Baunebenkosten und Übergangskonten","505","505 Städtebaulicher Wettbewerb"]
["5 Baunebenkosten und Übergangskonten","506","506 Innenarchitekturwettbewerb"]
[null,"507"]
[null,"508"]
["5 Baunebenkosten und Übergangskonten","509","509 Übriges"]
["5 Baunebenkosten und Übergangskonten"]
["5 Baunebenkosten und Übergangskonten","51","51 Bewilligungen, Gebühren"]
["5 Baunebenkosten und Übergangskonten","510","510 Übergangsposition"]
["5 Baunebenkosten und Übergangskonten","511","511 Bewilligungen, Baugespann (Gebühren)"]
["5 Baunebenkosten und Übergangskonten","512","512 Anschlussgebühren"]
["5 Baunebenkosten und Übergangskonten","512.0","      .0 Kanalisation"]
["5 Baunebenkosten und Übergangskonten","512.1","      .1 Elektrizität"]
["5 Baunebenkosten und Übergangskonten","512.2","      .2 Übermittlung"]
["5 Baunebenkosten und Übergangskonten","512.3","      .3 Gas"]
["5 Baunebenkosten und Übergangskonten","512.4","      .4 Wasser"]
["5 Baunebenkosten und Übergangskonten","512.5","      .5 Fernheizung"]
["5 Baunebenkosten und Übergangskonten","512.6","      .6 Medien"]
[null,"512.7"]
[null,"512.8"]
[null,"512.9"]
[null,"513"]
[null,"514"]
[null,"515"]
[null,"516"]
[null,"517"]
[null,"518"]
["5 Baunebenkosten und Übergangskonten","519","519 Übriges"]
["5 Baunebenkosten und Übergangskonten","519.1","      .1 Schutzraumersatzabgaben"]
["5 Baunebenkosten und Übergangskonten","52","52 Muster, Modelle, Vervielfältigungen, Dokumentation"]
["5 Baunebenkosten und Übergangskonten","520","520 Übergangsposition"]
["5 Baunebenkosten und Übergangskonten","521","521 Muster, Materialprüfungen"]
["5 Baunebenkosten und Übergangskonten","521.0","      .0 Muster"]
["5 Baunebenkosten und Übergangskonten","521.1","      .1 Materialprüfungen"]
[null,"521.2"]
[null,"521.3"]
[null,"521.4"]
[null,"521.5"]
[null,"521.6"]
[null,"521.7"]
[null,"521.8"]
[null,"521.9"]
["5 Baunebenkosten und Übergangskonten","522","522 Modelle"]
["5 Baunebenkosten und Übergangskonten","523","523 Fotos"]
["5 Baunebenkosten und Übergangskonten","524","524 Vervielfältigungen, Plankopien"]
["5 Baunebenkosten und Übergangskonten","525","525 Dokumentation"]
[null,"526"]
[null,"527"]
[null,"528"]
["5 Baunebenkosten und Übergangskonten","529","529 Übriges"]
["5 Baunebenkosten und Übergangskonten"]
["5 Baunebenkosten und Übergangskonten","53","53 Versicherungen"]
["5 Baunebenkosten und Übergangskonten","530","530 Übergangsposition"]
["5 Baunebenkosten und Übergangskonten","531","531 Bauzeitversicherungen"]
["5 Baunebenkosten und Übergangskonten","532","532 Spezialversicherungen"]
["5 Baunebenkosten und Übergangskonten","533","533 Selbstbehalt in Schadenfällen während der Bauzeit"]
[null,"534"]
[null,"535"]
[null,"536"]
[null,"537"]
[null,"538"]
["5 Baunebenkosten und Übergangskonten","539","539 Übriges"]
["5 Baunebenkosten und Übergangskonten"]
["5 Baunebenkosten und Übergangskonten","54","54 Finanzierung ab Baubeginn"]
["5 Baunebenkosten und Übergangskonten","540","540 Übergangsposition"]
["5 Baunebenkosten und Übergangskonten","541","541 Errichten von Hypotheken auf Liegenschaften"]
["5 Baunebenkosten und Übergangskonten","542","542 Baukreditzinsen, Bankspesen"]
["5 Baunebenkosten und Übergangskonten","543","543 Baurechtszinsen"]
[null,"544"]
["5 Baunebenkosten und Übergangskonten","545","545 Eigenkapitalzinsen"]
["5 Baunebenkosten und Übergangskonten","546","546 Liegenschaftensteuer während der Bauzeit"]
[null,"547"]
["5 Baunebenkosten und Übergangskonten","548","548 Rückvergütungen"]
["5 Baunebenkosten und Übergangskonten","549","549 Übriges"]
["5 Baunebenkosten und Übergangskonten"]
["5 Baunebenkosten und Übergangskonten"]
["5 Baunebenkosten und Übergangskonten","55","55 Bauherrenleistungen"]
["5 Baunebenkosten und Übergangskonten","550","550 Übergangsposition"]
[null,"551"]
[null,"552"]
[null,"553"]
[null,"554"]
[null,"555"]
[null,"556"]
["5 Baunebenkosten und Übergangskonten","557","557 Betriebsplanung"]
["5 Baunebenkosten und Übergangskonten","558","558 Projektleitung, Projektbegleitung"]
["5 Baunebenkosten und Übergangskonten","559","559 Übriges"]
["5 Baunebenkosten und Übergangskonten"]
["5 Baunebenkosten und Übergangskonten","56","56 Übrige Baunebenkosten"]
["5 Baunebenkosten und Übergangskonten","560","560 Übergangsposition"]
["5 Baunebenkosten und Übergangskonten","561","561 Bewachung durch Dritte"]
["5 Baunebenkosten und Übergangskonten","562","562 Nachbar- und Mieterentschädigungen, Nutzerkosten"]
["5 Baunebenkosten und Übergangskonten","563","563 Miete von fremdem Grund"]
["5 Baunebenkosten und Übergangskonten","564","564 Gutachten"]
["5 Baunebenkosten und Übergangskonten","565","565 Reisespesen"]
["5 Baunebenkosten und Übergangskonten","566","566 Grundsteinlegung, Aufrichte, Einweihung"]
["5 Baunebenkosten und Übergangskonten","567","567 Anwaltskosten, Gerichtskosten"]
["5 Baunebenkosten und Übergangskonten","568","568 Baureklame"]
["5 Baunebenkosten und Übergangskonten","569","569 Übriges"]
["5 Baunebenkosten und Übergangskonten"]
["5 Baunebenkosten und Übergangskonten","57","57 Mehrwertsteuer (MWSt)"]
["5 Baunebenkosten und Übergangskonten","570","570 Übergangsposition (MWSt)"]
["5 Baunebenkosten und Übergangskonten","571","571 Grundstück (MWSt)"]
["5 Baunebenkosten und Übergangskonten","572","572 Vorbereitungsarbeiten (MWSt)"]
["5 Baunebenkosten und Übergangskonten","573","573 Gebäude (MWSt)"]
["5 Baunebenkosten und Übergangskonten","574","574 Betriebseinrichtungen (MWSt)"]
["5 Baunebenkosten und Übergangskonten","575","575 Umgebung (MWSt)"]
["5 Baunebenkosten und Übergangskonten","576","576 Baunebenkosten und Übergangskosten (MWSt)"]
[null,"577"]
[null,"578"]
["5 Baunebenkosten und Übergangskonten","579","579 Ausstattung (MWSt)"]
["5 Baunebenkosten und Übergangskonten"]
["5 Baunebenkosten und Übergangskonten","58","58 Übergangskonten für Rückstellungen und Reserven"]
["5 Baunebenkosten und Übergangskonten","580","580 Übergangsposition"]
["5 Baunebenkosten und Übergangskonten","581","581 Rückstellungen für zu erwartende Kosten"]
["5 Baunebenkosten und Übergangskonten","582","582 Reserven für Teuerung"]
["5 Baunebenkosten und Übergangskonten","583","583 Reserven für Unvorhergesehenes"]
[null,"584"]
[null,"585"]
[null,"586"]
[null,"587"]
[null,"588"]
["5 Baunebenkosten und Übergangskonten","589","589 Übriges"]
["5 Baunebenkosten und Übergangskonten"]
["5 Baunebenkosten und Übergangskonten","59","59 Übergangskonten für Honorare"]
["5 Baunebenkosten und Übergangskonten","590","590 Übergangsposition"]
["5 Baunebenkosten und Übergangskonten","591","591 Architekt"]
["5 Baunebenkosten und Übergangskonten","592","592 Bauingenieur"]
["5 Baunebenkosten und Übergangskonten","593","593 Elektroingenieur"]
["5 Baunebenkosten und Übergangskonten","594","594 HLK-Ingenieur"]
["5 Baunebenkosten und Übergangskonten","595","595 Sanitäringenieur"]
["5 Baunebenkosten und Übergangskonten","596","596 Spezialisten"]
["5 Baunebenkosten und Übergangskonten","596.0","      .0 Geometer"]
["5 Baunebenkosten und Übergangskonten","596.1","      .1 Geologe, Geotechniker"]
["5 Baunebenkosten und Übergangskonten","596.2","      .2 Innenarchitekt"]
["5 Baunebenkosten und Übergangskonten","596.3","      .3 Bauphysiker"]
["5 Baunebenkosten und Übergangskonten","596.4","      .4 Akustiker"]
["5 Baunebenkosten und Übergangskonten","596.5","      .5 Landschaftsarchitekt"]
["5 Baunebenkosten und Übergangskonten","596.6","      .6 Bauökonom"]
[null,"596.7"]
[null,"596.8"]
[null,"596.9"]
[null,"597"]
["5 Baunebenkosten und Übergangskonten","598","598 Gebäudeautomationsingenieur"]
["5 Baunebenkosten und Übergangskonten","599","599 Übriges"]
["5 Baunebenkosten und Übergangskonten"]
[]
["6-8 Reserve"]
[null,"6","Reserve"]
[null,"60"]
[null,"600"]
[null,"601"]
[null,"602"]
[null,"603"]
[null,"604"]
[null,"605"]
[null,"606"]
[null,"607"]
[null,"608"]
[null,"609"]
[null,"7","Reserve"]
[null,"70"]
[null,"700"]
[null,"701"]
[null,"702"]
[null,"703"]
[null,"704"]
[null,"705"]
[null,"706"]
[null,"707"]
[null,"708"]
[null,"709"]
[null,"8","Reserve"]
[null,"80"]
[null,"800"]
[null,"801"]
[null,"802"]
[null,"803"]
[null,"804"]
[null,"805"]
[null,"806"]
[null,"807"]
[null,"808"]
[null,"809"]
[]
["9 Ausstattung"]
[null,"9","Ausstattung"]
["9 Ausstattung","90","90 Möbel"]
["9 Ausstattung","900","900 Übergangsposition"]
["9 Ausstattung","901","901 Garderobeneinrichtungen, Gestelle und dgl."]
["9 Ausstattung","902","902 Sporteinrichtungen"]
[null,"902.0"]
["9 Ausstattung","902.1","      .1 Sporthallen"]
["9 Ausstattung","902.2","      .2 Krafträume"]
["9 Ausstattung","902.3","      .3 Gymnastikräume"]
[null,"902.4"]
[null,"902.5"]
[null,"902.6"]
[null,"902.7"]
[null,"902.8"]
[null,"902.9"]
[null,"903"]
[null,"904"]
[null,"905"]
[null,"906"]
[null,"907"]
["9 Ausstattung","908","908 Schutzraumausstattungen"]
["9 Ausstattung","909","909 Übriges"]
["9 Ausstattung"]
["9 Ausstattung","91","91 Beleuchtungskörper"]
["9 Ausstattung","910","910 Übergangsposition"]
[null,"911"]
[null,"912"]
[null,"913"]
[null,"914"]
[null,"915"]
[null,"916"]
[null,"917"]
[null,"918"]
["9 Ausstattung","919","919 Übriges"]
["9 Ausstattung"]
["9 Ausstattung","92","92 Textilien"]
["9 Ausstattung","920","920 Übergangsposition"]
["9 Ausstattung","921","921 Vorhänge und Innendekorationsarbeiten"]
[null,"922"]
[null,"923"]
[null,"924"]
[null,"925"]
[null,"926"]
[null,"927"]
[null,"928"]
["9 Ausstattung","929","929 Übriges"]
["9 Ausstattung"]
["9 Ausstattung","93","93 Geräte, Apparate"]
["9 Ausstattung","930","930 Übergangsposition"]
[null,"931"]
[null,"932"]
[null,"933"]
[null,"934"]
[null,"935"]
[null,"936"]
[null,"937"]
[null,"938"]
["9 Ausstattung","939","939 Übriges"]
["9 Ausstattung"]
["9 Ausstattung","94","94 Kleininventar"]
["9 Ausstattung","940","940 Übergangsposition"]
[null,"941"]
[null,"942"]
[null,"943"]
[null,"944"]
[null,"945"]
[null,"946"]
[null,"947"]
[null,"948"]
[null,"949","949 Übriges"]
["9 Ausstattung"]
["9 Ausstattung","95","95 Reserve"]
[null,"950"]
[null,"951"]
[null,"952"]
[null,"953"]
[null,"954"]
[null,"955"]
[null,"956"]
[null,"957"]
[null,"958"]
[null,"959"]
["9 Ausstattung"]
["9 Ausstattung","96","96 Transportmittel"]
["9 Ausstattung","960","960 Übergangsposition"]
[null,"961"]
[null,"962"]
[null,"963"]
[null,"964"]
[null,"965"]
[null,"966"]
[null,"967"]
[null,"968"]
["9 Ausstattung","969","969 Übriges"]
["9 Ausstattung"]
["9 Ausstattung","97","97 Verbrauchsmaterial"]
["9 Ausstattung","970","970 Übergangsposition"]
[null,"971"]
[null,"972"]
[null,"973"]
[null,"974"]
[null,"975"]
[null,"976"]
[null,"977"]
[null,"978"]
["9 Ausstattung","979","979 Übriges"]
["9 Ausstattung"]
["9 Ausstattung","98","98 Künstlerischer Schmuck"]
["9 Ausstattung","980","980 Übergangsposition"]
[null,"981"]
[null,"982"]
[null,"983"]
[null,"984"]
[null,"985"]
[null,"986"]
[null,"987"]
[null,"988"]
["9 Ausstattung","989","989 Übriges"]
["9 Ausstattung"]
["9 Ausstattung","99","99 Honorare"]
["9 Ausstattung","990","990 Übergangsposition"]
["9 Ausstattung","991","991 Architekt"]
[null,"992"]
["9 Ausstattung","993","993 Elektroingenieur"]
[null,"994"]
[null,"995"]
["9 Ausstattung","996","996 Spezialisten"]
[null,"996.0"]
[null,"996.1"]
["9 Ausstattung","996.2","      .2 Innenarchitekt"]
[null,"996.3"]
[null,"996.4"]
[null,"996.5"]
["9 Ausstattung","996.6","      .6 Bauökonom"]
[null,"996.7"]
[null,"996.8"]
[null,"996.9"]
[null,"997"]
[null,"998"]
["9 Ausstattung","999","999 Übriges"]
["9 Ausstattung"]

{"sheet":"eBKP-H","index":10,"n_rows":361,"n_cols":3,"rows_kept":361,"cut":false,"hidden":false,"merged":[]}
[null,"eBKP-H","Bez. eBKP-H"]
["Spalte1","Spalte2","Spalte3"]
["A","A","Grundstück"]
["A","A0"]
["A","A1","Grundstück Baurecht"]
["A","A1.1","Grundstückserwerb"]
["A","A1.2","Baurechtserwerb"]
["A","A1.3","Bauwerkserwerb"]
["A","A1.4","Perimeterbeitrag"]
["A","A2","Nebenkosten zu Grundstück Baurecht"]
["A","A2.1","Handänderungssteuer, Gewinnsteuer"]
["A","A2.2","Notariatskosten"]
["A","A2.3","Grundbuchgebühren"]
["A","A2.4","Anwaltskosten, Gerichtskosten"]
["A","A2.5","Vermittlungsprovision"]
["A","A2.6","Abfindung, Servitut"]
["A","A2.7","Vermessung, Vermarkung"]
["B","B","Vorbereitung"]
["B","B0"]
["B","B1","Untersuchung, Aufnahme, Messung"]
["B","B1.1","Baugrunduntersuchung"]
["B","B1.2","Bestandsaufnahme"]
["B","B1.3","Umweltmessung"]
["B","B1.4","Überwachung"]
["B","B2","Baustelleneinrichtung"]
["B","B2.1","Baustellenerschliessung"]
["B","B2.2","Versorgung, Entsorgung"]
["B","B2.3","Arbeitsraum, Aufenthaltsraum"]
["B","B2.4","Hebe-, Verlade-, Transport-, Lagereinrichtung"]
["B","B2.5","Einrichtung für Materialaufbereitung"]
["B","B2.6","Winterbaumassnahme"]
["B","B3","Provisorium"]
["B","B3.1","Provisorisches Rückhaltesystem"]
["B","B3.2","Provisorische Werkleitung"]
["B","B3.3","Provisorisches Gebäude"]
["B","B3.4","Provisorisches Verkehrsanlage"]
["B","B3.5","Provisorische Ausstattung"]
["B","B4","Erschliessung durch Werkleitungen"]
["B","B4.1","Kanalisationsleitung"]
["B","B4.2","Elektroleitung"]
["B","B4.3","Telekomunikationsleitung"]
["B","B4.4","Heizleitung, Kälteleitung"]
["B","B4.5","Wasserleitung"]
["B","B4.6","Gasleitung"]
["B","B5","Rückbau Entsorgung Bauwerk"]
["B","B5.1","Rückbau nicht kontaminiertes Bauwerk"]
["B","B5.2","Rückbau kontaminiertes Bauwerk"]
["B","B6","Baugrube"]
["B","B6.1","Abholzung, Rodung"]
["B","B6.2","Nicht kontaminierter Aushub"]
["B","B6.3","Kontaminierter Aushub"]
["B","B6.4","Böschungssicherung"]
["B","B6.5","Baugrubenabschluss"]
["B","B6.6","Materialeinbau"]
["B","B6.7","Wasserhaltung"]
["B","B7","Baugrundverbesserung, Bauwerkssicherung"]
["B","B7.1","Verbesserung von Baugründen"]
["B","B7.2","Pfählung"]
["B","B7.3","Unterfangung Bauwerk"]
["B","B7.4","Sicherung Bauwerk"]
["B","B8","Gerüst"]
["B","B8.1","Fassadengerüst"]
["B","B8.2","Arbeitsgerüst"]
["C","C","Konstruktion Gebäude"]
["C","C0"]
["C","C1","Bodenplatte, Fundament"]
["C","C1.1","Kanalisation Gebäude"]
["C","C1.2","Abdichtung, Dämmung Bodenplatte"]
["C","C1.3","Einzel-, Streifenfundament"]
["C","C1.4","Nicht tragende Bodenplatte"]
["C","C1.5","Tragende Bodenplatte"]
["C","C2","Wandkonstruktion"]
["C","C2.1","Aussenwandkonstruktion"]
["C","C2.2","Innenwandkonstruktion"]
["C","C3","Stützenkonstruktion"]
["C","C3.1","Aussenstütze"]
["C","C3.2","innenstütze"]
["C","C4","Decken-, Dachkonstruktion"]
["C","C4.1","Decke"]
["C","C4.2","Treppe, Rampe"]
["C","C4.3","Balkon"]
["C","C4.4","Dachkonstruktion"]
["C","C5","Ergänzende Leistungen zu Konstruktion"]
["C","C5.1","Durchbruch, Schlitz zu Konstruktion"]
["C","C5.2","Maschinensockel, Einlage"]
["D","D","Technik Gebäude"]
["D","D0"]
["D","D1","Elektroanlage"]
["D","D1.1","Apparat, Anlage Starkstrom"]
["D","D1.2","Installation Starkstrom"]
["D","D1.3","Leuchte"]
["D","D1.4","Elektrogerät"]
["D","D1.5","Apparat, Anlage Schwachstrom"]
["D","D1.6","Installation Schwachstrom"]
["D","D2","Automations-, Leit-, Komunikationssystem"]
["D","D2.1","Managementebene"]
["D","D2.2","Automationsebene"]
["D","D2.3","Feldebene"]
["D","D2.4","Raumautomation"]
["D","D2.5","Automationsnetzwerk"]
["D","D2.6","Schaltgerätekompination"]
["D","D2.7","Integration"]
["D","D3","Sicherheitssystem"]
["D","D3.1","Einbruch-, Überfallmeldeanlage"]
["D","D3.2","Zutrittskontrollanlage"]
["D","D3.3","Videoüberwachungsanlage"]
["D","D3.4","Perimeterschutz, Umgebungsschutz"]
["D","D4","Brandschutz"]
["D","D4.1","Brandmeldeanlage"]
["D","D4.2","Gasmeldeanlage"]
["D","D4.3","Nasslöschanlage"]
["D","D4.4","Trockenlöschanlage"]
["D","D4.5","Löschgerät"]
["D","D4.6","Rauch- und Wärmeabzugsanlage"]
["D","D5","Wärmeanlage"]
["D","D5.1","Lagerung zu Wärmeanlage"]
["D","D5.2","Wärmeerzeugung"]
["D","D5.3","Wärmehauptverteilung"]
["D","D5.4","Wärmeabgabe"]
["D","D6","Kälteanlage"]
["D","D6.1","Lagerung zu Kälteanlage"]
["D","D6.2","Kälteerzeugung"]
["D","D6.3","Kältehauptverteilung"]
["D","D6.4","Kälteabgabe"]
["D","D7","Lufttechnische Anlage"]
["D","D7.1","Aussenluftführung, Fortluftführung"]
["D","D7.2","Luftaufbereitung"]
["D","D7.3","Lufthauptverteilung"]
["D","D7.4","Luftabgabe"]
["D","D7.5","Kleinanlage für Zuluft, Abluft"]
["D","D8","Wasser,- Gas,- Druckluftanlage"]
["D","D8.1","Armatur, Apparat"]
["D","D8.2","Installationselement"]
["D","D8.3","Wasseraufbereitungsanlage, Abwasseraufbereitungsanlage"]
["D","D8.4","Versorgungsleitungen"]
["D","D8.5","Entsorgungsleitungen"]
["D","D8.6","Gasleitungen"]
["D","D8.7","Druckluftanlage, Vakuumanlage"]
["D","D9","Transportanlage"]
["D","D9.1","Personenaufzug"]
["D","D9.2","Lastenaufzug"]
["D","D9.3","Bettenaufzug"]
["D","D9.4","Fahrtreppe, Fahrsteig"]
["D","D9.5","Hubtisch, Verladestation, Spezialaufzug"]
["D","D9.6","Parkieranlage"]
["D","D9.7","Weitere Transportanlagen"]
["E","E","Äussere Wandbekleidung Gebäude"]
["E","E0"]
["E","E1","Äussere Wandbekleidung unter Terrain"]
["E","E1.1","Wandabdichtung unter Terrain"]
["E","E1.2","Aussenwärmedämmung unter Terrain"]
["E","E1.3","Schutzschicht unter Terrain"]
["E","E2","Äussere Wandbekleidung über Terrain"]
["E","E2.1","Äussere Beschichtung"]
["E","E2.2","Aussenwärmedämmung"]
["E","E2.3","Fassadenbekleidung"]
["E","E2.4","Fassadensystem"]
["E","E2.5","Bekleidung Untersicht"]
["E","E2.6","Absturzsicherung"]
["E","E3","Einbauten, Absturzsicherung zu Aussenwand"]
["E","E3.1","Fenster"]
["E","E3.2","Tür, Tor"]
["E","E3.3","Sonnenschutz"]
["F","F","Bedachung Gebäude"]
["F","F0"]
["F","F1","Dachhaut"]
["F","F1.1","Dachabdichtung unter Terrain"]
["F","F1.2","Flachdach"]
["F","F1.3","Geneites Dach"]
["F","F1.4","Blitzschutz"]
["F","F2","Einbauten, Absturzsicherung zu Dach"]
["F","F2.1","Einbauten zu Flachdach"]
["F","F2.2","Einbauten zu geneigtem Dach"]
["G","G","Ausbau Gebäude"]
["G","G0"]
["G","G1","Trennwand, Tür, Tor, Fenster"]
["G","G1.1","Feststehende Trennwand"]
["G","G1.2","Bewegliche Trennwand"]
["G","G1.3","Innenfenster"]
["G","G1.4","Innentür, innentor"]
["G","G1.5","Verdunklung"]
["G","G2","Bodenbelag"]
["G","G2.1","Unterkonstruktion zu Bodenbelag"]
["G","G2.2","Fertiger Bodenbelag"]
["G","G3","Wand- und Stützenbekleidung"]
["G","G3.1","Unterkonstruktion zu Wandbekleidung"]
["G","G3.2","Fertige Wandbekleidung"]
["G","G4","Decken- und Dachbekleidung"]
["G","G4.1","Unterkonstruktion zu Deckenbekleidung"]
["G","G4.2","Fertige Deckenbekleidung"]
["G","G5","Einbauten, Absturzsicherung zu Ausbau"]
["G","G5.1","Einbauschrank, Regal"]
["G","G5.2","Einbauküche"]
["G","G5.3","Innerer Fensterausbau"]
["G","G5.4","Schutzeinrichtung Umgebung"]
["G","G5.5","Ofen, Cheminèe"]
["G","G5.6","Kleinbauteil"]
["G","G5.7","Begrünung im Gebäude"]
["G","G6","Ergänzende Leistungen zu Ausbau"]
["G","G6.1","Durchbruch, Schlitz zu Ausbau"]
["G","G6.2","Abschottung"]
["G","G6.3","Reinigung"]
["H","H","Nutzunsspezifische Anlage Gebäude"]
["H","H0"]
["H","H1","Produktions-, Laboranlagen"]
["H","H1.1"]
["H","H1.2"]
["H","H1.3"]
["H","H1.4"]
["H","H2","Grossküche"]
["H","H2.1"]
["H","H2.2"]
["H","H2.3"]
["H","H2.4"]
["H","H3","Wäscherei-, Reinigungsanlage"]
["H","H3.1"]
["H","H3.2"]
["H","H3.3"]
["H","H3.4"]
["H","H4","Spitalanlage"]
["H","H4.1"]
["H","H4.2"]
["H","H4.3"]
["H","H4.4"]
["H","H4.5"]
["H","H4.6"]
["H","H4.7"]
["H","H4.8"]
["H","H4.9"]
["H","H4.10"]
["H","H5","Anlage für Bildung, Kultur"]
["H","H5.1"]
["H","H5.2"]
["H","H5.3"]
["H","H5.4"]
["H","H6","Sport-, Freizeitanlage"]
["H","H6.1"]
["H","H6.2"]
["H","H6.3"]
["H","H6.4"]
["H","H7","Weitere nutzungsspezifische Anlagen"]
["H","H7.1"]
["H","H7.2"]
["H","H7.3"]
["H","H7.4"]
["I","I","Umgebung Gebäude"]
["I","I0"]
["I","I1","Umgebungsgestalltung"]
["I","I1.1","Geländeanpassung"]
["I","I1.2","Böschungssicherung Umgebung"]
["I","I1.3","Schutz Pflanzenbestand"]
["I","I1.4","Entwässerung"]
["I","I2","Bauwerk in Umgebung"]
["I","I2.1","Stützmauer"]
["I","I2.2","Frei stehende Wand"]
["I","I2.3","Kleinbauwerk"]
["I","I3","Grünfläche"]
["I","I3.1","Vegetationsschicht"]
["I","I3.2","Rasen"]
["I","I3.3","Bepflanzung"]
["I","I3.4","Wasserfläche"]
["I","I4","Hartfläche"]
["I","I4.1","Fundationsschicht"]
["I","I4.2","Abschluss"]
["I","I4.3","Belag"]
["I","I4.4","Gleisoberbau"]
["I","I5","Schutzeinrichtung Umgebung"]
["I","I5.1","Rückhaltesystem"]
["I","I5.2","Einfriedung"]
["I","I5.3","Immissionsschutz"]
["I","I6","Technik Umgebung"]
["I","I6.1","Elektroanlage Umgebung"]
["I","I6.2","Wärmeanlage Umgebung"]
["I","I6.3","Kälteanlage Umgebung"]
["I","I6.4","Wasser-, Gas-, Druckluftanlage Umgebung"]
["I","I6.5","Transportanlage Umgebung"]
["I","I7","Ausstattung Umgebung"]
["I","I7.1","Ausstattungsgegenstand"]
["I","I7.2","Gerät Umgebung"]
["J","J","Ausstattung Gebäude"]
["J","J0"]
["J","J1","Mobiliar"]
["J","J1.1","Allgemeines Mobiliar"]
["J","J1.2","Nutzungsspezifisches Mobiliar"]
["J","J1.3","Mobile Leuchte"]
["J","J1.4","Signaletik"]
["J","J2","Kleininventar"]
["J","J2.1","Allgemeines Kleininventar"]
["J","J2.2","Nutzungsspezifisches Kleininventar"]
["J","J2.3","Mobiles Gerät"]
["J","J3","Textilien"]
["J","J3.1","Allgemeine Textilien"]
["J","J3.2","Nutzungsspezifische Textilien"]
["J","J4","Kunst am Bau"]
["J","J4.1","Kunstobjekt"]
["J","J4.2","Künstlerisch gestalltetes Bauteil"]
[null,"K"]
[null,"L"]
[null,"M"]
[null,"N"]
[null,"O"]
[null,"P"]
[null,"Q"]
[null,"R"]
[null,"S"]
[null,"T"]
[null,"U"]
["V","V","Planungskosten"]
["V","V0"]
["V","V1","Planer"]
["V","V1.1","Architekt"]
["V","V1.2","Buingenieur"]
["V","V1.3","Fachingenieur Gebäudetechnik"]
["V","V1.4","Spezialist"]
["V","V1.5","Generalplaner, Planergemeinschaft"]
["V","V2","Unternehmer"]
["V","V2.1","Beratung zur Planung"]
["V","V2.2","Vorbereitung zur Bewirtschaftung"]
["V","V3","Auftraggeber"]
["V","V3.1","Auswahlverfahren"]
["V","V3.2","Eigentümer"]
["V","V3.3","Betreiber"]
["V","V3.4","Nutzer"]
["V","V3.5","Berater"]
["W","W","Nebenkosten"]
["W","W0"]
["W","W1","Bewilligung, Gebühren"]
["W","W1.1","Bewilligung, Gebühren"]
["W","W1.2","Gebühr"]
["W","W2","Versicherung, Garantie"]
["W","W2.1","Versicherung"]
["W","W2.2","Garantie"]
["W","W2.3","Rückvergütung"]
["W","W3","Kapitalkosten"]
["W","W3.1","Kapitalkosten zu Grundstück"]
["W","W3.2","Kapitalkosten zu erstellung"]
["W","W4","Bewirtung, Öffentlichkeitsarbeit, Entschädigung"]
["W","W4.1","Bewirtungskosten"]
["W","W4.2","Öffentlichkeitsarbeit"]
["W","W4.3","Entschädigung, Bewachung"]
["W","W5","Inbetriebnahme"]
["W","W5.1","Inbetriebnahme baulicher Anlagen"]
["W","W6","Vermietung, Verkauf"]
["W","W6.1","Vergütung zu Erstvermietung"]
["W","W6.2","Nebenkosten zu Erstvermietung"]
["W","W6.3","Vergütung zu Verkauf"]
["W","W6.4","Nebenkosten zu Verkauf"]
["W","W7","Betriebserfolg"]
["W","W7.1","Betriebsaufwand"]
["W","W7.2","Betriebsertrag"]
[null,"X"]
["Y","Y","Reserve, Teuerung"]
["Y","Y0"]
["Y","Y1","Reserve, Teuerung"]
["Y","Y1.1","Reserve"]
["Y","Y2","Teuerung"]
["Y","Y2.1","Teuerung"]
["Z","Z","Mehrwertsteuer"]
["Z","Z0"]
["Z","Z1","Mehrwertsteuer"]
["Z","Z1.1","Mehrwertsteuer"]

{"sheet":"BKPListe_A","index":11,"n_rows":1384,"n_cols":3,"rows_kept":1384,"cut":false,"hidden":true,"merged":[]}
["0 Grundstück","BKP-Nr.","Bezeichnung"]
[null,"0","Grundstück"]
["0 Grundstück","00","Vorstudien"]
["0 Grundstück","000","Übergangsposition"]
["0 Grundstück","001","Studien zur Grundstückbeurteilung, Machbarkeitsstudie"]
["0 Grundstück","002","Vermessung, Vermarchung"]
["0 Grundstück","003","Geotechnische Gutachten"]
["0 Grundstück","004","Quartierplankosten, Richtplankosten"]
["0 Grundstück","005","Provisorische Baugespanne"]
["0 Grundstück","006","Umweltverträglichkeitsprüfung"]
[null,"007"]
[null,"008"]
["0 Grundstück","009","Übriges"]
["0 Grundstück"]
["0 Grundstück","01","Grundstück- bzw. Baurechterwerb"]
["0 Grundstück","010","Übergangsposition"]
["0 Grundstück","011","Grundstückerwerb"]
["0 Grundstück","012","Baurechterwerb"]
["0 Grundstück","013","Brandmauereinkauf"]
[null,"014"]
[null,"015"]
[null,"016"]
[null,"017"]
["0 Grundstück","018","Sanierung Altlasten"]
["0 Grundstück","019","Übriges"]
["0 Grundstück"]
["0 Grundstück","02","Nebenkosten zu Grundstück- resp. Baurechterwerb"]
["0 Grundstück","020","Übergangsposition"]
["0 Grundstück","021","Handänderungssteuer"]
["0 Grundstück","022","Notariatskosten"]
["0 Grundstück","023","Grundbuchgebühren"]
["0 Grundstück","024","Anwaltskosten, Gerichtskosten"]
["0 Grundstück","025","Vermittlungsprovisionen"]
[null,"026"]
[null,"027"]
[null,"028"]
["0 Grundstück","029","Übriges"]
["0 Grundstück"]
["0 Grundstück","03","Abfindungen, Servitute, Beiträge"]
["0 Grundstück","030","Übergangsposition"]
["0 Grundstück","031","Inkonvenienzentschädigungen"]
["0 Grundstück","032","Abfindungen an Mieter und Pächter"]
["0 Grundstück","033","Errichtung von Servituten"]
["0 Grundstück","034","Ablösung von Servituten"]
["0 Grundstück","035","Wirtschaftspatente"]
["0 Grundstück","036","Beiträge Melioration"]
["0 Grundstück","037","Beiträge Güterzusammenlegung"]
["0 Grundstück","038","Perimeterbeiträge"]
["0 Grundstück","039","Übriges"]
["0 Grundstück"]
["0 Grundstück","04","Finanzierung vor Baubeginn"]
["0 Grundstück","040","Übergangsposition"]
["0 Grundstück","041","Errichten von Hypotheken auf Grundstück"]
["0 Grundstück","042","Hypothekarzinsen"]
["0 Grundstück","043","Baurechtszinsen"]
["0 Grundstück","044","Bankzinsen"]
["0 Grundstück","045","Eigenkapitalzinsen"]
["0 Grundstück","046","Grundstücksteuern"]
[null,"047"]
["0 Grundstück","048","Versicherungen bis Baubeginn"]
["0 Grundstück","049","Übriges"]
["0 Grundstück"]
["0 Grundstück","05","Erschliessung durch Leitungen (ausserhalb Grundstück)"]
["0 Grundstück","050","Übergangsposition"]
["0 Grundstück","051","Erdarbeiten"]
["0 Grundstück","052","Kanalisationsleitungen"]
["0 Grundstück","053","Elektroleitungen"]
["0 Grundstück","054","Heizungs-, Lüftungs-, Klima-, Kälteleitungen"]
["0 Grundstück","055","Sanitärleitungen"]
["0 Grundstück","056","Nebenarbeiten"]
[null,"057"]
[null,"058"]
["0 Grundstück","059","Übriges"]
["0 Grundstück"]
["0 Grundstück","06","Erschliessung durch Verkehrsanlagen ausserhalb Grundstück"]
["0 Grundstück","060","Übergangsposition"]
["0 Grundstück","061","Strassen"]
["0 Grundstück","062","Bahn"]
["0 Grundstück","063","Schiff"]
[null,"064"]
[null,"065"]
[null,"066"]
[null,"067"]
[null,"068"]
["0 Grundstück","069","Übriges"]
["0 Grundstück"]
["0 Grundstück","07","Reserve"]
[null,"070"]
[null,"071"]
[null,"072"]
[null,"073"]
[null,"074"]
[null,"075"]
[null,"076"]
[null,"077"]
[null,"078"]
[null,"079"]
["0 Grundstück"]
["0 Grundstück","08","Reserve"]
[null,"080"]
[null,"081"]
[null,"082"]
[null,"083"]
[null,"084"]
[null,"085"]
[null,"086"]
[null,"087"]
[null,"088"]
[null,"089"]
["0 Grundstück"]
["0 Grundstück","09","Honorare"]
["0 Grundstück","090","Übergangsposition"]
["0 Grundstück","091","Architekt"]
["0 Grundstück","092","Bauingenieur"]
["0 Grundstück","093","Elektroingenieur"]
["0 Grundstück","094","HLK-Ingenieur"]
["0 Grundstück","095","Sanitäringenieur"]
["0 Grundstück","096","Spezialisten"]
["0 Grundstück","096.0","Geometer"]
["0 Grundstück","096.1","Geologe, Geotechniker"]
[null,"096.2"]
[null,"096.3"]
[null,"096.4"]
[null,"096.5"]
["0 Grundstück","096.6","Bauökonom"]
[null,"096.7"]
["0 Grundstück","096.8","Makler"]
[null,"096.9"]
[null,"097"]
[null,"098"]
["0 Grundstück","099","Übriges"]
["0 Grundstück"]
["0 Grundstück"]
["0 Grundstück"]
[]
["1 Vorbereitungsarbeiten"]
[null,"1","Vorbereitungsarbeiten"]
["1 Vorbereitungsarbeiten","10","Bestandesaufnahmen, Baugrunduntersuchungen"]
["1 Vorbereitungsarbeiten","100","Übergangsposition"]
["1 Vorbereitungsarbeiten","101","Bestandesaufnahmen"]
["1 Vorbereitungsarbeiten","102","Baugrunduntersuchungen"]
["1 Vorbereitungsarbeiten","103","Grundwassererhebungen"]
[null,"104"]
[null,"105"]
[null,"106"]
[null,"107"]
[null,"108"]
["1 Vorbereitungsarbeiten","109","Übriges"]
["1 Vorbereitungsarbeiten"]
["1 Vorbereitungsarbeiten","11","Räumungen, Terrainvorbereitungen"]
["1 Vorbereitungsarbeiten","110","Übergangsposition"]
["1 Vorbereitungsarbeiten","111","Rodungen"]
["1 Vorbereitungsarbeiten","112","Abbrüche"]
["1 Vorbereitungsarbeiten","113","Demontagen"]
["1 Vorbereitungsarbeiten","114","Erdbewegungen"]
["1 Vorbereitungsarbeiten","115","Bohr- und Schneidarbeiten"]
["1 Vorbereitungsarbeiten","115.0","Baustelleneinrichtung"]
["1 Vorbereitungsarbeiten","115.1","Erdarbeiten"]
[null,"115.2"]
[null,"115.3"]
[null,"115.4"]
[null,"115.5"]
[null,"115.6"]
[null,"115.7"]
[null,"115.8"]
[null,"115.9"]
[null,"116"]
[null,"117"]
[null,"118"]
["1 Vorbereitungsarbeiten","119","Übriges"]
["1 Vorbereitungsarbeiten"]
["1 Vorbereitungsarbeiten","12","Sicherungen, Provisorien"]
["1 Vorbereitungsarbeiten","120","Übergangsposition"]
["1 Vorbereitungsarbeiten","121","Sicherung vorhandener Anlagen"]
["1 Vorbereitungsarbeiten","122","Provisorien"]
["1 Vorbereitungsarbeiten","123","Unterfangungen"]
["1 Vorbereitungsarbeiten","123.0","Baustelleneinrichtung"]
["1 Vorbereitungsarbeiten","123.1","Gerüste"]
["1 Vorbereitungsarbeiten","123.2","Spezielle Unterfangungsarbeiten"]
["1 Vorbereitungsarbeiten","123.3","Erdarbeiten"]
["1 Vorbereitungsarbeiten","123.4","Kanalisationen"]
["1 Vorbereitungsarbeiten","123.5","Beton- und Stahlbetonarbeiten"]
["1 Vorbereitungsarbeiten","123.6","Maurerarbeiten"]
[null,"123.7"]
[null,"123.8"]
[null,"123.9"]
["1 Vorbereitungsarbeiten","124","Instandsetzungsarbeiten"]
[null,"125"]
[null,"126"]
[null,"127"]
[null,"128"]
["1 Vorbereitungsarbeiten","129","Übriges"]
["1 Vorbereitungsarbeiten"]
["1 Vorbereitungsarbeiten","13","Gemeinsame Baustelleneinrichtung"]
["1 Vorbereitungsarbeiten","130","Übergangsposition"]
["1 Vorbereitungsarbeiten","131","Abschrankungen"]
["1 Vorbereitungsarbeiten","132","Zufahrten, Plätze"]
["1 Vorbereitungsarbeiten","133","Büro Bauleitung"]
["1 Vorbereitungsarbeiten","134","Unterkünfte, Verpflegungseinrichtungen"]
["1 Vorbereitungsarbeiten","135","Provisorische Installationen"]
["1 Vorbereitungsarbeiten","135.0","Kanalisationen"]
["1 Vorbereitungsarbeiten","135.1","Elektro"]
["1 Vorbereitungsarbeiten","135.2","Heizung, Lüftung, Klima, Kälte"]
["1 Vorbereitungsarbeiten","135.3","Wasser"]
["1 Vorbereitungsarbeiten","135.4","Übermittlung"]
[null,"135.5"]
[null,"135.6"]
[null,"135.7"]
[null,"135.8"]
[null,"135.9"]
["1 Vorbereitungsarbeiten","136","Kosten für Energie, Wasser und dgl      ."]
["1 Vorbereitungsarbeiten","137","Provisorische Abschlüsse und Abdeckungen"]
["1 Vorbereitungsarbeiten","138","Bauabfälle Sortierung"]
["1 Vorbereitungsarbeiten","139","Übriges"]
["1 Vorbereitungsarbeiten"]
["1 Vorbereitungsarbeiten","14","Anpassungen an bestehende Bauten"]
["1 Vorbereitungsarbeiten","140","Übergangsposition"]
["1 Vorbereitungsarbeiten","141","Terraingestaltung, Rohbau 1"]
["1 Vorbereitungsarbeiten","141.0","Erdarbeiten"]
["1 Vorbereitungsarbeiten","141.1","Baumeisterarbeiten"]
["1 Vorbereitungsarbeiten","141.2","Montagebau in Beton und vorfabriziertem Mauerwerk"]
["1 Vorbereitungsarbeiten","141.3","Montagebau in Stahl"]
["1 Vorbereitungsarbeiten","141.4","Montagebau in Holz"]
["1 Vorbereitungsarbeiten","141.5","Montagebau als Leichtkonstruktion"]
["1 Vorbereitungsarbeiten","141.6","Natur- und Kunststeinarbeiten"]
["1 Vorbereitungsarbeiten","141.7","Schutzraumabschlüsse"]
[null,"141.8"]
[null,"141.9"]
["1 Vorbereitungsarbeiten","142","Rohbau 2"]
["1 Vorbereitungsarbeiten","142.1","Fenster, Aussentüren, Tore"]
["1 Vorbereitungsarbeiten","142.2","Spenglerarbeiten"]
["1 Vorbereitungsarbeiten","142.3","Blitzschutz"]
["1 Vorbereitungsarbeiten","142.4","Bedachungsarbeiten"]
["1 Vorbereitungsarbeiten","142.5","Spezielle Dichtungen und Dämmungen"]
["1 Vorbereitungsarbeiten","142.6","Fassadenputze"]
["1 Vorbereitungsarbeiten","142.7","Äussere Oberflächenbehandlungen"]
["1 Vorbereitungsarbeiten","142.8","Äussere Abschlüsse, Sonnenschutz"]
[null,"142.9"]
["1 Vorbereitungsarbeiten","143","Elektroanlagen"]
["1 Vorbereitungsarbeiten","144","Heizungs-, Lüftungs-, Klima- und Kälteanlagen"]
["1 Vorbereitungsarbeiten","145","Sanitäranlagen"]
["1 Vorbereitungsarbeiten","146","Transportanlagen"]
["1 Vorbereitungsarbeiten","147","Ausbau 1"]
["1 Vorbereitungsarbeiten","147.1","Gipserarbeiten"]
["1 Vorbereitungsarbeiten","147.2","Metallbauarbeiten"]
["1 Vorbereitungsarbeiten","147.3","Schreinerarbeiten"]
["1 Vorbereitungsarbeiten","147.4","Spezialverglasungen (innere)"]
["1 Vorbereitungsarbeiten","147.5","Schliessanlagen"]
["1 Vorbereitungsarbeiten","147.6","Innere Abschlüsse"]
["1 Vorbereitungsarbeiten","147.7","Elementwände"]
[null,"147.8"]
[null,"147.9"]
["1 Vorbereitungsarbeiten","148","Ausbau 2"]
["1 Vorbereitungsarbeiten","148.1","Bodenbeläge"]
["1 Vorbereitungsarbeiten","148.2","Wandbeläge, Wandbekleidungen"]
["1 Vorbereitungsarbeiten","148.3","Deckenbekleidungen"]
["1 Vorbereitungsarbeiten","148.4","Hafnerarbeiten"]
["1 Vorbereitungsarbeiten","148.5","Innere Oberflächenbehandlungen"]
["1 Vorbereitungsarbeiten","148.6","Bauaustrocknung"]
["1 Vorbereitungsarbeiten","148.7","Baureinigung"]
["1 Vorbereitungsarbeiten","148.8","Gärtnerarbeiten"]
[null,"148.9"]
["1 Vorbereitungsarbeiten","149","Übriges"]
["1 Vorbereitungsarbeiten"]
["1 Vorbereitungsarbeiten","15","Anpassungen an bestehende Erschliessungsleitungen"]
["1 Vorbereitungsarbeiten","150","Übergangsposition"]
["1 Vorbereitungsarbeiten","151","Erdarbeiten"]
["1 Vorbereitungsarbeiten","152","Kanalisationsleitungen"]
["1 Vorbereitungsarbeiten","153","Elektroleitungen"]
["1 Vorbereitungsarbeiten","154","Heizungs-, Lüftungs-, Klima-, Kälteleitungen"]
["1 Vorbereitungsarbeiten","155","Sanitärleitungen"]
["1 Vorbereitungsarbeiten","156","Nebenarbeiten"]
[null,"157"]
[null,"158"]
["1 Vorbereitungsarbeiten","159","Übriges"]
["1 Vorbereitungsarbeiten"]
["1 Vorbereitungsarbeiten","16","Anpassungen an bestehende Verkehrsanlagen"]
["1 Vorbereitungsarbeiten","160","Übergangsposition"]
["1 Vorbereitungsarbeiten","161","Strassen"]
["1 Vorbereitungsarbeiten","162","Bahn"]
["1 Vorbereitungsarbeiten","163","Schiff"]
[null,"164"]
[null,"165"]
[null,"166"]
[null,"167"]
[null,"168"]
["1 Vorbereitungsarbeiten","169","Übriges"]
["1 Vorbereitungsarbeiten"]
["1 Vorbereitungsarbeiten","17","Spezielle Fundationen, Baugrubensicherung, Grundwasserabdichtung"]
["1 Vorbereitungsarbeiten","170","Übergangsposition"]
["1 Vorbereitungsarbeiten","171","Pfähle"]
["1 Vorbereitungsarbeiten","172","Baugrubenabschlüsse"]
["1 Vorbereitungsarbeiten","173","Aussteifungen"]
["1 Vorbereitungsarbeiten","174","Anker"]
["1 Vorbereitungsarbeiten","175","Grundwasserabdichtungen"]
["1 Vorbereitungsarbeiten","176","Wasserhaltung"]
["1 Vorbereitungsarbeiten","176.0","Offene Wasserhaltung"]
["1 Vorbereitungsarbeiten","176.1","Grundwasserabsenkungen"]
[null,"176.2"]
[null,"176.3"]
[null,"176.4"]
[null,"176.5"]
[null,"176.6"]
[null,"176.7"]
[null,"176.8"]
[null,"176.9"]
["1 Vorbereitungsarbeiten","177","Baugrundverbesserungen"]
["1 Vorbereitungsarbeiten","178","Nebenarbeiten"]
["1 Vorbereitungsarbeiten","179","Übriges"]
["1 Vorbereitungsarbeiten"]
["1 Vorbereitungsarbeiten","18","Reserve"]
[null,"180"]
[null,"181"]
[null,"182"]
[null,"183"]
[null,"184"]
[null,"185"]
[null,"186"]
[null,"187"]
[null,"188"]
[null,"189"]
["1 Vorbereitungsarbeiten"]
["1 Vorbereitungsarbeiten","19","Honorare"]
["1 Vorbereitungsarbeiten","190","Übergangsposition"]
["1 Vorbereitungsarbeiten","191","Architekt"]
["1 Vorbereitungsarbeiten","192","Bauingenieur"]
["1 Vorbereitungsarbeiten","193","Elektroingenieur"]
["1 Vorbereitungsarbeiten","194","HLK-Ingenieur"]
["1 Vorbereitungsarbeiten","195","Sanitäringenieur"]
["1 Vorbereitungsarbeiten","196","Spezialisten"]
["1 Vorbereitungsarbeiten","196.0","Geometer"]
["1 Vorbereitungsarbeiten","196.1","Geologe, Geotechniker"]
[null,"196.2"]
[null,"196.3"]
[null,"196.4"]
[null,"196.5"]
["1 Vorbereitungsarbeiten","196.6","Bauökonom"]
[null,"196.7"]
[null,"196.8"]
[null,"196.9"]
[null,"197"]
[null,"198"]
["1 Vorbereitungsarbeiten","199","Übriges"]
["1 Vorbereitungsarbeiten"]
["1 Vorbereitungsarbeiten"]
[]
["2 Gebäude"]
[null,"2","Gebäude"]
["2 Gebäude","20","Baugrube"]
["2 Gebäude","200","Übergangsposition"]
["2 Gebäude","201","Baugrubenaushub"]
["2 Gebäude","201.0","Baustelleneinrichtung"]
["2 Gebäude","201.1","Erdarbeiten"]
[null,"201.2"]
[null,"201.3"]
[null,"201.4"]
[null,"201.5"]
[null,"201.6"]
[null,"201.7"]
[null,"201.8"]
[null,"201.9"]
[null,"202"]
[null,"203"]
[null,"204"]
[null,"205"]
[null,"206"]
[null,"207"]
[null,"208"]
["2 Gebäude","209","Übriges"]
["2 Gebäude"]
["2 Gebäude","21","Rohbau 1"]
["2 Gebäude","210","Übergangsposition"]
["2 Gebäude","211","Baumeisterarbeiten"]
["2 Gebäude","211.0","Baustelleneinrichtung"]
["2 Gebäude","211.1","Gerüste"]
[null,"211.2"]
["2 Gebäude","211.3","Baumeisteraushub"]
["2 Gebäude","211.4","Kanalisationen im Gebäude"]
["2 Gebäude","211.5","Beton- und Stahlbetonarbeiten"]
["2 Gebäude","211.6","Maurerarbeiten"]
["2 Gebäude","211.7","Instandsetzungsarbeiten"]
[null,"211.8"]
[null,"211.9"]
["2 Gebäude","212","Montagebau in Beton und vorfabriziertem Mauerwerk"]
["2 Gebäude","212.0","Baustelleneinrichtung"]
["2 Gebäude","212.1","Gerüste"]
["2 Gebäude","212.2","Elemente aus Beton"]
["2 Gebäude","212.3","Elemente in vorfabriziertem Mauerwerk"]
["2 Gebäude","212.4","Elemente in Porenbeton"]
[null,"212.5"]
[null,"212.6"]
[null,"212.7"]
[null,"212.8"]
[null,"212.9"]
["2 Gebäude","213","Montagebau in Stahl"]
["2 Gebäude","213.0","Baustelleneinrichtung"]
["2 Gebäude","213.1","Gerüste"]
["2 Gebäude","213.2","Stahlkonstruktion"]
[null,"213.3"]
[null,"213.4"]
["2 Gebäude","213.5","Äussere Bekleidungen"]
[null,"213.6"]
[null,"213.7"]
[null,"213.8"]
[null,"213.9"]
["2 Gebäude","214","Montagebau in Holz"]
["2 Gebäude","214.0","Baustelleneinrichtung"]
["2 Gebäude","214.1","Traggerippe (Zimmermanns- konstruktionen)"]
["2 Gebäude","214.2","Traggerippe (Ingenieurholzbau)"]
["2 Gebäude","214.3","Holztafelbau"]
["2 Gebäude","214.4","Äussere Bekleidungen, Gesimse, Treppen"]
["2 Gebäude","214.5","Gerüste"]
["2 Gebäude","214.6","Steildächer, Unterkonstruktion"]
[null,"214.7"]
[null,"214.8"]
[null,"214.9"]
["2 Gebäude","215","Montagebau als Leichtkonstruktionen"]
["2 Gebäude","215.0","Baustelleneinrichtung"]
["2 Gebäude","215.1","Gerüste"]
["2 Gebäude","215.2","Fassadenbau"]
[null,"215.3"]
["2 Gebäude","215.4","Traggerippe"]
["2 Gebäude","215.5","Äussere Bekleidungen"]
[null,"215.6"]
[null,"215.7"]
[null,"215.8"]
[null,"215.9"]
["2 Gebäude","216","Natur- und Kunststeinarbeiten"]
["2 Gebäude","216.0","Natursteinarbeiten"]
["2 Gebäude","216.1","Kunststeinarbeiten"]
[null,"216.2"]
[null,"216.3"]
[null,"216.4"]
[null,"216.5"]
[null,"216.6"]
[null,"216.7"]
[null,"216.8"]
[null,"216.9"]
["2 Gebäude","217","Schutzraumabschlüsse"]
[null,"218"]
["2 Gebäude","219","Übriges"]
["2 Gebäude"]
["2 Gebäude","22","Rohbau 2"]
["2 Gebäude","220","Übergangsposition"]
["2 Gebäude","221","Fenster, Aussentüren, Tore"]
["2 Gebäude","221.0","Fenster aus Holz"]
["2 Gebäude","221.1","Fenster aus Holz/Metall"]
["2 Gebäude","221.2","Fenster aus Kunststoff"]
["2 Gebäude","221.3","Fenster aus Stahl"]
["2 Gebäude","221.4","Fenster aus Aluminium"]
["2 Gebäude","221.5","Aussentüren, Tore aus Holz"]
["2 Gebäude","221.6","Aussentüren, Tore aus Metall"]
["2 Gebäude","221.7","Schaufensteranlagen"]
["2 Gebäude","221.8","Spezielle lichtdurchlässige Bauteile (äussere)"]
["2 Gebäude","221.9","Metallbaufertigteile"]
["2 Gebäude","222","Spenglerarbeiten"]
["2 Gebäude","223","Blitzschutz"]
["2 Gebäude","224","Bedachungsarbeiten"]
["2 Gebäude","224.0","Deckungen (Steildächer)"]
["2 Gebäude","224.1","Plastische und elastische Dichtungsbeläge (Flachdächer)"]
["2 Gebäude","224.2","Glaseinbauten in Steildächern"]
["2 Gebäude","224.3","Glaseinbauten in Flachdächern"]
[null,"224.4"]
[null,"224.5"]
[null,"224.6"]
[null,"224.7"]
[null,"224.8"]
[null,"224.9"]
["2 Gebäude","225","Spezielle Dichtungen und Dämmungen"]
["2 Gebäude","225.0","      .0 Gerüste"]
["2 Gebäude","225.1","      .1 Fugendichtungen"]
["2 Gebäude","225.2","      .2 Spezielle Dämmungen"]
["2 Gebäude","225.3","      .3 Spezielle Feuchtigkeitsabdichtungen"]
["2 Gebäude","225.4","      .4 Brandschutzbekleidungen und dgl      ."]
[null,"225.5"]
[null,"225.6"]
[null,"225.7"]
[null,"225.8"]
[null,"225.9"]
["2 Gebäude","226","Fassadenputze"]
["2 Gebäude","226.0","      .0 Gerüste"]
["2 Gebäude","226.1","      .1 Verputzarbeiten (äussere)"]
["2 Gebäude","226.2","      .2 Verputzte Aussenwärmedämmungen"]
[null,"226.3","      .3 Wärmedämmung im Erdreich"]
[null,"226.4"]
[null,"226.5"]
[null,"226.6"]
[null,"226.7"]
[null,"226.8"]
[null,"226.9"]
["2 Gebäude","227","Äussere Oberflächenbehandlungen"]
["2 Gebäude","227.0","      .0 Gerüste"]
["2 Gebäude","227.1","      .1 Äussere Malerarbeiten"]
["2 Gebäude","227.2","      .2 Holzschutzarbeiten (äussere)"]
["2 Gebäude","227.3","      .3 Holz-Beizarbeiten und -Naturbehandlungen (äussere)"]
[null,"227.4"]
[null,"227.5"]
[null,"227.6"]
[null,"227.7"]
[null,"227.8"]
[null,"227.9"]
["2 Gebäude","228","Äussere Abschlüsse, Sonnenschutz"]
["2 Gebäude","228.0","      .0 Fenster- und Fenstertürläden"]
["2 Gebäude","228.1","      .1 Rollläden"]
["2 Gebäude","228.2","      .2 Lamellenstoren"]
["2 Gebäude","228.3","      .3 Sonnenstoren"]
["2 Gebäude","228.4","      .4 Blendschutzanlagen"]
[null,"228.5"]
["2 Gebäude","228.6","      .6 Bewegliche Gitterabschlüsse (äussere)"]
[null,"228.7"]
[null,"228.8"]
[null,"228.9"]
["2 Gebäude","229","Übriges"]
["2 Gebäude"]
["2 Gebäude","23","Elektroanlagen"]
["2 Gebäude","230","Übergangsposition"]
["2 Gebäude","231","Apparate Starkstrom"]
["2 Gebäude","232","Starkstrominstallationen"]
["2 Gebäude","233","Leuchten und Lampen"]
["2 Gebäude","234","Energieverbraucher"]
["2 Gebäude","235","Apparate Schwachstrom"]
["2 Gebäude","236","Schwachstrominstallationen"]
["2 Gebäude","237","Gebäudeautomation"]
["2 Gebäude","237.0","      .0 Managementebene"]
["2 Gebäude","237.1","      .1 Automationsebene"]
[null,"237.2"]
["2 Gebäude","237.3","      .3 Feldebene"]
[null,"237.4"]
[null,"237.5"]
[null,"237.6"]
["2 Gebäude","237.7","      .7 Schaltgerätekombination SGK"]
[null,"237.8"]
[null,"237.9"]
["2 Gebäude","238","238 Bauprovisorien"]
["2 Gebäude","239","239 Übriges"]
["2 Gebäude"]
["2 Gebäude","24","24 Heizungs-, Lüftungs-, Klimaanlagen"]
["2 Gebäude","240","240 Übergangsposition"]
["2 Gebäude","241","241 Zulieferung Energieträger, Lagerung"]
["2 Gebäude","242","242 Wärmeerzeugung"]
["2 Gebäude","243","243 Wärmeverteilung"]
["2 Gebäude","244","244 Lüftungsanlagen"]
["2 Gebäude","245","245 Klimaanlagen"]
["2 Gebäude","246","246 Kälteanlagen"]
["2 Gebäude","247","247 Spezialanlagen"]
["2 Gebäude","247.0","      .0 Wasseraufbereitung"]
["2 Gebäude","247.1","      .1 Druckluft für Regulierungen"]
["2 Gebäude","247.2","      .2 Spezialfilter"]
["2 Gebäude","247.3","      .2 Energierückgewinnung"]
["2 Gebäude","247.4","      .4 Schutzraumbelüftungen"]
["2 Gebäude","247.5","      .5 Spezielle Kaminanlagen"]
["2 Gebäude","247.6","      .6 Spezielle Energieerzeugung"]
[null,"247.7"]
[null,"247.8"]
[null,"247.9"]
["2 Gebäude","248","248 Dämmungen HLK-Installationen"]
["2 Gebäude","249","249 Übriges"]
["2 Gebäude"]
["2 Gebäude","25","25 Sanitäranlagen"]
["2 Gebäude","250","250 Übergangsposition"]
["2 Gebäude","251","251 Allgemeine Sanitärapparate"]
["2 Gebäude","251.0","      .0 Lieferung"]
["2 Gebäude","251.1","      .1 Montage"]
[null,"251.2"]
[null,"251.3"]
[null,"251.4"]
[null,"251.5"]
[null,"251.6"]
[null,"251.7"]
[null,"251.8"]
[null,"251.9"]
["2 Gebäude","252","252 Spezielle Sanitärapparate"]
["2 Gebäude","253","253 Sanitäre Ver- und Entsorgungsapparate"]
["2 Gebäude","254","254 Sanitärleitungen"]
["2 Gebäude","255","255 Dämmungen Sanitärinstallationen"]
["2 Gebäude","256","256 Sanitärinstallationselemente"]
["2 Gebäude","257","257 Elektro- und Pneumatiktafeln"]
["2 Gebäude","258","258 Kücheneinrichtungen"]
["2 Gebäude","259","259 Übriges"]
["2 Gebäude"]
["2 Gebäude","26","26 Transportanlagen"]
["2 Gebäude","260","260 Übergangsposition"]
["2 Gebäude","261","261 Aufzüge"]
["2 Gebäude","262","262 Fahrtreppen, Fahrsteige"]
["2 Gebäude","263","263 Fassadenreinigungsanlagen"]
["2 Gebäude","264","264 Sonstige Förderanlagen"]
["2 Gebäude","265","265 Hebeeinrichtungen"]
["2 Gebäude","266","266 Parkieranlagen"]
[null,"267"]
[null,"268"]
["2 Gebäude","269","269 Übriges"]
["2 Gebäude"]
["2 Gebäude","27","27 Ausbau 1"]
["2 Gebäude","270","270 Übergangsposition"]
["2 Gebäude","271","271 Gipserarbeiten"]
["2 Gebäude","271.0","      .0 Verputzarbeiten (innere)"]
["2 Gebäude","271.1","      .1 Spezielle Gipserarbeiten"]
["2 Gebäude","271.2","      .2 Gerüste"]
[null,"271.3"]
[null,"271.4"]
[null,"271.5"]
[null,"271.6"]
[null,"271.7"]
[null,"271.8"]
[null,"271.9"]
["2 Gebäude","272","272 Metallbauarbeiten"]
["2 Gebäude","272.0","      .0 Innentüren aus Metall"]
["2 Gebäude","272.1","      .1 Metallbaufertigteile"]
["2 Gebäude","272.2","      .2 Allgemeine Metallbauarbeiten (Schlosserarbeiten)"]
["2 Gebäude","272.3","      .3 Innere Verglasungen aus Metall"]
["2 Gebäude","272.4","      .4 Schutzraumteile"]
[null,"272.5"]
[null,"272.6"]
[null,"272.7"]
[null,"272.8"]
[null,"272.9"]
["2 Gebäude","273","273 Schreinerarbeiten"]
["2 Gebäude","273.0","      .0 Innentüren aus Holz"]
["2 Gebäude","273.1","      .1 Wandschränke, Gestelle und dgl      ."]
["2 Gebäude","273.2","      .2 Innere Verglasungen aus Holz"]
["2 Gebäude","273.3","      .3 Allgemeine Schreinerarbeiten"]
[null,"273.4"]
[null,"273.5"]
[null,"273.6"]
[null,"273.7"]
[null,"273.8"]
[null,"273.9"]
["2 Gebäude","274","274 Spezialverglasungen (innen)"]
["2 Gebäude","275","275 Schliessanlagen"]
["2 Gebäude","276","276 Innere Abschlüsse"]
["2 Gebäude","276.0","      .0 Verdunkelungseinrichtungen"]
["2 Gebäude","276.1","      .1 Bewegliche Gitterabschlüsse (innere)"]
[null,"276.2"]
[null,"276.3"]
[null,"276.4"]
[null,"276.5"]
[null,"276.6"]
[null,"276.7"]
[null,"276.8"]
[null,"276.9"]
["2 Gebäude","277","277 Elementwände"]
["2 Gebäude","277.0","      .0 Versetzbare Elementwände"]
["2 Gebäude","277.1","      .1 Schieb- und Faltwände"]
["2 Gebäude","277.2","      .2 Feststehende Elementwände"]
[null,"277.3"]
[null,"277.4"]
[null,"277.5"]
[null,"277.6"]
[null,"277.7"]
[null,"277.8"]
[null,"277.9"]
["2 Gebäude","279","279 Übriges"]
["2 Gebäude"]
["2 Gebäude","28","28 Ausbau 2"]
["2 Gebäude","280","280 Übergangsposition"]
["2 Gebäude","281","281 Bodenbeläge"]
["2 Gebäude","281.0","      .0 Unterlagsböden"]
["2 Gebäude","281.1","      .1 Fugenlose Bodenbeläge"]
["2 Gebäude","281.2","      .2 Bodenbeläge aus Kunststoffen, Textilien und dgl      ."]
[null,"281.3"]
["2 Gebäude","281.4","      .4 Bodenbeläge aus Naturstein"]
["2 Gebäude","281.5","      .5 Bodenbeläge aus Kunststein"]
["2 Gebäude","281.6","      .6 Bodenbeläge Plattenarbeiten"]
["2 Gebäude","281.7","      .7 Bodenbeläge aus Holz"]
["2 Gebäude","281.8","      .8 Doppelböden"]
["2 Gebäude","281.9","      .9 Sockel"]
["2 Gebäude","282","282 Wandbeläge, Wandbekleidungen"]
["2 Gebäude","282.0","      .0 Fugenlose Wandbeläge"]
["2 Gebäude","282.1","      .1 Tapezierarbeiten"]
["2 Gebäude","282.2","      .2 Wandbekleidungen aus Naturstein"]
["2 Gebäude","282.3","      .3 Wandbekleidungen aus Kunststein"]
["2 Gebäude","282.4","      .4 Wandbeläge Plattenarbeiten"]
["2 Gebäude","282.5","      .5 Wandbekleidungen aus Holz und Holzwerkstoffen"]
["2 Gebäude","282.6","      .6 Wandbekleidungen aus Kunststoffen, Textilien und dgl      ."]
["2 Gebäude","282.7","      .7 Gerüste"]
[null,"282.8"]
[null,"282.9"]
["2 Gebäude","283","283 Deckenbekleidungen"]
["2 Gebäude","283.0","      .0 Gerüste"]
["2 Gebäude","283.1","      .1 Deckenbekleidungen aus Metall: Platten"]
["2 Gebäude","283.2","      .2 Deckenbekleidungen aus Gips"]
["2 Gebäude","283.3","      .3 Deckenbekleidungen aus Mineralfasern"]
["2 Gebäude","283.4","      .4 Deckenbekleidungen aus Holz und Holzwerkstoffen"]
["2 Gebäude","283.5","      .5 Deckenbekleidungen aus Kunststoffen, Textilien und dgl      ."]
["2 Gebäude","283.6","      .6 Deckenbekleidungen aus Metall: Paneele und Lamellen"]
["2 Gebäude","283.7","      .7 Deckenbekleidungen aus Metall: Raster"]
[null,"283.8"]
[null,"283.9"]
["2 Gebäude","284","284 Hafnerarbeiten"]
["2 Gebäude","285","285 Innere Oberflächenbehandlungen"]
["2 Gebäude","285.0","      .0 Gerüste"]
["2 Gebäude","285.1","      .1 Innere Malerarbeiten"]
["2 Gebäude","285.2","      .2 Holzschutzarbeiten (innere)"]
["2 Gebäude","285.3","      .3 Holz-Beizarbeiten und -Naturbehandlungen (innere)"]
[null,"285.4"]
[null,"285.5"]
[null,"285.6"]
[null,"285.7"]
[null,"285.8"]
[null,"285.9"]
["2 Gebäude","286","286 Bauaustrocknung"]
["2 Gebäude","287","287 Baureinigung"]
["2 Gebäude","288","288 Gärtnerarbeiten (Gebäude)"]
["2 Gebäude","289","289 Übriges"]
["2 Gebäude"]
["2 Gebäude","29","29 Honorare"]
["2 Gebäude","290","290 Übergangsposition"]
["2 Gebäude","291","291 Architekt"]
["2 Gebäude","292","292 Bauingenieur"]
["2 Gebäude","293","293 Elektroingenieur"]
["2 Gebäude","294","294 HLK-Ingenieur"]
["2 Gebäude","295","295 Sanitäringenieur"]
["2 Gebäude","296","296 Spezialisten"]
["2 Gebäude","296.0","      .0 Geometer"]
[null,"296.1"]
["2 Gebäude","296.2","      .2 Innenarchitekt"]
["2 Gebäude","296.3","      .3 Bauphysiker"]
["2 Gebäude","296.4","      .4 Akustiker"]
["2 Gebäude","296.5","      .5 Landschaftsarchitekt"]
["2 Gebäude","296.6","      .6 Bauökonom"]
["2 Gebäude","296.7","      .7 Prüfingenieur"]
[null,"296.8"]
[null,"296.9"]
[null,"297"]
["2 Gebäude","298","298 Gebäudeautomationsingenieur"]
["2 Gebäude","299","299 Übriges"]
["2 Gebäude"]
[]
["3 Betriebseinrichtungen"]
[null,"3","Betriebseinrichtungen"]
["3 Betriebseinrichtungen","30","30 Baugrube"]
["3 Betriebseinrichtungen","300","300 Übergangsposition"]
["3 Betriebseinrichtungen","301","301 Baugrubenaushub"]
[null,"302"]
[null,"303"]
[null,"304"]
[null,"305"]
[null,"306"]
[null,"307"]
[null,"308"]
["3 Betriebseinrichtungen","309","309 Übriges"]
["3 Betriebseinrichtungen"]
["3 Betriebseinrichtungen","31","31 Rohbau 1"]
[null,"310"]
["3 Betriebseinrichtungen","311","311 Baumeisterarbeiten"]
["3 Betriebseinrichtungen","311.0","      .0 Baustelleneinrichtung"]
["3 Betriebseinrichtungen","311.1","      .1 Gerüste"]
[null,"311.2"]
["3 Betriebseinrichtungen","311.3","      .3 Baumeisteraushub"]
["3 Betriebseinrichtungen","311.4","      .4 Kanalisationen im Gebäude"]
["3 Betriebseinrichtungen","311.5","      .5 Beton- und Stahlbetonarbeiten"]
["3 Betriebseinrichtungen","311.6","      .6 Maurerarbeiten"]
["3 Betriebseinrichtungen","311.7","      .7 Instandsetzungsarbeiten"]
[null,"311.8"]
[null,"311.9"]
["3 Betriebseinrichtungen","312","312 Montagebau in Beton und vorfabriziertem Mauerwerk"]
["3 Betriebseinrichtungen","313","313 Montagebau in Stahl"]
["3 Betriebseinrichtungen","314","314 Montagebau in Holz"]
["3 Betriebseinrichtungen","315","315 Montagebau als Leichtkonstruktionen"]
["3 Betriebseinrichtungen","316","316 Natur- und Kunststeinarbeiten"]
["3 Betriebseinrichtungen","317","317 Schutzraumabschlüsse"]
[null,"318"]
["3 Betriebseinrichtungen","319","319 Übriges"]
["3 Betriebseinrichtungen"]
["3 Betriebseinrichtungen","32","32 Rohbau 2"]
["3 Betriebseinrichtungen","320","320 Übergansposition"]
["3 Betriebseinrichtungen","321","321 Fenster, Aussentüren, Tore"]
["3 Betriebseinrichtungen","322","322 Spenglerarbeiten"]
["3 Betriebseinrichtungen","323","323 Blitzschutz"]
["3 Betriebseinrichtungen","324","324 Bedachungsarbeiten"]
["3 Betriebseinrichtungen","325","325 Spezielle Dichtungen und Dämmungen"]
["3 Betriebseinrichtungen","326","326 Fassadenputze"]
["3 Betriebseinrichtungen","327","327 Äussere Oberflächenbehandlungen"]
["3 Betriebseinrichtungen","328","328 Äussere Abschlüsse, Sonnenschutz"]
["3 Betriebseinrichtungen","329","329 Übriges"]
["3 Betriebseinrichtungen"]
["3 Betriebseinrichtungen","33","33 Elektroanlagen"]
["3 Betriebseinrichtungen","330","330 Übergangsposition"]
["3 Betriebseinrichtungen","331","331 Apparate Starkstrom"]
["3 Betriebseinrichtungen","332","332 Starkstrominstallationen"]
["3 Betriebseinrichtungen","333","333 Leuchten und Lampen"]
["3 Betriebseinrichtungen","334","334 Energieverbraucher"]
["3 Betriebseinrichtungen","335","335 Apparate Schwachstrom"]
["3 Betriebseinrichtungen","336","336 Schwachstrominstallationen"]
["3 Betriebseinrichtungen","337","337 Gebäudeautomation"]
["3 Betriebseinrichtungen","338","338 Bauprovisorium"]
["3 Betriebseinrichtungen","339","339 Übriges"]
["3 Betriebseinrichtungen"]
["3 Betriebseinrichtungen","34","34 Heizungs-, Lüftungs-, Klima- und Kälteanlagen"]
["3 Betriebseinrichtungen","340","340 Übergangsposition"]
["3 Betriebseinrichtungen","341","341 Zulieferung Energieträger, Lagerung"]
["3 Betriebseinrichtungen","342","342 Wärmeerzeugung"]
["3 Betriebseinrichtungen","343","343 Wärmeverteilung"]
["3 Betriebseinrichtungen","344","344 Lüftungsanlagen"]
["3 Betriebseinrichtungen","345","345 Klimaanlagen"]
["3 Betriebseinrichtungen","346","346 Kälteanlagen"]
["3 Betriebseinrichtungen","347","347 Spezialanlagen"]
["3 Betriebseinrichtungen","348","348 Dämmungen HLK-Installationen"]
["3 Betriebseinrichtungen","349","349 Übriges"]
["3 Betriebseinrichtungen"]
["3 Betriebseinrichtungen","35","35 Sanitäranlagen"]
["3 Betriebseinrichtungen","350","350 Übergangsposition"]
["3 Betriebseinrichtungen","351","351 Allgemeine Sanitärapparate"]
["3 Betriebseinrichtungen","352","352 Spezielle Sanitärapparate"]
["3 Betriebseinrichtungen","353","353 Sanitäre Ver- und Entsorgungsapparate"]
["3 Betriebseinrichtungen","354","354 Sanitärleitungen"]
["3 Betriebseinrichtungen","355","355 Dämmungen Sanitärinstallationen"]
["3 Betriebseinrichtungen","356","356 Sanitärinstallationselemente"]
["3 Betriebseinrichtungen","357","357 Elektro- und Pneumatiktafeln"]
["3 Betriebseinrichtungen","358","358 Kücheneinrichtungen"]
["3 Betriebseinrichtungen","359","359 Übriges"]
["3 Betriebseinrichtungen"]
["3 Betriebseinrichtungen","36","36 Transportanlagen, Lageranlagen"]
["3 Betriebseinrichtungen","360","360 Übergangsposition"]
["3 Betriebseinrichtungen","361","361 Aufzüge"]
["3 Betriebseinrichtungen","362","362 Fahrtreppen, Fahrsteige"]
[null,"363"]
["3 Betriebseinrichtungen","364","364 Sonstige Förderanlagen"]
["3 Betriebseinrichtungen","365","365 Hebeeinrichtungen"]
["3 Betriebseinrichtungen","366","366 Parkieranlagen"]
[null,"367"]
["3 Betriebseinrichtungen","368","368 Sonstige Lageranlagen"]
["3 Betriebseinrichtungen","369","369 Übriges"]
["3 Betriebseinrichtungen"]
["3 Betriebseinrichtungen","37","37 Ausbau 1"]
["3 Betriebseinrichtungen","370","370 Übergangsposition"]
["3 Betriebseinrichtungen","371","371 Gipserarbeiten"]
["3 Betriebseinrichtungen","372","372 Metallbauarbeiten"]
["3 Betriebseinrichtungen","373","373 Schreinerarbeiten"]
["3 Betriebseinrichtungen","374","374 Spezialverglasungen (innere)"]
["3 Betriebseinrichtungen","375","375 Schliessanlagen"]
["3 Betriebseinrichtungen","376","376 Innere Abschlüsse"]
["3 Betriebseinrichtungen","377","377 Elementwände"]
[null,"378"]
["3 Betriebseinrichtungen","379","379 Übriges"]
["3 Betriebseinrichtungen"]
["3 Betriebseinrichtungen","38","38 Ausbau 2"]
["3 Betriebseinrichtungen","380","380 Übergangsposition"]
["3 Betriebseinrichtungen","381","381 Bodenbeläge"]
["3 Betriebseinrichtungen","382","382 Wandbeläge, Wandbekleidungen"]
["3 Betriebseinrichtungen","383","383 Deckenbekleidungen"]
["3 Betriebseinrichtungen","384","384 Hafnerarbeiten"]
["3 Betriebseinrichtungen","385","385 Innere Oberflächenbehandlungen"]
["3 Betriebseinrichtungen","386","386 Bauaustrocknung"]
["3 Betriebseinrichtungen","387","387 Baureinigung"]
["3 Betriebseinrichtungen","388","388 Gärtnerarbeiten (Betriebseinrichtungen)"]
["3 Betriebseinrichtungen","389","389 Übriges"]
["3 Betriebseinrichtungen"]
["3 Betriebseinrichtungen","39","39 Honorare"]
["3 Betriebseinrichtungen","390","390 Übergangsposition"]
["3 Betriebseinrichtungen","391","391 Architekt"]
["3 Betriebseinrichtungen","392","392 Bauingenieur"]
["3 Betriebseinrichtungen","393","393 Elektroingenieur"]
["3 Betriebseinrichtungen","394","394 HLK-Ingenieur"]
["3 Betriebseinrichtungen","395","395 Sanitäringenieur"]
["3 Betriebseinrichtungen","396","396 Spezialisten"]
[null,"397"]
["3 Betriebseinrichtungen","398","398 Gebäudeautomationsingenieur"]
["3 Betriebseinrichtungen","399","399 Übriges"]
["3 Betriebseinrichtungen"]
[]
["4 Umgebung"]
[null,"4","Umgebung"]
["4 Umgebung","40","40 Terraingestaltung"]
["4 Umgebung","400","400 Übergangsposition"]
["4 Umgebung","401","401 Erdbewegungen"]
["4 Umgebung","401.0","      .0 Baustelleneinrichtung"]
["4 Umgebung","401.1","      .1 Erdarbeiten"]
[null,"401.2"]
[null,"401.3"]
[null,"401.4"]
[null,"401.5"]
[null,"401.6"]
[null,"401.7"]
[null,"401.8"]
[null,"401.9"]
[null,"402"]
[null,"403"]
[null,"404"]
[null,"405"]
[null,"406"]
[null,"407"]
[null,"408"]
["4 Umgebung","409","409 Übriges"]
["4 Umgebung"]
["4 Umgebung","41","41 Roh- und Ausbauarbeiten"]
["4 Umgebung","410","410 Übergangsposition"]
["4 Umgebung","411","411 Baumeisterarbeiten"]
["4 Umgebung","411.0","      .0 Baustelleneinrichtung"]
["4 Umgebung","411.1","      .1 Gerüste"]
["4 Umgebung","411.2","      .2 Böschungs-, Uferverbauungen"]
["4 Umgebung","411.3","      .3 Baumeisteraushub"]
["4 Umgebung","411.4","      .4 Kanalisationen ausserhalb Gebäude"]
["4 Umgebung","411.5","      .5 Beton- und Stahlbetonarbeiten"]
["4 Umgebung","411.6","      .6 Maurerarbeiten"]
["4 Umgebung","411.7","      .7 Instandsetzungsarbeiten"]
[null,"411.8"]
[null,"411.9"]
[null,"412"]
["4 Umgebung","413","413 Übriger Rohbau 1"]
[null,"413.1"]
["4 Umgebung","413.2","      .2 Montagebau in Beton und vorfabriziertem Mauerwerk"]
["4 Umgebung","413.3","      .3 Montagebau in Stahl"]
["4 Umgebung","413.4","      .4 Montagebau in Holz"]
["4 Umgebung","413.5","      .5 Montagebau als Leichtkonstruktion"]
["4 Umgebung","413.6","      .6 Natur- und Kunststeinarbeiten"]
["4 Umgebung","413.7","      .7 Schutzraumteile"]
[null,"413.8"]
[null,"413.9"]
["4 Umgebung","414","414 Rohbau 2"]
["4 Umgebung","414.1","      .1 Fenster, Aussentüren, Tore"]
["4 Umgebung","414.2","      .2 Spenglerarbeiten"]
["4 Umgebung","414.3","      .3 Blitzschutz"]
["4 Umgebung","414.4","      .4 Bedachungsarbeiten"]
["4 Umgebung","414.5","      .5 Spezielle Dichtungen und Dämmungen"]
["4 Umgebung","414.6","      .6 Fassadenputze"]
["4 Umgebung","414.7","      .7 Äussere Oberflächenbehandlungen"]
["4 Umgebung","414.8","      .8 Äussere Abschlüsse, Sonnenschutz"]
["4 Umgebung","414.9","      .9 Arealabschlüsse"]
["4 Umgebung","415","415 Ausbau 1"]
["4 Umgebung","415.1","      .1 Gipserarbeiten"]
["4 Umgebung","415.2","      .2 Metallbauarbeiten"]
["4 Umgebung","415.3","      .3 Schreinerarbeiten"]
["4 Umgebung","415.4","      .4 Spezialverglasungen"]
["4 Umgebung","415.5","      .5 Schliessanlagen"]
["4 Umgebung","415.6","      .6 Innere Abschlüsse"]
["4 Umgebung","415.7","      .7 Elementwände"]
[null,"415.8"]
[null,"415.9"]
["4 Umgebung","416","416 Ausbau 2"]
["4 Umgebung","416.1","      .1 Bodenbeläge"]
["4 Umgebung","416.2","      .2 Wandbeläge, Wandbekleidungen"]
["4 Umgebung","416.3","      .3 Deckenbekleidungen"]
["4 Umgebung","416.4","      .4 Hafnerarbeiten"]
["4 Umgebung","416.5","      .5 Innere Oberflächenbehandlungen"]
[null,"416.6"]
[null,"416.7"]
[null,"416.8"]
[null,"416.9"]
[null,"417"]
[null,"418"]
["4 Umgebung","419","419 Übriges"]
["4 Umgebung"]
["4 Umgebung","42","42 Gartenanlagen"]
["4 Umgebung","420","420 Übergangsposition"]
["4 Umgebung","421","421 Gärtnerarbeiten"]
["4 Umgebung","422","422 Einfriedungen"]
["4 Umgebung","423","423 Ausstattungen, Geräte"]
["4 Umgebung","424","424 Spiel- und Sportplätze"]
[null,"425"]
[null,"426"]
[null,"427"]
[null,"428"]
["4 Umgebung","429","429 Übriges"]
["4 Umgebung"]
["4 Umgebung","43","43 Reserve"]
[null,"430"]
[null,"431"]
[null,"432"]
[null,"433"]
[null,"434"]
[null,"435"]
[null,"436"]
[null,"437"]
[null,"438"]
[null,"439"]
["4 Umgebung"]
["4 Umgebung","44","44 Installationen"]
["4 Umgebung","440","440 Übergangsposition"]
[null,"441"]
[null,"442"]
["4 Umgebung","443","443 Elektroanlagen"]
["4 Umgebung","444","444 Heizungs-, Lüftungs-, Klima-, Kälteanlagen"]
["4 Umgebung","445","445 Sanitäranlagen"]
["4 Umgebung","446","446 Transportanlagen"]
[null,"447"]
[null,"448"]
["4 Umgebung","449","449 Übriges"]
["4 Umgebung"]
["4 Umgebung","45","45 Erschliessung durch Leitungen (innerhalb Grundstück)"]
["4 Umgebung","450","450 Übergangsposition"]
["4 Umgebung","451","451 Erdarbeiten"]
["4 Umgebung","452","452 Kanalisationsleitungen"]
["4 Umgebung","453","453 Elektroleitungen"]
["4 Umgebung","454","454 Heizungs-, Lüftungs-, Klima-, Kälteleitungen"]
["4 Umgebung","455","455 Sanitärleitungen"]
["4 Umgebung","456","456 Nebenarbeiten"]
[null,"457"]
[null,"458"]
["4 Umgebung","459","459 Übriges"]
["4 Umgebung"]
["4 Umgebung","46","46 Kleinere Trassenbauten"]
["4 Umgebung","460","460 Übergangsposition"]
["4 Umgebung","461","461 Erd- und Unterbau"]
["4 Umgebung","462","462 Kleine Kunstbauten"]
["4 Umgebung","463","463 Oberbau"]
["4 Umgebung","464","464 Entwässerung"]
["4 Umgebung","465","465 Werkleitungen und Kanalisationen"]
[null,"466"]
[null,"467"]
["4 Umgebung","468","468 Ausbau"]
[null,"469"]
["4 Umgebung"]
["4 Umgebung","47","47 Kleinere Kunstbauten"]
["4 Umgebung","470","470 Übergangsposition"]
["4 Umgebung","471","471 Baugrube"]
["4 Umgebung","472","472 Tragkonstruktion"]
["4 Umgebung","473","473 Oberbau"]
["4 Umgebung","474","474 Entwässerung"]
["4 Umgebung","475","475 Werkleitungen und Kanalisationen"]
[null,"476"]
["4 Umgebung","477","477 Transportanlagen"]
["4 Umgebung","478","478 Ausbau"]
[null,"479"]
["4 Umgebung"]
["4 Umgebung","48","48 Kleinere Untertagbauten"]
["4 Umgebung","480","480 Übergangsposition"]
["4 Umgebung","481","481 Vortrieb"]
["4 Umgebung","482","482 Auskleidung, Gewölbe"]
["4 Umgebung","483","483 Oberbau"]
["4 Umgebung","484","484 Entwässerung und Wasserversorgung"]
["4 Umgebung","485","485 Werkleitungen und Kanalisationen"]
[null,"486"]
["4 Umgebung","487","487 Transportanlagen"]
["4 Umgebung","488","488 Ausbau"]
[null,"489"]
["4 Umgebung"]
["4 Umgebung","49","49 Honorare"]
["4 Umgebung","490","490 Übergangsposition"]
["4 Umgebung","491","491 Architekt"]
["4 Umgebung","492","492 Bauingenieur"]
["4 Umgebung","493","493 Elektroingenieur"]
["4 Umgebung","494","494 HLK-Ingenieur"]
["4 Umgebung","495","495 Sanitäringenieur"]
["4 Umgebung","496","496 Spezialisten"]
["4 Umgebung","496.0","      .0 Geometer"]
["4 Umgebung","496.1","      .1 Geologe, Geotechniker"]
["4 Umgebung","496.2","      .2 Innenarchitekt"]
["4 Umgebung","496.3","      .3 Bauphysiker"]
["4 Umgebung","496.4","      .4 Akustiker"]
["4 Umgebung","496.5","      .5 Landschaftsarchitekt"]
["4 Umgebung","496.6","      .6 Bauökonom"]
[null,"496.7"]
[null,"496.8"]
[null,"496.9"]
[null,"497"]
["4 Umgebung","498","498 Gebäudeautomationsingenieur"]
["4 Umgebung","499","499 Übriges"]
["4 Umgebung"]
[]
["5 Baunebenkosten und Übergangskonten"]
[null,"5","Baunebenkosten und Übergangskonten"]
["5 Baunebenkosten und Übergangskonten","50","50 Wettbewerbskosten"]
["5 Baunebenkosten und Übergangskonten","500","500 Übergangsposition"]
["5 Baunebenkosten und Übergangskonten","501","501 Architekturwettbewerbe"]
["5 Baunebenkosten und Übergangskonten","502","502 Ingenieurwettbewerbe"]
["5 Baunebenkosten und Übergangskonten","503","503 Wettbewerbe für Umgebungsgestaltung"]
["5 Baunebenkosten und Übergangskonten","504","504 Wettbewerbe für künstlerische Gestaltung"]
["5 Baunebenkosten und Übergangskonten","505","505 Städtebaulicher Wettbewerb"]
["5 Baunebenkosten und Übergangskonten","506","506 Innenarchitekturwettbewerb"]
[null,"507"]
[null,"508"]
["5 Baunebenkosten und Übergangskonten","509","509 Übriges"]
["5 Baunebenkosten und Übergangskonten"]
["5 Baunebenkosten und Übergangskonten","51","51 Bewilligungen, Gebühren"]
["5 Baunebenkosten und Übergangskonten","510","510 Übergangsposition"]
["5 Baunebenkosten und Übergangskonten","511","511 Bewilligungen, Baugespann (Gebühren)"]
["5 Baunebenkosten und Übergangskonten","512","512 Anschlussgebühren"]
["5 Baunebenkosten und Übergangskonten","512.0","      .0 Kanalisation"]
["5 Baunebenkosten und Übergangskonten","512.1","      .1 Elektrizität"]
["5 Baunebenkosten und Übergangskonten","512.2","      .2 Übermittlung"]
["5 Baunebenkosten und Übergangskonten","512.3","      .3 Gas"]
["5 Baunebenkosten und Übergangskonten","512.4","      .4 Wasser"]
["5 Baunebenkosten und Übergangskonten","512.5","      .5 Fernheizung"]
["5 Baunebenkosten und Übergangskonten","512.6","      .6 Medien"]
[null,"512.7"]
[null,"512.8"]
[null,"512.9"]
[null,"513"]
[null,"514"]
[null,"515"]
[null,"516"]
[null,"517"]
[null,"518"]
["5 Baunebenkosten und Übergangskonten","519","519 Übriges"]
["5 Baunebenkosten und Übergangskonten","519.1","      .1 Schutzraumersatzabgaben"]
["5 Baunebenkosten und Übergangskonten","52","52 Muster, Modelle, Vervielfältigungen, Dokumentation"]
["5 Baunebenkosten und Übergangskonten","520","520 Übergangsposition"]
["5 Baunebenkosten und Übergangskonten","521","521 Muster, Materialprüfungen"]
["5 Baunebenkosten und Übergangskonten","521.0","      .0 Muster"]
["5 Baunebenkosten und Übergangskonten","521.1","      .1 Materialprüfungen"]
[null,"521.2"]
[null,"521.3"]
[null,"521.4"]
[null,"521.5"]
[null,"521.6"]
[null,"521.7"]
[null,"521.8"]
[null,"521.9"]
["5 Baunebenkosten und Übergangskonten","522","522 Modelle"]
["5 Baunebenkosten und Übergangskonten","523","523 Fotos"]
["5 Baunebenkosten und Übergangskonten","524","524 Vervielfältigungen, Plankopien"]
["5 Baunebenkosten und Übergangskonten","525","525 Dokumentation"]
[null,"526"]
[null,"527"]
[null,"528"]
["5 Baunebenkosten und Übergangskonten","529","529 Übriges"]
["5 Baunebenkosten und Übergangskonten"]
["5 Baunebenkosten und Übergangskonten","53","53 Versicherungen"]
["5 Baunebenkosten und Übergangskonten","530","530 Übergangsposition"]
["5 Baunebenkosten und Übergangskonten","531","531 Bauzeitversicherungen"]
["5 Baunebenkosten und Übergangskonten","532","532 Spezialversicherungen"]
["5 Baunebenkosten und Übergangskonten","533","533 Selbstbehalt in Schadenfällen während der Bauzeit"]
[null,"534"]
[null,"535"]
[null,"536"]
[null,"537"]
[null,"538"]
["5 Baunebenkosten und Übergangskonten","539","539 Übriges"]
["5 Baunebenkosten und Übergangskonten"]
["5 Baunebenkosten und Übergangskonten","54","54 Finanzierung ab Baubeginn"]
["5 Baunebenkosten und Übergangskonten","540","540 Übergangsposition"]
["5 Baunebenkosten und Übergangskonten","541","541 Errichten von Hypotheken auf Liegenschaften"]
["5 Baunebenkosten und Übergangskonten","542","542 Baukreditzinsen, Bankspesen"]
["5 Baunebenkosten und Übergangskonten","543","543 Baurechtszinsen"]
[null,"544"]
["5 Baunebenkosten und Übergangskonten","545","545 Eigenkapitalzinsen"]
["5 Baunebenkosten und Übergangskonten","546","546 Liegenschaftensteuer während der Bauzeit"]
[null,"547"]
["5 Baunebenkosten und Übergangskonten","548","548 Rückvergütungen"]
["5 Baunebenkosten und Übergangskonten","549","549 Übriges"]
["5 Baunebenkosten und Übergangskonten"]
["5 Baunebenkosten und Übergangskonten"]
["5 Baunebenkosten und Übergangskonten","55","55 Bauherrenleistungen"]
["5 Baunebenkosten und Übergangskonten","550","550 Übergangsposition"]
[null,"551"]
[null,"552"]
[null,"553"]
[null,"554"]
[null,"555"]
[null,"556"]
["5 Baunebenkosten und Übergangskonten","557","557 Betriebsplanung"]
["5 Baunebenkosten und Übergangskonten","558","558 Projektleitung, Projektbegleitung"]
["5 Baunebenkosten und Übergangskonten","559","559 Übriges"]
["5 Baunebenkosten und Übergangskonten"]
["5 Baunebenkosten und Übergangskonten","56","56 Übrige Baunebenkosten"]
["5 Baunebenkosten und Übergangskonten","560","560 Übergangsposition"]
["5 Baunebenkosten und Übergangskonten","561","561 Bewachung durch Dritte"]
["5 Baunebenkosten und Übergangskonten","562","562 Nachbar- und Mieterentschädigungen, Nutzerkosten"]
["5 Baunebenkosten und Übergangskonten","563","563 Miete von fremdem Grund"]
["5 Baunebenkosten und Übergangskonten","564","564 Gutachten"]
["5 Baunebenkosten und Übergangskonten","565","565 Reisespesen"]
["5 Baunebenkosten und Übergangskonten","566","566 Grundsteinlegung, Aufrichte, Einweihung"]
["5 Baunebenkosten und Übergangskonten","567","567 Anwaltskosten, Gerichtskosten"]
["5 Baunebenkosten und Übergangskonten","568","568 Baureklame"]
["5 Baunebenkosten und Übergangskonten","569","569 Übriges"]
["5 Baunebenkosten und Übergangskonten"]
["5 Baunebenkosten und Übergangskonten","57","57 Mehrwertsteuer (MWSt)"]
["5 Baunebenkosten und Übergangskonten","570","570 Übergangsposition (MWSt)"]
["5 Baunebenkosten und Übergangskonten","571","571 Grundstück (MWSt)"]
["5 Baunebenkosten und Übergangskonten","572","572 Vorbereitungsarbeiten (MWSt)"]
["5 Baunebenkosten und Übergangskonten","573","573 Gebäude (MWSt)"]
["5 Baunebenkosten und Übergangskonten","574","574 Betriebseinrichtungen (MWSt)"]
["5 Baunebenkosten und Übergangskonten","575","575 Umgebung (MWSt)"]
["5 Baunebenkosten und Übergangskonten","576","576 Baunebenkosten und Übergangskosten (MWSt)"]
[null,"577"]
[null,"578"]
["5 Baunebenkosten und Übergangskonten","579","579 Ausstattung (MWSt)"]
["5 Baunebenkosten und Übergangskonten"]
["5 Baunebenkosten und Übergangskonten","58","58 Übergangskonten für Rückstellungen und Reserven"]
["5 Baunebenkosten und Übergangskonten","580","580 Übergangsposition"]
["5 Baunebenkosten und Übergangskonten","581","581 Rückstellungen für zu erwartende Kosten"]
["5 Baunebenkosten und Übergangskonten","582","582 Reserven für Teuerung"]
["5 Baunebenkosten und Übergangskonten","583","583 Reserven für Unvorhergesehenes"]
[null,"584"]
[null,"585"]
[null,"586"]
[null,"587"]
[null,"588"]
["5 Baunebenkosten und Übergangskonten","589","589 Übriges"]
["5 Baunebenkosten und Übergangskonten"]
["5 Baunebenkosten und Übergangskonten","59","59 Übergangskonten für Honorare"]
["5 Baunebenkosten und Übergangskonten","590","590 Übergangsposition"]
["5 Baunebenkosten und Übergangskonten","591","591 Architekt"]
["5 Baunebenkosten und Übergangskonten","592","592 Bauingenieur"]
["5 Baunebenkosten und Übergangskonten","593","593 Elektroingenieur"]
["5 Baunebenkosten und Übergangskonten","594","594 HLK-Ingenieur"]
["5 Baunebenkosten und Übergangskonten","595","595 Sanitäringenieur"]
["5 Baunebenkosten und Übergangskonten","596","596 Spezialisten"]
["5 Baunebenkosten und Übergangskonten","596.0","      .0 Geometer"]
["5 Baunebenkosten und Übergangskonten","596.1","      .1 Geologe, Geotechniker"]
["5 Baunebenkosten und Übergangskonten","596.2","      .2 Innenarchitekt"]
["5 Baunebenkosten und Übergangskonten","596.3","      .3 Bauphysiker"]
["5 Baunebenkosten und Übergangskonten","596.4","      .4 Akustiker"]
["5 Baunebenkosten und Übergangskonten","596.5","      .5 Landschaftsarchitekt"]
["5 Baunebenkosten und Übergangskonten","596.6","      .6 Bauökonom"]
[null,"596.7"]
[null,"596.8"]
[null,"596.9"]
[null,"597"]
["5 Baunebenkosten und Übergangskonten","598","598 Gebäudeautomationsingenieur"]
["5 Baunebenkosten und Übergangskonten","599","599 Übriges"]
["5 Baunebenkosten und Übergangskonten"]
[]
["6-8 Reserve"]
[null,"6","Reserve"]
[null,"60"]
[null,"600"]
[null,"601"]
[null,"602"]
[null,"603"]
[null,"604"]
[null,"605"]
[null,"606"]
[null,"607"]
[null,"608"]
[null,"609"]
[null,"7","Reserve"]
[null,"70"]
[null,"700"]
[null,"701"]
[null,"702"]
[null,"703"]
[null,"704"]
[null,"705"]
[null,"706"]
[null,"707"]
[null,"708"]
[null,"709"]
[null,"8","Reserve"]
[null,"80"]
[null,"800"]
[null,"801"]
[null,"802"]
[null,"803"]
[null,"804"]
[null,"805"]
[null,"806"]
[null,"807"]
[null,"808"]
[null,"809"]
[]
["9 Ausstattung"]
[null,"9","Ausstattung"]
["9 Ausstattung","90","90 Möbel"]
["9 Ausstattung","900","900 Übergangsposition"]
["9 Ausstattung","901","901 Garderobeneinrichtungen, Gestelle und dgl."]
["9 Ausstattung","902","902 Sporteinrichtungen"]
[null,"902.0"]
["9 Ausstattung","902.1","      .1 Sporthallen"]
["9 Ausstattung","902.2","      .2 Krafträume"]
["9 Ausstattung","902.3","      .3 Gymnastikräume"]
[null,"902.4"]
[null,"902.5"]
[null,"902.6"]
[null,"902.7"]
[null,"902.8"]
[null,"902.9"]
[null,"903"]
[null,"904"]
[null,"905"]
[null,"906"]
[null,"907"]
["9 Ausstattung","908","908 Schutzraumausstattungen"]
["9 Ausstattung","909","909 Übriges"]
["9 Ausstattung"]
["9 Ausstattung","91","91 Beleuchtungskörper"]
["9 Ausstattung","910","910 Übergangsposition"]
[null,"911"]
[null,"912"]
[null,"913"]
[null,"914"]
[null,"915"]
[null,"916"]
[null,"917"]
[null,"918"]
["9 Ausstattung","919","919 Übriges"]
["9 Ausstattung"]
["9 Ausstattung","92","92 Textilien"]
["9 Ausstattung","920","920 Übergangsposition"]
["9 Ausstattung","921","921 Vorhänge und Innendekorationsarbeiten"]
[null,"922"]
[null,"923"]
[null,"924"]
[null,"925"]
[null,"926"]
[null,"927"]
[null,"928"]
["9 Ausstattung","929","929 Übriges"]
["9 Ausstattung"]
["9 Ausstattung","93","93 Geräte, Apparate"]
["9 Ausstattung","930","930 Übergangsposition"]
[null,"931"]
[null,"932"]
[null,"933"]
[null,"934"]
[null,"935"]
[null,"936"]
[null,"937"]
[null,"938"]
["9 Ausstattung","939","939 Übriges"]
["9 Ausstattung"]
["9 Ausstattung","94","94 Kleininventar"]
["9 Ausstattung","940","940 Übergangsposition"]
[null,"941"]
[null,"942"]
[null,"943"]
[null,"944"]
[null,"945"]
[null,"946"]
[null,"947"]
[null,"948"]
[null,"949","949 Übriges"]
["9 Ausstattung"]
["9 Ausstattung","95","95 Reserve"]
[null,"950"]
[null,"951"]
[null,"952"]
[null,"953"]
[null,"954"]
[null,"955"]
[null,"956"]
[null,"957"]
[null,"958"]
[null,"959"]
["9 Ausstattung"]
["9 Ausstattung","96","96 Transportmittel"]
["9 Ausstattung","960","960 Übergangsposition"]
[null,"961"]
[null,"962"]
[null,"963"]
[null,"964"]
[null,"965"]
[null,"966"]
[null,"967"]
[null,"968"]
["9 Ausstattung","969","969 Übriges"]
["9 Ausstattung"]
["9 Ausstattung","97","97 Verbrauchsmaterial"]
["9 Ausstattung","970","970 Übergangsposition"]
[null,"971"]
[null,"972"]
[null,"973"]
[null,"974"]
[null,"975"]
[null,"976"]
[null,"977"]
[null,"978"]
["9 Ausstattung","979","979 Übriges"]
["9 Ausstattung"]
["9 Ausstattung","98","98 Künstlerischer Schmuck"]
["9 Ausstattung","980","980 Übergangsposition"]
[null,"981"]
[null,"982"]
[null,"983"]
[null,"984"]
[null,"985"]
[null,"986"]
[null,"987"]
[null,"988"]
["9 Ausstattung","989","989 Übriges"]
["9 Ausstattung"]
["9 Ausstattung","99","99 Honorare"]
["9 Ausstattung","990","990 Übergangsposition"]
["9 Ausstattung","991","991 Architekt"]
[null,"992"]
["9 Ausstattung","993","993 Elektroingenieur"]
[null,"994"]
[null,"995"]
["9 Ausstattung","996","996 Spezialisten"]
[null,"996.0"]
[null,"996.1"]
["9 Ausstattung","996.2","      .2 Innenarchitekt"]
[null,"996.3"]
[null,"996.4"]
[null,"996.5"]
["9 Ausstattung","996.6","      .6 Bauökonom"]
[null,"996.7"]
[null,"996.8"]
[null,"996.9"]
[null,"997"]
[null,"998"]
["9 Ausstattung","999","999 Übriges"]
["9 Ausstattung"]

{"sheet":"eBKP-H_A","index":12,"n_rows":361,"n_cols":3,"rows_kept":361,"cut":false,"hidden":true,"merged":[]}
[null,"eBKP-H","Bez. eBKP-H"]
[]
["A","A","Grundstück"]
["A","A0"]
["A","A1","Grundstück Baurecht"]
["A","A1.1","Grundstückserwerb"]
["A","A1.2","Baurechtserwerb"]
["A","A1.3","Bauwerkserwerb"]
["A","A1.4","Perimeterbeitrag"]
["A","A2","Nebenkosten zu Grundstück Baurecht"]
["A","A2.1","Handänderungssteuer, Gewinnsteuer"]
["A","A2.2","Notariatskosten"]
["A","A2.3","Grundbuchgebühren"]
["A","A2.4","Anwaltskosten, Gerichtskosten"]
["A","A2.5","Vermittlungsprovision"]
["A","A2.6","Abfindung, Servitut"]
["A","A2.7","Vermessung, Vermarkung"]
["B","B","Vorbereitung"]
["B","B0"]
["B","B1","Untersuchung, Aufnahme, Messung"]
["B","B1.1","Baugrunduntersuchung"]
["B","B1.2","Bestandsaufnahme"]
["B","B1.3","Umweltmessung"]
["B","B1.4","Überwachung"]
["B","B2","Baustelleneinrichtung"]
["B","B2.1","Baustellenerschliessung"]
["B","B2.2","Versorgung, Entsorgung"]
["B","B2.3","Arbeitsraum, Aufenthaltsraum"]
["B","B2.4","Hebe-, Verlade-, Transport-, Lagereinrichtung"]
["B","B2.5","Einrichtung für Materialaufbereitung"]
["B","B2.6","Winterbaumassnahme"]
["B","B3","Provisorium"]
["B","B3.1","Provisorisches Rückhaltesystem"]
["B","B3.2","Provisorische Werkleitung"]
["B","B3.3","Provisorisches Gebäude"]
["B","B3.4","Provisorisches Verkehrsanlage"]
["B","B3.5","Provisorische Ausstattung"]
["B","B4","Erschliessung durch Werkleitungen"]
["B","B4.1","Kanalisationsleitung"]
["B","B4.2","Elektroleitung"]
["B","B4.3","Telekomunikationsleitung"]
["B","B4.4","Heizleitung, Kälteleitung"]
["B","B4.5","Wasserleitung"]
["B","B4.6","Gasleitung"]
["B","B5","Rückbau Entsorgung Bauwerk"]
["B","B5.1","Rückbau nicht kontaminiertes Bauwerk"]
["B","B5.2","Rückbau kontaminiertes Bauwerk"]
["B","B6","Baugrube"]
["B","B6.1","Abholzung, Rodung"]
["B","B6.2","Nicht kontaminierter Aushub"]
["B","B6.3","Kontaminierter Aushub"]
["B","B6.4","Böschungssicherung"]
["B","B6.5","Baugrubenabschluss"]
["B","B6.6","Materialeinbau"]
["B","B6.7","Wasserhaltung"]
["B","B7","Baugrundverbesserung, Bauwerkssicherung"]
["B","B7.1","Verbesserung von Baugründen"]
["B","B7.2","Pfählung"]
["B","B7.3","Unterfangung Bauwerk"]
["B","B7.4","Sicherung Bauwerk"]
["B","B8","Gerüst"]
["B","B8.1","Fassadengerüst"]
["B","B8.2","Arbeitsgerüst"]
["C","C","Konstruktion Gebäude"]
["C","C0"]
["C","C1","Bodenplatte, Fundament"]
["C","C1.1","Kanalisation Gebäude"]
["C","C1.2","Abdichtung, Dämmung Bodenplatte"]
["C","C1.3","Einzel-, Streifenfundament"]
["C","C1.4","Nicht tragende Bodenplatte"]
["C","C1.5","Tragende Bodenplatte"]
["C","C2","Wandkonstruktion"]
["C","C2.1","Aussenwandkonstruktion"]
["C","C2.2","Innenwandkonstruktion"]
["C","C3","Stützenkonstruktion"]
["C","C3.1","Aussenstütze"]
["C","C3.2","innenstütze"]
["C","C4","Decken-, Dachkonstruktion"]
["C","C4.1","Decke"]
["C","C4.2","Treppe, Rampe"]
["C","C4.3","Balkon"]
["C","C4.4","Dachkonstruktion"]
["C","C5","Ergänzende Leistungen zu Konstruktion"]
["C","C5.1","Durchbruch, Schlitz zu Konstruktion"]
["C","C5.2","Maschinensockel, Einlage"]
["D","D","Technik Gebäude"]
["D","D0"]
["D","D1","Elektroanlage"]
["D","D1.1","Apparat, Anlage Starkstrom"]
["D","D1.2","Installation Starkstrom"]
["D","D1.3","Leuchte"]
["D","D1.4","Elektrogerät"]
["D","D1.5","Apparat, Anlage Schwachstrom"]
["D","D1.6","Installation Schwachstrom"]
["D","D2","Automations-, Leit-, Komunikationssystem"]
["D","D2.1","Managementebene"]
["D","D2.2","Automationsebene"]
["D","D2.3","Feldebene"]
["D","D2.4","Raumautomation"]
["D","D2.5","Automationsnetzwerk"]
["D","D2.6","Schaltgerätekompination"]
["D","D2.7","Integration"]
["D","D3","Sicherheitssystem"]
["D","D3.1","Einbruch-, Überfallmeldeanlage"]
["D","D3.2","Zutrittskontrollanlage"]
["D","D3.3","Videoüberwachungsanlage"]
["D","D3.4","Perimeterschutz, Umgebungsschutz"]
["D","D4","Brandschutz"]
["D","D4.1","Brandmeldeanlage"]
["D","D4.2","Gasmeldeanlage"]
["D","D4.3","Nasslöschanlage"]
["D","D4.4","Trockenlöschanlage"]
["D","D4.5","Löschgerät"]
["D","D4.6","Rauch- und Wärmeabzugsanlage"]
["D","D5","Wärmeanlage"]
["D","D5.1","Lagerung zu Wärmeanlage"]
["D","D5.2","Wärmeerzeugung"]
["D","D5.3","Wärmehauptverteilung"]
["D","D5.4","Wärmeabgabe"]
["D","D6","Kälteanlage"]
["D","D6.1","Lagerung zu Kälteanlage"]
["D","D6.2","Kälteerzeugung"]
["D","D6.3","Kältehauptverteilung"]
["D","D6.4","Kälteabgabe"]
["D","D7","Lufttechnische Anlage"]
["D","D7.1","Aussenluftführung, Fortluftführung"]
["D","D7.2","Luftaufbereitung"]
["D","D7.3","Lufthauptverteilung"]
["D","D7.4","Luftabgabe"]
["D","D7.5","Kleinanlage für Zuluft, Abluft"]
["D","D8","Wasser,- Gas,- Druckluftanlage"]
["D","D8.1","Armatur, Apparat"]
["D","D8.2","Installationselement"]
["D","D8.3","Wasseraufbereitungsanlage, Abwasseraufbereitungsanlage"]
["D","D8.4","Versorgungsleitungen"]
["D","D8.5","Entsorgungsleitungen"]
["D","D8.6","Gasleitungen"]
["D","D8.7","Druckluftanlage, Vakuumanlage"]
["D","D9","Transportanlage"]
["D","D9.1","Personenaufzug"]
["D","D9.2","Lastenaufzug"]
["D","D9.3","Bettenaufzug"]
["D","D9.4","Fahrtreppe, Fahrsteig"]
["D","D9.5","Hubtisch, Verladestation, Spezialaufzug"]
["D","D9.6","Parkieranlage"]
["D","D9.7","Weitere Transportanlagen"]
["E","E","Äussere Wandbekleidung Gebäude"]
["E","E0"]
["E","E1","Äussere Wandbekleidung unter Terrain"]
["E","E1.1","Wandabdichtung unter Terrain"]
["E","E1.2","Aussenwärmedämmung unter Terrain"]
["E","E1.3","Schutzschicht unter Terrain"]
["E","E2","Äussere Wandbekleidung über Terrain"]
["E","E2.1","Äussere Beschichtung"]
["E","E2.2","Aussenwärmedämmung"]
["E","E2.3","Fassadenbekleidung"]
["E","E2.4","Fassadensystem"]
["E","E2.5","Bekleidung Untersicht"]
["E","E2.6","Absturzsicherung"]
["E","E3","Einbauten, Absturzsicherung zu Aussenwand"]
["E","E3.1","Fenster"]
["E","E3.2","Tür, Tor"]
["E","E3.3","Sonnenschutz"]
["F","F","Bedachung Gebäude"]
["F","F0"]
["F","F1","Dachhaut"]
["F","F1.1","Dachabdichtung unter Terrain"]
["F","F1.2","Flachdach"]
["F","F1.3","Geneites Dach"]
["F","F1.4","Blitzschutz"]
["F","F2","Einbauten, Absturzsicherung zu Dach"]
["F","F2.1","Einbauten zu Flachdach"]
["F","F2.2","Einbauten zu geneigtem Dach"]
["G","G","Ausbau Gebäude"]
["G","G0"]
["G","G1","Trennwand, Tür, Tor, Fenster"]
["G","G1.1","Feststehende Trennwand"]
["G","G1.2","Bewegliche Trennwand"]
["G","G1.3","Innenfenster"]
["G","G1.4","Innentür, innentor"]
["G","G1.5","Verdunklung"]
["G","G2","Bodenbelag"]
["G","G2.1","Unterkonstruktion zu Bodenbelag"]
["G","G2.2","Fertiger Bodenbelag"]
["G","G3","Wand- und Stützenbekleidung"]
["G","G3.1","Unterkonstruktion zu Wandbekleidung"]
["G","G3.2","Fertige Wandbekleidung"]
["G","G4","Decken- und Dachbekleidung"]
["G","G4.1","Unterkonstruktion zu Deckenbekleidung"]
["G","G4.2","Fertige Deckenbekleidung"]
["G","G5","Einbauten, Absturzsicherung zu Ausbau"]
["G","G5.1","Einbauschrank, Regal"]
["G","G5.2","Einbauküche"]
["G","G5.3","Innerer Fensterausbau"]
["G","G5.4","Schutzeinrichtung Umgebung"]
["G","G5.5","Ofen, Cheminèe"]
["G","G5.6","Kleinbauteil"]
["G","G5.7","Begrünung im Gebäude"]
["G","G6","Ergänzende Leistungen zu Ausbau"]
["G","G6.1","Durchbruch, Schlitz zu Ausbau"]
["G","G6.2","Abschottung"]
["G","G6.3","Reinigung"]
["H","H","Nutzunsspezifische Anlage Gebäude"]
["H","H0"]
["H","H1","Produktions-, Laboranlagen"]
["H","H1.1"]
["H","H1.2"]
["H","H1.3"]
["H","H1.4"]
["H","H2","Grossküche"]
["H","H2.1"]
["H","H2.2"]
["H","H2.3"]
["H","H2.4"]
["H","H3","Wäscherei-, Reinigungsanlage"]
["H","H3.1"]
["H","H3.2"]
["H","H3.3"]
["H","H3.4"]
["H","H4","Spitalanlage"]
["H","H4.1"]
["H","H4.2"]
["H","H4.3"]
["H","H4.4"]
["H","H4.5"]
["H","H4.6"]
["H","H4.7"]
["H","H4.8"]
["H","H4.9"]
["H","H4.10"]
["H","H5","Anlage für Bildung, Kultur"]
["H","H5.1"]
["H","H5.2"]
["H","H5.3"]
["H","H5.4"]
["H","H6","Sport-, Freizeitanlage"]
["H","H6.1"]
["H","H6.2"]
["H","H6.3"]
["H","H6.4"]
["H","H7","Weitere nutzungsspezifische Anlagen"]
["H","H7.1"]
["H","H7.2"]
["H","H7.3"]
["H","H7.4"]
["I","I","Umgebung Gebäude"]
["I","I0"]
["I","I1","Umgebungsgestalltung"]
["I","I1.1","Geländeanpassung"]
["I","I1.2","Böschungssicherung Umgebung"]
["I","I1.3","Schutz Pflanzenbestand"]
["I","I1.4","Entwässerung"]
["I","I2","Bauwerk in Umgebung"]
["I","I2.1","Stützmauer"]
["I","I2.2","Frei stehende Wand"]
["I","I2.3","Kleinbauwerk"]
["I","I3","Grünfläche"]
["I","I3.1","Vegetationsschicht"]
["I","I3.2","Rasen"]
["I","I3.3","Bepflanzung"]
["I","I3.4","Wasserfläche"]
["I","I4","Hartfläche"]
["I","I4.1","Fundationsschicht"]
["I","I4.2","Abschluss"]
["I","I4.3","Belag"]
["I","I4.4","Gleisoberbau"]
["I","I5","Schutzeinrichtung Umgebung"]
["I","I5.1","Rückhaltesystem"]
["I","I5.2","Einfriedung"]
["I","I5.3","Immissionsschutz"]
["I","I6","Technik Umgebung"]
["I","I6.1","Elektroanlage Umgebung"]
["I","I6.2","Wärmeanlage Umgebung"]
["I","I6.3","Kälteanlage Umgebung"]
["I","I6.4","Wasser-, Gas-, Druckluftanlage Umgebung"]
["I","I6.5","Transportanlage Umgebung"]
["I","I7","Ausstattung Umgebung"]
["I","I7.1","Ausstattungsgegenstand"]
["I","I7.2","Gerät Umgebung"]
["J","J","Ausstattung Gebäude"]
["J","J0"]
["J","J1","Mobiliar"]
["J","J1.1","Allgemeines Mobiliar"]
["J","J1.2","Nutzungsspezifisches Mobiliar"]
["J","J1.3","Mobile Leuchte"]
["J","J1.4","Signaletik"]
["J","J2","Kleininventar"]
["J","J2.1","Allgemeines Kleininventar"]
["J","J2.2","Nutzungsspezifisches Kleininventar"]
["J","J2.3","Mobiles Gerät"]
["J","J3","Textilien"]
["J","J3.1","Allgemeine Textilien"]
["J","J3.2","Nutzungsspezifische Textilien"]
["J","J4","Kunst am Bau"]
["J","J4.1","Kunstobjekt"]
["J","J4.2","Künstlerisch gestalltetes Bauteil"]
[null,"K"]
[null,"L"]
[null,"M"]
[null,"N"]
[null,"O"]
[null,"P"]
[null,"Q"]
[null,"R"]
[null,"S"]
[null,"T"]
[null,"U"]
["V","V","Planungskosten"]
["V","V0"]
["V","V1","Planer"]
["V","V1.1","Architekt"]
["V","V1.2","Buingenieur"]
["V","V1.3","Fachingenieur Gebäudetechnik"]
["V","V1.4","Spezialist"]
["V","V1.5","Generalplaner, Planergemeinschaft"]
["V","V2","Unternehmer"]
["V","V2.1","Beratung zur Planung"]
["V","V2.2","Vorbereitung zur Bewirtschaftung"]
["V","V3","Auftraggeber"]
["V","V3.1","Auswahlverfahren"]
["V","V3.2","Eigentümer"]
["V","V3.3","Betreiber"]
["V","V3.4","Nutzer"]
["V","V3.5","Berater"]
["W","W","Nebenkosten"]
["W","W0"]
["W","W1","Bewilligung, Gebühren"]
["W","W1.1","Bewilligung, Gebühren"]
["W","W1.2","Gebühr"]
["W","W2","Versicherung, Garantie"]
["W","W2.1","Versicherung"]
["W","W2.2","Garantie"]
["W","W2.3","Rückvergütung"]
["W","W3","Kapitalkosten"]
["W","W3.1","Kapitalkosten zu Grundstück"]
["W","W3.2","Kapitalkosten zu erstellung"]
["W","W4","Bewirtung, Öffentlichkeitsarbeit, Entschädigung"]
["W","W4.1","Bewirtungskosten"]
["W","W4.2","Öffentlichkeitsarbeit"]
["W","W4.3","Entschädigung, Bewachung"]
["W","W5","Inbetriebnahme"]
["W","W5.1","Inbetriebnahme baulicher Anlagen"]
["W","W6","Vermietung, Verkauf"]
["W","W6.1","Vergütung zu Erstvermietung"]
["W","W6.2","Nebenkosten zu Erstvermietung"]
["W","W6.3","Vergütung zu Verkauf"]
["W","W6.4","Nebenkosten zu Verkauf"]
["W","W7","Betriebserfolg"]
["W","W7.1","Betriebsaufwand"]
["W","W7.2","Betriebsertrag"]
[null,"X"]
["Y","Y","Reserve, Teuerung"]
["Y","Y0"]
["Y","Y1","Reserve, Teuerung"]
["Y","Y1.1","Reserve"]
["Y","Y2","Teuerung"]
["Y","Y2.1","Teuerung"]
["Z","Z","Mehrwertsteuer"]
["Z","Z0"]
["Z","Z1","Mehrwertsteuer"]
["Z","Z1.1","Mehrwertsteuer"]

{"sheet":"Sheet3","index":13,"n_rows":8,"n_cols":9,"rows_kept":8,"cut":false,"hidden":true,"merged":[]}
[]
[{"$f":"SUM($B$2:$I$2)","v":212},25,33,55,1,66,7,13,12]
[{"$f":"SUM($B2:$I2)","v":212}]
[{"$f":"SUM($B4:$I4)","v":0}]
[{"$f":"SUM($B5:$I5)","v":0}]
[{"$f":"SUM($B6:$I6)","v":0}]
[{"$f":"SUM($B7:$I7)","v":0}]
[0]

{"sheet":"Baupreisindex","index":14,"n_rows":155,"n_cols":56,"rows_kept":155,"cut":false,"hidden":false,"merged":[]}
[null,null,null,"<POND_02>","<Date_Mois_Octobre>","<Date_Mois_Avril>"]
["<cc-05.05.01_Titre>",null,"Schweizerischer Baupreisindex - Entwicklung der Baupreise"]
["<cc-05.05.01_Sous-tItre>",null,"Indexwerte pro Grossregion und pro Objekttyp"]
["<BASE_2020>",null,"Basis Oktober 2020 = 100"]
[null,null,null,"Gewicht in %","Oktober","April","Oktober","April","Oktober","April","Oktober","April","Oktober","April","Oktober","April","Oktober","April","Oktober","April","Oktober","April","Oktober","April","Oktober","April","Oktober","April","Oktober","April","Oktober","April","Oktober","April","Oktober","April","Oktober","April","Oktober","April","Oktober","April","Oktober","April","Oktober","April","Oktober","April","Oktober","April","Oktober","April","Oktober","April","Oktober","April"]
[null,null,null,null,1998,1999,1999,2000,2000,2001,2001,2002,2002,2003,2003,2004,2004,2005,2005,2006,2006,2007,2007,2008,2008,2009,2009,2010,2010,2011,2011,2012,2012,2013,2013,2014,2014,2015,2015,2016,2016,2017,2017,2018,2018,2019,2019,2020,2020,2021,2021,2022,2022,2023,2023,2024]
[]
["<REG_01>","Schweiz","Schweiz"]
["<OBJ_02>","Schweiz","Baugewerbe : Total",100,78.7,79.5,81.599999999999994,83.1,85,87,86.9,86.3,85.5,84.6,84.9,85.2,86.9,87.4,88.6,89.6,91.9,93.5,95.3,97,98.7,96.8,96.9,96.9,97.6,99.1,99.7,99.7,99.9,100.1,100.7,100.5,100.4,99.8,100.3,99.7,99.3,98.9,98.9,99.3,99.6,100,100,100.2,100,101.4,104.1,109.2,112.7,113.9,114.5,115]
["<OBJ_03>","Schweiz","Hochbau",77.67,80.400000000000006,80.900000000000006,82.8,84.2,86,87.6,87.8,87.5,86.8,85.7,85.8,85.8,87.3,88.1,88.9,90,92.2,93.9,95.6,97.6,99.2,97.9,97.8,97.5,98.6,99.9,100.4,100.3,100.4,100.6,101.1,101.1,100.8,100.2,100.7,100.1,99.4,99,99.1,99.5,99.7,100.3,100.1,100.3,100,101.5,104.6,109.7,113.2,114.3,114.8,115.2]
["<OBJ_04>","Schweiz","Neubau",45.11,80.400000000000006,81.099999999999994,83,84.7,86.5,88.3,88.3,87.8,86.9,85.6,85.7,85.6,87.4,88.1,88.9,90,92.3,93.8,95.6,97.6,99.4,97.4,97.1,96.9,98.1,99.6,99.8,99.6,99.7,99.9,100.3,100.3,99.9,99.2,99.7,99.3,98.7,98.5,98.9,99.4,99.6,100,100,100.1,100,101.6,104.8,110.2,113.8,115.1,115.5,115.9]
["<OBJ_05>","Schweiz","Neubau Mehrfamilienhaus",25.7,81.2,82,83.8,85.7,87.6,89.2,89,88.3,87.4,86,86.1,86,87.9,88.5,89.4,90.4,92.7,94.1,95.7,97.7,99.6,97.3,97.1,96.8,98.1,99.4,99.6,99.4,99.4,99.5,99.9,100.1,99.6,99,99.5,99.2,98.7,98.5,99.1,99.5,99.7,100.1,100,100.2,100,101.4,104.5,109.7,113.6,114.9,115.5,115.7]
["<OBJ_06>","Schweiz","Neubau Mehrfamilienhaus aus Holz",5.17,"…","…","…","…","…","…","…","…","…",85.7,85.8,85.6,87,87.6,88.3,89.4,91.5,93.3,94.7,96.8,98.4,96.3,96.3,96,97.4,99,99.7,99.1,99.1,99,99.4,99.4,99.1,98.7,99.2,99.1,98.4,98.5,98.5,99.3,99.7,99.8,99.3,99.6,100,102.6,106.8,112.2,115.1,116.5,115.9,116.6]
["<OBJ_07>","Schweiz","Neubau Einfamilienhaus",5.38,"…","…","…","…","…","…","…","…","…","…","…","…","…","…","…","…","…","…","…","…","…","…","…","…",97.4,98.8,99,98.9,99.1,98.9,99.6,100.2,99.8,98.8,99.4,99.1,98.4,97.9,98.3,99.4,99.3,99.9,99.8,100,100,100.9,103.8,108.9,111.9,113.6,114.1,114.6]
["<OBJ_08>","Schweiz","Neubau Bürogebäude",5.39,79.2,79.8,82.3,83.3,85,87.1,88.1,88.1,87.3,86.4,86.3,86.2,87.5,88.6,89.1,90.6,93.1,95,97.1,99.2,100.8,99.8,99.5,99.2,100.3,102.3,102.7,102,102.5,103.4,103.7,102.6,102.6,101.4,102,100.9,100.3,99.6,99,99.3,99.3,99.7,100.4,100.4,100,101.9,104.8,110.7,114.8,116.1,116.5,117.6]
["<OBJ_09>","Schweiz","Neubau Lagerhalle",3.47,"…","…","…","…","…","…","…","…","…","…","…","…","…","…","…","…","…","…","…","…","…","…","…","…",97.4,99,99.5,99.8,99.8,100,100.5,100,99.6,98.7,99.1,98.2,97.9,98.1,99.2,99.4,99.5,99.9,100.2,100.1,100,102.3,106.1,111.9,114.8,115.3,115.1,115.9]
["<OBJ_10>","Schweiz","Renovation, Umbau",32.56,"…","…","…","…","…","…","…","…","…","…","…","…","…","…","…","…","…","…","…","…","…","…","…","…",99.3,100.5,101.2,101.1,101.4,101.6,102.1,102.1,101.9,101.5,102,101,100.3,99.6,99.2,99.7,99.8,100.6,100.3,100.5,100,101.4,104.3,109.1,112.4,113.2,113.9,114.2]
["<OBJ_11>","Schweiz","Renovation Mehrfamilienhaus",21.06,77.099999999999994,77.3,79.099999999999994,80,81.5,82.9,83.3,83.5,83.2,82.3,82.5,82.5,83.6,84.5,85.3,86.5,88.2,90.2,91.8,93.8,95,94.9,95.1,94.8,95.4,96.5,97.1,96.8,96.9,96.9,97.3,97.5,97.3,96.9,97.1,95.8,95.7,96.2,97.1,97.9,97.8,98.8,99.8,100.3,100,101.2,104.2,109.2,112.4,113.2,114,114.2]
["<OBJ_12>","Schweiz","Renovation Bürogebäude",11.5,"…","…","…","…","…","…","…","…","…","…","…","…","…","…","…","…","…","…","…","…","…","…","…","…",96.3,97.5,98.5,98.6,99.1,99.6,100.2,99.9,99.8,99.4,100.2,99.6,99.2,98.5,98.1,98.5,98.7,99.5,100,100.1,100,101.8,104.4,108.9,112.4,113.2,113.8,114.4]
["<OBJ_13>","Schweiz","Tiefbau",22.33,73,74.400000000000006,77.2,78.900000000000006,81.3,84.3,83.3,81.8,80.8,80.400000000000006,81.099999999999994,82.7,84.9,84.5,86.6,87.4,90,91.5,93.1,94.2,96.1,92.4,92.9,93.8,93.8,95.7,96.7,97.3,97.9,98.3,99.2,98.2,98.8,98.2,98.5,98.3,98.6,98.6,98.5,98.3,99.1,99.1,99.7,99.9,100,101.1,102.4,107.5,111.1,112.4,113.6,114.3]
["<OBJ_14>","Schweiz","Neubau Strasse",3.44,74.5,76,78.8,80.5,83,86,84.7,83.2,82.1,81.599999999999994,82.3,83.3,84.5,84.4,86.3,87.4,90.5,91.5,93.5,94,95,91.7,92.4,93.5,93,94.8,95.9,96.5,97.2,97.8,98.7,97.9,98.5,97.9,98.4,98.3,98.5,98.7,98.4,98.2,99,98.9,99.5,99.8,100,101.5,103.2,107.1,110.3,111.8,113,114]
["<OBJ_15>","Schweiz","Neubau Unterführung",1.71,"…","…","…","…","…",85.6,84.9,83.2,82.4,82,82.8,85.2,88.3,87.6,90.1,90.6,92.8,94.7,96.1,97.8,100.7,96.4,96.8,97.4,97.9,100.8,101.5,101.9,101.8,101.3,102,100.2,101,100.1,99.2,98.6,99.1,98.4,98.7,98.8,99.7,99.9,100.9,100.7,100,102.4,104.7,112,115.2,115.2,114.1,114.3]
["<OBJ_16>","Schweiz","Neubau Lärmschutzwand",7.0000000000000007E-2,"…","…","…","…","…","…","…","…","…","…","…","…","…","…","…","…","…","…","…","…","…","…","…","…",92.2,92.7,93.6,93.9,95.2,95.5,95.6,95.5,95.9,94.2,96,96.1,95.9,96.8,98.6,97.7,98.8,99.3,99,99.8,100,101.2,102.7,107.7,111.5,112.4,112.9,111.4]
["<OBJ_17>","Schweiz","Strassensanierung",17.11,"…","…","…","…","…","…","…","…","…","…","…","…","…","…","…","…","…","…","…","…","…","…","…","…","…","…","…","…","…","…","…","…","…","…","…","…","…","…","…","…","…","…","…","…",100,100.8,102,107.1,110.8,112.2,113.6,114.3]
[null,null,null,null,"","","","","","","","","","","","","","","","","","","","","","","","","","","","","","","","","","","","","","","","","","","","","","","","","","",""]
["<REG_02>","Genferseeregion","Genferseeregion",null,"","","","","","","","","","","","","","","","","","","","","","","","","","","","","","","","","","","","","","","","","","","","","","","","","","",""]
["<OBJ_02>","Genferseeregion","Baugewerbe : Total",100,74.900000000000006,75.900000000000006,78.3,79.7,81.7,84.6,84.7,85.8,84.5,84.8,84.6,85.9,88,89,90.3,91.9,93.9,95.6,97.4,99.1,100.4,98.4,98.3,98.4,98.4,100.2,100.7,100.4,100.4,100.6,101.3,100.8,100.6,99.9,101.1,99.9,99.1,99.3,99.4,99.5,99.5,99.8,100.3,100.3,100,101.2,103.7,108.5,111.2,113.4,113.9,114]
["<OBJ_03>","Genferseeregion","Hochbau",77.33,75,75.900000000000006,78.099999999999994,79.900000000000006,81.7,83.7,83.6,84.9,84.4,84.4,83.9,84.7,86.3,87.8,89,91,92.8,94.5,96.5,98.2,99.6,98.1,98.1,98,98.5,100.3,100.8,100.1,100.3,100.6,101.3,101.1,100.6,99.9,100.9,99.7,99.1,99.3,99.4,99.6,99.7,99.8,100.2,100.3,100,101,103.7,108.5,111.4,113.4,113.7,113.6]
["<OBJ_04>","Genferseeregion","Neubau",46.34,75.400000000000006,76.400000000000006,78.8,80.599999999999994,82.4,84.9,84.6,85.9,85.2,84.9,84.4,85.3,87.1,88.3,89.6,91.5,93.6,95,96.9,98.3,99.9,98.1,97.8,97.7,98.4,100.3,100.9,100.1,100.3,100.5,101,101.2,100.5,99.8,100.8,99.9,99.2,99.4,99.4,99.6,99.7,99.8,100.4,100.4,100,101.4,104.1,108.9,112.2,114,114.4,114.3]
["<OBJ_05>","Genferseeregion","Neubau Mehrfamilienhaus",26.47,75.599999999999994,76.7,78.7,80.8,82.6,85.1,84.5,85.5,84.9,84.5,84,85,86.9,88.1,89.5,91.4,93.5,94.7,96.3,97.7,99.5,97.4,97.3,97.1,97.7,99.6,100.1,99.4,99.8,99.8,100.2,100.5,99.8,99.2,100.4,99.5,98.9,99.2,99.4,99.9,99.9,100,100.4,100.6,100,101.4,104,108.6,112.1,114,114.4,114.2]
["<OBJ_06>","Genferseeregion","Neubau Mehrfamilienhaus aus Holz",0.95,"…","…","…","…","…","…","…","…","…",84.5,84.5,85.6,87.4,88.5,90.3,92.2,93.7,95.3,97.3,99.4,100.8,98.5,98.6,98.6,98.8,101.1,102.5,101.4,101.3,102.1,102.4,102.6,102,101.3,102.1,100.8,100.1,100.2,100.4,100.3,100,100.6,100,99.8,100,101.9,104.6,109.2,112.3,114.8,115,115.1]
["<OBJ_07>","Genferseeregion","Neubau Einfamilienhaus",7.58,"…","…","…","…","…","…","…","…","…","…","…","…","…","…","…","…","…","…","…","…","…","…","…","…",98.7,100.5,101,100,100.1,100.1,101.1,102.2,101.3,100.8,102.2,100.9,100.5,100.1,100.4,100.7,100.3,100.5,100.4,100.2,100,100.3,102.6,107.1,109.9,111.8,112.4,112.3]
["<OBJ_08>","Genferseeregion","Neubau Bürogebäude",6.79,74.900000000000006,75.900000000000006,79.5,80.5,82.2,84.5,85.1,87.6,86.9,86.7,86.1,86.9,88.2,89.5,90.4,92.3,94.4,96.4,99.3,100.9,101.8,100.6,100.2,100.1,101.2,103.4,103.7,102.6,102.7,103,103.2,101.9,101.9,100.5,100.9,100.4,99.3,99.4,98.4,98,98.8,98.4,100.4,100.2,100,102.1,105.2,111.1,114.4,116,116.4,116.8]
["<OBJ_09>","Genferseeregion","Neubau Lagerhalle",4.55,"…","…","…","…","…","…","…","…","…","…","…","…","…","…","…","…","…","…","…","…","…","…","…","…",97.7,99.6,100,100.2,100.2,100.9,101.7,101.2,100.5,99.6,100.4,98.9,98.5,98.6,99.1,99.4,99.3,99.5,100.5,100,100,102.2,105.2,111,113.5,114.4,114.2,114.8]
["<OBJ_10>","Genferseeregion","Renovation, Umbau",30.99,"…","…","…","…","…","…","…","…","…","…","…","…","…","…","…","…","…","…","…","…","…","…","…","…",99.5,101.1,101.6,101,101.2,101.6,102.4,101.9,101.6,101,101.9,100.4,99.9,99.9,99.9,100.1,100.1,100.2,100.1,100.2,100,100.5,103.1,107.8,110.2,112.5,112.6,112.4]
["<OBJ_11>","Genferseeregion","Renovation Mehrfamilienhaus",21.69,69.7,70.3,72,73.8,75.3,76.5,76.8,77.900000000000006,77.7,78.3,78,78.5,79.5,81.5,82.5,84.4,85.7,87.8,89.8,91.9,92.8,92,92.4,92.3,92.6,94.1,94.5,93.8,94,94.3,94.9,94.9,94.5,94.1,95,93.1,93,94.4,95.7,96.5,96.4,97.2,99.4,100,100,100.3,102.9,107.4,109.5,112,112.2,111.8]
["<OBJ_12>","Genferseeregion","Renovation Bürogebäude",9.3000000000000007,"…","…","…","…","…","…","…","…","…","…","…","…","…","…","…","…","…","…","…","…","…","…","…","…",97.2,98.5,99.4,98.9,99.1,99.8,100.7,99.3,99.2,98.4,99.3,98.5,97.5,98.1,97.5,96.8,97.3,97.7,99.1,99.6,100,100.8,103.5,108.7,111.7,113.8,113.7,113.7]
["<OBJ_13>","Genferseeregion","Tiefbau",22.67,74.400000000000006,75.599999999999994,78.8,78.900000000000006,81.599999999999994,87.2,87.9,88.5,84.5,85.9,86.6,89.3,93,92.5,94,94.6,97.2,99,100.1,101.5,102.7,99.1,98.6,99.6,97.7,99.9,100,101.5,100.6,100.7,101.6,99.3,100.3,99.5,101.6,100.5,99,99.4,99.7,99.2,98.9,99.7,100.8,100.6,100,101.6,103.6,108.6,110.6,113.3,114.6,115.5]
["<OBJ_14>","Genferseeregion","Neubau Strasse",4.75,77.5,78.8,82.1,82.2,85,90.8,91,92.3,87.4,88.1,88.1,90.7,93,92.8,93.2,94.6,98.7,100.2,101.3,102,103,100,99,100.7,97.6,99.6,99.6,101.2,100.2,100.5,101.6,99.3,100.4,99.7,101.9,100.9,99.4,100.1,100.4,99.4,99.1,99.8,100.8,100.6,100,101.6,103.9,107.8,109.8,112.4,113.7,115.1]
["<OBJ_15>","Genferseeregion","Neubau Unterführung",1.85,"…","…","…","…","…",84.8,86.1,86.1,82.8,84.9,86.3,89.1,94.2,93.3,95.9,95.8,97,99.1,100.2,102.2,103.6,99.4,99.4,99.7,99,102.1,102.8,103.6,103,102.3,102.1,99.6,100.2,99.3,100.4,98.6,97.5,96.5,97.1,98.1,98.1,99.5,100.9,100.8,100,103.1,105.8,114.1,115.9,116.4,115.2,115.4]
["<OBJ_16>","Genferseeregion","Neubau Lärmschutzwand",7.0000000000000007E-2,"…","…","…","…","…","…","…","…","…","…","…","…","…","…","…","…","…","…","…","…","…","…","…","…",94.2,94.8,95.6,97,98,98.6,98,97.3,97.8,96.1,98.5,98.4,97.6,98.3,100.2,99.2,99.5,100.1,99.9,100.2,100,101.4,102.8,107.6,110.9,112,112.3,110.7]
["<OBJ_17>","Genferseeregion","Strassensanierung",16,"…","…","…","…","…","…","…","…","…","…","…","…","…","…","…","…","…","…","…","…","…","…","…","…","…","…","…","…","…","…","…","…","…","…","…","…","…","…","…","…","…","…","…","…",100,101.4,103.2,108.2,110.2,113.2,114.8,115.7]
[null,null,null,null,"","","","","","","","","","","","","","","","","","","","","","","","","","","","","","","","","","","","","","","","","","","","","","","","","","",""]
["<REG_03>","Espace Mittelland","Espace Mittelland",null,"","","","","","","","","","","","","","","","","","","","","","","","","","","","","","","","","","","","","","","","","","","","","","","","","","",""]
["<OBJ_02>","Espace Mittelland","Baugewerbe : Total",100,77.5,79.2,80.599999999999994,81.900000000000006,83.6,86.5,87.2,86.6,85.4,84.5,84.8,85.6,87.4,87.5,88.7,90.3,92.9,93.4,95.1,97,99.2,96.5,96.7,96.8,97.8,98.8,99.5,99.7,99.9,99.5,99.9,99.3,99.8,99,99.4,99.1,98.5,97.9,98.3,98.5,99.4,99.8,99.8,100.3,100,101.4,104.6,109.6,112.7,112.9,113.2,114.4]
["<OBJ_03>","Espace Mittelland","Hochbau",77.400000000000006,80.3,81.8,82.8,84,85.8,87.9,88.9,89.1,87.7,86.7,86.8,87.1,88.8,89.1,89.8,91.5,93.8,94.4,96,98,99.9,98.1,98,97.6,98.8,100,100.7,100.6,100.7,100,100.1,99.7,99.8,99.3,99.7,99.6,98.8,98.2,98.6,99.2,99.7,100.4,100.1,100.5,100,101.5,104.9,110.3,113.3,113.7,113.7,114.9]
["<OBJ_04>","Espace Mittelland","Neubau",41.8,79.400000000000006,81.099999999999994,82.1,83.6,85.3,87.6,88.4,88.8,87.1,86.2,86.3,86.8,88.5,88.5,89.3,90.8,93.4,93.8,95.2,97.6,100,97.2,96.8,96.2,97.8,99,99.5,99.5,99.5,99,99.3,99.1,99.3,98.7,98.9,98.8,98,97.7,98.5,99,99.4,100,100,100.2,100,101.3,105.1,110.5,113.6,114.5,114.3,115.4]
["<OBJ_05>","Espace Mittelland","Neubau Mehrfamilienhaus",22.41,79.5,81.2,82.1,83.9,85.5,87.6,88.4,88.7,86.9,86,86.1,86.6,88.3,88.3,89.1,90.5,93.1,93.4,94.8,97.2,99.6,96.8,96.4,95.8,97.5,98.4,98.8,98.7,98.6,98.2,98.5,98.4,98.6,98.3,98.6,98.7,97.8,97.4,98.5,99,99.5,100.1,100.3,100.4,100,101.1,104.7,109.6,112.9,113.9,113.9,114.9]
["<OBJ_06>","Espace Mittelland","Neubau Mehrfamilienhaus aus Holz",6.02,"…","…","…","…","…","…","…","…","…",87.1,86.9,87.6,89.1,89.5,90,91.4,93.9,94.8,96.3,98.5,100.2,97.9,98.2,96.6,98.3,99.8,100.4,99.7,99.9,98.8,99.3,99.6,99.4,99,99.1,99.5,98.4,98.6,98.8,99.4,99.6,100,98.9,99.2,100,102,106.6,112.1,114.7,115.7,114.8,115.5]
["<OBJ_07>","Espace Mittelland","Neubau Einfamilienhaus",5.84,"…","…","…","…","…","…","…","…","…","…","…","…","…","…","…","…","…","…","…","…","…","…","…","…",96.6,97.8,98.3,98.7,98.6,97.7,98.1,98.6,98.8,98.4,98.3,98.2,97.4,97,97.6,98.8,98.8,99.7,99.6,100.1,100,101.1,104.2,109.8,112.8,114.3,113.9,115.3]
["<OBJ_08>","Espace Mittelland","Neubau Bürogebäude",3.57,80.400000000000006,82.5,83.7,84.4,86.3,89,90,90.8,89.3,88.7,88.5,89.1,90.8,90.9,91.6,93.5,96,97,98.3,100.7,103.1,100.7,99.9,99.3,100.7,102.9,103.8,103.9,104.3,104.2,104,102.4,102.7,100.7,101.2,100,100.1,98.7,98.8,98.8,99.5,100.4,100.6,101,100,101.3,104.9,112,115.6,115.9,116.4,118.8]
["<OBJ_09>","Espace Mittelland","Neubau Lagerhalle",3.9600000000000004,"…","…","…","…","…","…","…","…","…","…","…","…","…","…","…","…","…","…","…","…","…","…","…","…",97.4,98.7,99.2,99.8,99.7,99.3,99.5,99,99.2,98.2,98.5,97.7,97.2,97.3,98.9,98.9,99.4,99.8,100.1,100,100,101.8,106.1,112.5,115,115,114,115.6]
["<OBJ_10>","Espace Mittelland","Renovation, Umbau",35.6,"…","…","…","…","…","…","…","…","…","…","…","…","…","…","…","…","…","…","…","…","…","…","…","…",100.1,101.1,102.2,101.9,102.2,101.2,101.2,100.4,100.5,100.1,100.7,100.7,99.9,99,98.8,99.4,100.1,100.8,100.3,100.9,100,101.6,104.7,110.2,112.9,112.8,113,114.2]
["<OBJ_11>","Espace Mittelland","Renovation Mehrfamilienhaus",26.12,80.5,81.5,82.6,83.2,85.2,86.9,88.2,87.9,87.1,85.9,86,86,87.7,88.3,89.1,90.9,92.7,93.6,95.6,96.9,97.8,97.8,98.2,98.4,98.8,99.7,100.8,100.3,100.4,99.3,99.4,99.3,99.2,99.2,99.2,98.9,98.2,97.4,98.1,99.2,99.5,100.2,100.1,100.8,100,101.7,105,110.8,113.5,113.3,113.4,114.5]
["<OBJ_12>","Espace Mittelland","Renovation Bürogebäude",9.48,"…","…","…","…","…","…","…","…","…","…","…","…","…","…","…","…","…","…","…","…","…","…","…","…",98.7,100,101,101,101.5,100.6,100.5,98.9,99.3,98.2,99.6,99.2,99,97.7,97.9,98.3,99.1,99.7,99.9,99.6,100,101.5,104,108.6,111.4,111.3,112,113.2]
["<OBJ_13>","Espace Mittelland","Tiefbau",22.6,69.2,71,73.599999999999994,75.2,76.599999999999994,81.7,81.5,78.7,78.3,77.8,78.400000000000006,80.8,82.6,82.4,84.6,86.4,89.7,89.7,91.7,93.4,96.4,91,92.3,93.7,94.1,94.3,95.1,96.4,96.6,97.9,98.9,97.7,99.5,98.1,98.3,97.1,97.4,96.7,97.1,96.3,98.2,97.8,98.3,99.4,100,101.1,103.3,106.9,110.6,110.2,111.7,113.1]
["<OBJ_14>","Espace Mittelland","Neubau Strasse",4.28,69.599999999999994,71.400000000000006,74,75.599999999999994,77.099999999999994,82.2,82.5,80.2,79.400000000000006,79.3,79.8,81.3,82.9,82.4,84.6,87,90.6,89.7,92.8,94.4,95,89.8,90.9,93.7,93.5,93.5,94.3,95.6,95.9,97.5,98.6,97.5,99.4,97.9,98.3,97.2,97.5,96.9,97.2,96,98.1,97.4,98,99.4,100,101.2,103.7,107.5,111.3,110.9,112.3,113.8]
["<OBJ_15>","Espace Mittelland","Neubau Unterführung",1.94,"…","…","…","…","…",83.6,82.9,79.7,79.5,78.599999999999994,79.400000000000006,82.6,84.8,85,87.1,88.3,91.5,92.4,93.4,95.2,100.6,94.9,96.5,96.5,97.5,99.2,99.9,101.3,100.6,100.4,101.2,98.9,101,100,98.3,96.6,97.2,95.7,97.1,97.6,98.9,99.4,99.5,99.4,100,102.1,105.1,110.3,114.6,114.5,114,114.6]
["<OBJ_16>","Espace Mittelland","Neubau Lärmschutzwand",0.08,"…","…","…","…","…","…","…","…","…","…","…","…","…","…","…","…","…","…","…","…","…","…","…","…",91.9,91.8,92.8,93.4,94.7,95.4,95.7,95.4,96.4,94.3,96,95.8,95.5,96.1,98,96.9,98.2,98.9,98.5,99.6,100,101,102.5,107.2,111.3,112.5,113.2,111.9]
["<OBJ_17>","Espace Mittelland","Strassensanierung",16.3,"…","…","…","…","…","…","…","…","…","…","…","…","…","…","…","…","…","…","…","…","…","…","…","…","…","…","…","…","…","…","…","…","…","…","…","…","…","…","…","…","…","…","…","…",100,101,103,106.3,110,109.5,111.2,112.7]
[null,null,null,null,"","","","","","","","","","","","","","","","","","","","","","","","","","","","","","","","","","","","","","","","","","","","","","","","","","",""]
["<REG_04>","Nordwestschweiz","Nordwestschweiz",null,"","","","","","","","","","","","","","","","","","","","","","","","","","","","","","","","","","","","","","","","","","","","","","","","","","",""]
["<OBJ_02>","Nordwestschweiz","Baugewerbe : Total",100,84,83.7,86,88.1,90.7,90.3,89.1,87.1,87.2,84.9,85.6,84.5,87.5,88.8,90,90.7,92.8,94.5,96.7,97.7,99,96.8,95.8,96,97.3,97.9,98,98.4,99,100.4,101,102.3,101.8,101.4,101.9,101.6,100.8,99.8,100.4,99.9,99.8,100.7,100.5,100.5,100,102.5,105,111.9,115.3,116.8,117.7,117.4]
["<OBJ_03>","Nordwestschweiz","Hochbau",78.2,82.7,82.4,84.9,87,88.8,88.9,88.9,87.9,88,86.1,85.8,84.9,87.4,89.4,89.6,90.3,92.1,93.3,96.2,97.9,99.3,97.8,97,97.2,98,98.9,99,99.3,99.7,101.2,101.6,102.8,102.2,101.5,101.8,101.6,100.7,99.8,100.3,99.9,99.7,100.7,100.7,100.7,100,102.2,105.4,112.5,115.4,117.1,117.8,117.6]
["<OBJ_04>","Nordwestschweiz","Neubau",46.5,83.7,83.7,86.3,88.2,90.4,90.2,90,88.9,88.6,86.2,86,84.8,88,89.9,90,90.6,92.6,93.5,96.9,98.5,99.7,97.5,96.3,96.6,97.5,98.3,98.3,98.8,99.1,100.4,100.7,101.5,100.9,100.1,100.5,100.7,100.2,99.2,100,99.8,99.8,100.3,100.6,100.6,100,102.2,105.4,112.7,115.9,117.7,118.1,117.9]
["<OBJ_05>","Nordwestschweiz","Neubau Mehrfamilienhaus",26.46,83.7,83.6,86.1,87.9,90.3,90.1,89.5,88.4,88.2,85.6,85.4,84.1,87.8,89.8,89.9,90.4,92.4,93.3,96.6,98.1,99.3,96.8,95.4,95.8,96.6,97.5,97.1,97.8,98.1,99.6,99.8,101,99.9,99.1,99.4,99.9,99.4,98.4,99.5,99.2,99.5,100.1,100.6,100.7,100,102.2,105.4,112.7,116.3,118.1,118.7,118.1]
["<OBJ_06>","Nordwestschweiz","Neubau Mehrfamilienhaus aus Holz",4.42,"…","…","…","…","…","…","…","…","…",88.3,87.4,86.1,88.3,90.5,91,91.2,93.2,94.3,95.9,97.7,100,97.2,95.9,96.9,98.4,98.8,99,99.6,99.3,100.3,100.2,100.9,100.1,99.9,100.9,100.9,100,99.6,99.5,100.2,100.3,100.4,100.1,100.4,100,102.9,106.8,113.7,116.3,117.9,116.7,116.9]
["<OBJ_07>","Nordwestschweiz","Neubau Einfamilienhaus",5.65,"…","…","…","…","…","…","…","…","…","…","…","…","…","…","…","…","…","…","…","…","…","…","…","…",96.9,97.7,97.8,98.6,98.5,99.5,99.8,101.2,100.8,99.4,99.9,100.4,99.8,98.3,99,99.6,99.3,100.5,100.4,100.7,100,101.5,104.5,111.5,114.6,116.9,117.4,117.1]
["<OBJ_08>","Nordwestschweiz","Neubau Bürogebäude",6.31,84.2,84.4,87.6,89.5,91.1,91,92.1,90.8,90.7,88.8,88.6,87.5,89.1,91,90.9,91.7,94,94.9,98.6,100.5,101.7,100.6,100,100.1,101,102.3,102.4,102.1,102.5,104.1,104.6,104.2,104.7,104.3,104.9,103.9,103.4,102.4,102.6,101.6,100.5,100.6,100.8,100.6,100,102.1,104.8,112.3,115,117.1,117.9,118.8]
["<OBJ_09>","Nordwestschweiz","Neubau Lagerhalle",3.66,"…","…","…","…","…","…","…","…","…","…","…","…","…","…","…","…","…","…","…","…","…","…","…","…",96.8,97.6,97.7,98.6,99.2,100.1,100.6,101,100.4,99.4,99.8,99.8,99.6,99,100.4,100,99.9,100.6,100.6,100.5,100,102.7,106.8,113.6,115.9,116.7,117,117.3]
["<OBJ_10>","Nordwestschweiz","Renovation, Umbau",31.7,"…","…","…","…","…","…","…","…","…","…","…","…","…","…","…","…","…","…","…","…","…","…","…","…",99,99.9,100.2,100.2,100.8,102.6,103.1,104.9,104.1,103.7,103.8,102.9,101.4,100.7,100.7,100,99.5,101.4,100.8,100.9,100,102.2,105.2,112.2,114.8,116.3,117.3,117.1]
["<OBJ_11>","Nordwestschweiz","Renovation Mehrfamilienhaus",17.87,78.3,77.400000000000006,79.5,82.1,83,83.8,84,83.4,83.9,82.9,82.6,82.2,83.5,85.4,86,86.7,88,89.8,91.8,93.4,95.1,95.1,94.9,94.8,95.6,96.6,96.5,97.1,97.6,99,99.2,101.1,100.5,99.6,99.3,99.6,98.7,97.2,98.3,98.2,98.3,100.1,100.2,101.1,100,101.8,105,113,116,117.6,118.8,118.6]
["<OBJ_12>","Nordwestschweiz","Renovation Bürogebäude",13.83,"…","…","…","…","…","…","…","…","…","…","…","…","…","…","…","…","…","…","…","…","…","…","…","…",96.4,97.2,97.9,97,97.9,100.1,100.9,102.5,101.4,101.6,102.4,101.7,99.9,98.9,100.2,98.9,99,101,100.6,101.2,100,102.7,105.5,111.1,113.2,114.6,115.3,115.2]
["<OBJ_13>","Nordwestschweiz","Tiefbau",21.8,87,86.9,88.3,90.2,95.7,93.3,88.5,82.6,82.9,79.7,83.4,81.599999999999994,86.3,85.2,89.7,90.6,93.8,96.9,96.8,95.4,96.4,91.9,90.4,90.3,93.2,92.5,92.3,93.2,95.1,95.9,97.2,99.1,100.1,100.9,102,101.9,101.4,99.8,100.9,99.8,100.7,100.4,99.5,98.8,100,103.5,103.7,109.8,114.9,115.5,117.3,116.7]
["<OBJ_14>","Nordwestschweiz","Neubau Strasse",1.59,90.1,90,91.5,93.5,99.1,96.7,90.1,83.2,83.6,80.099999999999994,84.2,80.599999999999994,85,83.5,89,89.6,95.4,97.6,97.7,93.3,95.2,90.3,89.5,88.6,92.4,91.5,91.4,92.5,94.6,95.6,97.1,99,100.1,101.3,102.8,102.6,102.2,100.5,101.8,100.4,101.2,100.7,99.4,98.5,100,102.4,103.4,109.3,113.4,113.9,114.8,113.9]
["<OBJ_15>","Nordwestschweiz","Neubau Unterführung",0.99,"…","…","…","…","…",93.9,90.6,85.4,85.7,82.6,86.1,85.9,91.1,90.4,94.1,95.1,96.1,100.2,99.9,101.3,101.5,97.2,94.9,95.8,97.8,98.3,96.9,97.5,98.5,97.8,98.7,100.3,101.5,100.2,99.1,99.1,98.4,97.1,96.9,97.2,98.4,99.2,100,99.9,100,102.5,104.9,112.3,114.6,112.8,112.5,111.7]
["<OBJ_16>","Nordwestschweiz","Neubau Lärmschutzwand",0.04,"…","…","…","…","…","…","…","…","…","…","…","…","…","…","…","…","…","…","…","…","…","…","…","…",91.8,91.2,91.9,91.6,93.1,93.7,94.1,94.7,95.3,93.7,95.9,96.5,95.9,96.6,98.3,97.3,98.5,99,98.6,99.5,100,101.9,103.3,108.6,112.9,113.5,114.2,112.2]
["<OBJ_17>","Nordwestschweiz","Strassensanierung",19.18,"…","…","…","…","…","…","…","…","…","…","…","…","…","…","…","…","…","…","…","…","…","…","…","…","…","…","…","…","…","…","…","…","…","…","…","…","…","…","…","…","…","…","…","…",100,103.7,103.7,109.7,115.1,115.8,117.7,117.2]
[null,null,null,null,"","","","","","","","","","","","","","","","","","","","","","","","","","","","","","","","","","","","","","","","","","","","","","","","","","",""]
["<REG_05>","Zürich","Zürich",null,"","","","","","","","","","","","","","","","","","","","","","","","","","","","","","","","","","","","","","","","","","","","","","","","","","",""]
["<OBJ_02>","Zürich","Baugewerbe : Total",100,80.5,81.5,83.9,86.4,87.7,89.3,88.6,86.8,85.4,83.5,83.2,83.3,83.6,84.5,85.4,86.5,89.1,91.6,92.5,93.8,95.7,94.2,94.9,94.4,95.6,97.3,98.2,98.8,99.3,99.6,100.3,100.3,100,99.6,99.9,99.4,99.7,99.3,99.1,99.6,99.7,100.5,100.2,100.2,100,101.2,104.1,108.1,113.1,114,114.5,115.3]
["<OBJ_03>","Zürich","Hochbau",80.059999999999988,81.7,82.2,84.2,85.3,87.4,88.9,89,87.7,86.4,85.1,85.3,85,85.3,86.2,86.6,87.6,90.3,92.7,93.9,95.4,97.4,96.2,96.2,95.8,97.1,98.4,99,99.8,100.2,100.5,101,101.5,101.2,100.8,101.2,100.4,100.4,100,99.7,100.2,100.1,100.9,100.5,100.5,100,101.6,104.8,108.7,113.7,114.8,115.4,116]
["<OBJ_04>","Zürich","Neubau",45.97,82.6,83.4,85.5,87.2,89.6,91,91.1,89.3,87.5,86.1,86.3,85.9,86.3,87.3,88,89,92,94.1,95.3,96.7,99,97.3,97.1,96.8,98.3,99.7,100,100.1,100.4,100.5,100.9,101,100.5,100,100.5,99.7,99.7,99.5,99.6,100.1,100,100.6,100.1,100,100,101.6,104.6,109,114.2,115.6,116,116.6]
["<OBJ_05>","Zürich","Neubau Mehrfamilienhaus",27.85,83.9,84.8,87,89,91.4,92.7,92.6,90.5,88.7,87.1,87.3,87,87.5,88.4,89.2,90.1,93,95,96.1,97.4,99.8,97.6,97.4,97.1,98.8,100.1,100.5,100.5,100.6,100.6,100.9,101.1,100.6,100.2,100.5,99.8,99.9,99.7,100,100.3,100.2,100.9,100.2,100.1,100,101.3,104.3,108.6,113.9,115.2,115.8,116.1]
["<OBJ_06>","Zürich","Neubau Mehrfamilienhaus aus Holz",5.7,"…","…","…","…","…","…","…","…","…",85,85.1,84.6,85,85.5,85.8,86.2,89,91.6,93.1,94.3,95.8,94,94.1,94.3,96.1,97.2,98.2,98.1,98,97.5,98.1,98.1,98.1,97.8,98.4,98.3,98.4,98.9,98.7,99.3,100.2,100.2,99.8,99.7,100,103,106.7,111.5,115.7,117.1,116.9,117.4]
["<OBJ_07>","Zürich","Neubau Einfamilienhaus",2.98,"…","…","…","…","…","…","…","…","…","…","…","…","…","…","…","…","…","…","…","…","…","…","…","…",96.6,97.8,98.1,98.4,98.9,98.9,99.5,99.9,99.4,98.3,99,98.6,98.5,98.4,98.6,99.6,99.8,100.6,99.9,100,100,101.1,104.2,108.7,112.7,114.8,115.6,116]
["<OBJ_08>","Zürich","Neubau Bürogebäude",7.97,78.8,79.3,80.900000000000006,81.599999999999994,83.8,86.1,87,86,84.3,83.1,83.3,82.8,83,84,84.4,85.9,89.1,91.6,93,94.9,97.1,96.6,96.6,96.4,96.9,99,99.3,99.1,100.7,102.2,102.3,101.9,101.2,100.4,101.9,100.6,99.9,99.2,98.2,99.5,99.3,99.9,100.2,100,100,101.7,104.1,108.6,114.4,116,115.9,117.6]
["<OBJ_09>","Zürich","Neubau Lagerhalle",1.47,"…","…","…","…","…","…","…","…","…","…","…","…","…","…","…","…","…","…","…","…","…","…","…","…",96.4,98.5,99,99.5,99.9,100.3,100.5,100.2,99.8,99.2,99.7,98.6,99.2,99.3,100.5,100.6,100.2,100.6,100.2,100,100,102.4,106.3,110.3,115.7,116.5,116.6,117.4]
["<OBJ_10>","Zürich","Renovation, Umbau",34.090000000000003,"…","…","…","…","…","…","…","…","…","…","…","…","…","…","…","…","…","…","…","…","…","…","…","…",96.2,97.4,98.3,99.8,100.2,100.6,101.3,102.2,102,101.8,102.1,101.3,101.3,100.7,99.8,100.5,100.3,101.2,101,101,100,101.6,105.1,108.3,113.2,113.7,114.6,115.3]
["<OBJ_11>","Zürich","Renovation Mehrfamilienhaus",16.690000000000001,81.3,81.3,83,83.2,84.8,86.3,86.5,86.1,85.6,84.4,84.8,84.4,84.6,85.4,85.3,86.4,88.5,91.6,92.7,94.2,95.8,95.7,95.8,95.2,96.2,97.4,98.2,98.7,98.8,98.8,99.4,100.1,100,99.7,99.9,98.7,99.1,99.1,99.4,100.2,100,101.2,100.6,100.5,100,100.9,104.4,108.1,112.8,113.5,114.6,114.9]
["<OBJ_12>","Zürich","Renovation Bürogebäude",17.399999999999999,"…","…","…","…","…","…","…","…","…","…","…","…","…","…","…","…","…","…","…","…","…","…","…","…",93,94.3,95.3,97.5,98.3,99,99.7,100.8,100.6,100.4,100.7,100.5,101.4,99.8,98.9,99.7,99.1,100,100.2,100.5,100,102.4,105.7,108.5,113.5,114,114.6,115.8]
["<OBJ_13>","Zürich","Tiefbau",19.940000000000001,74.5,76.900000000000006,80.400000000000006,86.9,85.9,87.7,84.5,81.599999999999994,79.7,76.3,74.5,75.7,76.099999999999994,77.2,79.5,80.400000000000006,83,85.6,85.7,86.5,87.8,85.5,88.4,87.4,88.4,91.4,93.8,93.5,94.7,95.1,96.6,94.1,93.8,93.7,93.5,94.4,95.8,95.8,96.3,96.5,97.8,98.2,98.8,98.9,100,99.3,101.3,105.4,110.6,110.8,111.2,112.4]
["<OBJ_14>","Zürich","Neubau Strasse",1.88,76.2,78.599999999999994,82.2,88.9,87.8,89.7,87.2,83.1,81.5,78.599999999999994,77.400000000000006,78.5,77,77.7,80.7,80.8,83.5,85.9,85.5,85.5,85.7,83.5,87.8,85.6,86.4,89.5,92.1,92,93.3,94,95.6,93,92.5,92.5,92.6,93.5,95.4,95.7,95.8,96.1,97.4,97.9,98.2,98.7,100,100.2,102.2,104.7,109.9,109.7,109.4,110.4]
["<OBJ_15>","Zürich","Neubau Unterführung",1,"…","…","…","…","…",93.1,88.9,86.9,84.6,80.400000000000006,77.7,79.2,81.599999999999994,83.2,84.9,86.8,89.4,92.5,93.2,94.7,97.5,94.7,96.5,96.6,97.8,101,102.3,101.5,101.9,101,102.1,99.8,100,99.9,97.9,98.2,97.4,96.2,98.6,98.4,99.6,99.7,101.4,100.1,100,101.3,102.7,108.4,112.1,111.9,110.1,111.7]
["<OBJ_16>","Zürich","Neubau Lärmschutzwand",0.04,"…","…","…","…","…","…","…","…","…","…","…","…","…","…","…","…","…","…","…","…","…","…","…","…",92.1,93.3,94.1,93.8,94.9,94.9,95.2,94.8,94.8,93.1,94.9,95.8,95.5,96.2,98.3,97.3,98.4,99,98.7,99.4,100,100.9,102.3,106.7,111.2,111.7,112.2,110.8]
["<OBJ_17>","Zürich","Strassensanierung",17.02,"…","…","…","…","…","…","…","…","…","…","…","…","…","…","…","…","…","…","…","…","…","…","…","…","…","…","…","…","…","…","…","…","…","…","…","…","…","…","…","…","…","…","…","…",100,99.1,101.1,105.4,110.6,110.8,111.4,112.7]
[null,null,null,null,"","","","","","","","","","","","","","","","","","","","","","","","","","","","","","","","","","","","","","","","","","","","","","","","","","",""]
["<REG_06>","Ostschweiz","Ostschweiz",null,"","","","","","","","","","","","","","","","","","","","","","","","","","","","","","","","","","","","","","","","","","","","","","","","","","",""]
["<OBJ_02>","Ostschweiz","Baugewerbe : Total",100,79,79.2,81.900000000000006,82.9,84.6,86.1,86,85.5,85,84.1,85.1,85.1,86.2,86.5,87.9,88.3,90.3,92.2,94.2,96.6,98.5,96.7,97.1,96,96.9,99,100.3,98.8,98.7,98.8,99.9,99.3,99.1,97.9,98.2,97.8,97.3,97.8,96.8,98.5,98.9,98.9,99.6,100,100,101,103.3,109.3,113.1,113.8,114.8,115.9]
["<OBJ_03>","Ostschweiz","Hochbau",75.06,80.3,80.400000000000006,82.7,83.8,84.4,86.7,86.9,86.6,85.8,84.7,85.8,85.5,86.9,87.4,88.5,89,90.7,92.6,94,96.6,98.3,97,97.5,95.9,97.5,98.9,99.9,98.4,98.2,98.5,99.6,98.9,98.8,97.9,98.4,97.4,96.2,96.5,95.8,97.8,98,98.2,98.9,99.6,100,101.4,104.5,109.3,113,113.6,114.7,115.7]
["<OBJ_04>","Ostschweiz","Neubau",42.28,80.099999999999994,80.2,82.2,83.6,83.9,86.4,86.7,85.7,85,83.9,84.9,84.3,85.8,86.4,87.4,87.7,89.7,91.6,93,95.9,97.8,95.7,96.5,94.6,96.4,98,98.8,97.5,97.4,97.6,98.7,97.9,97.5,96.2,96.8,96.5,95.4,96.1,95.9,98,98.1,98.2,98.9,99.7,100,101.6,105,110.2,113.6,114.8,115.2,116.8]
["<OBJ_05>","Ostschweiz","Neubau Mehrfamilienhaus",22.79,80.8,81.099999999999994,82.9,84.5,84.9,87.2,87,85.9,85.3,84,85,84.4,86,86.6,87.5,87.8,89.6,91.5,92.9,95.9,97.7,95.4,96.3,94.5,96.1,97.6,98.1,96.9,96.6,96.8,98,97.4,97,95.9,96.5,96.6,95.4,96.4,96.2,98,98.2,98.2,98.8,99.8,100,101.3,104.5,109.7,113.3,114.6,115.3,117]
["<OBJ_06>","Ostschweiz","Neubau Mehrfamilienhaus aus Holz",5.81,"…","…","…","…","…","…","…","…","…",82.5,83.7,83.2,84.3,84.2,84.9,85.8,87.2,89.5,90.1,93.4,94.9,93.5,93.7,92,94,96,96.4,95.3,95,95.4,95.9,95.4,94.7,94.2,95.2,94.9,94.1,94.5,94.7,97.2,97.9,97.7,98.5,99.1,100,102.9,107.8,112.3,115.2,116.5,115.9,118]
["<OBJ_07>","Ostschweiz","Neubau Einfamilienhaus",6.4,"…","…","…","…","…","…","…","…","…","…","…","…","…","…","…","…","…","…","…","…","…","…","…","…",95.4,97.5,97.9,96.9,97.3,97,98.5,98,97.7,96.1,96.5,96.4,94.9,95.5,95.3,98.1,97.9,98.1,98.6,99.3,100,100.7,104.2,108.7,111.5,112.9,113.7,115]
["<OBJ_08>","Ostschweiz","Neubau Bürogebäude",4.01,82.1,81.599999999999994,84.1,84.6,85.1,88.3,90.4,89.5,88.8,88.2,89.1,88.5,89.9,90.7,91.6,92.3,94.9,97,98.8,101,103.2,102.1,102.3,100.3,102.6,103.9,106.5,103.1,103.1,104.7,105.4,103,102.6,100.2,100.6,98.8,98.5,97.2,95.9,98.2,97.8,98.7,99.9,100.1,100,102,104.5,110.6,115.3,115.3,115.8,116.8]
["<OBJ_09>","Ostschweiz","Neubau Lagerhalle",3.27,"…","…","…","…","…","…","…","…","…","…","…","…","…","…","…","…","…","…","…","…","…","…","…","…",96.8,98.7,99.5,98.7,98.3,98.5,99.5,98.4,97.5,96.2,96.8,95.7,95.2,96.3,97.1,98.7,98.6,98.6,99.7,99.9,100,102.6,106.4,112.1,115.1,115.6,115.5,117.2]
["<OBJ_10>","Ostschweiz","Renovation, Umbau",32.78,"…","…","…","…","…","…","…","…","…","…","…","…","…","…","…","…","…","…","…","…","…","…","…","…",99.3,100.5,101.6,99.8,99.7,99.9,101,100.5,100.9,100.5,100.8,98.8,97.3,97.1,95.5,97.4,97.8,98.3,98.8,99.6,100,101.2,103.8,108.1,112.1,112.1,113.9,114.4]
["<OBJ_11>","Ostschweiz","Renovation Mehrfamilienhaus",23.28,77.599999999999994,77.7,80.400000000000006,81,81.8,83.7,83.8,85,83.9,82.8,84.1,84.2,85.4,85.7,87.1,87.7,88.9,90.6,91.9,94.2,95.6,95.6,95.4,94.5,95.7,96.9,97.8,96.3,96.1,95.8,96.8,96.6,96.9,96.1,96.3,95.3,93.9,95.3,94.7,97.2,97.5,97.7,98.6,99.6,100,101.1,104.2,108.2,112.4,112.6,114.4,114.8]
["<OBJ_12>","Ostschweiz","Renovation Bürogebäude",9.5,"…","…","…","…","…","…","…","…","…","…","…","…","…","…","…","…","…","…","…","…","…","…","…","…",94.4,95.4,96.9,94.8,94.7,95.9,97,96,96.5,96.7,97.4,96.5,95.9,95.9,94.2,97.8,98.4,98.8,100.3,99.9,100,101.5,103.1,107.7,111.4,110.7,112.7,113.4]
["<OBJ_13>","Ostschweiz","Tiefbau",24.939999999999998,74.7,75.099999999999994,79.099999999999994,79.5,84.9,84,83,81.8,82.2,81.7,82.5,83.3,83.5,83.4,85.7,85.8,88.5,90.6,94.4,95.9,98.5,95,95.4,95.7,94.7,99.5,101.7,100.2,100.4,100.2,101,101,100.3,97.8,97.6,99.1,101.9,103,100.8,101.4,102.3,101.3,102.6,101.7,100,99.9,99.5,109.3,113.4,114.5,115,116.4]
["<OBJ_14>","Ostschweiz","Neubau Strasse",3.15,76.3,76.8,80.8,81.3,86.8,85.8,84,81.900000000000006,82.8,81.900000000000006,82.8,82.4,81.3,82.9,85.2,86,87.8,90.9,94.1,95.3,97.6,95.3,96.2,95.7,93.8,98.6,101,99.3,99.5,99.3,100.2,100.4,99.8,97,96.7,98.4,100.6,101.9,99.7,100.9,101.5,100.7,102,101.2,100,100.5,100.4,107.8,111.9,113.2,114.1,115.6]
["<OBJ_15>","Ostschweiz","Neubau Unterführung",2.4500000000000002,"…","…","…","…","…",85.6,85.4,85,85,84.9,85.5,87.7,89.2,87.3,89.7,89.2,92.7,94,98.6,100.3,103.4,98.6,98.5,99.7,99.4,105,107,105.9,105.7,104.9,105.9,104.3,103.7,102.1,101.7,102.5,108.6,108.8,106,104,106.4,104.3,105.4,103.7,100,102.6,103.3,114,118,117,115.1,115.8]
["<OBJ_16>","Ostschweiz","Neubau Lärmschutzwand",0.1,"…","…","…","…","…","…","…","…","…","…","…","…","…","…","…","…","…","…","…","…","…","…","…","…",91.2,92.3,93.7,93.6,95.1,95.1,95.4,96,95.7,93.9,95.8,96.5,97.1,97.9,99.4,98.4,99.9,100,99.7,100.3,100,100.9,102.2,108.4,112.2,113,113,111.4]
["<OBJ_17>","Ostschweiz","Strassensanierung",19.239999999999998,"…","…","…","…","…","…","…","…","…","…","…","…","…","…","…","…","…","…","…","…","…","…","…","…","…","…","…","…","…","…","…","…","…","…","…","…","…","…","…","…","…","…","…","…",100,99.4,98.9,108.9,113.1,114.4,115.2,116.7]
[null,null,null,null,"","","","","","","","","","","","","","","","","","","","","","","","","","","","","","","","","","","","","","","","","","","","","","","","","","",""]
["<REG_07>","Zentralschweiz","Zentralschweiz",null,"","","","","","","","","","","","","","","","","","","","","","","","","","","","","","","","","","","","","","","","","","","","","","","","","","",""]
["<OBJ_02>","Zentralschweiz","Baugewerbe : Total",100,82.1,82.9,84.8,86.5,88.6,90,89.3,89,89,87.7,87.1,87.2,88.5,87.7,89.5,90.5,92.4,94.3,96.3,98.7,100.1,98.9,99,99.7,100.4,101.9,102.1,102.4,102.9,102.6,102.9,102.4,102.4,102.5,102.4,101.7,101.5,100.4,100.5,100.4,100.9,101.5,99.7,99.9,100,101.1,104.4,109.9,113.1,114.4,115.3,114.5]
["<OBJ_03>","Zentralschweiz","Hochbau",84.56,83.9,84.2,86.2,87.2,89.9,91.1,90.7,90.1,90.4,88.5,88.2,87.9,89.7,89.1,90.7,91.9,94.2,96.4,98.3,101.1,102.4,101.2,101.3,101.3,102.2,103.6,103.5,104,104.1,103.5,103.7,103,102.7,102.6,102.7,102,101.9,100.4,100.7,100.7,101.1,101.7,99.7,99.6,100,101.5,104.7,110.5,113.9,114.9,115.6,114.9]
["<OBJ_04>","Zentralschweiz","Neubau",52.21,83.5,84.1,85.9,87.5,90.4,91.7,91,90,90,87.9,87.5,87,89.2,88.5,89.9,91.2,93.5,95.3,97.2,99.6,101.2,99.2,99.1,99.5,100.7,102.3,101.9,102.3,102.4,101.8,102.3,101.8,101.7,101.5,101.5,101.1,100.9,99.9,100.8,100.7,101.1,101.4,99.7,99.7,100,101.4,105.2,111.3,114.6,115.7,116.5,115.7]
["<OBJ_05>","Zentralschweiz","Neubau Mehrfamilienhaus",33.380000000000003,85.8,86.5,88,89.9,92.8,94,92.8,91.8,91.6,89.4,89,88.6,91.1,90.2,91.5,92.8,95,96.5,98.5,100.8,102.4,100,99.8,100.4,101.7,102.8,102.4,102.7,102.7,101.9,102.2,101.8,101.6,101.4,101.5,101.1,100.9,99.9,101,100.6,101.2,101.4,99.7,99.6,100,101,104.6,110.8,114.4,115.5,116.7,115.8]
["<OBJ_06>","Zentralschweiz","Neubau Mehrfamilienhaus aus Holz",8.6300000000000008,"…","…","…","…","…","…","…","…","…",88.3,88.2,87.4,89.3,88.8,89.7,91.5,93.9,95.4,97.1,99.1,100.4,98.2,98.2,98.6,99.9,101.6,101.7,101.3,101.6,100.8,101,100.7,101.3,101.3,101.5,101.4,101.5,100,99.9,100.5,100.8,100.7,99.2,99.6,100,102.9,107.1,113.2,115.3,116.3,116,115.5]
["<OBJ_07>","Zentralschweiz","Neubau Einfamilienhaus",3.55,"…","…","…","…","…","…","…","…","…","…","…","…","…","…","…","…","…","…","…","…","…","…","…","…",100.3,101.5,101.1,101.5,101.8,100.7,101.4,101.3,101.3,101,101.2,101,101.2,99.4,99.9,100.6,101.1,101.6,99.7,99.6,100,101.1,104.4,110.4,113.1,114.4,115.4,114.8]
["<OBJ_08>","Zentralschweiz","Neubau Bürogebäude",2.35,78.099999999999994,78.3,81.3,82,84.8,86.6,87.2,86.3,87,85.2,84.6,83.8,85.3,85.1,86.8,88.3,90.6,93.3,95.2,97.9,99.8,99,99.1,98.8,99.7,103.1,102.3,102.7,103.6,104.4,105.4,103.8,103.8,103.6,102.9,102.2,100.8,100.3,100.2,101.1,100.7,101.5,99.9,100,100,101.9,104.8,111.8,115.8,117.5,117.9,117]
["<OBJ_09>","Zentralschweiz","Neubau Lagerhalle",4.3,"…","…","…","…","…","…","…","…","…","…","…","…","…","…","…","…","…","…","…","…","…","…","…","…",97.6,99.9,100.2,101.3,101.2,100.9,101.4,100.7,100.9,100.9,100.7,99.6,99.4,99.6,101.6,101,101,101.7,99.9,100,100,102.3,106.3,112.4,115.5,116.2,116.1,115.8]
["<OBJ_10>","Zentralschweiz","Renovation, Umbau",32.35,"…","…","…","…","…","…","…","…","…","…","…","…","…","…","…","…","…","…","…","…","…","…","…","…",104.8,105.9,106.3,106.8,107,106.3,106.2,105.1,104.5,104.6,104.7,103.7,103.8,101.2,100.5,100.7,101.1,102.2,99.8,99.6,100,101.5,103.9,109.2,112.8,113.7,114.2,113.6]
["<OBJ_11>","Zentralschweiz","Renovation Mehrfamilienhaus",19.43,82.7,82.7,84.9,84.6,87,88,88.3,88.5,89.2,87.6,87.5,87.5,88.6,88.3,90.1,91,93.5,96.3,98.1,101.4,102.4,102.4,102.8,102.3,102.6,103.5,103.7,104,104,103.3,103.3,102.5,101.7,102.2,102,100.7,101.1,98.9,99.9,100,100.6,100.9,99.5,99.6,100,101.3,104.1,109.4,112.7,113.1,114.2,113.3]
["<OBJ_12>","Zentralschweiz","Renovation Bürogebäude",12.92,"…","…","…","…","…","…","…","…","…","…","…","…","…","…","…","…","…","…","…","…","…","…","…","…",102.6,104.1,104.9,106.2,106.6,106.1,105.7,104.1,103.7,103.3,103.8,102.3,100.8,100.9,99.8,100.2,100.6,100.9,99.7,100.1,100,101.8,103.6,109,113,114.6,114.3,114.1]
["<OBJ_13>","Zentralschweiz","Tiefbau",15.44,76.3,78.400000000000006,80.3,83.9,84.4,86.3,84.6,85.2,84.1,84.9,83.3,84.6,84.5,82.9,85.4,86.1,86.6,87.6,89.9,91.3,92.7,91.8,91.9,94.5,94.6,96.5,97.4,97.3,98.7,99.4,99.9,99.8,100.7,101.2,100.8,100,99.1,100.7,99.5,98.9,99.7,100.4,99.7,101.5,100,99.4,102.8,106.3,108.7,111.3,113.2,112.1]
["<OBJ_14>","Zentralschweiz","Neubau Strasse",1.1499999999999999,75.599999999999994,77.599999999999994,79.5,83.1,83.6,85.4,82.7,84,83.4,84.6,82.8,84.1,83,82.2,83.9,84.7,84.4,85.2,88.3,90.1,90.7,90.2,90.9,94.2,94.1,95.8,96.8,96.8,98.2,99,99.5,99.6,100.5,101.3,100.9,100,99.1,100.5,99.4,99,99.9,100.6,99.7,101.7,100,101.3,103.9,107.4,110.1,111.8,113,111.3]
["<OBJ_15>","Zentralschweiz","Neubau Unterführung",1.0900000000000001,"…","…","…","…","…",89.2,88.6,88.6,86.8,87.2,85.8,87.2,88.1,85.6,88.9,89.7,90.9,92.2,93.6,94.8,96.9,95.6,95.1,97.1,97.5,100.1,100.7,100.5,101.8,101.8,102.9,101.3,102.2,101.7,100.7,100.5,99.3,101.6,100.1,98.9,99.3,99.5,99.7,101.1,100,101.2,103.6,111.5,114.6,114.9,114.4,113.4]
["<OBJ_16>","Zentralschweiz","Neubau Lärmschutzwand",0.04,"…","…","…","…","…","…","…","…","…","…","…","…","…","…","…","…","…","…","…","…","…","…","…","…",91.1,91.7,92.2,91.6,93.1,93.7,93.6,93.6,94.2,92.8,94,92.1,93.3,95.3,96.7,96.1,97.5,98.6,98.3,99.6,100,100.9,103.4,108,112,112.9,113.2,111.8]
["<OBJ_17>","Zentralschweiz","Strassensanierung",13.16,"…","…","…","…","…","…","…","…","…","…","…","…","…","…","…","…","…","…","…","…","…","…","…","…","…","…","…","…","…","…","…","…","…","…","…","…","…","…","…","…","…","…","…","…",100,99.1,102.7,105.7,108,111,113.1,112.1]
[null,null,null,null,"","","","","","","","","","","","","","","","","","","","","","","","","","","","","","","","","","","","","","","","","","","","","","","","","","",""]
["<REG_08>","Tessin","Tessin",null,"","","","","","","","","","","","","","","","","","","","","","","","","","","","","","","","","","","","","","","","","","","","","","","","","","",""]
["<OBJ_02>","Tessin","Baugewerbe : Total",100,73.099999999999994,74.400000000000006,75.7,78,79,82.4,82.2,82.3,83.1,82.7,83.8,85.1,87.5,89,89.1,88.9,90.8,93.1,94,95.7,96.9,96.6,97,98.4,99.2,100.2,100.1,100.7,101.2,101.1,100.3,100.3,99.5,99.1,99.4,99.3,98.4,97.5,98.2,98.3,98.4,98.6,99.4,99.8,100,102.3,104,106.9,109.8,111.5,112.6,112.8]
["<OBJ_03>","Tessin","Hochbau",64.239999999999995,77.5,78.099999999999994,79,81.099999999999994,82.2,85.3,85.5,85.2,85,84.4,85.3,86,88.2,90.4,90.5,90.8,93,95.5,96.3,98.3,99.2,99.6,99.4,101.1,101.8,102.6,102.3,101.9,102,102.1,101.4,101.8,100.7,100,100.7,100.3,99.6,98.5,99.6,99.3,99.5,99.8,100.1,100.6,100,102,104.8,108.6,112,112.4,113.3,113.7]
["<OBJ_04>","Tessin","Neubau",39.93,75.7,76.2,77,79.599999999999994,80.8,84.3,84.4,83.7,83.4,82.8,83.7,84.9,87.2,89.7,89.5,89.9,92,94.6,95.5,97,98.1,98.1,97.9,99.9,100.6,101.6,100.8,100.5,100.8,101,100.2,100.8,99.5,98.5,99.1,99,98.4,98.1,98.8,98.7,98.9,99.2,99.7,100.3,100,102,105.4,109.5,113,113.8,114.5,115.1]
["<OBJ_05>","Tessin","Neubau Mehrfamilienhaus",18.77,76.5,77,77.5,80.3,81.7,85.1,85.1,84.4,84.1,83.4,84.3,85.4,87.7,90.1,89.9,90.1,92.1,94.4,95.3,96.7,97.9,97.5,97.3,99.3,100,100.7,100.1,100,100.3,100.6,99.7,100.5,99.2,98.4,98.9,98.9,98.2,97.9,98.7,98.4,98.8,99,99.6,100.2,100,101.8,104.6,108.2,111.9,111.8,113.1,112.9]
["<OBJ_06>","Tessin","Neubau Mehrfamilienhaus aus Holz",11.76,"…","…","…","…","…","…","…","…","…",82.5,83.1,83.5,85.6,87.4,87,87.7,89.9,92.3,93.2,95.1,96.4,95.3,95.1,96.5,97.4,98.8,98,98.1,97.8,98.1,97.6,98.5,97.5,97.6,97.8,97.7,96.8,97.6,98.2,99.2,99.1,98.6,98.7,99.9,100,102.5,106.5,111.3,114.2,116.7,116,117.7]
["<OBJ_07>","Tessin","Neubau Einfamilienhaus",2.13,"…","…","…","…","…","…","…","…","…","…","…","…","…","…","…","…","…","…","…","…","…","…","…","…",101.5,102.2,101.1,100.6,101,101.4,100.4,101.4,99.7,98.8,99.5,99.5,99.2,98.3,99.2,99.6,99.3,100,100.3,100.7,100,101.8,104.4,108,110.8,112,113,113.3]
["<OBJ_08>","Tessin","Neubau Bürogebäude",5.13,73,73.5,75.2,77.5,78.099999999999994,81.900000000000006,82.3,81.5,81.400000000000006,81.2,82.2,83.2,85.7,88.2,88.3,89.2,91.8,95.4,96,98.1,98.9,100.4,100.2,102.2,102.9,104.6,104.1,102.8,103,103,102.8,102.1,101.1,99.6,100.3,99.6,99.3,98.6,99.2,98.8,99,99.3,99.9,100.2,100,101.9,105.8,110.3,114.5,115,116.8,117.7]
["<OBJ_09>","Tessin","Neubau Lagerhalle",2.14,"…","…","…","…","…","…","…","…","…","…","…","…","…","…","…","…","…","…","…","…","…","…","…","…",100.9,102.3,102,102.9,102.6,102.6,101.7,101.1,99.8,98.9,99,98.2,98.1,98.5,98.3,98.4,98.6,99.1,99.7,100,100,102.5,106.7,111.3,113.9,113.7,114.4,115.3]
["<OBJ_10>","Tessin","Renovation, Umbau",24.31,"…","…","…","…","…","…","…","…","…","…","…","…","…","…","…","…","…","…","…","…","…","…","…","…",104.2,104.8,105.1,104.5,104.5,104.4,103.8,104,103.1,102.8,103.6,102.6,101.9,99.1,101.1,100.4,100.7,100.8,100.7,101.1,100,101.8,103.8,107.2,110.3,110.1,111.3,111.5]
["<OBJ_11>","Tessin","Renovation Mehrfamilienhaus",18.440000000000001,76.7,77.400000000000006,78.599999999999994,79.599999999999994,80.400000000000006,82.4,82.9,83.4,83.4,82.8,83.4,83.3,85.3,87,87.6,87.5,89.8,91.9,92.5,95.3,95.9,97.1,96.7,97.8,98.5,99.1,99.1,98.7,98.7,98.9,98,98.7,97.6,97.3,97.6,97.3,96.7,96.4,97.5,97.9,97.6,97.9,99,100.3,100,101.7,103.9,107,110,109.9,111.3,111.1]
["<OBJ_12>","Tessin","Renovation Bürogebäude",5.87,"…","…","…","…","…","…","…","…","…","…","…","…","…","…","…","…","…","…","…","…","…","…","…","…",100.4,101,101.5,100.7,100.8,100.3,100.4,99.7,99.2,99,100.4,99.7,99.9,99.1,98.6,97.7,98.5,98.4,100,100,100,102.1,103.3,107.6,111.3,110.4,111.3,112.8]
["<OBJ_13>","Tessin","Tiefbau",35.76,62.9,66.099999999999994,68.5,71.099999999999994,72.099999999999994,76.400000000000006,75.2,76.099999999999994,79.5,79.5,81.3,84.2,87.2,86.6,86.8,85.7,86.6,88.6,89.8,90.5,92.3,90.3,92.5,93,93.9,96.1,96,98.6,99.8,99.1,98.1,97.3,97.2,97.3,97,97.3,95.9,95.7,95.5,96.5,96.2,96.2,98,98.4,100,102.8,102.5,103.7,105.8,110,111.4,111.1]
["<OBJ_14>","Tessin","Neubau Strasse",9.86,66.099999999999994,69.5,72,74.8,75.8,80.3,79.3,79.900000000000006,83.6,83.4,86.3,88.5,91.1,90.8,89.1,88.2,88.5,89.4,90.9,91.4,92,91.2,93.3,93,93.6,95.8,95.7,98.2,99.9,99,97.9,97.4,97.1,97.6,97.3,97.7,96.2,96.1,95.6,96.4,96.1,96.2,97.9,98,100,103.3,103.7,105,107.3,111.4,113.2,113.2]
["<OBJ_15>","Tessin","Neubau Unterführung",3.65,"…","…","…","…","…",74.099999999999994,72.8,73.900000000000006,77.2,77.3,78.2,81.8,85.2,84.2,86.3,84.9,86.3,89.5,90.4,91.4,94.3,91.1,93.4,94.8,95.8,98.9,98.4,101.8,100.3,100.3,99.7,97,97.9,96.9,95.9,96,94.9,94.3,95.1,96.9,96.5,96.3,98.5,99.9,100,103,106.2,110.6,113.1,115,114.2,112.9]
["<OBJ_16>","Tessin","Neubau Lärmschutzwand",0.15,"…","…","…","…","…","…","…","…","…","…","…","…","…","…","…","…","…","…","…","…","…","…","…","…",91.5,91.5,92.5,94,95.2,94.9,94.4,94.4,94.5,92.9,94.7,95,94.7,95.8,97.6,97.3,98.4,98.9,98.6,99.5,100,102,103.3,107.3,110.6,111.9,112.9,111.6]
["<OBJ_17>","Tessin","Strassensanierung",22.1,"…","…","…","…","…","…","…","…","…","…","…","…","…","…","…","…","…","…","…","…","…","…","…","…","…","…","…","…","…","…","…","…","…","…","…","…","…","…","…","…","…","…","…","…",100,102.5,101.3,102,104,108.5,110.2,109.9]
[]
["<Pieds_tableau_1>",null,"Drei Punkte (…) bedeuten, dass der Wert nicht vorhanden, nicht genügend repräsentativ oder unter Datenschutz ist."]
["<Pieds_tableau_2>",null,"Bundesamt für Statistik, Baupreisindex"]
["<Pieds_tableau_3>",null,"Auskunft: Hotline BAP, 058 463 63 06, bap@bfs.admin.ch"]
["<Pieds_tableau_4>",null,"© BFS"]

{"sheet":"Listenfelder_T","index":15,"n_rows":28,"n_cols":4,"rows_kept":28,"cut":false,"hidden":false,"merged":[]}
["Region","Objektart","Jahr","Monat"]
["Schweiz","Baugewerbe : Total","1998","April"]
["Genferseeregion","Hochbau","1999","Oktober"]
["Espace Mittelland","Neubau","2000"]
["Nordwestschweiz","Neubau Mehrfamilienhaus","2001"]
["Zürich","Neubau Mehrfamilienhaus aus Holz","2002"]
["Ostschweiz","Neubau Einfamilienhaus","2003"]
["Zentralschweiz","Neubau Bürogebäude","2004"]
["Tessin","Neubau Lagerhalle","2005"]
[null,"Renovation, Umbau","2006"]
[null,"Renovation Mehrfamilienhaus","2007"]
[null,"Renovation Bürogebäude","2008"]
[null,"Tiefbau","2009"]
[null,"Neubau Strasse","2010"]
[null,"Neubau Unterführung","2011"]
[null,"Neubau Lärmschutzwand","2012"]
[null,"Strassensanierung","2013"]
[null,null,"2014"]
[null,null,"2015"]
[null,null,"2016"]
[null,null,"2017"]
[null,null,"2018"]
[null,null,"2019"]
[null,null,"2020"]
[null,null,"2021"]
[null,null,"2022"]
[null,null,"2023"]
[null,null,"2024"]

{"sheet":"Listenfelder","index":16,"n_rows":6,"n_cols":1,"rows_kept":6,"cut":false,"hidden":false,"merged":[]}
["Schätzung"]
["Sehr Tief"]
["Tief"]
["Mittel"]
["Hoch"]
["Sehr Hoch"]

{"sheet":"Listenfelder_211","index":17,"n_rows":8,"n_cols":11,"rows_kept":8,"cut":false,"hidden":false,"merged":[]}
["Bauteil","Schalungsfläche","Zuschläge (B)","Schalung","Schalung CHF/m2","Höhe","Beton","Beton CHF/m2","Stein","Mauerwerk CHF/m2","Zuschläge (M)"]
["1.Einzelfundament",{"$f":"IF('211'!C9=\"\",(4*1)*'211'!C8,'211'!C9*'211'!C8)","v":0},0.05,"1.Stirn- und Abschalung",167,null,"1.Unterlagsbeton",15,"1.Backstein / Aussenwand, 17.5cm",105,0.15]
["2.Streifenfundament",{"$f":"2*'211'!C8","v":0.9},0.05,"2.Typ 2, Schalung direkt. Abstellm. Schalhöhe bis 280cm",40,null,"2.Sauberkeitsschicht ",12.5,"2.Backstein / Innenwand, 12.5cm",90,0.15]
["3.Bodenplatte",{"$f":"IF('211'!C9=\"\",(4*1)*'211'!C8,'211'!C9*'211'!C8)","v":0},0.05,"3.Typ 4.1",null,null,"3.PC kg/m3 300",200,"3.Backstein / Innenwand, 15cm",95,0.15]
["4.Geschossdecke",1,0.15,null,null,null,null,null,"4.Dämmbackstein / Aussenwand"]
["5.Dachdecke",1,0.1,null,null,null,null,null,"5.Kalksandstein / Aussenwand"]
["6.Aussenwand",2,0.2,null,null,null,null,null,"6.Kalksandstein / Innenwand, 15cm",105,0.15]
["7.Innenwand",2,0.2]

{"sheet":"Nutzer","index":18,"n_rows":29,"n_cols":2,"rows_kept":29,"cut":false,"hidden":false,"merged":[]}
["Bearbeiter","Datum / Uhrzeit"]
["LindeA","2024-10-29T17:23:56"]
["LindeA","2024-10-30T08:12:11"]
["LindeA","2024-10-31T14:33:43"]
["LindeA","2024-10-31T14:58:03"]
["LindeA","2024-11-06T13:03:34"]
["LindeA","2024-11-25T15:20:56"]
["LindeA","2024-11-26T08:21:12"]
["LindeA","2024-11-26T08:26:14"]
["LindeA","2024-11-26T12:19:02"]
["LindeA","2024-12-16T17:02:42"]
["LindeA","2025-02-07T10:57:13"]
["LindeA","2025-02-07T12:26:28"]
["LindeA","2025-02-10T14:43:43"]
["LindeA","2025-02-10T15:08:35"]
["LindeA","2025-02-11T10:51:15"]
["LindeA","2025-02-11T11:42:02"]
["LindeA","2025-02-11T13:18:58"]
["LindeA","2025-02-12T09:21:30"]
["LindeA","2025-02-12T13:47:38"]
["LindeA","2025-02-12T15:49:09"]
["LindeA","2025-02-12T16:53:17"]
["LindeA","2025-02-13T12:46:22"]
["LindeA","2025-02-13T14:01:01"]
["LindeA","2025-02-18T14:35:24"]
["LindeA","2025-02-19T14:38:11"]
["LindeA","2025-02-19T16:07:55"]
["LindeA","2025-02-19T16:40:57"]
["Uwe","2025-02-19T18:06:02"]

{"sheet":"Bauteile (2)","index":19,"n_rows":501,"n_cols":27,"rows_kept":501,"cut":false,"hidden":true,"merged":[]}
["Lfd.-Nr.","eBKP-H","BKP","Beschreibung","Untertitel","Bauteil","Einheit","EP",null,null,null,null,"Bauteildicke","Unterlagsbeton.","Sauberkeitsschicht ","Schalung","Schalung direkt. Abstellm. Typ 2 Schalhöhe bis 280cm.","PC kg/m3 300.","Bewehrungsanteil KG/m3","Bewehrung kg","Anschlussbewehrung / Durchstanzarmierung und dgl.","Stein","Gleitlager","Sturz","Zuschläge.",null,"Gelb muss geprüft werden"]
[null,null,null,null,null,null,null,"INTERN","2024-01-01"]
[]
[1,"B 01.02","101",{"$f":"IF(C4=0,\"\",LOOKUP(C4,BKP,Baukostenplan))","v":"Bestandesaufnahmen"},null,"Gebäudeaufnahme Rissprotokolle","gl"]
[{"$f":"IF(C5=0,\"\",A4+1)","v":2},"B 01.01","102","Baugrunduntersuchungen",null,"Untersuchung","gl"]
[3,"B 01.03","102","Baugrunduntersuchungen","Umweltmessungen","Materialanalysen (falls Schadstoffe).","gl"]
[4,"B 01.04","102","Baugrunduntersuchungen","Überwachungen","Regelmässige Kontrollen (z.B. Gleis und dgl.).","h",120]
[5,"B 05.01","111","Rodungen",null,"Roden bestehender Sträucher und Bäume.","m2",3.5]
[6,null,"112","Abbrüche","Rückbau nicht kontaminiertes Bauwerk","Budgetbetrag für Entrümpelung. Verrechung nach effektivem Aufwand.","gl"]
[7,"B 05.02","112","Abbrüche","Rückbau nicht kontaminiertes Bauwerk","Abbrüche /  Demontagen","m3",40]
[8,"B 05.03","119","Übriges","Rückbau kontaminiertes Bauwerk","Abbruch","m3",42]
[9,"B 05.03","119","Übriges","Rückbau kontaminiertes Bauwerk","Zusätzliche Entsorgungsgebühren.","m3",32]
[10,null,"119","Übriges","Rückbau kontaminiertes Bauwerk","Schadstoffsanierung. \nVerrechung nach effektivem Aufwand.","gl"]
[11,"B 03","120","Übergangsposition",null,"Sicherung und Provisorien.","gl"]
[12,"B 02.01","13","Gemeinsame Baustelleneinrichtung",null,"Prozentsatz von BKP 2-4","%"]
[13,"B 02.01","131","Abschrankungen",null,"Signalisation u.d.gl.","gl"]
[14,"B 02.01","132","Zufahrten, Plätze",null,"Zufahrten und Plätze","m2"]
[15,"B 02.01","132","Zufahrten, Plätze",null,"Provisorische Parkplätze","Stk.",150]
[16,"B 02.03","133","Büro Bauleitung",null,"Einr. + Vorh. Bauleitungscontainer (LE=St x Mt).","LE",650]
[17,"B 02.02","135.0","Kanalisationen","Provisorische Installationen",null,"gl"]
[18,"B 02.02","135.1","Elektro","Provisorische Installationen","Einr. + Vorh. Baustromverteiler 2 Stk","Mnt.",535]
[19,"B 02.02","135.1","Elektro","Provisorische Installationen","Längeres Vorh. Baustromv. 2 Stk","Mnt.",344]
[20,"B 02.02","135.3","Wasser","Provisorische Installationen",null,"gl"]
[21,"B 02.02","136","Kosten für Energie, Wasser und dgl      .",null,"Verbr.+Ents. Baustrom, -wasser, -heizung","Mnt.",3750]
[22,"B 02.06","139","Übriges",null,"Winterbaumassnahmen.","m2"]
[23,null,"150","Übergangsposition","Telekommunikationsleitung","Nur Kabel.","m"]
[24,null,"150","Übergangsposition","Wasserleitung",null,"m"]
[25,"B 04","151","Erdarbeiten","Aushub und Hinterfüllung","Für sämtliche Werkleitungen (Wasser, Elektro, Medien).","m3",50]
[26,null,"152","Kanalisationsleitungen",null,"Kanalisation inkl. Schächte, Grabarbeiten und Spülung.","pl"]
[27,null,"153","Elektroleitungen",null,"Hüllrohre inkl. Schächte.","m"]
[28,null,"153","Elektroleitungen",null,"Stark.- Schwachstrom","m",95]
[29,null,"153","Elektroleitungen",null,"Bestehende Leitungen umlegen inkl. Grabarbeiten.","m"]
[30,"B 04","154","Heizungs-, Lüftungs-, Klima-, Kälteleitungen","Fernwärme, Fernbkälte","Heizungs- und Kälteleitung.","m",500]
[31,"B 04.08","154","Heizungs-, Lüftungs-, Klima-, Kälteleitungen","Gasleitung",null,"m",80]
[32,"B 06.03","172","Baugrubenabschlüsse","Böschungssicherung","Spritzbeton.","m2",180]
[33,"B 06.03","172","Baugrubenabschlüsse","Böschungssicherung","Nagelwände.","m2",360]
[34,"B 06.04","172","Baugrubenabschlüsse",null,"Spundwand.","m2",470]
[35,"B 06.04","172","Baugrubenabschlüsse",null,"Rühlwand.","m2",560]
[36,"B 06.04","172","Baugrubenabschlüsse",null,"Bohrpfahlwand.","m2",920]
[37,"C 01.01","175","Grundwasserabdichtungen",null,"Feuchtigkeitsabdichtung DK 2.","GGF",35]
[38,"C 01.01","175","Grundwasserabdichtungen",null,"Feuchtigkeitsabdichtung DK 1.","GGF",60]
[39,"E 01.01","175","Grundwasserabdichtungen","Abdichtung, Beschichtung unter Terrain","Abdichtung DK 2 Wände UG.","m2",35]
[40,"E 01.01","175","Grundwasserabdichtungen","Abdichtung, Beschichtung unter Terrain","Abdichtung DK 1 Wände UG.","m2",75]
[41,"B 06.06","176","Wasserhaltung",null,"Wasserhaltung für Oberflächenwasser.","gl"]
[42,"B 06.06","176","Wasserhaltung",null,"Gebühren für Einleitung Meteorwasser in Kanalisation.","m3",0.65]
[43,"B 06.06","176","Wasserhaltung",null,"Grundwasserabsenkung","m3"]
[44,"B 06.01","201.1","Erdarbeiten","Nicht kontaminierter Aushub","Oberboden maschinell mit seitlicher Lagerung.","m3",3.05]
[45,"B 06.01","201.1","Erdarbeiten","Nicht kontaminierter Aushub","Aushub maschinell mit seitlicher Lagerung.","m3",3.65]
[46,"B 06.01","201.1","Erdarbeiten","Nicht kontaminierter Aushub","Sohlenaushub letzte 20cm.","m3",4]
[47,"B 06.01","201.1","Erdarbeiten","Nicht kontaminierter Aushub","Transport Oberboden auf Deponie Baustelle.","m3",4]
[48,"B 06.01","201.1","Erdarbeiten","Nicht kontaminierter Aushub","Transport Oberboden auf Deponie Unternehmer.","m3",6.7]
[49,"B 06.01","201.1","Erdarbeiten","Nicht kontaminierter Aushub","Transport Aushub auf Deponie Unternehmer.","m3",10.6]
[50,"B 06.01","201.1","Erdarbeiten","Nicht kontaminierter Aushub","Gebühren Oberboden (Lagerung oder Abgabe).","m3",0.55000000000000004]
[51,"B 06.01","201.1","Erdarbeiten","Nicht kontaminierter Aushub","Gebühren Aushub (Lagerung oder Abgabe).","m3",5.6]
[52,"B 06.02","201.1","Erdarbeiten","Kontaminierter Aushub","Kontaminierter Aushub baggerfähig.","m3",36]
[53,"B 06.02","201.1","Erdarbeiten","Kontaminierter Aushub","Zusätzliche Gebühren.","m3"]
[54,"B 06.03","201.1","Erdarbeiten","Böschungssicherung","Einfache Baugrubensicherung mit PE-Folie.","m2",5.5]
[55,"B 06.05","201.1","Erdarbeiten","Materialeinbau","Einbringen Hinterfüllung von Deponie Baustelle.","m3",6.5]
[56,"B 06.05","201.1","Erdarbeiten","Materialeinbau","Hinderfüllung maschinell Verdichten.","m3",2.5]
[57,"B 06.05","201.1","Erdarbeiten","Materialeinbau","Liefern und Einbringen von Sickerkies 32-45mm.","m3",83]
[58,"B 02.01","211.0","Baustelleneinrichtung","Allgemeine Baustelleneinrichtung","Prozentsatz von BKP 2","%"," 6-8"]
[59,"B 02.03","211.0","Baustelleneinrichtung",null,"Bau-WC (LE=St x Mt)","LE",200]
[60,"B 02.03","211.0","Baustelleneinrichtung",null,"Längeres Vorh. Bau-WC (LE=St x Mt)","LE",200]
[61,"B 02.04","211.0","Baustelleneinrichtung",null,"Baukran (LE=St x Mt)","LE",5500]
[62,"B 02.04","211.0","Baustelleneinrichtung",null,"Kranbetrieb für dritte inkl. Bedinung","h"]
[63,"B 02.04","211.0","Baustelleneinrichtung",null,"Radwaschanlage (LE=St x Mt).","LE",2640]
[64,"B 08.01","211.1","Gerüste",null,"Fassadengerüst.","m2",36]
[65,"B 08.02","211.1",{"$f":"IF(C68=0,\"\",LOOKUP(C68,BKP,Baukostenplan))","v":"Gerüste"},null,"Innengerüst.","GF",2]
[{"$f":"IF(C69=0,\"\",A68+1)","v":66},"B 08.02","211.1","Gerüste",null,"Liftschachtgerüste.","Stk",410]
[67,"D 09.04","211.4","Kanalisationen im Gebäude",null,"Kanalisation unter/in Bodenplatte inkl. Aushub.","GGF",65]
[68,"D 09.04","211.4","Kanalisationen im Gebäude",null,"Versickerungsanlage","GGF",8]
[69,"D 09.04","211.4","Kanalisationen im Gebäude","Abwassersammlung","Kanalisation.","GGF",40]
[70,"C 01.02","211.5","Beton- und Stahlbetonarbeiten",null,"Einzelfundament, Beton horizontal oder im Gefalle bis 3%,","m2",{"$f":"(N73+P73)+((1*M73)*R73)+(((1*M73)*S73)*T73)+(((N73+P73)+((1*M73)*R73)+(((1*M73)*S73)*T73))*Y73)","v":191.83499999999998},null,null,null,null,0.3,15,null,48,null,195,120,1.7,null,null,null,null,0.05]
[71,"C 01.03","211.5","Beton- und Stahlbetonarbeiten",null,"Bodenplatte, Beton horizontal oder im Gefalle bis 3%,","m2",{"$f":"(O74+((4*M74)*P74))+((1*M74)*R74)+(((1*M74)*S74)*T74)+(((O74+((4*M74)*P74))+((1*M74)*R74)+(((1*M74)*S74)*T74))*Y74)","v":194.56499999999997},null,null,null,null,0.3,null,12.5,48,null,180,120,1.7,null,null,null,null,0.05]
[72,"C 02.01","211.5","Beton- und Stahlbetonarbeiten","Aussenwand","Aussenwandkonstruktion Betonwände","m2",{"$f":"(Q75*2)+((1*M75)*R75)+(((1*M75)*S75)*T75)+(((Q75*2)+((1*M75)*R75)+(((1*M75)*S75)*T75))*Y75)","v":192.96},null,null,null,null,0.2,null,null,null,36,240,120,1.7,null,null,null,null,0.2]
[73,"C 02.02","211.5","Beton- und Stahlbetonarbeiten","Innenwand","Innenwandkonstruktion Betonwände","m2",{"$f":"(Q76*2)+((1*M76)*R76)+(((1*M76)*S76)*T76)+(((Q76*2)+((1*M76)*R76)+(((1*M76)*S76)*T76))*Y76)","v":188.88},null,null,null,null,0.2,null,null,null,36,240,110,1.7,null,null,null,null,0.2]
[74,"C 04.01","211.5","Beton- und Stahlbetonarbeiten",null,"Geschossdecke in Beton","m2",{"$f":"(Q77+(R77*M77))+((M77*S77)*T77)+((((M77*S77)*T77))*U77)+(((Q77+(R77*M77))+((M77*S77)*T77)+((((M77*S77)*T77))*U77))*Y77)","v":222.49280000000002},null,null,null,null,0.32,null,null,null,40,230,120,1.6,0.3,null,null,null,0.15]
[75,"C 04.04","211.5","Beton- und Stahlbetonarbeiten",null,"Flachdachkonstruktion in Beton","m2",{"$f":"(Q78+(R78*M78))+((M78*S78)*T78)+((((M78*S78)*T78))*U78)+(((Q78+(R78*M78))+((M78*S78)*T78)+((((M78*S78)*T78))*U78))*Y78)","v":178.64000000000001},null,null,null,null,0.25,null,null,null,40,240,120,1.6,0.3,null,null,null,0.1]
[76,"C 04.08","211.5","Beton- und Stahlbetonarbeiten","Aussen liegende  Konstruktion, Vordach","Kragplattenanschlüsse gedämmt.","m",320]
[77,"C 04.08","211.5","Beton- und Stahlbetonarbeiten","Aussen liegende  Konstruktion, Vordach","Balkone","m2",230]
[78,"C 05.01","211.5","Beton- und Stahlbetonarbeiten","Durchbruch, Schlitz zu Konstruktion","Regie Baumeister, Prozent von BKP 23, 24, 25, 26","%",2.2999999999999998]
[79,"C 05.01","211.5","Beton- und Stahlbetonarbeiten","Durchbruch, Schlitz zu Konstruktion","Durchbruch, Schlitz zu Konstruktion, Prozent von BKP 23, 24, 25, 26","%",2.2999999999999998]
[80,"C 02.01","211.6","Maurerarbeiten","Backstein","Aussenwandkonstruktion Backstein","m2",{"$f":"(1*V83)+(W83)+(((1*V83)+(W83))*Y83)","v":133.4},null,null,null,null,0.17499999999999999,null,null,null,null,null,null,null,null,105,11,null,0.15]
[81,"C 02.01","211.6","Maurerarbeiten","Dämmbackstein","Aussenwand Dämmbackstein Imbrex z7 inkl. Leibungen und Stürze","m2",{"$f":"(1*V84)+(W84)+(((1*V84)+(W84))*Y84)","v":272},null,null,null,null,0.49,null,null,null,null,null,null,null,null,272,0,null,0]
[82,"C 02.02","211.6","Maurerarbeiten",null,"Innenwandkonstruktion Backstein","m2",{"$f":"(1*V85)+(W85)+(((1*V85)+(W85))*Y85)","v":116.15},null,null,null,null,0.125,null,null,null,null,null,null,null,null,90,11,null,0.15]
[83,"C 02.02","211.6","Maurerarbeiten",null,"Innenwandkonstruktion Backstein","m2",{"$f":"(1*V86)+(W86)+(((1*V86)+(W86))*Y86)","v":121.9},null,null,null,null,0.15,null,null,null,null,null,null,null,null,95,11,null,0.15]
[84,"C 02.02","211.6","Maurerarbeiten",null,"Innenwandkonstruktion Kalksandstein","m2",{"$f":"(1*V87)+(W87)+(((1*V87)+(W87))*Y87)","v":133.4},null,null,null,null,0.15,null,null,null,null,null,null,null,null,105,11,null,0.15]
[85,"C 02.02","211.6","Maurerarbeiten",null,"Stürze zu Mauerwerke","m",{"$f":"X88+(X88*Y88)","v":47.25},null,null,null,null,null,null,null,null,null,null,null,null,null,null,null,45,0.05]
[86,"C 05.02","211.6","Maurerarbeiten","Ergänzende Leistungen","Zu Maurerarbeiten wie Mörtel Stahlzargen und dgl, Prozent von BKP 27+28","%",4.5]
[87,"C 01.01","211.9",0,"Abdichtung, Dämmung Bodenplatte","Perimeterdämmung XPS 500, 160mm.","m2",75]
[88,"E 01.02","211.9",0,"Aussenwärmedämmung unter Terrain","Perimeterdämmung.","m2",60]
[89,"E 01.03","211.9",0,null,"Schutzschicht unter Terrain.","m2",15]
[90,"C 03.01","212.2","Elemente aus Beton","Aussenstütze vorfabriziert","Vorfabrizierte Betonstützen 20x20cm.","m",500]
[91,"C 03.02","212.2","Elemente aus Beton","Innenstütze vorfabriziert","Vorfabrizierte Betonstützen 20x20cm.","m",500]
[92,"C 04.02","212.2","Elemente aus Beton","Innen liegende Treppen, Rampe","Vorfabrizierte innen Treppen in Beton. \n(Gemessene Aufsichtsfläche)","m2",650]
[93,"C 04.03","212.2","Elemente aus Beton","Innen liegendes Podest","Vorfabrizierte innen Podest in Beton.","m2",590]
[94,"C 04.06","212.2","Elemente aus Beton","Aussen liegende Treppe, Rampe","Vorfabrizierte aussen Treppen in Beton.","m2",650]
[95,"C 04.07","212.2","Elemente aus Beton","Aussen liegendes Podest","Vorfabrizierte aussen Podest in Beton.","m2",590]
[96,"E 02.06","212.2","Elemente aus Beton","Aussen liegende Absturzsicherung","Balkonbrüstungen Beton.","m",250]
[97,"C 01.04","212.2","Elemente aus Beton",null,"Erdverbundene Treppe, Rampe","m2",500]
[98,"C 01.05","212.2","Elemente aus Beton",null,"Erdverbundenes Podest.","m2",300]
[99,"C 04.05","214.1","Traggerippe (Zimmermanns- konstruktionen)","Konstruktion geneigtes Dach","Konstruktion geneigtes Dach in Holz.","m2",160]
[100,"E 02.03","215.2","Fassadenbau","Hinterlüftete Fassadensysteme","Lattenrost ausgedämmt, hinterl. Faserzementplatten.","m2",450]
[101,"C 05.02","217","Schutzraumabschlüsse","Schutzraumbauteile","Panzertüre.","Stk.",1200]
[102,"C 05.02","217","Schutzraumabschlüsse","Schutzraumbauteile","Fluchtröhre.","m1"]
[103,"E 03.01","221.1","Fenster aus Holz/Metall","Fenster","Fenster und Fenstertüren in Holz/Metall (mit SIGAB).","m2",650]
[104,"E 03.01","221.1","Fenster aus Holz/Metall","Fenster","Hebeschiebe in Holz/Metall (mit SIGAB).","m2",800]
[105,"E 03.01","221.2","Fenster aus Kunststoff","Fenster","Fenster und Fenstertüren in Kunststoff (mit SIGAB).","m2",500]
[106,"E 03.01","221.2","Fenster aus Kunststoff","Fenster","Hebeschiebe in Kunststoff (mit SIGAB).","m2",560]
[107,"E 03.01","221.3","Fenster aus Stahl","Fenster","Fenster und Fenstertüren in Kunststoff/Metall (mit SIGAB).","m2",560]
[108,"E 03.01","221.3","Fenster aus Stahl","Fenster","Hebeschiebe in Kunststoff/Metall (mit SIGAB).","m2",680]
[109,"E 03.02","221.6","Aussentüren, Tore aus Metall","Aussentüre","Aluminium Haustüre.","m2",1500]
[110,"E 03.03","221.6","Aussentüren, Tore aus Metall","Aussentor","Kipptor aus Metall.","m2",1200]
[111,"E 03.03","221.6","Aussentüren, Tore aus Metall","Aussentor","Handsender zu Tor","Stk",90]
[112,"E 02.04","221.7","Schaufensteranlagen","Systemfassade","Pfosten-/Riegel ohne Konstruktion max. über 1 Gechoss.","m2",1050]
[113,"F 01.01","222","Spenglerarbeiten","Dachabdichtung","Spenglerarbeiten, pro m2 Dachfläche","m2",35]
[114,"F 02.03","223","Blitzschutz","Schutzanlage zu Dach","Blitzschutz.Pro m2 Dachfläche","m2",13]
[115,"F 01.01","224.1","Plastische und elastische Dichtungsbeläge (Flachdächer)","Dachabdichtung unter Terrain","Vorarbeiten und Arbeiten.","m2",2.5]
[116,"F 01.01","224.1","Plastische und elastische Dichtungsbeläge (Flachdächer)","Dachabdichtung unter Terrain","Bitumenvoranstrich.","m2",3]
[117,"F 01.01","224.1","Plastische und elastische Dichtungsbeläge (Flachdächer)","Dachabdichtung unter Terrain","1cm Abdichtung bituminös 2-lagig.","m2",25]
[118,"F 01.01","224.1","Plastische und elastische Dichtungsbeläge (Flachdächer)","Dachabdichtung unter Terrain","Drain WS20.","m2",9]
[119,"F 01.01","224.1","Plastische und elastische Dichtungsbeläge (Flachdächer)","Dachabdichtung unter Terrain","Service pro Jahr. 5 x Kosten Dachabdichtung unter Terrain","Stk",0.75]
[120,"F 01.01","224.1","Plastische und elastische Dichtungsbeläge (Flachdächer)","Dachabdichtung","Zuschläge, Prozentsatz auf Adichtungsarbeiten","%",10]
[121,"F 01.02","224.1","Plastische und elastische Dichtungsbeläge (Flachdächer)","Flachdach begrünt","Dampfsperre.","m2",13]
[122,"F 01.02","224.1","Plastische und elastische Dichtungsbeläge (Flachdächer)","Flachdach begrünt","Wärmedämmung.","m2",60]
[123,"F 01.02","224.1","Plastische und elastische Dichtungsbeläge (Flachdächer)","Flachdach begrünt","Bitumendichtungsbahn 2-lagig.","m2",30]
[124,"F 01.02","224.1","Plastische und elastische Dichtungsbeläge (Flachdächer)","Flachdach begrünt","Schutz-/Entwässerungsschicht.","m2",15]
[125,"F 01.02","224.1","Plastische und elastische Dichtungsbeläge (Flachdächer)","Flachdach begrünt","Extensive Begrünung.","m2",30]
[126,"F 01.02","224.1","Plastische und elastische Dichtungsbeläge (Flachdächer)","Flachdach Balkon ungedämmt","Abdichtung.","m2",20]
[127,"F 01.02","224.1","Plastische und elastische Dichtungsbeläge (Flachdächer)","Flachdach Balkon ungedämmt","Zementüberzug.","m2",35]
[128,"F 01.02","224.1","Plastische und elastische Dichtungsbeläge (Flachdächer)","Flachdach Balkon gedämmt","Zementplatten inkl. Kiesschicht.","m2",65]
[129,"F 01.02","224.1",{"$f":"IF(C132=0,\"\",LOOKUP(C132,BKP,Baukostenplan))","v":"Plastische und elastische Dichtungsbeläge (Flachdächer)"},"Absturzsicherung Flachdach","Anschlagpunkte mit Grundplatten auf Beton. 5 Stück pro m","m",240]
[{"$f":"IF(C133=0,\"\",A132+1)","v":130},"F 01.02","224.1","Plastische und elastische Dichtungsbeläge (Flachdächer)","Absturzsicherung Flachdach","Führungsseil.","m",14]
[131,"F 01.02","224.1","Plastische und elastische Dichtungsbeläge (Flachdächer)","Absturzsicherung Flachdach","Eckverbindung.","Stk",25]
[132,"F 01.02","224.1","Plastische und elastische Dichtungsbeläge (Flachdächer)","Absturzsicherung Flachdach","Sicherheitstest.","Stk",375]
[133,"F 01.02","224.1","Plastische und elastische Dichtungsbeläge (Flachdächer)","Absturzsicherung Flachdach","Auffanggurt.","Stk",170]
[134,"F 01.02","224.1","Plastische und elastische Dichtungsbeläge (Flachdächer)","Absturzsicherung Flachdach","Sicherungsseil.","Stk",160]
[135,"F 02.02","224.2","Glaseinbauten in Steildächern","Element zu geneigtem Dach","Dachfenster z.B. Velux","Stk",2000]
[136,"F 02.01","224.3","Glaseinbauten in Flachdächern","Element zu Flachdach","RWA 1.2x1.2m ohne Sonnenschutz.","Stk",3500]
[137,"F 02.01","224.3","Glaseinbauten in Flachdächern","Element zu Flachdach","Dachausstieg 1.5x0.75m.","Stk",2500]
[138,"G 06.01","225.1","      .1 Fugendichtungen","Durchbruch, Schlitz zu Ausbau","Fugendichtungen.","GF",5]
[139,"G 03.01","225.2","      .2 Spezielle Dämmungen","Unterkonstruktion zu Wandbekleidung","Wanddämmung z.B. Unitex gestrichen UG.","m2",65]
[140,"G 04.01","225.2","      .2 Spezielle Dämmungen","Fertige Bekleidung Decke","Deckendämmung z.B. Unitex gestrichen UG.","m2",65]
[141,"G 06.02","225.4","      .4 Brandschutzbekleidungen und dgl      .","Abschottung","Brandschutzbekleidungen.","GF",6]
[142,"G 06.02","225.4","      .4 Brandschutzbekleidungen und dgl      .","Abschottung","Ausflocken von GIS-Elemente.","m3",210]
[143,"E 02.01","226.2","      .2 Verputzte Aussenwärmedämmungen","Äussere Beschichtung","Kunststoffnetz-Armierung.","m2",9]
[144,"E 02.01","226.2","      .2 Verputzte Aussenwärmedämmungen","Äussere Beschichtung","Grundputz.","m2",18]
[145,"E 02.01","226.2","      .2 Verputzte Aussenwärmedämmungen","Äussere Beschichtung","Deckputz.","m2",30]
[146,"E 02.01","226.2","      .2 Verputzte Aussenwärmedämmungen","Äussere Beschichtung","Zuschläge für Anschlüsse, Durchdringungen, etc., \nProzentsatz auf Aussenwärmedämmung","%",12]
[147,"E 02.02","226.2","      .2 Verputzte Aussenwärmedämmungen","Aussendämmung ","Klebemörtel 0.5cm.","m2",12]
[148,"E 02.02","226.2","      .2 Verputzte Aussenwärmedämmungen","Aussendämmung ","EPS-Dämmplatte 20.0cm.","m2",72]
[149,"E 02.02","226.2","      .2 Verputzte Aussenwärmedämmungen","Aussendämmung ","Sturzelemente.","m",60]
[150,"E 02.02","226.2","      .2 Verputzte Aussenwärmedämmungen","Aussendämmung ","Alu-Fensterbänke inkl. Winkel.","m",130]
[151,"E 02.02","226.2","      .2 Verputzte Aussenwärmedämmungen","Aussendämmung ","Zuschläge für Leibungen. Prozentsatz auf Aussenwärmedämmung","%",3]
[152,"E 02.02","226.2","      .2 Verputzte Aussenwärmedämmungen","Aussendämmung ","Zuschläge für Trawik in Leibungen (zur Handlaufbef.). Prozentsatz auf Aussenwärmedämmung","%",8]
[153,"E 02.02","226.2","      .2 Verputzte Aussenwärmedämmungen","Aussendämmung ","Zuschläge für Anschlüsse, Durchdringungen, etc. Prozentsatz auf Aussenwärmedämmung","%",10]
[154,"E 02.01","227.1","      .1 Äussere Malerarbeiten","Äussere Beschichtung","Anstrich auf Deckputz.","m2",12]
[155,"E 02.05","227.1","      .1 Äussere Malerarbeiten","Fassadenbekleidung Untersicht","Anstrich auf Balkonuntersichten.","m2",10]
[156,"E 03.04","228.2","      .2 Lamellenstoren","Sonnenschutz ","Verbundraffstoren mit Handkurbel.","m2",110]
[157,"E 03.04","228.3","      .3 Sonnenstoren","Sonnenschutz ","Gelenkarmmarkisen mit Handkurbel.","m2",130]
[158,"E 03.04","228.3","      .3 Sonnenstoren","Sonnenschutz ","Balkon / Loggia Vertikalmarkise Seilführung. Elektrisch.","m2",190]
[159,"E 03.04","228.3","      .3 Sonnenstoren","Sonnenschutz ","Balkon / Loggia Vertikalmarkise Seilführung. Manuell","m2",170]
[160,"D 01.01","231","Apparate Starkstrom","Anlage Erzeugung Starkstrom","EG-OG.","GF",90]
[161,"D 01.01","231","Apparate Starkstrom","Anlage Erzeugung Starkstrom","UG/Keller.","GF",25]
[162,"D 01.01","231","Apparate Starkstrom","Anlage Erzeugung Starkstrom","Photovoltaikanlagen","m2",280]
[163,"D 01.05","233","Leuchten und Lampen","Verbraucher Starkstrom: Leuchten","EG-OG.","GF",12]
[164,"D 01.05","233","Leuchten und Lampen","Verbraucher Starkstrom: Leuchten","UG/Keller.","GF",8]
[165,"D 04.01","236","Schwachstrominstallationen","Brandmeldeanlage","Brandmeldeanlage EG-AG.","GF",25]
[166,"D 04.01","236","Schwachstrominstallationen","Brandmeldeanlage","Brandmeldeanlage ESH.","GF",7]
[167,"D 04.02","236","Schwachstrominstallationen",null,"Gaswarnanlage.","GF",15]
[168,"D 02.01","237.1","      .1 Automationsebene","Managementebene","Elektro.","GF",7]
[169,"D 02.01","237.1","      .1 Automationsebene","Managementebene","HLKS","GF",12]
[170,"D 05.02","242","242 Wärmeerzeugung",null,"Wärmepumpe Erdsonde/Wasser & Bohrung ca. 200m.","EBF",60]
[171,"D 05.04","243","243 Wärmeverteilung",null,"Wärmehauptverteilung.","EBF",60]
[172,"D 04.06","244","244 Lüftungsanlagen",null,"Rauch- und Wärmeabzugsanlage ESH.","GF",20]
[173,"D 07.01","244","244 Lüftungsanlagen","Aussenluftversorgung, Fortluftführung","Lüftungsanalgen UG/Keller.","GF",35]
[174,"D 07.01","244","244 Lüftungsanlagen","Aussenluftversorgung, Fortluftführung","Lüftungsanalgen ESH.","GF",40]
[175,"D 07.02","244","244 Lüftungsanlagen","Luftaufbereitung","Kontrollierte Wohnungslüftung.","Whg.",11000]
[176,"D 07.02","244","244 Lüftungsanlagen",null,"Einzelne Abluftanlagen.","Stk",1800]
[177,"D 07.03","244","244 Lüftungsanlagen",null,"Luftwärmespeicherung.","GF",500]
[178,"D 06.02","246","246 Kälteanlagen",null,"Freecooling.","EBF",2.5]
[179,"D 08.05","251","251 Allgemeine Sanitärapparate","Wasser: Armatur, Apparat","Lieferung Sanitärapparate 2.5-Zimmerwohnung.","Whg",7000]
[180,"D 08.05","251","251 Allgemeine Sanitärapparate","Wasser: Armatur, Apparat","Lieferung Sanitärapparate 3.5-Zimmerwohnung.","Whg",7000]
[181,"D 08.05","251","251 Allgemeine Sanitärapparate","Wasser: Armatur, Apparat","Lieferung Sanitärapparate 4.5-Zimmerwohnung.","Whg",13000]
[182,"D 08.05","251","251 Allgemeine Sanitärapparate","Wasser: Armatur, Apparat","Lieferung Sanitärapparate 5.5-Zimmerwohnung.","Whg",13000]
[183,"D 08.05","251","251 Allgemeine Sanitärapparate","Wasser: Armatur, Apparat","Montage Sanitärapparate, Prozentsatz auf Apparatelieferung","%",30]
[184,"D 08.02","253","253 Sanitäre Ver- und Entsorgungsapparate",null,"Wasserbehandlung.","GF",555]
[185,"D 08.04","254","254 Sanitärleitungen","Wasserverteilung    ","Leitungen über GF.","GF",38]
[186,"D 08.04","255","255 Dämmungen Sanitärinstallationen","Wasserverteilung    ","Dämmungen Leitungen über GF.","GF",18]
[187,"D 08.06","256","256 Sanitärinstallationselemente","Wasser: Installationselemente","Installationselemente.","Stk",1600]
[188,"D 04.05","257","257 Elektro- und Pneumatiktafeln","Löschgerät","Handfeuerlöscher.","Stk.",550]
[189,"D 04.05","257","257 Elektro- und Pneumatiktafeln","Löschgerät","Feuerlöschposten.","Stk.",2600]
[190,"D 04.03","257","257 Elektro- und Pneumatiktafeln",null,"Sprinkleranlage ESH","GF",15]
[191,"G 05.02","258","258 Kücheneinrichtungen",null,"Küche für 2.5-Zimmerwohnung (5 Elemente).","Stk",7500]
[192,"G 05.02","258","258 Kücheneinrichtungen",null,"Küche für 3.5-Zimmerwohnung (6 Elemente).","Stk",9000]
[193,"G 05.02","258",{"$f":"IF(C196=0,\"\",LOOKUP(C196,BKP,Baukostenplan))","v":"258 Kücheneinrichtungen"},null,"Küche für 4.5-Zimmerwohnung (7 Elemente).","Stk",10500]
[{"$f":"IF(C197=0,\"\",A196+1)","v":194},"G 05.02","258","258 Kücheneinrichtungen",null,"Küche für 5.5-Zimmerwohnung (7 Elemente).","Stk",10500]
[195,"D 12.01","261","261 Aufzüge","Personenaufzug ","Aufzüge (8 Pers.) mit xy Haltestellen (pro Haltestelle Hst).","Hst",8200]
[196,"D 12.02","261","261 Aufzüge","Lasten- und Serviceaufzug","Lasten- und Serviceaufzüge.","Hst",20000]
[197,"D 12.03","263","263 Fassadenreinigungsanlagen","Spezialaufzüge","Befahranlage für Fassade","Stk",150000]
[198,"G 03.02","271.0","      .0 Verputzarbeiten (innere)",null,"Grundputz.","m2",9]
[199,"G 03.02","271.0","      .0 Verputzarbeiten (innere)",null,"Abrieb 1.5mm auf GP.","m2",15]
[200,"G 03.02","271.0","      .0 Verputzarbeiten (innere)",null,"Abrieb 1.5mm auf GKP ohne GP.","m2",18]
[201,"G 04.02","271.0","      .0 Verputzarbeiten (innere)","Fertige Bekleidung Decke","Weissputz Q3 inkl. Haftgrund.","m2",18]
[202,"G 04.02","271.0","      .0 Verputzarbeiten (innere)","Fertige Bekleidung Decke","Weissputz Q4 inkl. Haftgrund.","m2",25]
[203,"G 01.01","271.1","      .1 Spezielle Gipserarbeiten","Feststehende Trennwand","Gipsständer 10.5cm.","m2",95]
[204,"G 01.01","271.1","      .1 Spezielle Gipserarbeiten","Feststehende Trennwand","Gipsständer 12.5cm.","m2",120]
[205,"G 01.01","271.1","      .1 Spezielle Gipserarbeiten","Feststehende Trennwand","Gipsständer 15cm.","m2",130]
[206,"G 01.03","271.1","      .1 Spezielle Gipserarbeiten","Schachfront","Beplankung (nur Platten 2x125mm) auf GIS.","m2",60]
[207,"G 01.03","271.1","      .1 Spezielle Gipserarbeiten","Schachfront","Vorsatzschale.","m2",95]
[208,"G 01.06","272.0","      .0 Innentüren aus Metall","Innentor","Brandschutztor.","m2",2500]
[209,"G 05.07","272.1","      .1 Metallbaufertigteile","Kleinbauteil, Schutzraumeinrichtung","Briefkasten.","Stk",520]
[210,"G 05.07","272.1","      .1 Metallbaufertigteile","Kleinbauteil, Schutzraumeinrichtung","Bögli-Veloständer.","Stk",250]
[211,"G 05.07","272.1","      .1 Metallbaufertigteile","Kleinbauteil, Schutzraumeinrichtung","Kleinbauteile wie z.B. Abschlusswinkel und dgl.","GF",1.5]
[212,"E 02.06","272.2","      .2 Allgemeine Metallbauarbeiten (Schlosserarbeiten)","Aussen liegende Absturzsicherung","Staketengeländer.","m",380]
[213,"E 02.06","272.2","      .2 Allgemeine Metallbauarbeiten (Schlosserarbeiten)","Aussen liegende Absturzsicherung","Glasgeländer.","m",860]
[214,"E 02.06","272.2","      .2 Allgemeine Metallbauarbeiten (Schlosserarbeiten)","Aussen liegende Absturzsicherung","Handlauf.","m",170]
[215,"E 03.05","272.2","      .2 Allgemeine Metallbauarbeiten (Schlosserarbeiten)","Absturzsicherung","Staketengeländer duplexiert.","m",390]
[216,"E 03.05","272.2","      .2 Allgemeine Metallbauarbeiten (Schlosserarbeiten)","Absturzsicherung","Staketengeländer feuerverzinkt.","m",330]
[217,"E 03.05","272.2","      .2 Allgemeine Metallbauarbeiten (Schlosserarbeiten)","Absturzsicherung","Glasgeländer.","m",860]
[218,"E 03.05","272.2","      .2 Allgemeine Metallbauarbeiten (Schlosserarbeiten)","Absturzsicherung","Handlauf.","m",180]
[219,"G 05.05","272.2","      .2 Allgemeine Metallbauarbeiten (Schlosserarbeiten)","Absturz-, Ansprallschutzeinrichtung","Handlauf in Treppenhaus.","m",150]
[220,"G 05.05","272.2","      .2 Allgemeine Metallbauarbeiten (Schlosserarbeiten)","Absturz-, Ansprallschutzeinrichtung","Staketengeländer Treppenhaus.","m",360]
[221,"G 05.06","272.2","      .2 Allgemeine Metallbauarbeiten (Schlosserarbeiten)","Sonderbauteil","Cheminées.","Stk"]
[222,"G 05.06","272.2","      .2 Allgemeine Metallbauarbeiten (Schlosserarbeiten)","Sonderbauteil","Pflanztröge.","Stk"]
[223,"G 05.07","272.4","      .4 Schutzraumteile","Schutzraumbauteile","Ausstattung wie Trockenklosett, Betten und dgl.","GF",7]
[224,"G 05.07","272.4","      .4 Schutzraumteile","Kleinbauteil, Schutzraumeinrichtung","Schutzraumeinrichtung wie z.B. Trockenklosett, Bett und dgl.","GF",7]
[225,"G 01.05","273.0","      .0 Innentüren aus Holz",null,"Wohnungseingangstüre EI30 KH-belegt 1x2.1m Stahlzarge.","m2",960]
[226,"G 01.05","273.0","      .0 Innentüren aus Holz",null,"Zimmertüre KH-belegt 0.8x2.1m Stahlzarge.","m2",380]
[227,"G 01.05","273.0","      .0 Innentüren aus Holz",null,"Zimmertüre KH-belegt 0.8x2.1m Blockfutter.","m2",460]
[228,"G 01.05","273.0","      .0 Innentüren aus Holz",null,"Türe KH-belegt 0.8x2.1m Blockfutter EI30.","m2",560]
[229,"G 01.05","273.0","      .0 Innentüren aus Holz",null,"Türe zu TRH KH-belegt 0.9x2.1m Stahlzargen EI30 inkl. Türschl.","m2",960]
[230,"G 01.05","273.0","      .0 Innentüren aus Holz",null,"Türe UG KH-belegt 0.9x2.1m Stahlzargen EI30.","m2",550]
[231,"G 05.01","273.1","      .1 Wandschränke, Gestelle und dgl      .","Garderobe","Einbauschränke 3-teilig (2x Hochschr. mit Kleiderst.).","Stk",1300]
[232,"G 05.03","273.3","      .3 Allgemeine Schreinerarbeiten","Innerer Fensterausbau","VS 57 Vorhangschiene 1 x.","m",26]
[233,"G 05.03","273.3","      .3 Allgemeine Schreinerarbeiten","Innerer Fensterausbau","Fenstersims gestrichen.","m",70]
[234,"G 01.04","274","274 Spezialverglasungen (innen)",null,"Innenfenster.","m2",650]
[235,"D 03.04","275","275 Schliessanlagen",null,"Schliessanlage.","GF",5]
[236,"G 05.04","276","276 Innere Abschlüsse","Innerer Abschluss","Vorhang.","m2",200]
[237,"G 01.02","277.1","      .1 Schieb- und Faltwände","Bewegliche Trennwand","Elementschiebewände.","m2",1400]
[238,"G 01.01","277.2","      .2 Feststehende Elementwände","Feststehende Trennwand","WC-Trennwände inkl. Türen.","m2",450]
[239,"G 01.01","277.2","      .2 Feststehende Elementwände","Feststehende Trennwand","Holzlattenverschlag Keller inkl. Türen.","m2",45]
[240,"G 02.01","281.0","      .0 Unterlagsböden",null,"Trittschalldämmung 20mm.","m2",10.5]
[241,"G 02.01","281.0","      .0 Unterlagsböden",null,"Wärmedämmung 40mm.","m2",22]
[242,"G 02.01","281.0","      .0 Unterlagsböden",null,"PE-Folie.","m2",1.5]
[243,"G 02.01","281.0","      .0 Unterlagsböden",null,"Zementunterlagsboden.","m2",26]
[244,"G 02.01","281.0","      .0 Unterlagsböden",null,"Zuschläge für Anschüsse, etc. Prozentsatz auf UB Kosten","%",5]
[245,"G 02.02","281.1","      .1 Fugenlose Bodenbeläge",null,"Hartbetonbelag ohne Anforderungen ungeschliffen.","m2",35]
[246,"G 02.02","281.1","      .1 Fugenlose Bodenbeläge",null,"Hartbetonbelag mit 2K-Anstrich.","m2",50]
[247,"G 02.02","281.1","      .1 Fugenlose Bodenbeläge",null,"Hartbetonbelag imprägniert.","m2",55]
[248,"G 02.02","281.2","      .2 Bodenbeläge aus Kunststoffen, Textilien und dgl      .",null,"Epoxi-Kunstflessbelag.","m2",180]
[249,"G 02.02","281.2","      .2 Bodenbeläge aus Kunststoffen, Textilien und dgl      .",null,"Linoleum.","m2",70]
[250,"G 02.02","281.2","      .2 Bodenbeläge aus Kunststoffen, Textilien und dgl      .",null,"Parkdeckbelag Triflex.","m2",80]
[251,"G 02.02","281.2","      .2 Bodenbeläge aus Kunststoffen, Textilien und dgl      .",null,"Kugelgarn z.B. Fabromont fertig verlegt.","m2",55]
[252,"G 02.02","281.2","      .2 Bodenbeläge aus Kunststoffen, Textilien und dgl      .",null,"Schmutzschleusen z.B. Coral fertig verlegt.","m2",80]
[253,"G 02.02","281.6","      .6 Bodenbeläge Plattenarbeiten",null,"Keramischer Plattenboden 30x60cm z.B. Colby-Classic Material.","m2",80]
[254,"G 02.02","281.6","      .6 Bodenbeläge Plattenarbeiten",null,"Verlegearbeit zu Plattenboden.","m2",45]
[255,"G 02.02","281.6","      .6 Bodenbeläge Plattenarbeiten",null,"Sockel aus Platten zu Plattenboden.","m1",20]
[256,"G 02.02","281.6","      .6 Bodenbeläge Plattenarbeiten",null,"Vorarbeit wie Abdichtungen und dgl. inkl. Zuschläge zu Bodenplatten.","%",20]
[257,"G 02.02","281.7",{"$f":"IF(C260=0,\"\",LOOKUP(C260,BKP,Baukostenplan))","v":"      .7 Bodenbeläge aus Holz"},null,"Parkettboden z.B. Scheucher Bilaflor Material.","m2",58]
[{"$f":"IF(C261=0,\"\",A260+1)","v":258},"G 02.02","281.7","      .7 Bodenbeläge aus Holz",null,"Verlegearbeit inkl. Spachtelung und Zuschläge zu Parkettboden.","m2",40]
[259,"G 02.02","281.7","      .7 Bodenbeläge aus Holz",null,"Sockel in Holz zu Parkettboden.","m1",10]
[260,"G 02.02","281.8","      .8 Doppelböden",null,"Doppelböden inkl. vorgängiger Anstrich.","m2",75]
[261,"G 02.02","281.9","      .9 Sockel",null,"Sockel Alu.","m1",18]
[262,"G 03.02","282.4","      .4 Wandbeläge Plattenarbeiten",null,"Keramische Wandplatten 30x60cm z.B. Coby-Classic Material.","m2",80]
[263,"G 03.02","282.4","      .4 Wandbeläge Plattenarbeiten",null,"Verlegearbeit zu Wandplatten.","m2",45]
[264,"G 03.02","282.4","      .4 Wandbeläge Plattenarbeiten",null,"Vorarbeit wie Abdichtungen und dgl. inkl. Zuschläge zu Wandplatten.","%",25]
[265,"G 01.05","285.1","      .1 Innere Malerarbeiten",null,"Anstrich auf Innentüren (beidseitig).","m2",25]
[266,"G 02.02","285.1","      .1 Innere Malerarbeiten",null,"Anstrich auf Boden roh.","m2",12]
[267,"G 02.02","285.1","      .1 Innere Malerarbeiten",null,"Bodenmarkierung ESH.","Ehp",150]
[268,"G 03.02","285.1","      .1 Innere Malerarbeiten",null,"Anstrich auf Abrieb.","m2",6]
[269,"G 03.02","285.1","      .1 Innere Malerarbeiten",null,"Anstrich auf Wand roh.","m2",5]
[270,"G 04.02","285.1","      .1 Innere Malerarbeiten","Fertige Bekleidung Decke","Anstrich auf Weissputz.","m2",6]
[271,"G 04.02","285.1","      .1 Innere Malerarbeiten","Fertige Bekleidung Decke","Anstrich auf Decke roh.","m2",5]
[272,"G 05.07","285.1","      .1 Innere Malerarbeiten","Kleinbauteil, Schutzraumeinrichtung","Anstriche auf Metall- und Kleinteile.","GF",2]
[273,"G 06.03","286","286 Bauaustrocknung",null,"Gebäudeaustrocknung.","GF",3.5]
[274,"G 06.03","287","287 Baureinigung","Reinigung","Bau- und Endreinigung.","GF",10.5]
[275,"G 06.03","287","287 Baureinigung",null,"Spülen der Schmutz- und Meteorleitungen.","gl",1500]
["",null,null,""]
["",null,null,""]
["",null,null,""]
["",null,null,""]
["",null,null,""]
["",null,null,""]
["",null,null,""]
["",null,null,""]
["",null,null,""]
["",null,null,""]
["",null,null,""]
["",null,null,""]
["",null,null,""]
["",null,null,""]
["",null,null,""]
["",null,null,""]
["",null,null,""]
["",null,null,""]
["",null,null,""]
["",null,null,""]
["",null,null,""]
["",null,null,""]
["",null,null,""]
["",null,null,""]
["",null,null,""]
["",null,null,""]
["",null,null,""]
["",null,null,""]
["",null,null,""]
["",null,null,""]
["",null,null,""]
["",null,null,""]
["",null,null,""]
["",null,null,""]
["",null,null,""]
["",null,null,""]
["",null,null,""]
["",null,null,""]
["",null,null,""]
["",null,null,""]
["",null,null,""]
["",null,null,""]
["",null,null,""]
["",null,null,""]
["",null,null,""]
["",null,null,{"$f":"IF(C324=0,\"\",LOOKUP(C324,BKP,Baukostenplan))","v":""}]
[{"$f":"IF(C325=0,\"\",A324+1)","v":""},null,null,""]
["",null,null,""]
["",null,null,""]
["",null,null,""]
["",null,null,""]
["",null,null,""]
["",null,null,""]
["",null,null,""]
["",null,null,""]
["",null,null,""]
["",null,null,""]
["",null,null,""]
["",null,null,""]
["",null,null,""]
["",null,null,""]
["",null,null,""]
["",null,null,""]
["",null,null,""]
["",null,null,""]
["",null,null,""]
["",null,null,""]
["",null,null,""]
["",null,null,""]
["",null,null,""]
["",null,null,""]
["",null,null,""]
["",null,null,""]
["",null,null,""]
["",null,null,""]
["",null,null,""]
["",null,null,""]
["",null,null,""]
["",null,null,""]
["",null,null,""]
["",null,null,""]
["",null,null,""]
["",null,null,""]
["",null,null,""]
["",null,null,""]
["",null,null,""]
["",null,null,""]
["",null,null,""]
["",null,null,""]
["",null,null,""]
["",null,null,""]
["",null,null,""]
["",null,null,""]
["",null,null,""]
["",null,null,""]
["",null,null,""]
["",null,null,""]
["",null,null,""]
["",null,null,""]
["",null,null,""]
["",null,null,""]
["",null,null,""]
["",null,null,""]
["",null,null,""]
["",null,null,""]
["",null,null,""]
["",null,null,""]
["",null,null,""]
["",null,null,""]
["",null,null,{"$f":"IF(C388=0,\"\",LOOKUP(C388,BKP,Baukostenplan))","v":""}]
[{"$f":"IF(C389=0,\"\",A388+1)","v":""},null,null,""]
["",null,null,""]
["",null,null,""]
["",null,null,""]
["",null,null,""]
["",null,null,""]
["",null,null,""]
["",null,null,""]
["",null,null,""]
["",null,null,""]
["",null,null,""]
["",null,null,""]
["",null,null,""]
["",null,null,""]
["",null,null,""]
["",null,null,""]
["",null,null,""]
["",null,null,""]
["",null,null,""]
["",null,null,""]
["",null,null,""]
["",null,null,""]
["",null,null,""]
["",null,null,""]
["",null,null,""]
["",null,null,""]
["",null,null,""]
["",null,null,""]
["",null,null,""]
["",null,null,""]
["",null,null,""]
["",null,null,""]
["",null,null,""]
["",null,null,""]
["",null,null,""]
["",null,null,""]
["",null,null,""]
["",null,null,""]
["",null,null,""]
["",null,null,""]
["",null,null,""]
["",null,null,""]
["",null,null,""]
["",null,null,""]
["",null,null,""]
["",null,null,""]
["",null,null,""]
["",null,null,""]
["",null,null,""]
["",null,null,""]
["",null,null,""]
["",null,null,""]
["",null,null,""]
["",null,null,""]
["",null,null,""]
["",null,null,""]
["",null,null,""]
["",null,null,""]
["",null,null,""]
["",null,null,""]
["",null,null,""]
["",null,null,""]
["",null,null,""]
["",null,null,{"$f":"IF(C452=0,\"\",LOOKUP(C452,BKP,Baukostenplan))","v":""}]
[{"$f":"IF(C453=0,\"\",A452+1)","v":""},null,null,""]
["",null,null,""]
["",null,null,""]
["",null,null,""]
["",null,null,""]
["",null,null,""]
["",null,null,""]
["",null,null,""]
["",null,null,""]
["",null,null,""]
["",null,null,""]
["",null,null,""]
["",null,null,""]
["",null,null,""]
["",null,null,""]
["",null,null,""]
["",null,null,""]
["",null,null,""]
["",null,null,""]
["",null,null,""]
["",null,null,""]
["",null,null,""]
["",null,null,""]
["",null,null,""]
["",null,null,""]
["",null,null,""]
["",null,null,""]
["",null,null,""]
["",null,null,""]
["",null,null,""]
["",null,null,""]
["",null,null,""]
["",null,null,""]
["",null,null,""]
["",null,null,""]
["",null,null,""]
["",null,null,""]
["",null,null,""]
["",null,null,""]
["",null,null,""]
["",null,null,""]
["",null,null,""]
["",null,null,""]
["",null,null,""]
["",null,null,""]
["",null,null,""]
["",null,null,""]
["",null,null,""]
["",null,null,""]

{"sheet":"Bauteile (3)","index":20,"n_rows":501,"n_cols":11,"rows_kept":501,"cut":false,"hidden":true,"merged":[]}
["Lfd.-Nr.","BKP","eBKP-H","Beschreibung","Untertitel","Bauteil","Einheit",2024,2023,2022,{"$f":"COUNTIF(A:A,\">0\")","v":276}]
[1,"101","B 01.02",{"$f":"IF(B2=0,\"\",LOOKUP(B2,BKP,Baukostenplan))","v":"Bestandesaufnahmen"},null,"Gebäudeaufnahme Rissprotokolle","gl"]
[{"$f":"IF(B3=0,\"\",A2+1)","v":2},"102","B 01.01","Baugrunduntersuchungen",null,"Untersuchung","gl"]
[3,"102","B 01.03","Baugrunduntersuchungen","Umweltmessungen","Materialanalysen (falls Schadstoffe).","gl"]
[4,"102","B 01.04","Baugrunduntersuchungen","Überwachungen","Regelmässige Kontrollen (z.B. Gleis und dgl.).","h",120]
[5,"111","B 05.01","Rodungen",null,"Roden bestehender Sträucher und Bäume.","m2",3.5]
[6,"112",null,"Abbrüche","Rückbau nicht kontaminiertes Bauwerk","Budgetbetrag für Entrümpelung. Verrechung nach effektivem Aufwand.","gl"]
[7,"112","B 05.02","Abbrüche","Rückbau nicht kontaminiertes Bauwerk","Abbrüche /  Demontagen","m3",40]
[8,"119","B 05.03","Übriges","Rückbau kontaminiertes Bauwerk","Abbruch","m3",42]
[9,"119","B 05.03","Übriges","Rückbau kontaminiertes Bauwerk","Zusätzliche Entsorgungsgebühren.","m3",32]
[10,"119",null,"Übriges","Rückbau kontaminiertes Bauwerk","Schadstoffsanierung. \nVerrechung nach effektivem Aufwand.","gl"]
[11,"120","B 03","Übergangsposition",null,"Sicherung und Provisorien.","gl"]
[12,"13","B 02.01","Gemeinsame Baustelleneinrichtung",null,"Prozentsatz von BKP 2-4","%"]
[13,"131","B 02.01","Abschrankungen",null,"Signalisation u.d.gl.","gl"]
[14,"132","B 02.01","Zufahrten, Plätze",null,"Zufahrten und Plätze","m2"]
[15,"132","B 02.01","Zufahrten, Plätze",null,"Provisorische Parkplätze","Stk.",150]
[16,"133","B 02.03","Büro Bauleitung",null,"Einr. + Vorh. Bauleitungscontainer (LE=St x Mt).","LE",650]
[17,"135.0","B 02.02","Kanalisationen","Provisorische Installationen",null,"gl"]
[18,"135.1","B 02.02","Elektro","Provisorische Installationen","Einr. + Vorh. Baustromverteiler 2 Stk","Mnt.",535]
[19,"135.1","B 02.02","Elektro","Provisorische Installationen","Längeres Vorh. Baustromv. 2 Stk","Mnt.",344]
[20,"135.3","B 02.02","Wasser","Provisorische Installationen",null,"gl"]
[21,"136","B 02.02","Kosten für Energie, Wasser und dgl      .",null,"Verbr.+Ents. Baustrom, -wasser, -heizung","Mnt.",3750]
[22,"139","B 02.06","Übriges",null,"Winterbaumassnahmen.","m2"]
[23,"150",null,"Übergangsposition","Telekommunikationsleitung","Nur Kabel.","m"]
[24,"150",null,"Übergangsposition","Wasserleitung",null,"m"]
[25,"151","B 04","Erdarbeiten","Aushub und Hinterfüllung","Für sämtliche Werkleitungen (Wasser, Elektro, Medien).","m3",50]
[26,"152",null,"Kanalisationsleitungen",null,"Kanalisation inkl. Schächte, Grabarbeiten und Spülung.","pl"]
[27,"153",null,"Elektroleitungen",null,"Hüllrohre inkl. Schächte.","m"]
[28,"153",null,"Elektroleitungen",null,"Stark.- Schwachstrom","m",95]
[29,"153",null,"Elektroleitungen",null,"Bestehende Leitungen umlegen inkl. Grabarbeiten.","m"]
[30,"154","B 04","Heizungs-, Lüftungs-, Klima-, Kälteleitungen","Fernwärme, Fernbkälte","Heizungs- und Kälteleitung.","m",500]
[31,"154","B 04.08","Heizungs-, Lüftungs-, Klima-, Kälteleitungen","Gasleitung",null,"m",80]
[32,"172","B 06.03","Baugrubenabschlüsse","Böschungssicherung","Spritzbeton.","m2",180]
[33,"172","B 06.03","Baugrubenabschlüsse","Böschungssicherung","Nagelwände.","m2",360]
[34,"172","B 06.04","Baugrubenabschlüsse",null,"Spundwand.","m2",470]
[35,"172","B 06.04","Baugrubenabschlüsse",null,"Rühlwand.","m2",560]
[36,"172","B 06.04","Baugrubenabschlüsse",null,"Bohrpfahlwand.","m2",920]
[37,"175","C 01.01","Grundwasserabdichtungen",null,"Feuchtigkeitsabdichtung DK 2.","GGF",35]
[38,"175","C 01.01","Grundwasserabdichtungen",null,"Feuchtigkeitsabdichtung DK 1.","GGF",60]
[39,"175","E 01.01","Grundwasserabdichtungen","Abdichtung, Beschichtung unter Terrain","Abdichtung DK 2 Wände UG.","m2",35]
[40,"175","E 01.01","Grundwasserabdichtungen","Abdichtung, Beschichtung unter Terrain","Abdichtung DK 1 Wände UG.","m2",75]
[41,"176","B 06.06","Wasserhaltung",null,"Wasserhaltung für Oberflächenwasser.","gl"]
[42,"176","B 06.06","Wasserhaltung",null,"Gebühren für Einleitung Meteorwasser in Kanalisation.","m3",0.65]
[43,"176","B 06.06","Wasserhaltung",null,"Grundwasserabsenkung","m3"]
[44,"201.1","B 06.01","Erdarbeiten","Nicht kontaminierter Aushub","Oberboden maschinell mit seitlicher Lagerung.","m3",3.05]
[45,"201.1","B 06.01","Erdarbeiten","Nicht kontaminierter Aushub","Aushub maschinell mit seitlicher Lagerung.","m3",3.65]
[46,"201.1","B 06.01","Erdarbeiten","Nicht kontaminierter Aushub","Sohlenaushub letzte 20cm.","m3",4]
[47,"201.1","B 06.01","Erdarbeiten","Nicht kontaminierter Aushub","Transport Oberboden auf Deponie Baustelle.","m3",4]
[48,"201.1","B 06.01","Erdarbeiten","Nicht kontaminierter Aushub","Transport Oberboden auf Deponie Unternehmer.","m3",6.7]
[49,"201.1","B 06.01","Erdarbeiten","Nicht kontaminierter Aushub","Transport Aushub auf Deponie Unternehmer.","m3",10.6,12,11]
[50,"201.1","B 06.01","Erdarbeiten","Nicht kontaminierter Aushub","Gebühren Oberboden (Lagerung oder Abgabe).","m3",0.55000000000000004]
[51,"201.1","B 06.01","Erdarbeiten","Nicht kontaminierter Aushub","Gebühren Aushub (Lagerung oder Abgabe).","m3",5.6]
[52,"201.1","B 06.02","Erdarbeiten","Kontaminierter Aushub","Kontaminierter Aushub baggerfähig.","m3",36]
[53,"201.1","B 06.02","Erdarbeiten","Kontaminierter Aushub","Zusätzliche Gebühren.","m3"]
[54,"201.1","B 06.03","Erdarbeiten","Böschungssicherung","Einfache Baugrubensicherung mit PE-Folie.","m2",5.5]
[55,"201.1","B 06.05","Erdarbeiten","Materialeinbau","Einbringen Hinterfüllung von Deponie Baustelle.","m3",6.5]
[56,"201.1","B 06.05","Erdarbeiten","Materialeinbau","Hinderfüllung maschinell Verdichten.","m3",2.5]
[57,"201.1","B 06.05","Erdarbeiten","Materialeinbau","Liefern und Einbringen von Sickerkies 32-45mm.","m3",83]
[58,"211.0","B 02.01","Baustelleneinrichtung","Allgemeine Baustelleneinrichtung","Prozentsatz von BKP 2","%"," 6-8"]
[59,"211.0","B 02.03","Baustelleneinrichtung",null,"Bau-WC (LE=St x Mt)","LE",200]
[60,"211.0","B 02.03","Baustelleneinrichtung",null,"Längeres Vorh. Bau-WC (LE=St x Mt)","LE",200]
[61,"211.0","B 02.04","Baustelleneinrichtung",null,"Baukran (LE=St x Mt)","LE",5500]
[62,"211.0","B 02.04","Baustelleneinrichtung",null,"Kranbetrieb für dritte inkl. Bedinung","h"]
[63,"211.0","B 02.04","Baustelleneinrichtung",null,"Radwaschanlage (LE=St x Mt).","LE",2640]
[64,"211.1","B 08.01","Gerüste",null,"Fassadengerüst.","m2",36]
[65,"211.1","B 08.02",{"$f":"IF(B66=0,\"\",LOOKUP(B66,BKP,Baukostenplan))","v":"Gerüste"},null,"Innengerüst.","GF",2]
[{"$f":"IF(B67=0,\"\",A66+1)","v":66},"211.1","B 08.02","Gerüste",null,"Liftschachtgerüste.","Stk",410]
[67,"211.4","D 09.04","Kanalisationen im Gebäude",null,"Kanalisation unter/in Bodenplatte inkl. Aushub.","GGF",65]
[68,"211.4","D 09.04","Kanalisationen im Gebäude",null,"Versickerungsanlage","GGF",8]
[69,"211.4","D 09.04","Kanalisationen im Gebäude","Abwassersammlung","Kanalisation.","GGF",40]
[70,"211.5","C 01.02","Beton- und Stahlbetonarbeiten",null,"Einzelfundament, Beton horizontal oder im Gefalle bis 3%,","m2","Link",1000,800]
[71,"211.5","C 01.03","Beton- und Stahlbetonarbeiten",null,"Bodenplatte, Beton horizontal oder im Gefalle bis 3%,","m2","Link"]
[72,"211.5","C 02.01","Beton- und Stahlbetonarbeiten","Aussenwand","Aussenwandkonstruktion Betonwände","m2","Link"]
[73,"211.5","C 02.02","Beton- und Stahlbetonarbeiten","Innenwand","Innenwandkonstruktion Betonwände","m2","Link"]
[74,"211.5","C 04.01","Beton- und Stahlbetonarbeiten",null,"Geschossdecke in Beton","m2","Link"]
[75,"211.5","C 04.04","Beton- und Stahlbetonarbeiten",null,"Flachdachkonstruktion in Beton","m2","Link"]
[76,"211.5","C 04.08","Beton- und Stahlbetonarbeiten","Aussen liegende  Konstruktion, Vordach","Kragplattenanschlüsse gedämmt.","m",320]
[77,"211.5","C 04.08","Beton- und Stahlbetonarbeiten","Aussen liegende  Konstruktion, Vordach","Balkone","m2",230]
[78,"211.5","C 05.01","Beton- und Stahlbetonarbeiten","Durchbruch, Schlitz zu Konstruktion","Regie Baumeister, Prozent von BKP 23, 24, 25, 26","%",2.2999999999999998]
[79,"211.5","C 05.01","Beton- und Stahlbetonarbeiten","Durchbruch, Schlitz zu Konstruktion","Durchbruch, Schlitz zu Konstruktion, Prozent von BKP 23, 24, 25, 26","%",2.2999999999999998]
[80,"211.5","C 01 03","Beton- und Stahlbetonarbeiten",null,"Bodenplatte aus Stahlfaserbeton (ca. 35Kg/m3)","m2","Link"]
[81,"211.6","C 02.01","Maurerarbeiten","Backstein","Aussenwandkonstruktion Backstein","m2","Link"]
[82,"211.6","C 02.01","Maurerarbeiten","Dämmbackstein","Aussenwand Dämmbackstein Imbrex z7 inkl. Leibungen und Stürze","m2","Link"]
[83,"211.6","C 02.02","Maurerarbeiten",null,"Innenwandkonstruktion Backstein","m2","Link"]
[84,"211.6","C 02.02","Maurerarbeiten",null,"Innenwandkonstruktion Backstein","m2","Link"]
[85,"211.6","C 02.02","Maurerarbeiten",null,"Innenwandkonstruktion Kalksandstein","m2","Link"]
[86,"211.6","C 02.02","Maurerarbeiten",null,"Stürze zu Mauerwerke","m","Link"]
[87,"211.6","C 05.02","Maurerarbeiten","Ergänzende Leistungen","Zu Maurerarbeiten wie Mörtel Stahlzargen und dgl, Prozent von BKP 27+28","%",4.5]
[88,"211.9","C 01.01",0,"Abdichtung, Dämmung Bodenplatte","Perimeterdämmung XPS 500, 160mm.","m2",75]
[89,"211.9","E 01.02",0,"Aussenwärmedämmung unter Terrain","Perimeterdämmung.","m2",60]
[90,"211.9","E 01.03",0,null,"Schutzschicht unter Terrain.","m2",15]
[91,"212.2","C 03.01","Elemente aus Beton","Aussenstütze vorfabriziert","Vorfabrizierte Betonstützen 20x20cm.","m",500]
[92,"212.2","C 03.02","Elemente aus Beton","Innenstütze vorfabriziert","Vorfabrizierte Betonstützen 20x20cm.","m",500]
[93,"212.2","C 04.02","Elemente aus Beton","Innen liegende Treppen, Rampe","Vorfabrizierte innen Treppen in Beton. \n(Gemessene Aufsichtsfläche)","m2",650]
[94,"212.2","C 04.03","Elemente aus Beton","Innen liegendes Podest","Vorfabrizierte innen Podest in Beton.","m2",590]
[95,"212.2","C 04.06","Elemente aus Beton","Aussen liegende Treppe, Rampe","Vorfabrizierte aussen Treppen in Beton.","m2",650]
[96,"212.2","C 04.07","Elemente aus Beton","Aussen liegendes Podest","Vorfabrizierte aussen Podest in Beton.","m2",590]
[97,"212.2","E 02.06","Elemente aus Beton","Aussen liegende Absturzsicherung","Balkonbrüstungen Beton.","m",250]
[98,"212.2","C 01.04","Elemente aus Beton",null,"Erdverbundene Treppe, Rampe","m2",500]
[99,"212.2","C 01.05","Elemente aus Beton",null,"Erdverbundenes Podest.","m2",300]
[100,"214.1","C 04.05","Traggerippe (Zimmermanns- konstruktionen)","Konstruktion geneigtes Dach","Konstruktion geneigtes Dach in Holz.","m2",160]
[101,"215.2","E 02.03","Fassadenbau","Hinterlüftete Fassadensysteme","Lattenrost ausgedämmt, hinterl. Faserzementplatten.","m2",450]
[102,"217","C 05.02","Schutzraumabschlüsse","Schutzraumbauteile","Panzertüre.","Stk.",1200]
[103,"217","C 05.02","Schutzraumabschlüsse","Schutzraumbauteile","Fluchtröhre.","m1"]
[104,"221.1","E 03.01","Fenster aus Holz/Metall","Fenster","Fenster und Fenstertüren in Holz/Metall (mit SIGAB).","m2",650]
[105,"221.1","E 03.01","Fenster aus Holz/Metall","Fenster","Hebeschiebe in Holz/Metall (mit SIGAB).","m2",800]
[106,"221.2","E 03.01","Fenster aus Kunststoff","Fenster","Fenster und Fenstertüren in Kunststoff (mit SIGAB).","m2",500]
[107,"221.2","E 03.01","Fenster aus Kunststoff","Fenster","Hebeschiebe in Kunststoff (mit SIGAB).","m2",560]
[108,"221.3","E 03.01","Fenster aus Stahl","Fenster","Fenster und Fenstertüren in Kunststoff/Metall (mit SIGAB).","m2",560]
[109,"221.3","E 03.01","Fenster aus Stahl","Fenster","Hebeschiebe in Kunststoff/Metall (mit SIGAB).","m2",680]
[110,"221.6","E 03.02","Aussentüren, Tore aus Metall","Aussentüre","Aluminium Haustüre.","m2",1500]
[111,"221.6","E 03.03","Aussentüren, Tore aus Metall","Aussentor","Kipptor aus Metall.","m2",1200]
[112,"221.6","E 03.03","Aussentüren, Tore aus Metall","Aussentor","Handsender zu Tor","Stk",90]
[113,"221.7","E 02.04","Schaufensteranlagen","Systemfassade","Pfosten-/Riegel ohne Konstruktion max. über 1 Gechoss.","m2",1050]
[114,"222","F 01.01","Spenglerarbeiten","Dachabdichtung","Spenglerarbeiten, pro m2 Dachfläche","m2",35]
[115,"223","F 02.03","Blitzschutz","Schutzanlage zu Dach","Blitzschutz.Pro m2 Dachfläche","m2",13]
[116,"224.1","F 01.01","Plastische und elastische Dichtungsbeläge (Flachdächer)","Dachabdichtung unter Terrain","Vorarbeiten und Arbeiten.","m2",2.5]
[117,"224.1","F 01.01","Plastische und elastische Dichtungsbeläge (Flachdächer)","Dachabdichtung unter Terrain","Bitumenvoranstrich.","m2",3]
[118,"224.1","F 01.01","Plastische und elastische Dichtungsbeläge (Flachdächer)","Dachabdichtung unter Terrain","1cm Abdichtung bituminös 2-lagig.","m2",25]
[119,"224.1","F 01.01","Plastische und elastische Dichtungsbeläge (Flachdächer)","Dachabdichtung unter Terrain","Drain WS20.","m2",9]
[120,"224.1","F 01.01","Plastische und elastische Dichtungsbeläge (Flachdächer)","Dachabdichtung unter Terrain","Service pro Jahr. 5 x Kosten Dachabdichtung unter Terrain","Stk",0.75]
[121,"224.1","F 01.01","Plastische und elastische Dichtungsbeläge (Flachdächer)","Dachabdichtung","Zuschläge, Prozentsatz auf Adichtungsarbeiten","%",10]
[122,"224.1","F 01.02","Plastische und elastische Dichtungsbeläge (Flachdächer)","Flachdach begrünt","Dampfsperre.","m2",13]
[123,"224.1","F 01.02","Plastische und elastische Dichtungsbeläge (Flachdächer)","Flachdach begrünt","Wärmedämmung.","m2",60]
[124,"224.1","F 01.02","Plastische und elastische Dichtungsbeläge (Flachdächer)","Flachdach begrünt","Bitumendichtungsbahn 2-lagig.","m2",30]
[125,"224.1","F 01.02","Plastische und elastische Dichtungsbeläge (Flachdächer)","Flachdach begrünt","Schutz-/Entwässerungsschicht.","m2",15]
[126,"224.1","F 01.02","Plastische und elastische Dichtungsbeläge (Flachdächer)","Flachdach begrünt","Extensive Begrünung.","m2",30]
[127,"224.1","F 01.02","Plastische und elastische Dichtungsbeläge (Flachdächer)","Flachdach Balkon ungedämmt","Abdichtung.","m2",20]
[128,"224.1","F 01.02","Plastische und elastische Dichtungsbeläge (Flachdächer)","Flachdach Balkon ungedämmt","Zementüberzug.","m2",35]
[129,"224.1","F 01.02",{"$f":"IF(B130=0,\"\",LOOKUP(B130,BKP,Baukostenplan))","v":"Plastische und elastische Dichtungsbeläge (Flachdächer)"},"Flachdach Balkon gedämmt","Zementplatten inkl. Kiesschicht.","m2",65]
[{"$f":"IF(B131=0,\"\",A130+1)","v":130},"224.1","F 01.02","Plastische und elastische Dichtungsbeläge (Flachdächer)","Absturzsicherung Flachdach","Anschlagpunkte mit Grundplatten auf Beton. 5 Stück pro m","m",240]
[131,"224.1","F 01.02","Plastische und elastische Dichtungsbeläge (Flachdächer)","Absturzsicherung Flachdach","Führungsseil.","m",14]
[132,"224.1","F 01.02","Plastische und elastische Dichtungsbeläge (Flachdächer)","Absturzsicherung Flachdach","Eckverbindung.","Stk",25]
[133,"224.1","F 01.02","Plastische und elastische Dichtungsbeläge (Flachdächer)","Absturzsicherung Flachdach","Sicherheitstest.","Stk",375]
[134,"224.1","F 01.02","Plastische und elastische Dichtungsbeläge (Flachdächer)","Absturzsicherung Flachdach","Auffanggurt.","Stk",170]
[135,"224.1","F 01.02","Plastische und elastische Dichtungsbeläge (Flachdächer)","Absturzsicherung Flachdach","Sicherungsseil.","Stk",160]
[136,"224.2","F 02.02","Glaseinbauten in Steildächern","Element zu geneigtem Dach","Dachfenster z.B. Velux","Stk",2000]
[137,"224.3","F 02.01","Glaseinbauten in Flachdächern","Element zu Flachdach","RWA 1.2x1.2m ohne Sonnenschutz.","Stk",3500]
[138,"224.3","F 02.01","Glaseinbauten in Flachdächern","Element zu Flachdach","Dachausstieg 1.5x0.75m.","Stk",2500]
[139,"225.1","G 06.01","      .1 Fugendichtungen","Durchbruch, Schlitz zu Ausbau","Fugendichtungen.","GF",5]
[140,"225.2","G 03.01","      .2 Spezielle Dämmungen","Unterkonstruktion zu Wandbekleidung","Wanddämmung z.B. Unitex gestrichen UG.","m2",65]
[141,"225.2","G 04.01","      .2 Spezielle Dämmungen","Fertige Bekleidung Decke","Deckendämmung z.B. Unitex gestrichen UG.","m2",65]
[142,"225.4","G 06.02","      .4 Brandschutzbekleidungen und dgl      .","Abschottung","Brandschutzbekleidungen.","GF",6]
[143,"225.4","G 06.02","      .4 Brandschutzbekleidungen und dgl      .","Abschottung","Ausflocken von GIS-Elemente.","m3",210]
[144,"226.2","E 02.01","      .2 Verputzte Aussenwärmedämmungen","Äussere Beschichtung","Kunststoffnetz-Armierung.","m2",9]
[145,"226.2","E 02.01","      .2 Verputzte Aussenwärmedämmungen","Äussere Beschichtung","Grundputz.","m2",18]
[146,"226.2","E 02.01","      .2 Verputzte Aussenwärmedämmungen","Äussere Beschichtung","Deckputz.","m2",30]
[147,"226.2","E 02.01","      .2 Verputzte Aussenwärmedämmungen","Äussere Beschichtung","Zuschläge für Anschlüsse, Durchdringungen, etc., \nProzentsatz auf Aussenwärmedämmung","%",12]
[148,"226.2","E 02.02","      .2 Verputzte Aussenwärmedämmungen","Aussendämmung ","Klebemörtel 0.5cm.","m2",12]
[149,"226.2","E 02.02","      .2 Verputzte Aussenwärmedämmungen","Aussendämmung ","EPS-Dämmplatte 20.0cm.","m2",72]
[150,"226.2","E 02.02","      .2 Verputzte Aussenwärmedämmungen","Aussendämmung ","Sturzelemente.","m",60]
[151,"226.2","E 02.02","      .2 Verputzte Aussenwärmedämmungen","Aussendämmung ","Alu-Fensterbänke inkl. Winkel.","m",130]
[152,"226.2","E 02.02","      .2 Verputzte Aussenwärmedämmungen","Aussendämmung ","Zuschläge für Leibungen. Prozentsatz auf Aussenwärmedämmung","%",3]
[153,"226.2","E 02.02","      .2 Verputzte Aussenwärmedämmungen","Aussendämmung ","Zuschläge für Trawik in Leibungen (zur Handlaufbef.). Prozentsatz auf Aussenwärmedämmung","%",8]
[154,"226.2","E 02.02","      .2 Verputzte Aussenwärmedämmungen","Aussendämmung ","Zuschläge für Anschlüsse, Durchdringungen, etc. Prozentsatz auf Aussenwärmedämmung","%",10]
[155,"227.1","E 02.01","      .1 Äussere Malerarbeiten","Äussere Beschichtung","Anstrich auf Deckputz.","m2",12]
[156,"227.1","E 02.05","      .1 Äussere Malerarbeiten","Fassadenbekleidung Untersicht","Anstrich auf Balkonuntersichten.","m2",10]
[157,"228.2","E 03.04","      .2 Lamellenstoren","Sonnenschutz ","Verbundraffstoren mit Handkurbel.","m2",110]
[158,"228.3","E 03.04","      .3 Sonnenstoren","Sonnenschutz ","Gelenkarmmarkisen mit Handkurbel.","m2",130]
[159,"228.3","E 03.04","      .3 Sonnenstoren","Sonnenschutz ","Balkon / Loggia Vertikalmarkise Seilführung. Elektrisch.","m2",190]
[160,"228.3","E 03.04","      .3 Sonnenstoren","Sonnenschutz ","Balkon / Loggia Vertikalmarkise Seilführung. Manuell","m2",170]
[161,"231","D 01.01","Apparate Starkstrom","Anlage Erzeugung Starkstrom","EG-OG.","GF",90]
[162,"231","D 01.01","Apparate Starkstrom","Anlage Erzeugung Starkstrom","UG/Keller.","GF",25]
[163,"231","D 01.01","Apparate Starkstrom","Anlage Erzeugung Starkstrom","Photovoltaikanlagen","m2",280]
[164,"233","D 01.05","Leuchten und Lampen","Verbraucher Starkstrom: Leuchten","EG-OG.","GF",12]
[165,"233","D 01.05","Leuchten und Lampen","Verbraucher Starkstrom: Leuchten","UG/Keller.","GF",8]
[166,"236","D 04.01","Schwachstrominstallationen","Brandmeldeanlage","Brandmeldeanlage EG-AG.","GF",25]
[167,"236","D 04.01","Schwachstrominstallationen","Brandmeldeanlage","Brandmeldeanlage ESH.","GF",7]
[168,"236","D 04.02","Schwachstrominstallationen",null,"Gaswarnanlage.","GF",15]
[169,"237.1","D 02.01","      .1 Automationsebene","Managementebene","Elektro.","GF",7]
[170,"237.1","D 02.01","      .1 Automationsebene","Managementebene","HLKS","GF",12]
[171,"242","D 05.02","242 Wärmeerzeugung",null,"Wärmepumpe Erdsonde/Wasser & Bohrung ca. 200m.","EBF",60]
[172,"243","D 05.04","243 Wärmeverteilung",null,"Wärmehauptverteilung.","EBF",60]
[173,"244","D 04.06","244 Lüftungsanlagen",null,"Rauch- und Wärmeabzugsanlage ESH.","GF",20]
[174,"244","D 07.01","244 Lüftungsanlagen","Aussenluftversorgung, Fortluftführung","Lüftungsanalgen UG/Keller.","GF",35]
[175,"244","D 07.01","244 Lüftungsanlagen","Aussenluftversorgung, Fortluftführung","Lüftungsanalgen ESH.","GF",40]
[176,"244","D 07.02","244 Lüftungsanlagen","Luftaufbereitung","Kontrollierte Wohnungslüftung.","Whg.",11000]
[177,"244","D 07.02","244 Lüftungsanlagen",null,"Einzelne Abluftanlagen.","Stk",1800]
[178,"244","D 07.03","244 Lüftungsanlagen",null,"Luftwärmespeicherung.","GF",500]
[179,"246","D 06.02","246 Kälteanlagen",null,"Freecooling.","EBF",2.5]
[180,"251","D 08.05","251 Allgemeine Sanitärapparate","Wasser: Armatur, Apparat","Lieferung Sanitärapparate 2.5-Zimmerwohnung.","Whg",7000]
[181,"251","D 08.05","251 Allgemeine Sanitärapparate","Wasser: Armatur, Apparat","Lieferung Sanitärapparate 3.5-Zimmerwohnung.","Whg",7000]
[182,"251","D 08.05","251 Allgemeine Sanitärapparate","Wasser: Armatur, Apparat","Lieferung Sanitärapparate 4.5-Zimmerwohnung.","Whg",13000]
[183,"251","D 08.05","251 Allgemeine Sanitärapparate","Wasser: Armatur, Apparat","Lieferung Sanitärapparate 5.5-Zimmerwohnung.","Whg",13000]
[184,"251","D 08.05","251 Allgemeine Sanitärapparate","Wasser: Armatur, Apparat","Montage Sanitärapparate, Prozentsatz auf Apparatelieferung","%",30]
[185,"253","D 08.02","253 Sanitäre Ver- und Entsorgungsapparate",null,"Wasserbehandlung.","GF",555]
[186,"254","D 08.04","254 Sanitärleitungen","Wasserverteilung    ","Leitungen über GF.","GF",38]
[187,"255","D 08.04","255 Dämmungen Sanitärinstallationen","Wasserverteilung    ","Dämmungen Leitungen über GF.","GF",18]
[188,"256","D 08.06","256 Sanitärinstallationselemente","Wasser: Installationselemente","Installationselemente.","Stk",1600]
[189,"257","D 04.05","257 Elektro- und Pneumatiktafeln","Löschgerät","Handfeuerlöscher.","Stk.",550]
[190,"257","D 04.05","257 Elektro- und Pneumatiktafeln","Löschgerät","Feuerlöschposten.","Stk.",2600]
[191,"257","D 04.03","257 Elektro- und Pneumatiktafeln",null,"Sprinkleranlage ESH","GF",15]
[192,"258","G 05.02","258 Kücheneinrichtungen",null,"Küche für 2.5-Zimmerwohnung (5 Elemente).","Stk",7500]
[193,"258","G 05.02",{"$f":"IF(B194=0,\"\",LOOKUP(B194,BKP,Baukostenplan))","v":"258 Kücheneinrichtungen"},null,"Küche für 3.5-Zimmerwohnung (6 Elemente).","Stk",9000]
[{"$f":"IF(B195=0,\"\",A194+1)","v":194},"258","G 05.02","258 Kücheneinrichtungen",null,"Küche für 4.5-Zimmerwohnung (7 Elemente).","Stk",10500]
[195,"258","G 05.02","258 Kücheneinrichtungen",null,"Küche für 5.5-Zimmerwohnung (7 Elemente).","Stk",10500]
[196,"261","D 12.01","261 Aufzüge","Personenaufzug ","Aufzüge (8 Pers.) mit xy Haltestellen (pro Haltestelle Hst).","Hst",8200]
[197,"261","D 12.02","261 Aufzüge","Lasten- und Serviceaufzug","Lasten- und Serviceaufzüge.","Hst",20000]
[198,"263","D 12.03","263 Fassadenreinigungsanlagen","Spezialaufzüge","Befahranlage für Fassade","Stk",150000]
[199,"271.0","G 03.02","      .0 Verputzarbeiten (innere)",null,"Grundputz.","m2",9]
[200,"271.0","G 03.02","      .0 Verputzarbeiten (innere)",null,"Abrieb 1.5mm auf GP.","m2",15]
[201,"271.0","G 03.02","      .0 Verputzarbeiten (innere)",null,"Abrieb 1.5mm auf GKP ohne GP.","m2",18]
[202,"271.0","G 04.02","      .0 Verputzarbeiten (innere)","Fertige Bekleidung Decke","Weissputz Q3 inkl. Haftgrund.","m2",18]
[203,"271.0","G 04.02","      .0 Verputzarbeiten (innere)","Fertige Bekleidung Decke","Weissputz Q4 inkl. Haftgrund.","m2",25]
[204,"271.1","G 01.01","      .1 Spezielle Gipserarbeiten","Feststehende Trennwand","Gipsständer 10.5cm.","m2",95]
[205,"271.1","G 01.01","      .1 Spezielle Gipserarbeiten","Feststehende Trennwand","Gipsständer 12.5cm.","m2",120]
[206,"271.1","G 01.01","      .1 Spezielle Gipserarbeiten","Feststehende Trennwand","Gipsständer 15cm.","m2",130]
[207,"271.1","G 01.03","      .1 Spezielle Gipserarbeiten","Schachfront","Beplankung (nur Platten 2x125mm) auf GIS.","m2",60]
[208,"271.1","G 01.03","      .1 Spezielle Gipserarbeiten","Schachfront","Vorsatzschale.","m2",95]
[209,"272.0","G 01.06","      .0 Innentüren aus Metall","Innentor","Brandschutztor.","m2",2500]
[210,"272.1","G 05.07","      .1 Metallbaufertigteile","Kleinbauteil, Schutzraumeinrichtung","Briefkasten.","Stk",520]
[211,"272.1","G 05.07","      .1 Metallbaufertigteile","Kleinbauteil, Schutzraumeinrichtung","Bögli-Veloständer.","Stk",250]
[212,"272.1","G 05.07","      .1 Metallbaufertigteile","Kleinbauteil, Schutzraumeinrichtung","Kleinbauteile wie z.B. Abschlusswinkel und dgl.","GF",1.5]
[213,"272.2","E 02.06","      .2 Allgemeine Metallbauarbeiten (Schlosserarbeiten)","Aussen liegende Absturzsicherung","Staketengeländer.","m",380]
[214,"272.2","E 02.06","      .2 Allgemeine Metallbauarbeiten (Schlosserarbeiten)","Aussen liegende Absturzsicherung","Glasgeländer.","m",860]
[215,"272.2","E 02.06","      .2 Allgemeine Metallbauarbeiten (Schlosserarbeiten)","Aussen liegende Absturzsicherung","Handlauf.","m",170]
[216,"272.2","E 03.05","      .2 Allgemeine Metallbauarbeiten (Schlosserarbeiten)","Absturzsicherung","Staketengeländer duplexiert.","m",390]
[217,"272.2","E 03.05","      .2 Allgemeine Metallbauarbeiten (Schlosserarbeiten)","Absturzsicherung","Staketengeländer feuerverzinkt.","m",330]
[218,"272.2","E 03.05","      .2 Allgemeine Metallbauarbeiten (Schlosserarbeiten)","Absturzsicherung","Glasgeländer.","m",860]
[219,"272.2","E 03.05","      .2 Allgemeine Metallbauarbeiten (Schlosserarbeiten)","Absturzsicherung","Handlauf.","m",180]
[220,"272.2","G 05.05","      .2 Allgemeine Metallbauarbeiten (Schlosserarbeiten)","Absturz-, Ansprallschutzeinrichtung","Handlauf in Treppenhaus.","m",150]
[221,"272.2","G 05.05","      .2 Allgemeine Metallbauarbeiten (Schlosserarbeiten)","Absturz-, Ansprallschutzeinrichtung","Staketengeländer Treppenhaus.","m",360]
[222,"272.2","G 05.06","      .2 Allgemeine Metallbauarbeiten (Schlosserarbeiten)","Sonderbauteil","Cheminées.","Stk"]
[223,"272.2","G 05.06","      .2 Allgemeine Metallbauarbeiten (Schlosserarbeiten)","Sonderbauteil","Pflanztröge.","Stk"]
[224,"272.4","G 05.07","      .4 Schutzraumteile","Schutzraumbauteile","Ausstattung wie Trockenklosett, Betten und dgl.","GF",7]
[225,"272.4","G 05.07","      .4 Schutzraumteile","Kleinbauteil, Schutzraumeinrichtung","Schutzraumeinrichtung wie z.B. Trockenklosett, Bett und dgl.","GF",7]
[226,"273.0","G 01.05","      .0 Innentüren aus Holz",null,"Wohnungseingangstüre EI30 KH-belegt 1x2.1m Stahlzarge.","m2",960]
[227,"273.0","G 01.05","      .0 Innentüren aus Holz",null,"Zimmertüre KH-belegt 0.8x2.1m Stahlzarge.","m2",380]
[228,"273.0","G 01.05","      .0 Innentüren aus Holz",null,"Zimmertüre KH-belegt 0.8x2.1m Blockfutter.","m2",460]
[229,"273.0","G 01.05","      .0 Innentüren aus Holz",null,"Türe KH-belegt 0.8x2.1m Blockfutter EI30.","m2",560]
[230,"273.0","G 01.05","      .0 Innentüren aus Holz",null,"Türe zu TRH KH-belegt 0.9x2.1m Stahlzargen EI30 inkl. Türschl.","m2",960]
[231,"273.0","G 01.05","      .0 Innentüren aus Holz",null,"Türe UG KH-belegt 0.9x2.1m Stahlzargen EI30.","m2",550]
[232,"273.1","G 05.01","      .1 Wandschränke, Gestelle und dgl      .","Garderobe","Einbauschränke 3-teilig (2x Hochschr. mit Kleiderst.).","Stk",1300]
[233,"273.3","G 05.03","      .3 Allgemeine Schreinerarbeiten","Innerer Fensterausbau","VS 57 Vorhangschiene 1 x.","m",26]
[234,"273.3","G 05.03","      .3 Allgemeine Schreinerarbeiten","Innerer Fensterausbau","Fenstersims gestrichen.","m",70]
[235,"274","G 01.04","274 Spezialverglasungen (innen)",null,"Innenfenster.","m2",650]
[236,"275","D 03.04","275 Schliessanlagen",null,"Schliessanlage.","GF",5]
[237,"276","G 05.04","276 Innere Abschlüsse","Innerer Abschluss","Vorhang.","m2",200]
[238,"277.1","G 01.02","      .1 Schieb- und Faltwände","Bewegliche Trennwand","Elementschiebewände.","m2",1400]
[239,"277.2","G 01.01","      .2 Feststehende Elementwände","Feststehende Trennwand","WC-Trennwände inkl. Türen.","m2",450]
[240,"277.2","G 01.01","      .2 Feststehende Elementwände","Feststehende Trennwand","Holzlattenverschlag Keller inkl. Türen.","m2",45]
[241,"281.0","G 02.01","      .0 Unterlagsböden",null,"Trittschalldämmung 20mm.","m2",10.5]
[242,"281.0","G 02.01","      .0 Unterlagsböden",null,"Wärmedämmung 40mm.","m2",22]
[243,"281.0","G 02.01","      .0 Unterlagsböden",null,"PE-Folie.","m2",1.5]
[244,"281.0","G 02.01","      .0 Unterlagsböden",null,"Zementunterlagsboden.","m2",26]
[245,"281.0","G 02.01","      .0 Unterlagsböden",null,"Zuschläge für Anschüsse, etc. Prozentsatz auf UB Kosten","%",5]
[246,"281.1","G 02.02","      .1 Fugenlose Bodenbeläge",null,"Hartbetonbelag ohne Anforderungen ungeschliffen.","m2",35]
[247,"281.1","G 02.02","      .1 Fugenlose Bodenbeläge",null,"Hartbetonbelag mit 2K-Anstrich.","m2",50]
[248,"281.1","G 02.02","      .1 Fugenlose Bodenbeläge",null,"Hartbetonbelag imprägniert.","m2",55]
[249,"281.2","G 02.02","      .2 Bodenbeläge aus Kunststoffen, Textilien und dgl      .",null,"Epoxi-Kunstflessbelag.","m2",180]
[250,"281.2","G 02.02","      .2 Bodenbeläge aus Kunststoffen, Textilien und dgl      .",null,"Linoleum.","m2",70]
[251,"281.2","G 02.02","      .2 Bodenbeläge aus Kunststoffen, Textilien und dgl      .",null,"Parkdeckbelag Triflex.","m2",80]
[252,"281.2","G 02.02","      .2 Bodenbeläge aus Kunststoffen, Textilien und dgl      .",null,"Kugelgarn z.B. Fabromont fertig verlegt.","m2",55]
[253,"281.2","G 02.02","      .2 Bodenbeläge aus Kunststoffen, Textilien und dgl      .",null,"Schmutzschleusen z.B. Coral fertig verlegt.","m2",80]
[254,"281.6","G 02.02","      .6 Bodenbeläge Plattenarbeiten",null,"Keramischer Plattenboden 30x60cm z.B. Colby-Classic Material.","m2",80]
[255,"281.6","G 02.02","      .6 Bodenbeläge Plattenarbeiten",null,"Verlegearbeit zu Plattenboden.","m2",45]
[256,"281.6","G 02.02","      .6 Bodenbeläge Plattenarbeiten",null,"Sockel aus Platten zu Plattenboden.","m1",20]
[257,"281.6","G 02.02",{"$f":"IF(B258=0,\"\",LOOKUP(B258,BKP,Baukostenplan))","v":"      .6 Bodenbeläge Plattenarbeiten"},null,"Vorarbeit wie Abdichtungen und dgl. inkl. Zuschläge zu Bodenplatten.","%",20]
[{"$f":"IF(B259=0,\"\",A258+1)","v":258},"281.7","G 02.02","      .7 Bodenbeläge aus Holz",null,"Parkettboden z.B. Scheucher Bilaflor Material.","m2",58]
[259,"281.7","G 02.02","      .7 Bodenbeläge aus Holz",null,"Verlegearbeit inkl. Spachtelung und Zuschläge zu Parkettboden.","m2",40]
[260,"281.7","G 02.02","      .7 Bodenbeläge aus Holz",null,"Sockel in Holz zu Parkettboden.","m1",10]
[261,"281.8","G 02.02","      .8 Doppelböden",null,"Doppelböden inkl. vorgängiger Anstrich.","m2",75]
[262,"281.9","G 02.02","      .9 Sockel",null,"Sockel Alu.","m1",18]
[263,"282.4","G 03.02","      .4 Wandbeläge Plattenarbeiten",null,"Keramische Wandplatten 30x60cm z.B. Coby-Classic Material.","m2",80]
[264,"282.4","G 03.02","      .4 Wandbeläge Plattenarbeiten",null,"Verlegearbeit zu Wandplatten.","m2",45]
[265,"282.4","G 03.02","      .4 Wandbeläge Plattenarbeiten",null,"Vorarbeit wie Abdichtungen und dgl. inkl. Zuschläge zu Wandplatten.","%",25]
[266,"285.1","G 01.05","      .1 Innere Malerarbeiten",null,"Anstrich auf Innentüren (beidseitig).","m2",25]
[267,"285.1","G 02.02","      .1 Innere Malerarbeiten",null,"Anstrich auf Boden roh.","m2",12]
[268,"285.1","G 02.02","      .1 Innere Malerarbeiten",null,"Bodenmarkierung ESH.","Ehp",150]
[269,"285.1","G 03.02","      .1 Innere Malerarbeiten",null,"Anstrich auf Abrieb.","m2",6]
[270,"285.1","G 03.02","      .1 Innere Malerarbeiten",null,"Anstrich auf Wand roh.","m2",5]
[271,"285.1","G 04.02","      .1 Innere Malerarbeiten","Fertige Bekleidung Decke","Anstrich auf Weissputz.","m2",6]
[272,"285.1","G 04.02","      .1 Innere Malerarbeiten","Fertige Bekleidung Decke","Anstrich auf Decke roh.","m2",5]
[273,"285.1","G 05.07","      .1 Innere Malerarbeiten","Kleinbauteil, Schutzraumeinrichtung","Anstriche auf Metall- und Kleinteile.","GF",2]
[274,"286","G 06.03","286 Bauaustrocknung",null,"Gebäudeaustrocknung.","GF",3.5]
[275,"287","G 06.03","287 Baureinigung","Reinigung","Bau- und Endreinigung.","GF",10.5]
[276,"287","G 06.03","287 Baureinigung",null,"Spülen der Schmutz- und Meteorleitungen.","gl",1500]
[null,null,null,""]
[{"$f":"IF(B279=0,\"\",A278+1)","v":""},null,null,""]
["",null,null,""]
["",null,null,""]
["",null,null,""]
["",null,null,""]
["",null,null,""]
["",null,null,""]
["",null,null,""]
["",null,null,""]
["",null,null,""]
["",null,null,""]
["",null,null,""]
["",null,null,""]
["",null,null,""]
["",null,null,""]
["",null,null,""]
["",null,null,""]
["",null,null,""]
["",null,null,""]
["",null,null,""]
["",null,null,""]
["",null,null,""]
["",null,null,""]
["",null,null,""]
["",null,null,""]
["",null,null,""]
["",null,null,""]
["",null,null,""]
["",null,null,""]
["",null,null,""]
["",null,null,""]
["",null,null,""]
["",null,null,""]
["",null,null,""]
["",null,null,""]
["",null,null,""]
["",null,null,""]
["",null,null,""]
["",null,null,""]
["",null,null,""]
["",null,null,""]
["",null,null,""]
["",null,null,""]
["",null,null,{"$f":"IF(B322=0,\"\",LOOKUP(B322,BKP,Baukostenplan))","v":""}]
["",null,null,""]
["",null,null,""]
["",null,null,""]
["",null,null,""]
["",null,null,""]
["",null,null,""]
["",null,null,""]
["",null,null,""]
["",null,null,""]
["",null,null,""]
["",null,null,""]
["",null,null,""]
["",null,null,""]
["",null,null,""]
["",null,null,""]
["",null,null,""]
["",null,null,""]
["",null,null,""]
["",null,null,""]
["",null,null,""]
[{"$f":"IF(B343=0,\"\",A342+1)","v":""},null,null,""]
["",null,null,""]
["",null,null,""]
["",null,null,""]
["",null,null,""]
["",null,null,""]
["",null,null,""]
["",null,null,""]
["",null,null,""]
["",null,null,""]
["",null,null,""]
["",null,null,""]
["",null,null,""]
["",null,null,""]
["",null,null,""]
["",null,null,""]
["",null,null,""]
["",null,null,""]
["",null,null,""]
["",null,null,""]
["",null,null,""]
["",null,null,""]
["",null,null,""]
["",null,null,""]
["",null,null,""]
["",null,null,""]
["",null,null,""]
["",null,null,""]
["",null,null,""]
["",null,null,""]
["",null,null,""]
["",null,null,""]
["",null,null,""]
["",null,null,""]
["",null,null,""]
["",null,null,""]
["",null,null,""]
["",null,null,""]
["",null,null,""]
["",null,null,""]
["",null,null,""]
["",null,null,""]
["",null,null,""]
["",null,null,{"$f":"IF(B386=0,\"\",LOOKUP(B386,BKP,Baukostenplan))","v":""}]
["",null,null,""]
["",null,null,""]
["",null,null,""]
["",null,null,""]
["",null,null,""]
["",null,null,""]
["",null,null,""]
["",null,null,""]
["",null,null,""]
["",null,null,""]
["",null,null,""]
["",null,null,""]
["",null,null,""]
["",null,null,""]
["",null,null,""]
["",null,null,""]
["",null,null,""]
["",null,null,""]
["",null,null,""]
["",null,null,""]
[{"$f":"IF(B407=0,\"\",A406+1)","v":""},null,null,""]
["",null,null,""]
["",null,null,""]
["",null,null,""]
["",null,null,""]
["",null,null,""]
["",null,null,""]
["",null,null,""]
["",null,null,""]
["",null,null,""]
["",null,null,""]
["",null,null,""]
["",null,null,""]
["",null,null,""]
["",null,null,""]
["",null,null,""]
["",null,null,""]
["",null,null,""]
["",null,null,""]
["",null,null,""]
["",null,null,""]
["",null,null,""]
["",null,null,""]
["",null,null,""]
["",null,null,""]
["",null,null,""]
["",null,null,""]
["",null,null,""]
["",null,null,""]
["",null,null,""]
["",null,null,""]
["",null,null,""]
["",null,null,""]
["",null,null,""]
["",null,null,""]
["",null,null,""]
["",null,null,""]
["",null,null,""]
["",null,null,""]
["",null,null,""]
["",null,null,""]
["",null,null,""]
["",null,null,""]
["",null,null,{"$f":"IF(B450=0,\"\",LOOKUP(B450,BKP,Baukostenplan))","v":""}]
["",null,null,""]
["",null,null,""]
["",null,null,""]
["",null,null,""]
["",null,null,""]
["",null,null,""]
["",null,null,""]
["",null,null,""]
["",null,null,""]
["",null,null,""]
["",null,null,""]
["",null,null,""]
["",null,null,""]
["",null,null,""]
["",null,null,""]
["",null,null,""]
["",null,null,""]
["",null,null,""]
["",null,null,""]
["",null,null,""]
[{"$f":"IF(B471=0,\"\",A470+1)","v":""},null,null,""]
["",null,null,""]
["",null,null,""]
["",null,null,""]
["",null,null,""]
["",null,null,""]
["",null,null,""]
["",null,null,""]
["",null,null,""]
["",null,null,""]
["",null,null,""]
["",null,null,""]
["",null,null,""]
["",null,null,""]
["",null,null,""]
["",null,null,""]
["",null,null,""]
["",null,null,""]
["",null,null,""]
["",null,null,""]
["",null,null,""]
["",null,null,""]
["",null,null,""]
["",null,null,""]
["",null,null,""]
["",null,null,""]
["",null,null,""]
["",null,null,""]
["",null,null,""]
["",null,null,""]
[{"$error":"#VALUE!"},200,1234,{"$error":"#N/A"},"Test Bauteil","Keine","mm4",5000]

{"sheet":"Bauteile (4)","index":21,"n_rows":500,"n_cols":10,"rows_kept":500,"cut":false,"hidden":true,"merged":[]}
["ID","BKP","eBKP-H","Beschreibung","Untertitel","Bauteil","Einheit","2024 ","2023 ","2022 "]
[1,"101","B 01.02",{"$f":"IF(B2=0,\"\",LOOKUP(B2,BKP,Baukostenplan))","v":"Bestandesaufnahmen"},null,"Gebäudeaufnahme Rissprotokolle","gl"]
[2,"102","B 01.01","Baugrunduntersuchungen",null,"Untersuchung","gl"]
[3,"102","B 01.03","Baugrunduntersuchungen","Umweltmessungen","Materialanalysen (falls Schadstoffe).","gl"]
[4,"287","G 06.03","287 Baureinigung","Test 7000","Spülen der Schmutz- und Meteorleitungen.","gl",1500]
[5,"111","B 05.01","Rodungen",null,"Roden bestehender Sträucher und Bäume.","m2",3.5]
[6,"112",null,"Abbrüche","Rückbau nicht kontaminiertes Bauwerk","Budgetbetrag für Entrümpelung. Verrechung nach effektivem Aufwand.","gl"]
[7,"112","B 05.02","Abbrüche","Rückbau nicht kontaminiertes Bauwerk","Abbrüche /  Demontagen","m3",40]
[8,"119","B 05.03","Übriges","Rückbau kontaminiertes Bauwerk","Abbruch","m3",42]
[9,"119","B 05.03","Übriges","Rückbau kontaminiertes Bauwerk","Zusätzliche Entsorgungsgebühren.","m3",32]
[10,"119",null,"Übriges","Rückbau kontaminiertes Bauwerk","Schadstoffsanierung. \nVerrechung nach effektivem Aufwand.","gl"]
[11,"120","B 03","Übergangsposition",null,"Sicherung und Provisorien.","gl"]
[12,"13","B 02.01","Gemeinsame Baustelleneinrichtung",null,"Prozentsatz von BKP 2-4","%"]
[13,"131","B 02.01","Abschrankungen",null,"Signalisation u.d.gl.","gl"]
[14,"132","B 02.01","Zufahrten, Plätze",null,"Zufahrten und Plätze","m2"]
[15,"132","B 02.01","Zufahrten, Plätze",null,"Provisorische Parkplätze","Stk.",150]
[16,"133","B 02.03","Büro Bauleitung",null,"Einr. + Vorh. Bauleitungscontainer (LE=St x Mt).","LE",650]
[17,"135.0","B 02.02","Kanalisationen","Provisorische Installationen",null,"gl"]
[18,"135.1","B 02.02","Elektro","Provisorische Installationen","Einr. + Vorh. Baustromverteiler 2 Stk","Mnt.",535]
[19,"135.1","B 02.02","Elektro","Provisorische Installationen","Längeres Vorh. Baustromv. 2 Stk","Mnt.",344]
[20,"135.3","B 02.02","Wasser","Provisorische Installationen",null,"gl"]
[21,"136","B 02.02","Kosten für Energie, Wasser und dgl      .",null,"Verbr.+Ents. Baustrom, -wasser, -heizung","Mnt.",3750]
[22,"139","B 02.06","Übriges",null,"Winterbaumassnahmen.","m2"]
[23,"150",null,"Übergangsposition","Telekommunikationsleitung","Nur Kabel.","m"]
[24,"150",null,"Übergangsposition","Wasserleitung",null,"m"]
[25,"151","B 04","Erdarbeiten","Aushub und Hinterfüllung","Für sämtliche Werkleitungen (Wasser, Elektro, Medien).","m3",50]
[26,"152",null,"Kanalisationsleitungen",null,"Kanalisation inkl. Schächte, Grabarbeiten und Spülung.","pl"]
[27,"153",null,"Elektroleitungen",null,"Hüllrohre inkl. Schächte.","m"]
[28,"153",null,"Elektroleitungen",null,"Stark.- Schwachstrom","m",95]
[29,"153",null,"Elektroleitungen",null,"Bestehende Leitungen umlegen inkl. Grabarbeiten.","m"]
[30,"154","B 04","Heizungs-, Lüftungs-, Klima-, Kälteleitungen","Fernwärme, Fernbkälte","Heizungs- und Kälteleitung.","m",500]
[31,"154","B 04.08","Heizungs-, Lüftungs-, Klima-, Kälteleitungen","Gasleitung",null,"m",80]
[32,"172","B 06.03","Baugrubenabschlüsse","Böschungssicherung","Spritzbeton.","m2",180]
[33,"172","B 06.03","Baugrubenabschlüsse","Böschungssicherung","Nagelwände.","m2",360]
[34,"172","B 06.04","Baugrubenabschlüsse",null,"Spundwand.","m2",470]
[35,"172","B 06.04","Baugrubenabschlüsse",null,"Rühlwand.","m2",560]
[36,"172","B 06.04","Baugrubenabschlüsse",null,"Bohrpfahlwand.","m2",920]
[37,"175","C 01.01","Grundwasserabdichtungen",null,"Feuchtigkeitsabdichtung DK 2.","GGF",35]
[38,"175","C 01.01","Grundwasserabdichtungen",null,"Feuchtigkeitsabdichtung DK 1.","GGF",60]
[39,"175","E 01.01","Grundwasserabdichtungen","Abdichtung, Beschichtung unter Terrain","Abdichtung DK 2 Wände UG.","m2",35]
[40,"175","E 01.01","Grundwasserabdichtungen","Abdichtung, Beschichtung unter Terrain","Abdichtung DK 1 Wände UG.","m2",75]
[41,"176","B 06.06","Wasserhaltung",null,"Wasserhaltung für Oberflächenwasser.","gl"]
[42,"176","B 06.06","Wasserhaltung",null,"Gebühren für Einleitung Meteorwasser in Kanalisation.","m3",0.65]
[43,"176","B 06.06","Wasserhaltung",null,"Grundwasserabsenkung","m3"]
[44,"201.1","B 06.01","Erdarbeiten","Nicht kontaminierter Aushub","Oberboden maschinell mit seitlicher Lagerung.","m3",3.05]
[45,"201.1","B 06.01","Erdarbeiten","Nicht kontaminierter Aushub","Aushub maschinell mit seitlicher Lagerung.","m3",3.65]
[46,"201.1","B 06.01","Erdarbeiten","Nicht kontaminierter Aushub","Sohlenaushub letzte 20cm.","m3",4]
[47,"201.1","B 06.01","Erdarbeiten","Nicht kontaminierter Aushub","Transport Oberboden auf Deponie Baustelle.","m3",4]
[48,"201.1","B 06.01","Erdarbeiten","Nicht kontaminierter Aushub","Transport Oberboden auf Deponie Unternehmer.","m3",6.7]
[49,"201.1","B 06.01","Erdarbeiten","Nicht kontaminierter Aushub","Transport Aushub auf Deponie Unternehmer.","m3",10.6,12,11]
[50,"201.1","B 06.01","Erdarbeiten","Nicht kontaminierter Aushub","Gebühren Oberboden (Lagerung oder Abgabe).","m3",0.55000000000000004]
[51,"201.1","B 06.01","Erdarbeiten","Nicht kontaminierter Aushub","Gebühren Aushub (Lagerung oder Abgabe).","m3",5.6]
[52,"201.1","B 06.02","Erdarbeiten","Kontaminierter Aushub","Kontaminierter Aushub baggerfähig.","m3",36]
[53,"201.1","B 06.02","Erdarbeiten","Kontaminierter Aushub","Zusätzliche Gebühren.","m3"]
[54,"201.1","B 06.03","Erdarbeiten","Böschungssicherung","Einfache Baugrubensicherung mit PE-Folie.","m2",5.5]
[55,"201.1","B 06.05","Erdarbeiten","Materialeinbau","Einbringen Hinterfüllung von Deponie Baustelle.","m3",6.5]
[56,"201.1","B 06.05","Erdarbeiten","Materialeinbau","Hinderfüllung maschinell Verdichten.","m3",2.5]
[57,"201.1","B 06.05","Erdarbeiten","Materialeinbau","Liefern und Einbringen von Sickerkies 32-45mm.","m3",83]
[58,"211.0","B 02.01","Baustelleneinrichtung","Allgemeine Baustelleneinrichtung","Prozentsatz von BKP 2","%"," 6-8"]
[59,"211.0","B 02.03","Baustelleneinrichtung",null,"Bau-WC (LE=St x Mt)","LE",200]
[60,"211.0","B 02.03","Baustelleneinrichtung",null,"Längeres Vorh. Bau-WC (LE=St x Mt)","LE",200]
[61,"211.0","B 02.04","Baustelleneinrichtung",null,"Baukran (LE=St x Mt)","LE",5500]
[62,"211.0","B 02.04","Baustelleneinrichtung",null,"Kranbetrieb für dritte inkl. Bedinung","h"]
[63,"211.0","B 02.04","Baustelleneinrichtung",null,"Radwaschanlage (LE=St x Mt).","LE",2640]
[64,"211.1","B 08.01","Gerüste",null,"Fassadengerüst.","m2",36]
[65,"211.1","B 08.02",{"$f":"IF(B66=0,\"\",LOOKUP(B66,BKP,Baukostenplan))","v":"Gerüste"},null,"Innengerüst.","GF",2]
[66,"211.1","B 08.02","Gerüste",null,"Liftschachtgerüste.","Stk",410]
[67,"211.4","D 09.04","Kanalisationen im Gebäude",null,"Kanalisation unter/in Bodenplatte inkl. Aushub.","GGF",65]
[68,"211.4","D 09.04","Kanalisationen im Gebäude",null,"Versickerungsanlage","GGF",8]
[69,"211.4","D 09.04","Kanalisationen im Gebäude","Abwassersammlung","Kanalisation.","GGF",40]
[70,"211.5","C 01.02","Beton- und Stahlbetonarbeiten",null,"Einzelfundament, Beton horizontal oder im Gefalle bis 3%,","m2","Link",1000,800]
[71,"211.5","C 01.03","Beton- und Stahlbetonarbeiten",null,"Bodenplatte, Beton horizontal oder im Gefalle bis 3%,","m2","Link"]
[72,"211.5","C 02.01","Beton- und Stahlbetonarbeiten","Aussenwand","Aussenwandkonstruktion Betonwände","m2","Link"]
[73,"211.5","C 02.02","Beton- und Stahlbetonarbeiten","Innenwand","Innenwandkonstruktion Betonwände","m2","Link"]
[74,"211.5","C 04.01","Beton- und Stahlbetonarbeiten",null,"Geschossdecke in Beton","m2","Link"]
[75,"211.5","C 04.04","Beton- und Stahlbetonarbeiten",null,"Flachdachkonstruktion in Beton","m2","Link"]
[76,"211.5","C 04.08","Beton- und Stahlbetonarbeiten","Aussen liegende  Konstruktion, Vordach","Kragplattenanschlüsse gedämmt.","m",320]
[77,"211.5","C 04.08","Beton- und Stahlbetonarbeiten","Aussen liegende  Konstruktion, Vordach","Balkone","m2",230]
[78,"211.5","C 05.01","Beton- und Stahlbetonarbeiten","Durchbruch, Schlitz zu Konstruktion","Regie Baumeister, Prozent von BKP 23, 24, 25, 26","%",2.2999999999999998]
[79,"211.5","C 05.01","Beton- und Stahlbetonarbeiten","Durchbruch, Schlitz zu Konstruktion","Durchbruch, Schlitz zu Konstruktion, Prozent von BKP 23, 24, 25, 26","%",2.2999999999999998]
[80,"211.5","C 01 03","Beton- und Stahlbetonarbeiten",null,"Bodenplatte aus Stahlfaserbeton (ca. 35Kg/m3)","m2","Link"]
[81,"211.6","C 02.01","Maurerarbeiten","Backstein","Aussenwandkonstruktion Backstein","m2","Link"]
[82,"211.6","C 02.01","Maurerarbeiten","Dämmbackstein","Aussenwand Dämmbackstein Imbrex z7 inkl. Leibungen und Stürze","m2","Link"]
[83,"211.6","C 02.02","Maurerarbeiten",null,"Innenwandkonstruktion Backstein","m2","Link"]
[84,"211.6","C 02.02","Maurerarbeiten",null,"Innenwandkonstruktion Backstein","m2","Link"]
[85,"211.6","C 02.02","Maurerarbeiten",null,"Innenwandkonstruktion Kalksandstein","m2","Link"]
[86,"211.6","C 02.02","Maurerarbeiten",null,"Stürze zu Mauerwerke","m","Link"]
[87,"211.6","C 05.02","Maurerarbeiten","Ergänzende Leistungen","Zu Maurerarbeiten wie Mörtel Stahlzargen und dgl, Prozent von BKP 27+28","%",4.5]
[88,"211.9","C 01.01",0,"Abdichtung, Dämmung Bodenplatte","Perimeterdämmung XPS 500, 160mm.","m2",75]
[89,"211.9","E 01.02",0,"Aussenwärmedämmung unter Terrain","Perimeterdämmung.","m2",60]
[90,"211.9","E 01.03",0,null,"Schutzschicht unter Terrain.","m2",15]
[91,"212.2","C 03.01","Elemente aus Beton","Aussenstütze vorfabriziert","Vorfabrizierte Betonstützen 20x20cm.","m",500]
[92,"212.2","C 03.02","Elemente aus Beton","Innenstütze vorfabriziert","Vorfabrizierte Betonstützen 20x20cm.","m",500]
[93,"212.2","C 04.02","Elemente aus Beton","Innen liegende Treppen, Rampe","Vorfabrizierte innen Treppen in Beton. \n(Gemessene Aufsichtsfläche)","m2",650]
[94,"212.2","C 04.03","Elemente aus Beton","Innen liegendes Podest","Vorfabrizierte innen Podest in Beton.","m2",590]
[95,"212.2","C 04.06","Elemente aus Beton","Aussen liegende Treppe, Rampe","Vorfabrizierte aussen Treppen in Beton.","m2",650]
[96,"212.2","C 04.07","Elemente aus Beton","Aussen liegendes Podest","Vorfabrizierte aussen Podest in Beton.","m2",590]
[97,"212.2","E 02.06","Elemente aus Beton","Aussen liegende Absturzsicherung","Balkonbrüstungen Beton.","m",250]
[98,"212.2","C 01.04","Elemente aus Beton",null,"Erdverbundene Treppe, Rampe","m2",500]
[99,"212.2","C 01.05","Elemente aus Beton",null,"Erdverbundenes Podest.","m2",300]
[100,"214.1","C 04.05","Traggerippe (Zimmermanns- konstruktionen)","Konstruktion geneigtes Dach","Konstruktion geneigtes Dach in Holz.","m2",160]
[101,"215.2","E 02.03","Fassadenbau","Hinterlüftete Fassadensysteme","Lattenrost ausgedämmt, hinterl. Faserzementplatten.","m2",450]
[102,"217","C 05.02","Schutzraumabschlüsse","Schutzraumbauteile","Panzertüre.","Stk.",1200]
[103,"217","C 05.02","Schutzraumabschlüsse","Schutzraumbauteile","Fluchtröhre.","m1"]
[104,"221.1","E 03.01","Fenster aus Holz/Metall","Fenster Test","Hebeschiebe in Holz/Metall (mit SIGAB).","m2","800","800",650]
[105,"221.1","E 03.01","Fenster aus Holz/Metall","Fenster","Hebeschiebe in Holz/Metall (mit SIGAB).","m2",800]
[106,"221.1","E 03.01","Fenster aus Holz/Metall","Fenster Test","Hebeschiebe in Holz/Metall (mit SIGAB).","m2","800",150]
[107,"221.2","E 03.01","Fenster aus Kunststoff","Fenster","Fenster und Fenstertüren in Kunststoff (mit SIGAB).","m2",500]
[108,"221.2","E 03.01","Fenster aus Kunststoff","Fenster","Hebeschiebe in Kunststoff (mit SIGAB).","m2",560]
[109,"221.3","E 03.01","Fenster aus Stahl","Fenster","Fenster und Fenstertüren in Kunststoff/Metall (mit SIGAB).","m2",560]
[110,"221.3","E 03.01","Fenster aus Stahl","Fenster","Hebeschiebe in Kunststoff/Metall (mit SIGAB).","m2",680]
[111,"221.6","E 03.02","Aussentüren, Tore aus Metall","Aussentüre","Aluminium Haustüre.","m2",1500]
[112,"221.6","E 03.03","Aussentüren, Tore aus Metall","Aussentor","Kipptor aus Metall.","m2",1200]
[113,"221.6","E 03.03","Aussentüren, Tore aus Metall","Aussentor","Handsender zu Tor","Stk",90]
[114,"221.7","E 02.04","Schaufensteranlagen","Systemfassade","Pfosten-/Riegel ohne Konstruktion max. über 1 Gechoss.","m2",1050]
[115,"222","F 01.01","Spenglerarbeiten","Dachabdichtung","Spenglerarbeiten, pro m2 Dachfläche","m2",35]
[116,"223","F 02.03","Blitzschutz","Schutzanlage zu Dach","Blitzschutz.Pro m2 Dachfläche","m2",13]
[117,"224.1","F 01.01","Plastische und elastische Dichtungsbeläge (Flachdächer)","Dachabdichtung unter Terrain","Vorarbeiten und Arbeiten.","m2",2.5]
[118,"224.1","F 01.01","Plastische und elastische Dichtungsbeläge (Flachdächer)","Dachabdichtung unter Terrain","Bitumenvoranstrich.","m2",3]
[119,"224.1","F 01.01","Plastische und elastische Dichtungsbeläge (Flachdächer)","Dachabdichtung unter Terrain","1cm Abdichtung bituminös 2-lagig.","m2",25]
[120,"224.1","F 01.01","Plastische und elastische Dichtungsbeläge (Flachdächer)","Dachabdichtung unter Terrain","Drain WS20.","m2",9]
[121,"224.1","F 01.01","Plastische und elastische Dichtungsbeläge (Flachdächer)","Dachabdichtung unter Terrain","Service pro Jahr. 5 x Kosten Dachabdichtung unter Terrain","Stk",0.75]
[122,"224.1","F 01.01","Plastische und elastische Dichtungsbeläge (Flachdächer)","Dachabdichtung","Zuschläge, Prozentsatz auf Adichtungsarbeiten","%",10]
[123,"224.1","F 01.02","Plastische und elastische Dichtungsbeläge (Flachdächer)","Flachdach begrünt","Dampfsperre.","m2",13]
[124,"224.1","F 01.02","Plastische und elastische Dichtungsbeläge (Flachdächer)","Flachdach begrünt","Wärmedämmung.","m2",60]
[125,"224.1","F 01.02","Plastische und elastische Dichtungsbeläge (Flachdächer)","Flachdach begrünt","Bitumendichtungsbahn 2-lagig.","m2",30]
[126,"224.1","F 01.02","Plastische und elastische Dichtungsbeläge (Flachdächer)","Flachdach begrünt","Schutz-/Entwässerungsschicht.","m2",15]
[127,"224.1","F 01.02","Plastische und elastische Dichtungsbeläge (Flachdächer)","Flachdach begrünt","Extensive Begrünung.","m2",30]
[128,"224.1","F 01.02","Plastische und elastische Dichtungsbeläge (Flachdächer)","Flachdach Balkon ungedämmt","Abdichtung.","m2",20]
[129,"224.1","F 01.02",{"$f":"IF(B130=0,\"\",LOOKUP(B130,BKP,Baukostenplan))","v":"Plastische und elastische Dichtungsbeläge (Flachdächer)"},"Flachdach Balkon ungedämmt","Zementüberzug.","m2",35]
[130,"224.1","F 01.02","Plastische und elastische Dichtungsbeläge (Flachdächer)","Flachdach Balkon gedämmt","Zementplatten inkl. Kiesschicht.","m2",65]
[131,"224.1","F 01.02","Plastische und elastische Dichtungsbeläge (Flachdächer)","Absturzsicherung Flachdach","Anschlagpunkte mit Grundplatten auf Beton. 5 Stück pro m","m",240]
[132,"224.1","F 01.02","Plastische und elastische Dichtungsbeläge (Flachdächer)","Absturzsicherung Flachdach","Führungsseil.","m",14]
[133,"224.1","F 01.02","Plastische und elastische Dichtungsbeläge (Flachdächer)","Absturzsicherung Flachdach","Eckverbindung.","Stk",25]
[134,"224.1","F 01.02","Plastische und elastische Dichtungsbeläge (Flachdächer)","Absturzsicherung Flachdach","Sicherheitstest.","Stk",375]
[135,"224.1","F 01.02","Plastische und elastische Dichtungsbeläge (Flachdächer)","Absturzsicherung Flachdach","Auffanggurt.","Stk",170]
[136,"224.1","F 01.02","Plastische und elastische Dichtungsbeläge (Flachdächer)","Absturzsicherung Flachdach","Sicherungsseil.","Stk",160]
[137,"224.2","F 02.02","Glaseinbauten in Steildächern","Element zu geneigtem Dach","Dachfenster z.B. Velux","Stk",2000]
[138,"224.3","F 02.01","Glaseinbauten in Flachdächern","Element zu Flachdach","RWA 1.2x1.2m ohne Sonnenschutz.","Stk",3500]
[139,"224.3","F 02.01","Glaseinbauten in Flachdächern","Element zu Flachdach","Dachausstieg 1.5x0.75m.","Stk",2500]
[140,"225.1","G 06.01","      .1 Fugendichtungen","Durchbruch, Schlitz zu Ausbau","Fugendichtungen.","GF",5]
[141,"225.2","G 03.01","      .2 Spezielle Dämmungen","Unterkonstruktion zu Wandbekleidung","Wanddämmung z.B. Unitex gestrichen UG.","m2",65]
[142,"225.2","G 04.01","      .2 Spezielle Dämmungen","Fertige Bekleidung Decke","Deckendämmung z.B. Unitex gestrichen UG.","m2",65]
[143,"225.4","G 06.02","      .4 Brandschutzbekleidungen und dgl      .","Abschottung","Brandschutzbekleidungen.","GF",6]
[144,"225.4","G 06.02","      .4 Brandschutzbekleidungen und dgl      .","Abschottung","Ausflocken von GIS-Elemente.","m3",210]
[145,"226.2","E 02.01","      .2 Verputzte Aussenwärmedämmungen","Äussere Beschichtung","Kunststoffnetz-Armierung.","m2",9]
[146,"226.2","E 02.01","      .2 Verputzte Aussenwärmedämmungen","Äussere Beschichtung","Grundputz.","m2",18]
[147,"226.2","E 02.01","      .2 Verputzte Aussenwärmedämmungen","Äussere Beschichtung","Deckputz.","m2",30]
[148,"226.2","E 02.01","      .2 Verputzte Aussenwärmedämmungen","Äussere Beschichtung","Zuschläge für Anschlüsse, Durchdringungen, etc., \nProzentsatz auf Aussenwärmedämmung","%",12]
[149,"226.2","E 02.02","      .2 Verputzte Aussenwärmedämmungen","Aussendämmung ","Klebemörtel 0.5cm.","m2",12]
[150,"226.2","E 02.02","      .2 Verputzte Aussenwärmedämmungen","Aussendämmung ","EPS-Dämmplatte 20.0cm.","m2",72]
[151,"226.2","E 02.02","      .2 Verputzte Aussenwärmedämmungen","Aussendämmung ","Sturzelemente.","m",60]
[152,"226.2","E 02.02","      .2 Verputzte Aussenwärmedämmungen","Aussendämmung ","Alu-Fensterbänke inkl. Winkel.","m",130]
[153,"226.2","E 02.02","      .2 Verputzte Aussenwärmedämmungen","Aussendämmung ","Zuschläge für Leibungen. Prozentsatz auf Aussenwärmedämmung","%",3]
[154,"226.2","E 02.02","      .2 Verputzte Aussenwärmedämmungen","Aussendämmung ","Zuschläge für Trawik in Leibungen (zur Handlaufbef.). Prozentsatz auf Aussenwärmedämmung","%",8]
[155,"226.2","E 02.02","      .2 Verputzte Aussenwärmedämmungen","Aussendämmung ","Zuschläge für Anschlüsse, Durchdringungen, etc. Prozentsatz auf Aussenwärmedämmung","%",10]
[156,"227.1","E 02.01","      .1 Äussere Malerarbeiten","Äussere Beschichtung","Anstrich auf Deckputz.","m2",12]
[157,"227.1","E 02.05","      .1 Äussere Malerarbeiten","Fassadenbekleidung Untersicht","Anstrich auf Balkonuntersichten.","m2",10]
[158,"228.2","E 03.04","      .2 Lamellenstoren","Sonnenschutz ","Verbundraffstoren mit Handkurbel.","m2",110]
[159,"228.3","E 03.04","      .3 Sonnenstoren","Sonnenschutz ","Gelenkarmmarkisen mit Handkurbel.","m2",130]
[160,"228.3","E 03.04","      .3 Sonnenstoren","Sonnenschutz ","Balkon / Loggia Vertikalmarkise Seilführung. Elektrisch.","m2",190]
[161,"228.3","E 03.04","      .3 Sonnenstoren","Sonnenschutz ","Balkon / Loggia Vertikalmarkise Seilführung. Manuell","m2",170]
[162,"231","D 01.01","Apparate Starkstrom","Anlage Erzeugung Starkstrom","EG-OG.","GF",90]
[163,"231","D 01.01","Apparate Starkstrom","Anlage Erzeugung Starkstrom","UG/Keller.","GF",25]
[164,"231","D 01.01","Apparate Starkstrom","Anlage Erzeugung Starkstrom","Photovoltaikanlagen","m2",280]
[165,"233","D 01.05","Leuchten und Lampen","Verbraucher Starkstrom: Leuchten","EG-OG.","GF",12]
[166,"233","D 01.05","Leuchten und Lampen","Verbraucher Starkstrom: Leuchten","UG/Keller.","GF",8]
[167,"236","D 04.01","Schwachstrominstallationen","Brandmeldeanlage","Brandmeldeanlage EG-AG.","GF",25]
[168,"236","D 04.01","Schwachstrominstallationen","Brandmeldeanlage","Brandmeldeanlage ESH.","GF",7]
[169,"236","D 04.02","Schwachstrominstallationen",null,"Gaswarnanlage.","GF",15]
[170,"237.1","D 02.01","      .1 Automationsebene","Managementebene","Elektro.","GF",7]
[171,"237.1","D 02.01","      .1 Automationsebene","Managementebene","HLKS","GF",12]
[172,"242","D 05.02","242 Wärmeerzeugung",null,"Wärmepumpe Erdsonde/Wasser & Bohrung ca. 200m.","EBF",60]
[173,"243","D 05.04","243 Wärmeverteilung",null,"Wärmehauptverteilung.","EBF",60]
[174,"244","D 04.06","244 Lüftungsanlagen",null,"Rauch- und Wärmeabzugsanlage ESH.","GF",20]
[175,"244","D 07.01","244 Lüftungsanlagen","Aussenluftversorgung, Fortluftführung","Lüftungsanalgen UG/Keller.","GF",35]
[176,"244","D 07.01","244 Lüftungsanlagen","Aussenluftversorgung, Fortluftführung","Lüftungsanalgen ESH.","GF",40]
[177,"244","D 07.02","244 Lüftungsanlagen","Luftaufbereitung","Kontrollierte Wohnungslüftung.","Whg.",11000]
[178,"244","D 07.02","244 Lüftungsanlagen",null,"Einzelne Abluftanlagen.","Stk",1800]
[179,"244","D 07.03","244 Lüftungsanlagen",null,"Luftwärmespeicherung.","GF",500]
[180,"246","D 06.02","246 Kälteanlagen",null,"Freecooling.","EBF",2.5]
[181,"251","D 08.05","251 Allgemeine Sanitärapparate","Wasser: Armatur, Apparat","Lieferung Sanitärapparate 2.5-Zimmerwohnung.","Whg",7000]
[182,"251","D 08.05","251 Allgemeine Sanitärapparate","Wasser: Armatur, Apparat","Lieferung Sanitärapparate 3.5-Zimmerwohnung.","Whg",7000]
[183,"251","D 08.05","251 Allgemeine Sanitärapparate","Wasser: Armatur, Apparat","Lieferung Sanitärapparate 4.5-Zimmerwohnung.","Whg",13000]
[184,"251","D 08.05","251 Allgemeine Sanitärapparate","Wasser: Armatur, Apparat","Lieferung Sanitärapparate 5.5-Zimmerwohnung.","Whg",13000]
[185,"251","D 08.05","251 Allgemeine Sanitärapparate","Wasser: Armatur, Apparat","Montage Sanitärapparate, Prozentsatz auf Apparatelieferung","%",30]
[186,"253","D 08.02","253 Sanitäre Ver- und Entsorgungsapparate",null,"Wasserbehandlung.","GF",555]
[187,"254","D 08.04","254 Sanitärleitungen","Wasserverteilung    ","Leitungen über GF.","GF",38]
[188,"255","D 08.04","255 Dämmungen Sanitärinstallationen","Wasserverteilung    ","Dämmungen Leitungen über GF.","GF",18]
[189,"256","D 08.06","256 Sanitärinstallationselemente","Wasser: Installationselemente","Installationselemente.","Stk",1600]
[190,"257","D 04.05","257 Elektro- und Pneumatiktafeln","Löschgerät","Handfeuerlöscher.","Stk.",550]
[191,"257","D 04.05","257 Elektro- und Pneumatiktafeln","Löschgerät","Feuerlöschposten.","Stk.",2600]
[192,"257","D 04.03","257 Elektro- und Pneumatiktafeln",null,"Sprinkleranlage ESH","GF",15]
[193,"258","G 05.02",{"$f":"IF(B194=0,\"\",LOOKUP(B194,BKP,Baukostenplan))","v":"258 Kücheneinrichtungen"},null,"Küche für 2.5-Zimmerwohnung (5 Elemente).","Stk",7500]
[194,"258","G 05.02","258 Kücheneinrichtungen",null,"Küche für 3.5-Zimmerwohnung (6 Elemente).","Stk",9000]
[195,"258","G 05.02","258 Kücheneinrichtungen",null,"Küche für 4.5-Zimmerwohnung (7 Elemente).","Stk",10500]
[196,"258","G 05.02","258 Kücheneinrichtungen",null,"Küche für 5.5-Zimmerwohnung (7 Elemente).","Stk",10500]
[197,"261","D 12.01","261 Aufzüge","Personenaufzug ","Aufzüge (8 Pers.) mit xy Haltestellen (pro Haltestelle Hst).","Hst",8200]
[198,"261","D 12.02","261 Aufzüge","Lasten- und Serviceaufzug","Lasten- und Serviceaufzüge.","Hst",20000]
[199,"263","D 12.03","263 Fassadenreinigungsanlagen","Spezialaufzüge","Befahranlage für Fassade","Stk",150000]
[200,"271.0","G 03.02","      .0 Verputzarbeiten (innere)",null,"Grundputz.","m2",9]
[201,"271.0","G 03.02","      .0 Verputzarbeiten (innere)",null,"Abrieb 1.5mm auf GP.","m2",15]
[202,"271.0","G 03.02","      .0 Verputzarbeiten (innere)",null,"Abrieb 1.5mm auf GKP ohne GP.","m2",18]
[203,"271.0","G 04.02","      .0 Verputzarbeiten (innere)","Fertige Bekleidung Decke","Weissputz Q3 inkl. Haftgrund.","m2",18]
[204,"271.0","G 04.02","      .0 Verputzarbeiten (innere)","Fertige Bekleidung Decke","Weissputz Q4 inkl. Haftgrund.","m2",25]
[205,"271.1","G 01.01","      .1 Spezielle Gipserarbeiten","Feststehende Trennwand","Gipsständer 10.5cm.","m2",95]
[206,"271.1","G 01.01","      .1 Spezielle Gipserarbeiten","Feststehende Trennwand","Gipsständer 12.5cm.","m2",120]
[207,"271.1","G 01.01","      .1 Spezielle Gipserarbeiten","Feststehende Trennwand","Gipsständer 15cm.","m2",130]
[208,"271.1","G 01.03","      .1 Spezielle Gipserarbeiten","Schachfront","Beplankung (nur Platten 2x125mm) auf GIS.","m2",60]
[209,"271.1","G 01.03","      .1 Spezielle Gipserarbeiten","Schachfront","Vorsatzschale.","m2",95]
[210,"272.0","G 01.06","      .0 Innentüren aus Metall","Innentor","Brandschutztor.","m2",2500]
[211,"272.1","G 05.07","      .1 Metallbaufertigteile","Kleinbauteil, Schutzraumeinrichtung","Briefkasten.","Stk",520]
[212,"272.1","G 05.07","      .1 Metallbaufertigteile","Kleinbauteil, Schutzraumeinrichtung","Kleinbauteile wie z.B. Abschlusswinkel und dgl.","GF",1.5]
[213,"272.2","E 02.06","      .2 Allgemeine Metallbauarbeiten (Schlosserarbeiten)","Aussen liegende Absturzsicherung","Staketengeländer.","m",380]
[214,"272.2","E 02.06","      .2 Allgemeine Metallbauarbeiten (Schlosserarbeiten)","Aussen liegende Absturzsicherung","Glasgeländer.","m",860]
[215,"272.2","E 02.06","      .2 Allgemeine Metallbauarbeiten (Schlosserarbeiten)","Aussen liegende Absturzsicherung","Handlauf.","m",170]
[216,"272.2","E 03.05","      .2 Allgemeine Metallbauarbeiten (Schlosserarbeiten)","Absturzsicherung","Staketengeländer duplexiert.","m",390]
[217,"272.2","E 03.05","      .2 Allgemeine Metallbauarbeiten (Schlosserarbeiten)","Absturzsicherung","Staketengeländer feuerverzinkt.","m",330]
[218,"272.2","E 03.05","      .2 Allgemeine Metallbauarbeiten (Schlosserarbeiten)","Absturzsicherung","Glasgeländer.","m",860]
[219,"272.2","E 03.05","      .2 Allgemeine Metallbauarbeiten (Schlosserarbeiten)","Absturzsicherung","Handlauf.","m",180]
[220,"272.2","G 05.05","      .2 Allgemeine Metallbauarbeiten (Schlosserarbeiten)","Absturz-, Ansprallschutzeinrichtung","Staketengeländer Treppenhaus.","m",360]
[221,"272.2","G 05.06","      .2 Allgemeine Metallbauarbeiten (Schlosserarbeiten)","Sonderbauteil","Cheminées.","Stk"]
[222,"272.2","G 05.06","      .2 Allgemeine Metallbauarbeiten (Schlosserarbeiten)","Sonderbauteil","Pflanztröge.","Stk"]
[223,"272.4","G 05.07","      .4 Schutzraumteile","Schutzraumbauteile","Ausstattung wie Trockenklosett, Betten und dgl.","GF",7]
[224,"272.4","G 05.07","      .4 Schutzraumteile","Kleinbauteil, Schutzraumeinrichtung","Schutzraumeinrichtung wie z.B. Trockenklosett, Bett und dgl.","GF",7]
[225,"273.0","G 01.05","      .0 Innentüren aus Holz",null,"Wohnungseingangstüre EI30 KH-belegt 1x2.1m Stahlzarge.","m2",960]
[226,"273.0","G 01.05","      .0 Innentüren aus Holz",null,"Zimmertüre KH-belegt 0.8x2.1m Stahlzarge.","m2",380]
[227,"273.0","G 01.05","      .0 Innentüren aus Holz",null,"Zimmertüre KH-belegt 0.8x2.1m Blockfutter.","m2",460]
[228,"273.0","G 01.05","      .0 Innentüren aus Holz",null,"Türe KH-belegt 0.8x2.1m Blockfutter EI30.","m2",560]
[229,"273.0","G 01.05","      .0 Innentüren aus Holz",null,"Türe zu TRH KH-belegt 0.9x2.1m Stahlzargen EI30 inkl. Türschl.","m2",960]
[230,"273.0","G 01.05","      .0 Innentüren aus Holz",null,"Türe UG KH-belegt 0.9x2.1m Stahlzargen EI30.","m2",550]
[231,"273.1","G 05.01","      .1 Wandschränke, Gestelle und dgl      .","Garderobe","Einbauschränke 3-teilig (2x Hochschr. mit Kleiderst.).","Stk",1300]
[232,"273.3","G 05.03","      .3 Allgemeine Schreinerarbeiten","Innerer Fensterausbau","VS 57 Vorhangschiene 1 x.","m",26]
[233,"273.3","G 05.03","      .3 Allgemeine Schreinerarbeiten","Innerer Fensterausbau","Fenstersims gestrichen.","m",70]
[234,"274","G 01.04","274 Spezialverglasungen (innen)",null,"Innenfenster.","m2",650]
[235,"275","D 03.04","275 Schliessanlagen",null,"Schliessanlage.","GF",5]
[236,"276","G 05.04","276 Innere Abschlüsse","Innerer Abschluss","Vorhang.","m2",200]
[237,"277.1","G 01.02","      .1 Schieb- und Faltwände","Bewegliche Trennwand","Elementschiebewände.","m2",1400]
[238,"277.2","G 01.01","      .2 Feststehende Elementwände","Feststehende Trennwand","WC-Trennwände inkl. Türen.","m2",450]
[239,"277.2","G 01.01","      .2 Feststehende Elementwände","Feststehende Trennwand","Holzlattenverschlag Keller inkl. Türen.","m2",45]
[240,"281.0","G 02.01","      .0 Unterlagsböden",null,"Trittschalldämmung 20mm.","m2",10.5]
[241,"281.0","G 02.01","      .0 Unterlagsböden",null,"Wärmedämmung 40mm.","m2",22]
[242,"281.0","G 02.01","      .0 Unterlagsböden",null,"PE-Folie.","m2",1.5]
[243,"281.0","G 02.01","      .0 Unterlagsböden",null,"Zementunterlagsboden.","m2",26]
[244,"281.0","G 02.01","      .0 Unterlagsböden",null,"Zuschläge für Anschüsse, etc. Prozentsatz auf UB Kosten","%",5]
[245,"281.1","G 02.02","      .1 Fugenlose Bodenbeläge",null,"Hartbetonbelag ohne Anforderungen ungeschliffen.","m2",35]
[246,"281.1","G 02.02","      .1 Fugenlose Bodenbeläge",null,"Hartbetonbelag mit 2K-Anstrich.","m2",50]
[247,"281.1","G 02.02","      .1 Fugenlose Bodenbeläge",null,"Hartbetonbelag imprägniert.","m2",55]
[248,"281.2","G 02.02","      .2 Bodenbeläge aus Kunststoffen, Textilien und dgl      .",null,"Epoxi-Kunstflessbelag.","m2",180]
[249,"281.2","G 02.02","      .2 Bodenbeläge aus Kunststoffen, Textilien und dgl      .",null,"Linoleum.","m2",70]
[250,"281.2","G 02.02","      .2 Bodenbeläge aus Kunststoffen, Textilien und dgl      .",null,"Parkdeckbelag Triflex.","m2",80]
[251,"281.2","G 02.02","      .2 Bodenbeläge aus Kunststoffen, Textilien und dgl      .",null,"Kugelgarn z.B. Fabromont fertig verlegt.","m2",55]
[252,"281.2","G 02.02","      .2 Bodenbeläge aus Kunststoffen, Textilien und dgl      .",null,"Schmutzschleusen z.B. Coral fertig verlegt.","m2",80]
[253,"281.6","G 02.02","      .6 Bodenbeläge Plattenarbeiten",null,"Keramischer Plattenboden 30x60cm z.B. Colby-Classic Material.","m2",80]
[254,"281.6","G 02.02","      .6 Bodenbeläge Plattenarbeiten",null,"Verlegearbeit zu Plattenboden.","m2",45]
[255,"281.6","G 02.02","      .6 Bodenbeläge Plattenarbeiten",null,"Sockel aus Platten zu Plattenboden.","m1",20]
[256,"281.6","G 02.02","      .6 Bodenbeläge Plattenarbeiten",null,"Vorarbeit wie Abdichtungen und dgl. inkl. Zuschläge zu Bodenplatten.","%",20]
[257,"281.7","G 02.02",{"$f":"IF(B258=0,\"\",LOOKUP(B258,BKP,Baukostenplan))","v":"      .7 Bodenbeläge aus Holz"},null,"Parkettboden z.B. Scheucher Bilaflor Material.","m2",58]
[258,"281.7","G 02.02","      .7 Bodenbeläge aus Holz",null,"Verlegearbeit inkl. Spachtelung und Zuschläge zu Parkettboden.","m2",40]
[259,"281.7","G 02.02","      .7 Bodenbeläge aus Holz",null,"Sockel in Holz zu Parkettboden.","m1",10]
[260,"281.8","G 02.02","      .8 Doppelböden",null,"Doppelböden inkl. vorgängiger Anstrich.","m2",75]
[261,"281.9","G 02.02","      .9 Sockel",null,"Sockel Alu.","m1",18]
[262,"282.4","G 03.02","      .4 Wandbeläge Plattenarbeiten",null,"Keramische Wandplatten 30x60cm z.B. Coby-Classic Material.","m2",80]
[263,"282.4","G 03.02","      .4 Wandbeläge Plattenarbeiten",null,"Verlegearbeit zu Wandplatten.","m2",45]
[264,"282.4","G 03.02","      .4 Wandbeläge Plattenarbeiten",null,"Vorarbeit wie Abdichtungen und dgl. inkl. Zuschläge zu Wandplatten.","%",25]
[265,"285.1","G 01.05","      .1 Innere Malerarbeiten",null,"Anstrich auf Innentüren (beidseitig).","m2",25]
[266,"285.1","G 02.02","      .1 Innere Malerarbeiten",null,"Anstrich auf Boden roh.","m2",12]
[267,"285.1","G 02.02","      .1 Innere Malerarbeiten",null,"Bodenmarkierung ESH.","Ehp",150]
[268,"285.1","G 03.02","      .1 Innere Malerarbeiten",null,"Anstrich auf Abrieb.","m2",6]
[269,"285.1","G 03.02","      .1 Innere Malerarbeiten",null,"Anstrich auf Wand roh.","m2",5]
[270,"285.1","G 04.02","      .1 Innere Malerarbeiten","Fertige Bekleidung Decke","Anstrich auf Weissputz.","m2",6]
[271,"285.1","G 04.02","      .1 Innere Malerarbeiten","Fertige Bekleidung Decke","Anstrich auf Decke roh.","m2",5]
[272,"285.1","G 05.07","      .1 Innere Malerarbeiten","Kleinbauteil, Schutzraumeinrichtung","Anstriche auf Metall- und Kleinteile.","GF",2]
[273,"286","G 06.03","286 Bauaustrocknung",null,"Gebäudeaustrocknung.","GF",3.5]
[274,"287","G 06.03","287 Baureinigung","Reinigung","Bau- und Endreinigung.","GF",10.5]
[275,"287","G 06.03","287 Baureinigung",null,"Spülen der Schmutz- und Meteorleitungen.","gl",1500]
[null,null,null,""]
[null,null,null,""]
[null,null,null,""]
[null,null,null,""]
[null,null,null,""]
[null,null,null,""]
[null,null,null,""]
[null,null,null,""]
[null,null,null,""]
[null,null,null,""]
[null,null,null,""]
[null,null,null,""]
[null,null,null,""]
[null,null,null,""]
[null,null,null,""]
[null,null,null,""]
[null,null,null,""]
[null,null,null,""]
[null,null,null,""]
[null,null,null,""]
[null,null,null,""]
[null,null,null,""]
[null,null,null,""]
[null,null,null,""]
[null,null,null,""]
[null,null,null,""]
[null,null,null,""]
[null,null,null,""]
[null,null,null,""]
[null,null,null,""]
[null,null,null,""]
[null,null,null,""]
[null,null,null,""]
[null,null,null,""]
[null,null,null,""]
[null,null,null,""]
[null,null,null,""]
[null,null,null,""]
[null,null,null,""]
[null,null,null,""]
[null,null,null,""]
[null,null,null,""]
[null,null,null,""]
[null,null,null,""]
[null,null,null,""]
[null,null,null,{"$f":"IF(B322=0,\"\",LOOKUP(B322,BKP,Baukostenplan))","v":""}]
[null,null,null,""]
[null,null,null,""]
[null,null,null,""]
[null,null,null,""]
[null,null,null,""]
[null,null,null,""]
[null,null,null,""]
[null,null,null,""]
[null,null,null,""]
[null,null,null,""]
[null,null,null,""]
[null,null,null,""]
[null,null,null,""]
[null,null,null,""]
[null,null,null,""]
[null,null,null,""]
[null,null,null,""]
[null,null,null,""]
[null,null,null,""]
[null,null,null,""]
[null,null,null,""]
[null,null,null,""]
[null,null,null,""]
[null,null,null,""]
[null,null,null,""]
[null,null,null,""]
[null,null,null,""]
[null,null,null,""]
[null,null,null,""]
[null,null,null,""]
[null,null,null,""]
[null,null,null,""]
[null,null,null,""]
[null,null,null,""]
[null,null,null,""]
[null,null,null,""]
[null,null,null,""]
[null,null,null,""]
[null,null,null,""]
[null,null,null,""]
[null,null,null,""]
[null,null,null,""]
[null,null,null,""]
[null,null,null,""]
[null,null,null,""]
[null,null,null,""]
[null,null,null,""]
[null,null,null,""]
[null,null,null,""]
[null,null,null,""]
[null,null,null,""]
[null,null,null,""]
[null,null,null,""]
[null,null,null,""]
[null,null,null,""]
[null,null,null,""]
[null,null,null,""]
[null,null,null,""]
[null,null,null,""]
[null,null,null,""]
[null,null,null,""]
[null,null,null,""]
[null,null,null,""]
[null,null,null,{"$f":"IF(B386=0,\"\",LOOKUP(B386,BKP,Baukostenplan))","v":""}]
[null,null,null,""]
[null,null,null,""]
[null,null,null,""]
[null,null,null,""]
[null,null,null,""]
[null,null,null,""]
[null,null,null,""]
[null,null,null,""]
[null,null,null,""]
[null,null,null,""]
[null,null,null,""]
[null,null,null,""]
[null,null,null,""]
[null,null,null,""]
[null,null,null,""]
[null,null,null,""]
[null,null,null,""]
[null,null,null,""]
[null,null,null,""]
[null,null,null,""]
[null,null,null,""]
[null,null,null,""]
[null,null,null,""]
[null,null,null,""]
[null,null,null,""]
[null,null,null,""]
[null,null,null,""]
[null,null,null,""]
[null,null,null,""]
[null,null,null,""]
[null,null,null,""]
[null,null,null,""]
[null,null,null,""]
[null,null,null,""]
[null,null,null,""]
[null,null,null,""]
[null,null,null,""]
[null,null,null,""]
[null,null,null,""]
[null,null,null,""]
[null,null,null,""]
[null,null,null,""]
[null,null,null,""]
[null,null,null,""]
[null,null,null,""]
[null,null,null,""]
[null,null,null,""]
[null,null,null,""]
[null,null,null,""]
[null,null,null,""]
[null,null,null,""]
[null,null,null,""]
[null,null,null,""]
[null,null,null,""]
[null,null,null,""]
[null,null,null,""]
[null,null,null,""]
[null,null,null,""]
[null,null,null,""]
[null,null,null,""]
[null,null,null,""]
[null,null,null,""]
[null,null,null,""]
[null,null,null,{"$f":"IF(B450=0,\"\",LOOKUP(B450,BKP,Baukostenplan))","v":""}]
[null,null,null,""]
[null,null,null,""]
[null,null,null,""]
[null,null,null,""]
[null,null,null,""]
[null,null,null,""]
[null,null,null,""]
[null,null,null,""]
[null,null,null,""]
[null,null,null,""]
[null,null,null,""]
[null,null,null,""]
[null,null,null,""]
[null,null,null,""]
[null,null,null,""]
[null,null,null,""]
[null,null,null,""]
[null,null,null,""]
[null,null,null,""]
[null,null,null,""]
[null,null,null,""]
[null,null,null,""]
[null,null,null,""]
[null,null,null,""]
[null,null,null,""]
[null,null,null,""]
[null,null,null,""]
[null,null,null,""]
[null,null,null,""]
[null,null,null,""]
[null,null,null,""]
[null,null,null,""]
[null,null,null,""]
[null,null,null,""]
[null,null,null,""]
[null,null,null,""]
[null,null,null,""]
[null,null,null,""]
[null,null,null,""]
[null,null,null,""]
[null,null,null,""]
[null,null,null,""]
[null,null,null,""]
[null,null,null,""]
[null,null,null,""]
[null,null,null,""]
[null,null,null,""]
[null,null,null,""]
[null,null,null,""]
[null,null,null,""]

{"sheet":"Bauteile_B","index":22,"n_rows":277,"n_cols":9,"rows_kept":277,"cut":false,"hidden":true,"merged":[]}
["BKP","eBKP-H","Beschreibung","Untertitel","Bauteil","Einheit","2024 ","2023 ","2022 "]
["101","B 01.02","Bestandesaufnahmen",null,"Gebäudeaufnahme Rissprotokolle","gl",10,"    ","    "]
["102","B 01.01",{"$f":"IF(A3=0,\"\",LOOKUP(A3,BKP,Baukostenplan))","v":"Baugrunduntersuchungen"},null,"Untersuchung","gl",11]
["102","B 01.03","Baugrunduntersuchungen","Umweltmessungen","Materialanalysen (falls Schadstoffe).","gl",12,5,6]
["287","G 06.03","287 Baureinigung",null,"Spülen der Schmutz- und Meteorleitungen.","gl",13]
["111","B 05.01","Rodungen",null,"Roden bestehender Sträucher und Bäume.","m2",14]
["112",null,"Abbrüche","Rückbau nicht kontaminiertes Bauwerk","Budgetbetrag für Entrümpelung. Verrechung nach effektivem Aufwand.","gl",15]
["112","B 05.02","Abbrüche","Rückbau nicht kontaminiertes Bauwerk","Abbrüche /  Demontagen","m3",16]
["119","B 05.03","Übriges","Rückbau kontaminiertes Bauwerk","Abbruch","m3",17]
["119","B 05.03","Übriges","Rückbau kontaminiertes Bauwerk","Zusätzliche Entsorgungsgebühren.","m3",18]
["119",null,"Übriges","Rückbau kontaminiertes Bauwerk","Schadstoffsanierung. \nVerrechung nach effektivem Aufwand.","gl",19]
["120","B 03","Übergangsposition",null,"Sicherung und Provisorien.","gl",20]
["13","B 02.01","Gemeinsame Baustelleneinrichtung",null,"Prozentsatz von BKP 2-4","%",21]
["131","B 02.01","Abschrankungen",null,"Signalisation u.d.gl.","gl",22]
["132","B 02.01","Zufahrten, Plätze",null,"Zufahrten und Plätze","m2",23]
["132","B 02.01","Zufahrten, Plätze",null,"Provisorische Parkplätze","Stk.",24]
["133","B 02.03","Büro Bauleitung",null,"Einr. + Vorh. Bauleitungscontainer (LE=St x Mt).","LE",25]
["135.0","B 02.02","Kanalisationen","Provisorische Installationen",null,"gl",26]
["135.1","B 02.02","Elektro","Provisorische Installationen","Einr. + Vorh. Baustromverteiler 2 Stk","Mnt.",27]
["135.1","B 02.02","Elektro","Provisorische Installationen","Längeres Vorh. Baustromv. 2 Stk","Mnt.",28]
["135.3","B 02.02","Wasser","Provisorische Installationen",null,"gl",29]
["136","B 02.02","Kosten für Energie, Wasser und dgl      .",null,"Verbr.+Ents. Baustrom, -wasser, -heizung","Mnt.",30]
["139","B 02.06","Übriges",null,"Winterbaumassnahmen.","m2",31]
["150",null,"Übergangsposition","Telekommunikationsleitung","Nur Kabel.","m",32]
["150",null,"Übergangsposition","Wasserleitung",null,"m",33]
["151","B 04","Erdarbeiten","Aushub und Hinterfüllung","Für sämtliche Werkleitungen (Wasser, Elektro, Medien).","m3",34]
["152",null,"Kanalisationsleitungen",null,"Kanalisation inkl. Schächte, Grabarbeiten und Spülung.","pl",35]
["153",null,"Elektroleitungen",null,"Hüllrohre inkl. Schächte.","m",36]
["153",null,"Elektroleitungen",null,"Stark.- Schwachstrom","m",37]
["153",null,"Elektroleitungen",null,"Bestehende Leitungen umlegen inkl. Grabarbeiten.","m",38]
["154","B 04","Heizungs-, Lüftungs-, Klima-, Kälteleitungen","Fernwärme, Fernbkälte","Heizungs- und Kälteleitung.","m",39]
["154","B 04.08","Heizungs-, Lüftungs-, Klima-, Kälteleitungen","Gasleitung",null,"m",40]
["172","B 06.03","Baugrubenabschlüsse","Böschungssicherung","Spritzbeton.","m2",41]
["172","B 06.03","Baugrubenabschlüsse","Böschungssicherung","Nagelwände.","m2",42]
["172","B 06.04","Baugrubenabschlüsse",null,"Spundwand.","m2",43]
["172","B 06.04","Baugrubenabschlüsse",null,"Rühlwand.","m2",44]
["172","B 06.04","Baugrubenabschlüsse",null,"Bohrpfahlwand.","m2",45]
["175","C 01.01","Grundwasserabdichtungen",null,"Feuchtigkeitsabdichtung DK 2.","GGF",46]
["175","C 01.01","Grundwasserabdichtungen",null,"Feuchtigkeitsabdichtung DK 1.","GGF",47]
["175","E 01.01","Grundwasserabdichtungen","Abdichtung, Beschichtung unter Terrain","Abdichtung DK 2 Wände UG.","m2",48]
["175","E 01.01","Grundwasserabdichtungen","Abdichtung, Beschichtung unter Terrain","Abdichtung DK 1 Wände UG.","m2",49]
["176","B 06.06","Wasserhaltung",null,"Wasserhaltung für Oberflächenwasser.","gl",50]
["176","B 06.06","Wasserhaltung",null,"Gebühren für Einleitung Meteorwasser in Kanalisation.","m3",51]
["176","B 06.06","Wasserhaltung",null,"Grundwasserabsenkung","m3",52]
["201.1","B 06.01","Erdarbeiten","Nicht kontaminierter Aushub","Oberboden maschinell mit seitlicher Lagerung.","m3",53]
["201.1","B 06.01","Erdarbeiten","Nicht kontaminierter Aushub","Aushub maschinell mit seitlicher Lagerung.","m3",54]
["201.1","B 06.01","Erdarbeiten","Nicht kontaminierter Aushub","Sohlenaushub letzte 20cm.","m3",55]
["201.1","B 06.01","Erdarbeiten","Nicht kontaminierter Aushub","Transport Oberboden auf Deponie Baustelle.","m3",56]
["201.1","B 06.01","Erdarbeiten","Nicht kontaminierter Aushub","Transport Oberboden auf Deponie Unternehmer.","m3",57]
["201.1","B 06.01","Erdarbeiten","Nicht kontaminierter Aushub","Transport Aushub auf Deponie Unternehmer.","m3",58,12,11]
["201.1","B 06.01","Erdarbeiten","Nicht kontaminierter Aushub","Gebühren Oberboden (Lagerung oder Abgabe).","m3",59]
["201.1","B 06.01","Erdarbeiten","Nicht kontaminierter Aushub","Gebühren Aushub (Lagerung oder Abgabe).","m3",60]
["201.1","B 06.02","Erdarbeiten","Kontaminierter Aushub","Kontaminierter Aushub baggerfähig.","m3",61]
["201.1","B 06.02","Erdarbeiten","Kontaminierter Aushub","Zusätzliche Gebühren.","m3",62]
["201.1","B 06.03","Erdarbeiten","Böschungssicherung","Einfache Baugrubensicherung mit PE-Folie.","m2",63]
["201.1","B 06.05","Erdarbeiten","Materialeinbau","Einbringen Hinterfüllung von Deponie Baustelle.","m3",64]
["201.1","B 06.05","Erdarbeiten","Materialeinbau","Hinderfüllung maschinell Verdichten.","m3",65]
["201.1","B 06.05","Erdarbeiten","Materialeinbau","Liefern und Einbringen von Sickerkies 32-45mm.","m3",66]
["211.0","B 02.01","Baustelleneinrichtung","Allgemeine Baustelleneinrichtung","Prozentsatz von BKP 2","%",67]
["211.0","B 02.03","Baustelleneinrichtung",null,"Bau-WC (LE=St x Mt)","LE",68]
["211.0","B 02.03","Baustelleneinrichtung",null,"Längeres Vorh. Bau-WC (LE=St x Mt)","LE",69]
["211.0","B 02.04","Baustelleneinrichtung",null,"Baukran (LE=St x Mt)","LE",70]
["211.0","B 02.04","Baustelleneinrichtung",null,"Kranbetrieb für dritte inkl. Bedinung","h",71]
["211.0","B 02.04","Baustelleneinrichtung",null,"Radwaschanlage (LE=St x Mt).","LE",72]
["211.1","B 08.01","Gerüste",null,"Fassadengerüst.","m2",73]
["211.1","B 08.02",{"$f":"IF(A66=0,\"\",LOOKUP(A66,BKP,Baukostenplan))","v":"Gerüste"},null,"Innengerüst.","GF",74]
["211.1","B 08.02","Gerüste",null,"Liftschachtgerüste.","Stk",75]
["211.4","D 09.04","Kanalisationen im Gebäude",null,"Kanalisation unter/in Bodenplatte inkl. Aushub.","GGF",76]
["211.4","D 09.04","Kanalisationen im Gebäude",null,"Versickerungsanlage","GGF",77]
["211.4","D 09.04","Kanalisationen im Gebäude","Abwassersammlung","Kanalisation.","GGF",78]
["211.5","C 01.02","Beton- und Stahlbetonarbeiten",null,"Einzelfundament, Beton horizontal oder im Gefalle bis 3%,","m2",79,1000,800]
["211.5","C 01.03","Beton- und Stahlbetonarbeiten",null,"Bodenplatte, Beton horizontal oder im Gefalle bis 3%,","m2",80]
["211.5","C 02.01","Beton- und Stahlbetonarbeiten","Aussenwand","Aussenwandkonstruktion Betonwände","m2",81]
["211.5","C 02.02","Beton- und Stahlbetonarbeiten","Innenwand","Innenwandkonstruktion Betonwände","m2",82]
["211.5","C 04.01","Beton- und Stahlbetonarbeiten",null,"Geschossdecke in Beton","m2",83]
["211.5","C 04.04","Beton- und Stahlbetonarbeiten",null,"Flachdachkonstruktion in Beton","m2",84]
["211.5","C 04.08","Beton- und Stahlbetonarbeiten","Aussen liegende  Konstruktion, Vordach","Kragplattenanschlüsse gedämmt.","m",85]
["211.5","C 04.08","Beton- und Stahlbetonarbeiten","Aussen liegende  Konstruktion, Vordach","Balkone","m2",86]
["211.5","C 05.01","Beton- und Stahlbetonarbeiten","Durchbruch, Schlitz zu Konstruktion","Regie Baumeister, Prozent von BKP 23, 24, 25, 26","%",87]
["211.5","C 05.01","Beton- und Stahlbetonarbeiten","Durchbruch, Schlitz zu Konstruktion","Durchbruch, Schlitz zu Konstruktion, Prozent von BKP 23, 24, 25, 26","%",88]
["211.5","C 01 03","Beton- und Stahlbetonarbeiten",null,"Bodenplatte aus Stahlfaserbeton (ca. 35Kg/m3)","m2",89]
["211.6","C 02.01","Maurerarbeiten","Backstein","Aussenwandkonstruktion Backstein","m2",90]
["211.6","C 02.01","Maurerarbeiten","Dämmbackstein","Aussenwand Dämmbackstein Imbrex z7 inkl. Leibungen und Stürze","m2",91]
["211.6","C 02.02","Maurerarbeiten",null,"Innenwandkonstruktion Backstein","m2",92]
["211.6","C 02.02","Maurerarbeiten",null,"Innenwandkonstruktion Backstein","m2",93]
["211.6","C 02.02","Maurerarbeiten",null,"Innenwandkonstruktion Kalksandstein","m2",94]
["211.6","C 02.02","Maurerarbeiten",null,"Stürze zu Mauerwerke","m",95]
["211.6","C 05.02","Maurerarbeiten","Ergänzende Leistungen","Zu Maurerarbeiten wie Mörtel Stahlzargen und dgl, Prozent von BKP 27+28","%",96]
["211.9","C 01.01",0,"Abdichtung, Dämmung Bodenplatte","Perimeterdämmung XPS 500, 160mm.","m2",97]
["211.9","E 01.02",0,"Aussenwärmedämmung unter Terrain","Perimeterdämmung.","m2",98]
["211.9","E 01.03",0,null,"Schutzschicht unter Terrain.","m2",99]
["212.2","C 03.01","Elemente aus Beton","Aussenstütze vorfabriziert","Vorfabrizierte Betonstützen 20x20cm.","m",100]
["212.2","C 03.02","Elemente aus Beton","Innenstütze vorfabriziert","Vorfabrizierte Betonstützen 20x20cm.","m",101]
["212.2","C 04.02","Elemente aus Beton","Innen liegende Treppen, Rampe","Vorfabrizierte innen Treppen in Beton. \n(Gemessene Aufsichtsfläche)","m2",102]
["212.2","C 04.03","Elemente aus Beton","Innen liegendes Podest","Vorfabrizierte innen Podest in Beton.","m2",103]
["212.2","C 04.06","Elemente aus Beton","Aussen liegende Treppe, Rampe","Vorfabrizierte aussen Treppen in Beton.","m2",104]
["212.2","C 04.07","Elemente aus Beton","Aussen liegendes Podest","Vorfabrizierte aussen Podest in Beton.","m2",105]
["212.2","E 02.06","Elemente aus Beton","Aussen liegende Absturzsicherung","Balkonbrüstungen Beton.","m",106]
["212.2","C 01.04","Elemente aus Beton",null,"Erdverbundene Treppe, Rampe","m2",107]
["212.2","C 01.05","Elemente aus Beton",null,"Erdverbundenes Podest.","m2",108]
["214.1","C 04.05","Traggerippe (Zimmermanns- konstruktionen)","Konstruktion geneigtes Dach","Konstruktion geneigtes Dach in Holz.","m2",109]
["215.2","E 02.03","Fassadenbau","Hinterlüftete Fassadensysteme","Lattenrost ausgedämmt, hinterl. Faserzementplatten.","m2",110]
["217","C 05.02","Schutzraumabschlüsse","Schutzraumbauteile","Panzertüre.","Stk.",111]
["217","C 05.02","Schutzraumabschlüsse","Schutzraumbauteile","Fluchtröhre.","m1",112]
["221.1","E 03.01","Fenster aus Holz/Metall","Fenster Test","Hebeschiebe in Holz/Metall (mit SIGAB).","m2",113,"800",650]
["221.1","E 03.01","Fenster aus Holz/Metall","Fenster","Hebeschiebe in Holz/Metall (mit SIGAB).","m2",114]
["221.1","E 03.01","Fenster aus Holz/Metall","Fenster Test","Hebeschiebe in Holz/Metall (mit SIGAB).","m2",115,150]
["221.2","E 03.01","Fenster aus Kunststoff","Fenster","Fenster und Fenstertüren in Kunststoff (mit SIGAB).","m2",116]
["221.2","E 03.01","Fenster aus Kunststoff","Fenster","Hebeschiebe in Kunststoff (mit SIGAB).","m2",117]
["221.3","E 03.01","Fenster aus Stahl","Fenster","Fenster und Fenstertüren in Kunststoff/Metall (mit SIGAB).","m2",118]
["221.3","E 03.01","Fenster aus Stahl","Fenster","Hebeschiebe in Kunststoff/Metall (mit SIGAB).","m2",119]
["221.6","E 03.02","Aussentüren, Tore aus Metall","Aussentüre","Aluminium Haustüre.","m2",120]
["221.6","E 03.03","Aussentüren, Tore aus Metall","Aussentor","Kipptor aus Metall.","m2",121]
["221.6","E 03.03","Aussentüren, Tore aus Metall","Aussentor","Handsender zu Tor","Stk",122]
["221.7","E 02.04","Schaufensteranlagen","Systemfassade","Pfosten-/Riegel ohne Konstruktion max. über 1 Gechoss.","m2",123]
["222","F 01.01","Spenglerarbeiten","Dachabdichtung","Spenglerarbeiten, pro m2 Dachfläche","m2",124]
["223","F 02.03","Blitzschutz","Schutzanlage zu Dach","Blitzschutz.Pro m2 Dachfläche","m2",125]
["224.1","F 01.01","Plastische und elastische Dichtungsbeläge (Flachdächer)","Dachabdichtung unter Terrain","Vorarbeiten und Arbeiten.","m2",126]
["224.1","F 01.01","Plastische und elastische Dichtungsbeläge (Flachdächer)","Dachabdichtung unter Terrain","Bitumenvoranstrich.","m2",127]
["224.1","F 01.01","Plastische und elastische Dichtungsbeläge (Flachdächer)","Dachabdichtung unter Terrain","1cm Abdichtung bituminös 2-lagig.","m2",128]
["224.1","F 01.01","Plastische und elastische Dichtungsbeläge (Flachdächer)","Dachabdichtung unter Terrain","Drain WS20.","m2",129]
["224.1","F 01.01","Plastische und elastische Dichtungsbeläge (Flachdächer)","Dachabdichtung unter Terrain","Service pro Jahr. 5 x Kosten Dachabdichtung unter Terrain","Stk",130]
["224.1","F 01.01","Plastische und elastische Dichtungsbeläge (Flachdächer)","Dachabdichtung","Zuschläge, Prozentsatz auf Adichtungsarbeiten","%",131]
["224.1","F 01.02","Plastische und elastische Dichtungsbeläge (Flachdächer)","Flachdach begrünt","Dampfsperre.","m2",132]
["224.1","F 01.02","Plastische und elastische Dichtungsbeläge (Flachdächer)","Flachdach begrünt","Wärmedämmung.","m2",133]
["224.1","F 01.02","Plastische und elastische Dichtungsbeläge (Flachdächer)","Flachdach begrünt","Bitumendichtungsbahn 2-lagig.","m2",134]
["224.1","F 01.02","Plastische und elastische Dichtungsbeläge (Flachdächer)","Flachdach begrünt","Schutz-/Entwässerungsschicht.","m2",135]
["224.1","F 01.02","Plastische und elastische Dichtungsbeläge (Flachdächer)","Flachdach begrünt","Extensive Begrünung.","m2",136]
["224.1","F 01.02","Plastische und elastische Dichtungsbeläge (Flachdächer)","Flachdach Balkon ungedämmt","Abdichtung.","m2",137]
["224.1","F 01.02",{"$f":"IF(A130=0,\"\",LOOKUP(A130,BKP,Baukostenplan))","v":"Plastische und elastische Dichtungsbeläge (Flachdächer)"},"Flachdach Balkon ungedämmt","Zementüberzug.","m2",138]
["224.1","F 01.02","Plastische und elastische Dichtungsbeläge (Flachdächer)","Flachdach Balkon gedämmt","Zementplatten inkl. Kiesschicht.","m2",139]
["224.1","F 01.02","Plastische und elastische Dichtungsbeläge (Flachdächer)","Absturzsicherung Flachdach","Anschlagpunkte mit Grundplatten auf Beton. 5 Stück pro m","m",140]
["224.1","F 01.02","Plastische und elastische Dichtungsbeläge (Flachdächer)","Absturzsicherung Flachdach","Führungsseil.","m",141]
["224.1","F 01.02","Plastische und elastische Dichtungsbeläge (Flachdächer)","Absturzsicherung Flachdach","Eckverbindung.","Stk",142]
["224.1","F 01.02","Plastische und elastische Dichtungsbeläge (Flachdächer)","Absturzsicherung Flachdach","Sicherheitstest.","Stk",143]
["224.1","F 01.02","Plastische und elastische Dichtungsbeläge (Flachdächer)","Absturzsicherung Flachdach","Auffanggurt.","Stk",144]
["224.1","F 01.02","Plastische und elastische Dichtungsbeläge (Flachdächer)","Absturzsicherung Flachdach","Sicherungsseil.","Stk",145]
["224.2","F 02.02","Glaseinbauten in Steildächern","Element zu geneigtem Dach","Dachfenster z.B. Velux","Stk",146]
["224.3","F 02.01","Glaseinbauten in Flachdächern","Element zu Flachdach","RWA 1.2x1.2m ohne Sonnenschutz.","Stk",147]
["224.3","F 02.01","Glaseinbauten in Flachdächern","Element zu Flachdach","Dachausstieg 1.5x0.75m.","Stk",148]
["225.1","G 06.01","      .1 Fugendichtungen","Durchbruch, Schlitz zu Ausbau","Fugendichtungen.","GF",149]
["225.2","G 03.01","      .2 Spezielle Dämmungen","Unterkonstruktion zu Wandbekleidung","Wanddämmung z.B. Unitex gestrichen UG.","m2",150]
["225.2","G 04.01","      .2 Spezielle Dämmungen","Fertige Bekleidung Decke","Deckendämmung z.B. Unitex gestrichen UG.","m2",151]
["225.4","G 06.02","      .4 Brandschutzbekleidungen und dgl      .","Abschottung","Brandschutzbekleidungen.","GF",152]
["225.4","G 06.02","      .4 Brandschutzbekleidungen und dgl      .","Abschottung","Ausflocken von GIS-Elemente.","m3",153]
["226.2","E 02.01","      .2 Verputzte Aussenwärmedämmungen","Äussere Beschichtung","Kunststoffnetz-Armierung.","m2",154]
["226.2","E 02.01","      .2 Verputzte Aussenwärmedämmungen","Äussere Beschichtung","Grundputz.","m2",155]
["226.2","E 02.01","      .2 Verputzte Aussenwärmedämmungen","Äussere Beschichtung","Deckputz.","m2",156]
["226.2","E 02.01","      .2 Verputzte Aussenwärmedämmungen","Äussere Beschichtung","Zuschläge für Anschlüsse, Durchdringungen, etc., \nProzentsatz auf Aussenwärmedämmung","%",157]
["226.2","E 02.02","      .2 Verputzte Aussenwärmedämmungen","Aussendämmung ","Klebemörtel 0.5cm.","m2",158]
["226.2","E 02.02","      .2 Verputzte Aussenwärmedämmungen","Aussendämmung ","EPS-Dämmplatte 20.0cm.","m2",159]
["226.2","E 02.02","      .2 Verputzte Aussenwärmedämmungen","Aussendämmung ","Sturzelemente.","m",160]
["226.2","E 02.02","      .2 Verputzte Aussenwärmedämmungen","Aussendämmung ","Alu-Fensterbänke inkl. Winkel.","m",161]
["226.2","E 02.02","      .2 Verputzte Aussenwärmedämmungen","Aussendämmung ","Zuschläge für Leibungen. Prozentsatz auf Aussenwärmedämmung","%",162]
["226.2","E 02.02","      .2 Verputzte Aussenwärmedämmungen","Aussendämmung ","Zuschläge für Trawik in Leibungen (zur Handlaufbef.). Prozentsatz auf Aussenwärmedämmung","%",163]
["226.2","E 02.02","      .2 Verputzte Aussenwärmedämmungen","Aussendämmung ","Zuschläge für Anschlüsse, Durchdringungen, etc. Prozentsatz auf Aussenwärmedämmung","%",164]
["227.1","E 02.01","      .1 Äussere Malerarbeiten","Äussere Beschichtung","Anstrich auf Deckputz.","m2",165]
["227.1","E 02.05","      .1 Äussere Malerarbeiten","Fassadenbekleidung Untersicht","Anstrich auf Balkonuntersichten.","m2",166]
["228.2","E 03.04","      .2 Lamellenstoren","Sonnenschutz ","Verbundraffstoren mit Handkurbel.","m2",167]
["228.3","E 03.04","      .3 Sonnenstoren","Sonnenschutz ","Gelenkarmmarkisen mit Handkurbel.","m2",168]
["228.3","E 03.04","      .3 Sonnenstoren","Sonnenschutz ","Balkon / Loggia Vertikalmarkise Seilführung. Elektrisch.","m2",169]
["228.3","E 03.04","      .3 Sonnenstoren","Sonnenschutz ","Balkon / Loggia Vertikalmarkise Seilführung. Manuell","m2",170]
["231","D 01.01","Apparate Starkstrom","Anlage Erzeugung Starkstrom","EG-OG.","GF",171]
["231","D 01.01","Apparate Starkstrom","Anlage Erzeugung Starkstrom","UG/Keller.","GF",172]
["231","D 01.01","Apparate Starkstrom","Anlage Erzeugung Starkstrom","Photovoltaikanlagen","m2",173]
["233","D 01.05","Leuchten und Lampen","Verbraucher Starkstrom: Leuchten","EG-OG.","GF",174]
["233","D 01.05","Leuchten und Lampen","Verbraucher Starkstrom: Leuchten","UG/Keller.","GF",175]
["236","D 04.01","Schwachstrominstallationen","Brandmeldeanlage","Brandmeldeanlage EG-AG.","GF",176]
["236","D 04.01","Schwachstrominstallationen","Brandmeldeanlage","Brandmeldeanlage ESH.","GF",177]
["236","D 04.02","Schwachstrominstallationen",null,"Gaswarnanlage.","GF",178]
["237.1","D 02.01","      .1 Automationsebene","Managementebene","Elektro.","GF",179]
["237.1","D 02.01","      .1 Automationsebene","Managementebene","HLKS","GF",180]
["242","D 05.02","242 Wärmeerzeugung",null,"Wärmepumpe Erdsonde/Wasser & Bohrung ca. 200m.","EBF",181]
["243","D 05.04","243 Wärmeverteilung",null,"Wärmehauptverteilung.","EBF",182]
["244","D 04.06","244 Lüftungsanlagen",null,"Rauch- und Wärmeabzugsanlage ESH.","GF",183]
["244","D 07.01","244 Lüftungsanlagen","Aussenluftversorgung, Fortluftführung","Lüftungsanalgen UG/Keller.","GF",184]
["244","D 07.01","244 Lüftungsanlagen","Aussenluftversorgung, Fortluftführung","Lüftungsanalgen ESH.","GF",185]
["244","D 07.02","244 Lüftungsanlagen","Luftaufbereitung","Kontrollierte Wohnungslüftung.","Whg.",186]
["244","D 07.02","244 Lüftungsanlagen",null,"Einzelne Abluftanlagen.","Stk",187]
["244","D 07.03","244 Lüftungsanlagen",null,"Luftwärmespeicherung.","GF",188]
["246","D 06.02","246 Kälteanlagen",null,"Freecooling.","EBF",189]
["251","D 08.05","251 Allgemeine Sanitärapparate","Wasser: Armatur, Apparat","Lieferung Sanitärapparate 2.5-Zimmerwohnung.","Whg",190]
["251","D 08.05","251 Allgemeine Sanitärapparate","Wasser: Armatur, Apparat","Lieferung Sanitärapparate 3.5-Zimmerwohnung.","Whg",191]
["251","D 08.05","251 Allgemeine Sanitärapparate","Wasser: Armatur, Apparat","Lieferung Sanitärapparate 4.5-Zimmerwohnung.","Whg",192]
["251","D 08.05","251 Allgemeine Sanitärapparate","Wasser: Armatur, Apparat","Lieferung Sanitärapparate 5.5-Zimmerwohnung.","Whg",193]
["251","D 08.05","251 Allgemeine Sanitärapparate","Wasser: Armatur, Apparat","Montage Sanitärapparate, Prozentsatz auf Apparatelieferung","%",194]
["253","D 08.02","253 Sanitäre Ver- und Entsorgungsapparate",null,"Wasserbehandlung.","GF",195]
["254","D 08.04","254 Sanitärleitungen","Wasserverteilung    ","Leitungen über GF.","GF",196]
["255","D 08.04","255 Dämmungen Sanitärinstallationen","Wasserverteilung    ","Dämmungen Leitungen über GF.","GF",197]
["256","D 08.06","256 Sanitärinstallationselemente","Wasser: Installationselemente","Installationselemente.","Stk",198]
["257","D 04.05","257 Elektro- und Pneumatiktafeln","Löschgerät","Handfeuerlöscher.","Stk.",199]
["257","D 04.05","257 Elektro- und Pneumatiktafeln","Löschgerät","Feuerlöschposten.","Stk.",200]
["257","D 04.03","257 Elektro- und Pneumatiktafeln",null,"Sprinkleranlage ESH","GF",201]
["258","G 05.02",{"$f":"IF(A194=0,\"\",LOOKUP(A194,BKP,Baukostenplan))","v":"258 Kücheneinrichtungen"},null,"Küche für 2.5-Zimmerwohnung (5 Elemente).","Stk",202]
["258","G 05.02","258 Kücheneinrichtungen",null,"Küche für 3.5-Zimmerwohnung (6 Elemente).","Stk",203]
["258","G 05.02","258 Kücheneinrichtungen",null,"Küche für 4.5-Zimmerwohnung (7 Elemente).","Stk",204]
["258","G 05.02","258 Kücheneinrichtungen",null,"Küche für 5.5-Zimmerwohnung (7 Elemente).","Stk",205]
["261","D 12.01","261 Aufzüge","Personenaufzug ","Aufzüge (8 Pers.) mit xy Haltestellen (pro Haltestelle Hst).","Hst",206]
["261","D 12.02","261 Aufzüge","Lasten- und Serviceaufzug","Lasten- und Serviceaufzüge.","Hst",207]
["263","D 12.03","263 Fassadenreinigungsanlagen","Spezialaufzüge","Befahranlage für Fassade","Stk",208]
["271.0","G 03.02","      .0 Verputzarbeiten (innere)",null,"Grundputz.","m2",209]
["271.0","G 03.02","      .0 Verputzarbeiten (innere)",null,"Abrieb 1.5mm auf GP.","m2",210]
["271.0","G 03.02","      .0 Verputzarbeiten (innere)",null,"Abrieb 1.5mm auf GKP ohne GP.","m2",211]
["271.0","G 04.02","      .0 Verputzarbeiten (innere)","Fertige Bekleidung Decke","Weissputz Q3 inkl. Haftgrund.","m2",212]
["271.0","G 04.02","      .0 Verputzarbeiten (innere)","Fertige Bekleidung Decke","Weissputz Q4 inkl. Haftgrund.","m2",213]
["271.1","G 01.01","      .1 Spezielle Gipserarbeiten","Feststehende Trennwand","Gipsständer 10.5cm.","m2",214]
["271.1","G 01.01","      .1 Spezielle Gipserarbeiten","Feststehende Trennwand","Gipsständer 12.5cm.","m2",215]
["271.1","G 01.01","      .1 Spezielle Gipserarbeiten","Feststehende Trennwand","Gipsständer 15cm.","m2",216]
["271.1","G 01.03","      .1 Spezielle Gipserarbeiten","Schachfront","Beplankung (nur Platten 2x125mm) auf GIS.","m2",217]
["271.1","G 01.03","      .1 Spezielle Gipserarbeiten","Schachfront","Vorsatzschale.","m2",218]
["272.0","G 01.06","      .0 Innentüren aus Metall","Innentor","Brandschutztor.","m2",219]
["272.1","G 05.07","      .1 Metallbaufertigteile","Kleinbauteil, Schutzraumeinrichtung","Briefkasten.","Stk",220]
["272.1","G 05.07","      .1 Metallbaufertigteile","Kleinbauteil, Schutzraumeinrichtung","Kleinbauteile wie z.B. Abschlusswinkel und dgl.","GF",221]
["272.2","E 02.06","      .2 Allgemeine Metallbauarbeiten (Schlosserarbeiten)","Aussen liegende Absturzsicherung","Staketengeländer.","m",222]
["272.2","E 02.06","      .2 Allgemeine Metallbauarbeiten (Schlosserarbeiten)","Aussen liegende Absturzsicherung","Glasgeländer.","m",223]
["272.2","E 02.06","      .2 Allgemeine Metallbauarbeiten (Schlosserarbeiten)","Aussen liegende Absturzsicherung","Handlauf.","m",224]
["272.2","E 03.05","      .2 Allgemeine Metallbauarbeiten (Schlosserarbeiten)","Absturzsicherung","Staketengeländer duplexiert.","m",225]
["272.2","E 03.05","      .2 Allgemeine Metallbauarbeiten (Schlosserarbeiten)","Absturzsicherung","Staketengeländer feuerverzinkt.","m",226]
["272.2","E 03.05","      .2 Allgemeine Metallbauarbeiten (Schlosserarbeiten)","Absturzsicherung","Glasgeländer.","m",227]
["272.2","E 03.05","      .2 Allgemeine Metallbauarbeiten (Schlosserarbeiten)","Absturzsicherung","Handlauf.","m",228]
["272.2","G 05.05","      .2 Allgemeine Metallbauarbeiten (Schlosserarbeiten)","Absturz-, Ansprallschutzeinrichtung","Staketengeländer Treppenhaus.","m",229]
["272.2","G 05.06","      .2 Allgemeine Metallbauarbeiten (Schlosserarbeiten)","Sonderbauteil","Cheminées.","Stk",230]
["272.2","G 05.06","      .2 Allgemeine Metallbauarbeiten (Schlosserarbeiten)","Sonderbauteil","Pflanztröge.","Stk",231]
["272.4","G 05.07","      .4 Schutzraumteile","Schutzraumbauteile","Ausstattung wie Trockenklosett, Betten und dgl.","GF",232]
["272.4","G 05.07","      .4 Schutzraumteile","Kleinbauteil, Schutzraumeinrichtung","Schutzraumeinrichtung wie z.B. Trockenklosett, Bett und dgl.","GF",233]
["273.0","G 01.05","      .0 Innentüren aus Holz",null,"Wohnungseingangstüre EI30 KH-belegt 1x2.1m Stahlzarge.","m2",234]
["273.0","G 01.05","      .0 Innentüren aus Holz",null,"Zimmertüre KH-belegt 0.8x2.1m Stahlzarge.","m2",235]
["273.0","G 01.05","      .0 Innentüren aus Holz",null,"Zimmertüre KH-belegt 0.8x2.1m Blockfutter.","m2",236]
["273.0","G 01.05","      .0 Innentüren aus Holz",null,"Türe KH-belegt 0.8x2.1m Blockfutter EI30.","m2",237]
["273.0","G 01.05","      .0 Innentüren aus Holz",null,"Türe zu TRH KH-belegt 0.9x2.1m Stahlzargen EI30 inkl. Türschl.","m2",238]
["273.0","G 01.05","      .0 Innentüren aus Holz",null,"Türe UG KH-belegt 0.9x2.1m Stahlzargen EI30.","m2",239]
["273.1","G 05.01","      .1 Wandschränke, Gestelle und dgl      .","Garderobe","Einbauschränke 3-teilig (2x Hochschr. mit Kleiderst.).","Stk",240]
["273.3","G 05.03","      .3 Allgemeine Schreinerarbeiten","Innerer Fensterausbau","VS 57 Vorhangschiene 1 x.","m",241]
["273.3","G 05.03","      .3 Allgemeine Schreinerarbeiten","Innerer Fensterausbau","Fenstersims gestrichen.","m",242]
["274","G 01.04","274 Spezialverglasungen (innen)",null,"Innenfenster.","m2",243]
["275","D 03.04","275 Schliessanlagen",null,"Schliessanlage.","GF",244]
["276","G 05.04","276 Innere Abschlüsse","Innerer Abschluss","Vorhang.","m2",245]
["277.1","G 01.02","      .1 Schieb- und Faltwände","Bewegliche Trennwand","Elementschiebewände.","m2",246]
["277.2","G 01.01","      .2 Feststehende Elementwände","Feststehende Trennwand","WC-Trennwände inkl. Türen.","m2",247]
["277.2","G 01.01","      .2 Feststehende Elementwände","Feststehende Trennwand","Holzlattenverschlag Keller inkl. Türen.","m2",248]
["281.0","G 02.01","      .0 Unterlagsböden",null,"Trittschalldämmung 20mm.","m2",249]
["281.0","G 02.01","      .0 Unterlagsböden",null,"Wärmedämmung 40mm.","m2",250]
["281.0","G 02.01","      .0 Unterlagsböden",null,"PE-Folie.","m2",251]
["281.0","G 02.01","      .0 Unterlagsböden",null,"Zementunterlagsboden.","m2",252]
["281.0","G 02.01","      .0 Unterlagsböden",null,"Zuschläge für Anschüsse, etc. Prozentsatz auf UB Kosten","%",253]
["281.1","G 02.02","      .1 Fugenlose Bodenbeläge",null,"Hartbetonbelag ohne Anforderungen ungeschliffen.","m2",254]
["281.1","G 02.02","      .1 Fugenlose Bodenbeläge",null,"Hartbetonbelag mit 2K-Anstrich.","m2",255]
["281.1","G 02.02","      .1 Fugenlose Bodenbeläge",null,"Hartbetonbelag imprägniert.","m2",256]
["281.2","G 02.02","      .2 Bodenbeläge aus Kunststoffen, Textilien und dgl      .",null,"Epoxi-Kunstflessbelag.","m2",257]
["281.2","G 02.02","      .2 Bodenbeläge aus Kunststoffen, Textilien und dgl      .",null,"Linoleum.","m2",258]
["281.2","G 02.02","      .2 Bodenbeläge aus Kunststoffen, Textilien und dgl      .",null,"Parkdeckbelag Triflex.","m2",259]
["281.2","G 02.02","      .2 Bodenbeläge aus Kunststoffen, Textilien und dgl      .",null,"Kugelgarn z.B. Fabromont fertig verlegt.","m2",260]
["281.2","G 02.02","      .2 Bodenbeläge aus Kunststoffen, Textilien und dgl      .",null,"Schmutzschleusen z.B. Coral fertig verlegt.","m2",261]
["281.6","G 02.02","      .6 Bodenbeläge Plattenarbeiten",null,"Keramischer Plattenboden 30x60cm z.B. Colby-Classic Material.","m2",262]
["281.6","G 02.02","      .6 Bodenbeläge Plattenarbeiten",null,"Verlegearbeit zu Plattenboden.","m2",263]
["281.6","G 02.02","      .6 Bodenbeläge Plattenarbeiten",null,"Sockel aus Platten zu Plattenboden.","m1",264]
["281.6","G 02.02","      .6 Bodenbeläge Plattenarbeiten",null,"Vorarbeit wie Abdichtungen und dgl. inkl. Zuschläge zu Bodenplatten.","%",265]
["281.7","G 02.02",{"$f":"IF(A258=0,\"\",LOOKUP(A258,BKP,Baukostenplan))","v":"      .7 Bodenbeläge aus Holz"},null,"Parkettboden z.B. Scheucher Bilaflor Material.","m2",266]
["281.7","G 02.02","      .7 Bodenbeläge aus Holz",null,"Verlegearbeit inkl. Spachtelung und Zuschläge zu Parkettboden.","m2",267]
["281.7","G 02.02","      .7 Bodenbeläge aus Holz",null,"Sockel in Holz zu Parkettboden.","m1",268]
["281.8","G 02.02","      .8 Doppelböden",null,"Doppelböden inkl. vorgängiger Anstrich.","m2",269]
["281.9","G 02.02","      .9 Sockel",null,"Sockel Alu.","m1",270]
["282.4","G 03.02","      .4 Wandbeläge Plattenarbeiten",null,"Keramische Wandplatten 30x60cm z.B. Coby-Classic Material.","m2",271]
["282.4","G 03.02","      .4 Wandbeläge Plattenarbeiten",null,"Verlegearbeit zu Wandplatten.","m2",272]
["282.4","G 03.02","      .4 Wandbeläge Plattenarbeiten",null,"Vorarbeit wie Abdichtungen und dgl. inkl. Zuschläge zu Wandplatten.","%",273]
["285.1","G 01.05","      .1 Innere Malerarbeiten",null,"Anstrich auf Innentüren (beidseitig).","m2",274]
["285.1","G 02.02","      .1 Innere Malerarbeiten",null,"Anstrich auf Boden roh.","m2",275]
["285.1","G 02.02","      .1 Innere Malerarbeiten",null,"Bodenmarkierung ESH.","Ehp",276]
["285.1","G 03.02","      .1 Innere Malerarbeiten",null,"Anstrich auf Abrieb.","m2",277]
["285.1","G 03.02","      .1 Innere Malerarbeiten",null,"Anstrich auf Wand roh.","m2",278]
["285.1","G 04.02","      .1 Innere Malerarbeiten","Fertige Bekleidung Decke","Anstrich auf Weissputz.","m2",279]
["285.1","G 04.02","      .1 Innere Malerarbeiten","Fertige Bekleidung Decke","Anstrich auf Decke roh.","m2",280]
["285.1","G 05.07","      .1 Innere Malerarbeiten","Kleinbauteil, Schutzraumeinrichtung","Anstriche auf Metall- und Kleinteile.","GF",281]
["286","G 06.03","286 Bauaustrocknung",null,"Gebäudeaustrocknung.","GF",282]
["287","G 06.03","287 Baureinigung","Reinigung","Bau- und Endreinigung.","GF",283]
["287","G 06.03","287 Baureinigung",null,"Spülen der Schmutz- und Meteorleitungen.","gl",284]
["011",null,"Grundstückerwerb"]