{"text_format":"1","workbook":"xlsx","n_sheets":2,"sheets":["Liste","Detail"],"not_rendered":{"charts":0,"images":0,"macros":1,"external_links":0,"defined_names":19,"comments":0,"pivot_tables":0},"unopened":[],"bounds":{"document_bytes":16777216,"sheet_cells":100000,"rows_first":2000,"rows_last":500,"rows_between":2000,"halvings":0,"cell_chars":16384,"cell_head_chars":4096},"cells_cut":0,"cells_raw":0,"read":"whole","date_system":"1900"}

{"sheet":"Liste","index":0,"n_rows":301,"n_cols":14,"rows_kept":301,"cut":false,"hidden":false,"merged":[]}
["Lagerort","Lagerplatz","Kategorie","Typ","Marke","Beschreibung","Artikelnummern","Menge","Betrieb","Apparat","Eingelagert von","Eingelagert am","Details","Lfd. Nr."]
["Container","8.6","Antriebe","Keilriemen","optibelt","SPA 2500Lw",null,6,"X1","XX111","Mustermann","2025-02-27",null,1]
["Container","8.6","Antriebe",null,null,null,null,null,null,null,null,null,null,2]
["Container","8.6","Antriebe",null,null,null,null,null,null,null,null,null,null,3]
["Container","8.6","Antriebe",null,null,null,null,null,null,null,null,null,null,4]
["Container","8.6","Antriebe",null,null,null,null,null,null,null,null,null,null,5]
["Container","9.4","Antriebe",null,null,null,null,null,null,null,null,null,null,6]
["Container","9.4","Antriebe",null,null,null,null,null,null,null,null,null,null,7]
["Container","9.4","Antriebe",null,null,null,null,null,null,null,null,null,null,8]
["Container","9.4","Antriebe",null,null,null,null,null,null,null,null,null,null,9]
["Container","9.4","Antriebe",null,null,null,null,null,null,null,null,null,null,10]
["Container","9.4","Antriebe",null,null,null,null,null,null,null,null,null,null,11]
["Container","9.4","Antriebe",null,null,null,null,null,null,null,null,null,null,12]
["Container","9.4","Antriebe",null,null,null,null,null,null,null,null,null,null,13]
["Container","8.2","Antriebe",null,null,null,null,null,null,null,null,null,null,14]
["Container","8.2","Antriebe",null,null,null,null,null,null,null,null,null,null,15]
["Container","8.2","Antriebe",null,null,null,null,null,null,null,null,null,null,16]
["Container","8.2","Antriebe",null,null,null,null,null,null,null,null,null,null,17]
["Container","8.3","Antriebe",null,null,null,null,null,null,null,null,null,null,18]
["Container","8.3","Antriebe",null,null,null,null,null,null,null,null,null,null,19]
["Container","8.3","Antriebe",null,null,null,null,null,null,null,null,null,null,20]
["Container","8.3","Antriebe",null,null,null,null,null,null,null,null,null,null,21]
["Container","8.3","Antriebe",null,null,null,null,null,null,null,null,null,null,22]
["Container","8.4","Antriebe",null,null,null,null,null,null,null,null,null,null,23]
["Container","8.4","Antriebe",null,null,null,null,null,null,null,null,null,null,24]
["Container","8.4","Antriebe",null,null,null,null,null,null,null,null,null,null,25]
["Container","8.6","Antriebe",null,null,null,null,null,null,null,null,null,null,26]
["Container","9.5","Antriebe",null,null,null,null,null,null,null,null,null,null,27]
["Container","9.5","Antriebe",null,null,null,null,null,null,null,null,null,null,28]
["Container","9.5","Antriebe",null,null,null,null,null,null,null,null,null,null,29]
["Container","9.5","Antriebe",null,null,null,null,null,null,null,null,null,null,30]
["Container","9.5","Antriebe",null,null,null,null,null,null,null,null,null,null,31]
["Container","9.5","Antriebe",null,null,null,null,null,null,null,null,null,null,32]
["Container","9.5","Antriebe",null,null,null,null,null,null,null,null,null,null,33]
["Container","9.5","Antriebe",null,null,null,null,null,null,null,null,null,null,34]
["Container","9.5","Antriebe",null,null,null,null,null,null,null,null,null,null,35]
["Container","9.4","Antriebe",null,null,null,null,null,null,null,null,null,null,36]
["Container","8.5","Antriebe",null,null,null,null,null,null,null,null,null,null,37]
["Container","8.5","Antriebe",null,null,null,null,null,null,null,null,null,null,38]
["Container","8.5","Antriebe",null,null,null,null,null,null,null,null,null,null,39]
["Container","8.5","Antriebe",null,null,null,null,null,null,null,null,null,null,40]
["Werkstatt","30.1","Antriebe",null,null,null,null,null,null,null,null,null,null,41]
["Werkstatt","30.2","Antriebe",null,null,null,null,null,null,null,null,null,null,42]
["Werkstatt","30.1","Antriebe",null,null,null,null,null,null,null,null,null,null,43]
["Werkstatt","30.6","Antriebe",null,null,null,null,null,null,null,null,null,null,44]
["Werkstatt","30.2","Antriebe",null,null,null,null,null,null,null,null,null,null,45]
["Werkstatt","30.2","Antriebe",null,null,null,null,null,null,null,null,null,null,46]
["Werkstatt","30.2","Antriebe",null,null,null,null,null,null,null,null,null,null,47]
["Werkstatt","30.1","Antriebe",null,null,null,null,null,null,null,null,null,null,48]
["Werkstatt","30.3","Antriebe",null,null,null,null,null,null,null,null,null,null,49]
["Werkstatt","30.2","Antriebe",null,null,null,null,null,null,null,null,null,null,50]
["Werkstatt","30.1","Antriebe",null,null,null,null,null,null,null,null,null,null,51]
["Werkstatt","30.1","Antriebe",null,null,null,null,null,null,null,null,null,null,52]
["Werkstatt","30.1","Antriebe",null,null,null,null,null,null,null,null,null,null,53]
["Werkstatt","30.6","Antriebe",null,null,null,null,null,null,null,null,null,null,54]
["Werkstatt","30.2","Antriebe",null,null,null,null,null,null,null,null,null,null,55]
["Werkstatt","30.1","Antriebe",null,null,null,null,null,null,null,null,null,null,56]
["Werkstatt","30.5","Antriebe",null,null,null,null,null,null,null,null,null,null,57]
["Werkstatt","30.6","Antriebe",null,null,null,null,null,null,null,null,null,null,58]
["Werkstatt","30.1","Antriebe",null,null,null,null,null,null,null,null,null,null,59]
["Werkstatt","30.1","Antriebe",null,null,null,null,null,null,null,null,null,null,60]
["Werkstatt","30.5","Antriebe",null,null,null,null,null,null,null,null,null,null,61]
["Werkstatt","30.1","Antriebe",null,null,null,null,null,null,null,null,null,null,62]
["Werkstatt","30.1","Antriebe",null,null,null,null,null,null,null,null,null,null,63]
["Werkstatt","30.2","Antriebe",null,null,null,null,null,null,null,null,null,null,64]
["Werkstatt","30.2","Antriebe",null,null,null,null,null,null,null,null,null,null,65]
["Werkstatt","30.1","Antriebe",null,null,null,null,null,null,null,null,null,null,66]
["Werkstatt","30.2","Antriebe",null,null,null,null,null,null,null,null,null,null,67]
["Werkstatt","30.2","Antriebe",null,null,null,null,null,null,null,null,null,null,68]
["Werkstatt","30.2","Antriebe",null,null,null,null,null,null,null,null,null,null,69]
["Werkstatt","30.1","Antriebe",null,null,null,null,null,null,null,null,null,null,70]
["Werkstatt","30.1","Antriebe",null,null,null,null,null,null,null,null,null,null,71]
["Werkstatt","30.1","Antriebe",null,null,null,null,null,null,null,null,null,null,72]
["Werkstatt","30.6","Antriebe",null,null,null,null,null,null,null,null,null,null,73]
["Werkstatt","30.1","Antriebe",null,null,null,null,null,null,null,null,null,null,74]
["Werkstatt","30.2","Antriebe",null,null,null,null,null,null,null,null,null,null,75]
["Werkstatt","30.5","Antriebe",null,null,null,null,null,null,null,null,null,null,76]
["Werkstatt","30.6","Antriebe",null,null,null,null,null,null,null,null,null,null,77]
["Werkstatt","30.2","Antriebe",null,null,null,null,null,null,null,null,null,null,78]
["Werkstatt","30.2","Antriebe",null,null,null,null,null,null,null,null,null,null,79]
["Werkstatt","30.5","Antriebe",null,null,null,null,null,null,null,null,null,null,80]
["Werkstatt","30.6","Antriebe",null,null,null,null,null,null,null,null,null,null,81]
["Werkstatt","30.2","Antriebe",null,null,null,null,null,null,null,null,null,null,82]
["Werkstatt","30.5","Antriebe",null,null,null,null,null,null,null,null,null,null,83]
["Werkstatt","30.5","Antriebe",null,null,null,null,null,null,null,null,null,null,84]
["Werkstatt","30.6","Antriebe",null,null,null,null,null,null,null,null,null,null,85]
["Werkstatt","30.3","Antriebe",null,null,null,null,null,null,null,null,null,null,86]
["Werkstatt","30.2","Antriebe",null,null,null,null,null,null,null,null,null,null,87]
["Werkstatt","30.5","Antriebe",null,null,null,null,null,null,null,null,null,null,88]
["Werkstatt","30.6","Antriebe",null,null,null,null,null,null,null,null,null,null,89]
["Werkstatt","30.3","Antriebe",null,null,null,null,null,null,null,null,null,null,90]
["Werkstatt","30.5","Antriebe",null,null,null,null,null,null,null,null,null,null,91]
["Werkstatt","30.2","Antriebe",null,null,null,null,null,null,null,null,null,null,92]
["Werkstatt","30.3","Antriebe",null,null,null,null,null,null,null,null,null,null,93]
["Werkstatt","30.3","Antriebe",null,null,null,null,null,null,null,null,null,null,94]
["Keller",null,"Antriebe",null,null,null,null,null,null,null,null,null,null,95]
["Werkstatt","30.4","Antriebe",null,null,null,null,null,null,null,null,null,null,96]
["Werkstatt","30.4","Antriebe",null,null,null,null,null,null,null,null,null,null,97]
["Werkstatt","30.4","Antriebe",null,null,null,null,null,null,null,null,null,null,98]
["Werkstatt","30.4","Antriebe",null,null,null,null,null,null,null,null,null,null,99]
["Werkstatt","30.4","Antriebe",null,null,null,null,null,null,null,null,null,null,100]
["Werkstatt","30.4","Antriebe",null,null,null,null,null,null,null,null,null,null,101]
["Werkstatt","30.4","Antriebe",null,null,null,null,null,null,null,null,null,null,102]
["Werkstatt","30.4","Antriebe",null,null,null,null,null,null,null,null,null,null,103]
["Werkstatt","30.4","Antriebe",null,null,null,null,null,null,null,null,null,null,104]
["Werkstatt","30.4","Antriebe",null,null,null,null,null,null,null,null,null,null,105]
["Werkstatt","30.4","Antriebe",null,null,null,null,null,null,null,null,null,null,106]
["Werkstatt","30.4","Antriebe",null,null,null,null,null,null,null,null,null,null,107]
["Werkstatt","30.4","Antriebe",null,null,null,null,null,null,null,null,null,null,108]
["Werkstatt","30.4","Antriebe",null,null,null,null,null,null,null,null,null,null,109]
["Werkstatt","30.4","Antriebe",null,null,null,null,null,null,null,null,null,null,110]
["Werkstatt","30.4","Antriebe",null,null,null,null,null,null,null,null,null,null,111]
["Werkstatt","30.4","Antriebe",null,null,null,null,null,null,null,null,null,null,112]
["Container","8.1","Antriebe",null,null,null,null,null,null,null,null,null,null,113]
["Container","8.1","Antriebe",null,null,null,null,null,null,null,null,null,null,114]
["Container","8.1","Antriebe",null,null,null,null,null,null,null,null,null,null,115]
["Container","8.1","Antriebe",null,null,null,null,null,null,null,null,null,null,116]
["Container","8.1","Antriebe",null,null,null,null,null,null,null,null,null,null,117]
["Werkstatt","30.4","Antriebe",null,null,null,null,null,null,null,null,null,null,118]
["Werkstatt","30.4","Antriebe",null,null,null,null,null,null,null,null,null,null,119]
["Werkstatt","30.4","Antriebe",null,null,null,null,null,null,null,null,null,null,120]
["Container","9.4","Antriebe",null,null,null,null,null,null,null,null,null,null,121]
["Container","9.4","Antriebe",null,null,null,null,null,null,null,null,null,null,122]
["Container","9.4","Antriebe",null,null,null,null,null,null,null,null,null,null,123]
["Container","9.4","Antriebe",null,null,null,null,null,null,null,null,null,null,124]
["Container","9.4","Antriebe",null,null,null,null,null,null,null,null,null,null,125]
["Container","9.4","Antriebe",null,null,null,null,null,null,null,null,null,null,126]
["Container","9.4","Antriebe",null,null,null,null,null,null,null,null,null,null,127]
["Container","9.4","Antriebe",null,null,null,null,null,null,null,null,null,null,128]
["Container","9.4","Antriebe",null,null,null,null,null,null,null,null,null,null,129]
["Werkstatt","30.4","Antriebe",null,null,null,null,null,null,null,null,null,null,130]
["Werkstatt","30.4","Antriebe",null,null,null,null,null,null,null,null,null,null,131]
["Werkstatt","30.4","Antriebe",null,null,null,null,null,null,null,null,null,null,132]
["Werkstatt","30.4","Antriebe",null,null,null,null,null,null,null,null,null,null,133]
["Werkstatt","30.4","Antriebe",null,null,null,null,null,null,null,null,null,null,134]
["Werkstatt","30.4","Antriebe",null,null,null,null,null,null,null,null,null,null,135]
["Werkstatt","30.4","Antriebe",null,null,null,null,null,null,null,null,null,null,136]
["Keller",null,"Apparate",null,null,null,null,null,null,null,null,null,null,137]
["Container","5.3","Apparate",null,null,null,null,null,null,null,null,null,null,138]
["Container","9.2","Apparate",null,null,null,null,null,null,null,null,null,null,139]
["Keller",null,"Apparate",null,null,null,null,null,null,null,null,null,null,140]
["Keller",null,"Apparate",null,null,null,null,null,null,null,null,null,null,141]
["Container","5.2","Apparate",null,null,null,null,null,null,null,null,null,null,142]
["Container","5.3","Apparate",null,null,null,null,null,null,null,null,null,null,143]
["Container","5.3","Apparate",null,null,null,null,null,null,null,null,null,null,144]
["Keller",null,"Apparate",null,null,null,null,null,null,null,null,null,null,145]
["Container","5.2","Apparate",null,null,null,null,null,null,null,null,null,null,146]
["Container","5.2","Apparate",null,null,null,null,null,null,null,null,null,null,147]
["Container","5.2","Apparate",null,null,null,null,null,null,null,null,null,null,148]
["Keller",null,"Apparate",null,null,null,null,null,null,null,null,null,null,149]
["Container","5.3","Apparate",null,null,null,null,null,null,null,null,null,null,150]
["Container","5.3","Apparate",null,null,null,null,null,null,null,null,null,null,151]
["Container","5.3","Apparate",null,null,null,null,null,null,null,null,null,null,152]
["Container","5.3","Apparate",null,null,null,null,null,null,null,null,null,null,153]
["Container","5.3","Apparate",null,null,null,null,null,null,null,null,null,null,154]
["Container","5.3","Apparate",null,null,null,null,null,null,null,null,null,null,155]
["Container","5.4","Apparate",null,null,null,null,null,null,null,null,null,null,156]
["Keller",null,"Apparate",null,null,null,null,null,null,null,null,null,null,157]
["Container","5.4","Apparate",null,null,null,null,null,null,null,null,null,null,158]
["Container","10.5","Apparate",null,null,null,null,null,null,null,null,null,null,159]
["Container","5.4","Apparate",null,null,null,null,null,null,null,null,null,null,160]
["Container","5.4","Apparate",null,null,null,null,null,null,null,null,null,null,161]
["Container","5.4","Apparate",null,null,null,null,null,null,null,null,null,null,162]
["Container","5.3","Apparate",null,null,null,null,null,null,null,null,null,null,163]
["Container","10.2","Apparate",null,null,null,null,null,null,null,null,null,null,164]
["Container","5.4","Apparate",null,null,null,null,null,null,null,null,null,null,165]
["Container","10.6","Apparate",null,null,null,null,null,null,null,null,null,null,166]
["Container","5.1","Hilfsmittel",null,null,null,null,null,null,null,null,null,null,167]
["Container","5.1","Hilfsmittel",null,null,null,null,null,null,null,null,null,null,168]
["Container","11.1","Hydraulik",null,null,null,null,null,null,null,null,null,null,169]
["Container","5.5","Hydraulik",null,null,null,null,null,null,null,null,null,null,170]
["Container","10.3","Hydraulik",null,null,null,null,null,null,null,null,null,null,171]
["Container","5.3","Hydraulik",null,null,null,null,null,null,null,null,null,null,172]
["Container","7.3","Pneumatik",null,null,null,null,null,null,null,null,null,null,173]
["Container","7.2","Pneumatik",null,null,null,null,null,null,null,null,null,null,174]
["Container","7.2","Pneumatik",null,null,null,null,null,null,null,null,null,null,175]
["Container","7.2","Pneumatik",null,null,null,null,null,null,null,null,null,null,176]
["Keller",null,"Pneumatik",null,null,null,null,null,null,null,null,null,null,177]
["Container","7.2","Pneumatik",null,null,null,null,null,null,null,null,null,null,178]
["Container","7.2","Pneumatik",null,null,null,null,null,null,null,null,null,null,179]
["Container","7.2","Pneumatik",null,null,null,null,null,null,null,null,null,null,180]
["Container","7.2","Pneumatik",null,null,null,null,null,null,null,null,null,null,181]
["Container",null,"Pneumatik",null,null,null,null,null,null,null,null,null,null,182]
["Container","7.2","Pneumatik",null,null,null,null,null,null,null,null,null,null,183]
["Container","7.2","Pneumatik",null,null,null,null,null,null,null,null,null,null,184]
["Container","5.2","Pneumatik",null,null,null,null,null,null,null,null,null,null,185]
["Container","7.3","Pneumatik",null,null,null,null,null,null,null,null,null,null,186]
["Container","7.1","Pneumatik",null,null,null,null,null,null,null,null,null,null,187]
["Container","7.3","Pneumatik",null,null,null,null,null,null,null,null,null,null,188]
["Container","7.3","Pneumatik",null,null,null,null,null,null,null,null,null,null,189]
["Container","7.3","Pneumatik",null,null,null,null,null,null,null,null,null,null,190]
["Container","7.1","Pneumatik",null,null,null,null,null,null,null,null,null,null,191]
["Container","7.3","Pneumatik",null,null,null,null,null,null,null,null,null,null,192]
["Container","7.3","Pneumatik",null,null,null,null,null,null,null,null,null,null,193]
["Container","7.3","Pneumatik",null,null,null,null,null,null,null,null,null,null,194]
["Container","7.3","Pneumatik",null,null,null,null,null,null,null,null,null,null,195]
["Container","7.1","Pneumatik",null,null,null,null,null,null,null,null,null,null,196]
["Container","7.3","Pneumatik",null,null,null,null,null,null,null,null,null,null,197]
["Container","5.2","Sensoren",null,null,null,null,null,null,null,null,null,null,198]
["Container","5.2","Sensoren",null,null,null,null,null,null,null,null,null,null,199]
["Container","10.5","Sensoren",null,null,null,null,null,null,null,null,null,null,200]
["Container","11.3","Sonstiges",null,null,null,null,null,null,null,null,null,null,201]
["Container","11.3","Sonstiges",null,null,null,null,null,null,null,null,null,null,202]
["Container","5.4","Zubehör",null,null,null,null,null,null,null,null,null,null,203]
["Container","11.6","Zubehör",null,null,null,null,null,null,null,null,null,null,204]
["Container","10.5","Zubehör",null,null,null,null,null,null,null,null,null,null,205]
["Container","10.5","Zubehör",null,null,null,null,null,null,null,null,null,null,206]
["Container","10.5","Zubehör",null,null,null,null,null,null,null,null,null,null,207]
["Container","10.5","Zubehör",null,null,null,null,null,null,null,null,null,null,208]
["Container","10.5","Zubehör",null,null,null,null,null,null,null,null,null,null,209]
["Container","10.5","Zubehör",null,null,null,null,null,null,null,null,null,null,210]
["Container","10.5","Zubehör",null,null,null,null,null,null,null,null,null,null,211]
["Container","10.5","Zubehör",null,null,null,null,null,null,null,null,null,null,212]
["Container","5.4","Zubehör",null,null,null,null,null,null,null,null,null,null,213]
["Container","11.6","Zubehör",null,null,null,null,null,null,null,null,null,null,214]
["Container","10.1","Zubehör",null,null,null,null,null,null,null,null,null,null,215]
["Container","5.2","Zubehör",null,null,null,null,null,null,null,null,null,null,216]
["Container","5.2","Zubehör",null,null,null,null,null,null,null,null,null,null,217]
["Container","10.5","Zubehör",null,null,null,null,null,null,null,null,null,null,218]
["Container","11.3","Zubehör",null,null,null,null,null,null,null,null,null,null,219]
["Container","11.3","Zubehör",null,null,null,null,null,null,null,null,null,null,220]
["Container","11.6","Zubehör",null,null,null,null,null,null,null,null,null,null,221]
[null,null,null,null,null,null,null,null,null,null,null,null,null,222]
[null,null,null,null,null,null,null,null,null,null,null,null,null,223]
[null,null,null,null,null,null,null,null,null,null,null,null,null,224]
[null,null,null,null,null,null,null,null,null,null,null,null,null,225]
[null,null,null,null,null,null,null,null,null,null,null,null,null,226]
[null,null,null,null,null,null,null,null,null,null,null,null,null,227]
[null,null,null,null,null,null,null,null,null,null,null,null,null,228]
[null,null,null,null,null,null,null,null,null,null,null,null,null,229]
[null,null,null,null,null,null,null,null,null,null,null,null,null,230]
[null,null,null,null,null,null,null,null,null,null,null,null,null,231]
[null,null,null,null,null,null,null,null,null,null,null,null,null,232]
[null,null,null,null,null,null,null,null,null,null,null,null,null,233]
[null,null,null,null,null,null,null,null,null,null,null,null,null,234]
[null,null,null,null,null,null,null,null,null,null,null,null,null,235]
[null,null,null,null,null,null,null,null,null,null,null,null,null,236]
[null,null,null,null,null,null,null,null,null,null,null,null,null,237]
[null,null,null,null,null,null,null,null,null,null,null,null,null,238]
[null,null,null,null,null,null,null,null,null,null,null,null,null,239]
[null,null,null,null,null,null,null,null,null,null,null,null,null,240]
[null,null,null,null,null,null,null,null,null,null,null,null,null,241]
[null,null,null,null,null,null,null,null,null,null,null,null,null,242]
[null,null,null,null,null,null,null,null,null,null,null,null,null,243]
[null,null,null,null,null,null,null,null,null,null,null,null,null,244]
[null,null,null,null,null,null,null,null,null,null,null,null,null,245]
[null,null,null,null,null,null,null,null,null,null,null,null,null,246]
[null,null,null,null,null,null,null,null,null,null,null,null,null,247]
[null,null,null,null,null,null,null,null,null,null,null,null,null,248]
[null,null,null,null,null,null,null,null,null,null,null,null,null,249]
[null,null,null,null,null,null,null,null,null,null,null,null,null,250]
[null,null,null,null,null,null,null,null,null,null,null,null,null,251]
[null,null,null,null,null,null,null,null,null,null,null,null,null,252]
[null,null,null,null,null,null,null,null,null,null,null,null,null,253]
[null,null,null,null,null,null,null,null,null,null,null,null,null,254]
[null,null,null,null,null,null,null,null,null,null,null,null,null,255]
[null,null,null,null,null,null,null,null,null,null,null,null,null,256]
[null,null,null,null,null,null,null,null,null,null,null,null,null,257]
[null,null,null,null,null,null,null,null,null,null,null,null,null,258]
[null,null,null,null,null,null,null,null,null,null,null,null,null,259]
[null,null,null,null,null,null,null,null,null,null,null,null,null,260]
[null,null,null,null,null,null,null,null,null,null,null,null,null,261]
[null,null,null,null,null,null,null,null,null,null,null,null,null,262]
[null,null,null,null,null,null,null,null,null,null,null,null,null,263]
[null,null,null,null,null,null,null,null,null,null,null,null,null,264]
[null,null,null,null,null,null,null,null,null,null,null,null,null,265]
[null,null,null,null,null,null,null,null,null,null,null,null,null,266]
[null,null,null,null,null,null,null,null,null,null,null,null,null,267]
[null,null,null,null,null,null,null,null,null,null,null,null,null,268]
[null,null,null,null,null,null,null,null,null,null,null,null,null,269]
[null,null,null,null,null,null,null,null,null,null,null,null,null,270]
[null,null,null,null,null,null,null,null,null,null,null,null,null,271]
[null,null,null,null,null,null,null,null,null,null,null,null,null,272]
[null,null,null,null,null,null,null,null,null,null,null,null,null,273]
[null,null,null,null,null,null,null,null,null,null,null,null,null,274]
[null,null,null,null,null,null,null,null,null,null,null,null,null,275]
[null,null,null,null,null,null,null,null,null,null,null,null,null,276]
[null,null,null,null,null,null,null,null,null,null,null,null,null,277]
[null,null,null,null,null,null,null,null,null,null,null,null,null,278]
[null,null,null,null,null,null,null,null,null,null,null,null,null,279]
[null,null,null,null,null,null,null,null,null,null,null,null,null,280]
[null,null,null,null,null,null,null,null,null,null,null,null,null,281]
[null,null,null,null,null,null,null,null,null,null,null,null,null,282]
[null,null,null,null,null,null,null,null,null,null,null,null,null,283]
[null,null,null,null,null,null,null,null,null,null,null,null,null,284]
[null,null,null,null,null,null,null,null,null,null,null,null,null,285]
[null,null,null,null,null,null,null,null,null,null,null,null,null,286]
[null,null,null,null,null,null,null,null,null,null,null,null,null,287]
[null,null,null,null,null,null,null,null,null,null,null,null,null,288]
[null,null,null,null,null,null,null,null,null,null,null,null,null,289]
[null,null,null,null,null,null,null,null,null,null,null,null,null,290]
[null,null,null,null,null,null,null,null,null,null,null,null,null,291]
[null,null,null,null,null,null,null,null,null,null,null,null,null,292]
[null,null,null,null,null,null,null,null,null,null,null,null,null,293]
[null,null,null,null,null,null,null,null,null,null,null,null,null,294]
[null,null,null,null,null,null,null,null,null,null,null,null,null,295]
[null,null,null,null,null,null,null,null,null,null,null,null,null,296]
[null,null,null,null,null,null,null,null,null,null,null,null,null,297]
[null,null,null,null,null,null,null,null,null,null,null,null,null,298]
[null,null,null,null,null,null,null,null,null,null,null,null,null,299]
[null,null,null,null,null,null,null,null,null,null,null,null,null,300]

{"sheet":"Detail","index":1,"n_rows":17,"n_cols":2,"rows_kept":17,"cut":false,"hidden":false,"merged":[]}
["Lagerort:",{"$f":"INDEX(Liste!$A$1:$N$222,_xlfn.SHEET()-1,1)","v":"Lagerort"}]
["Kategorie:",{"$f":"INDEX(Liste!$A$1:$N$222,_xlfn.SHEET()-1,3)","v":"Kategorie"}]
["Typ:",{"$f":"INDEX(Liste!$A$1:$N$222,_xlfn.SHEET()-1,4)","v":"Typ"}]
["Beschreibung:",{"$f":"INDEX(Liste!$A$1:$N$222,_xlfn.SHEET()-1,6)","v":"Beschreibung"}]
[]
["Aktueller Zustand:"]
[]
["Durchgeführte Arbeiten:"]
[]
[]
[]
[]
[]
[]
[]
[]
["Bilder:"]