{"text_format":"1","workbook":"xlsx","n_sheets":4,"sheets":["Start","1","Adressen","Bilder"],"not_rendered":{"charts":0,"images":4,"macros":1,"external_links":1,"defined_names":11,"comments":0,"pivot_tables":0},"unopened":[],"bounds":{"document_bytes":16777216,"sheet_cells":100000,"rows_first":2000,"rows_last":500,"rows_between":2000,"halvings":0,"cell_chars":16384,"cell_head_chars":4096},"cells_cut":0,"cells_raw":0,"read":"whole","date_system":"1900"}

{"sheet":"Start","index":0,"n_rows":21,"n_cols":10,"rows_kept":21,"cut":false,"hidden":false,"merged":[[5,2,5,11],[7,4,7,9],[8,2,8,4],[11,2,11,11],[14,9,14,10],[18,2,18,11],[20,2,20,10],[22,2,22,11],[23,2,23,11],[14,4,14,7],[14,2,14,3]]}
[]
[]
[]
[]
[]
[]
[]
[]
[null,null,"Bereich:",null,null,null,null,"/",{"$f":"VLOOKUP($F$10,Adressen!B1:F4, 3, FALSE)","v":"Beispiel 2 GmbH"}]
[null,null,null,null,null,2]
[]
[]
[]
[]
[null,null,null,null,null,null,null,null,null,{"$f":"+F16","v":0}]
[null,null,null,null,null,0]
[]
[]
[null,null,"Hinweise:"]
[null,null,"Graue Fläche ",null,"heißt - es gibt Handlungsbedarf!"]
[null,null,"Lesen Sie bitte die Hinweise, die Ihnen Ihre Arbeit vereinfachen sollen. "]

{"sheet":"1","index":1,"n_rows":6,"n_cols":1,"rows_kept":6,"cut":false,"hidden":false,"merged":[[0,0,2,3],[3,0,3,3],[5,0,5,3]]}
[]
[]
[]
[]
[]
[{"$f":"VLOOKUP(Start!F10,Adressen!B2:E4,4,FALSE)","v":"Beispiel 2 GmbH · Hauptstraße 1 · 54321 Stadt"}]

{"sheet":"Adressen","index":2,"n_rows":4,"n_cols":6,"rows_kept":4,"cut":false,"hidden":false,"merged":[]}
["BuKr","No","Adresse ","Name ","Briefkopf","BuKr"]
["0100",1,"Beispiel 1\nTeststraße 1\n12345 Test","Beispiel 1 GmbH","Beispiel 1 GmbH · Teststraße 1· 12345 Test","0100"]
["0340",2,"Beispiel 2\nHaupstraße 1\n54321 Stadt","Beispiel 2 GmbH","Beispiel 2 GmbH · Hauptstraße 1 · 54321 Stadt","0340"]
["0880",3,"Beispiel 3\nDorfstraße 1\n11111 Dorf","Beispiel 3 GmbH","Beispiel 3 GmbH · Dorfstraße 1 · 11111 Dorf","0880"]

{"sheet":"Bilder","index":3,"n_rows":0,"n_cols":0,"rows_kept":0,"cut":false,"hidden":false,"merged":[]}