{"text_format":"1","workbook":"xlsx","n_sheets":3,"sheets":["Start (2)","Tabelle 7er","null"],"not_rendered":{"charts":0,"images":0,"macros":1,"external_links":0,"defined_names":0,"comments":0,"pivot_tables":0},"unopened":[],"bounds":{"document_bytes":16777216,"sheet_cells":100000,"rows_first":2000,"rows_last":500,"rows_between":2000,"halvings":0,"cell_chars":16384,"cell_head_chars":4096},"cells_cut":0,"cells_raw":0,"read":"whole","date_system":"1900"}

{"sheet":"Start (2)","index":0,"n_rows":45,"n_cols":17,"rows_kept":45,"cut":false,"hidden":false,"merged":[[33,9,33,10],[34,9,34,10],[35,9,35,10],[33,11,33,12],[34,11,34,12],[35,11,35,12]]}
["Namen",null,"Einfügen",{"$f":"RAND()","v":0.85148367398512237},null,"Startgeld",5,"Sielgeld - kalkuliert",4,null,null,null,"Zu zahlen","Bezahlt",0,0,0]
[{"$f":"null!A2","v":"Siggi"},"SP 1","Kerstin P.",{"$f":"RAND()","v":0.37846291138114707},null,{"$f":"C2","v":"Kerstin P."},0,{"$f":"'Tabelle 7er'!Q80","v":0},0,{"$f":"F2","v":"Kerstin P."},{"$f":"ROUNDUP(H2,0)","v":0},{"$f":"ROUNDUP(H2,0)-I2","v":0},{"$f":"L2","v":0},0,1,1,5]
[{"$f":"null!A3","v":"Manue R."},"SP 2","Freilos",{"$f":"RAND()","v":0.99488331282408982},null,{"$f":"C3","v":"Freilos"},0,{"$f":"'Tabelle 7er'!Q81","v":0},0,{"$f":"F3","v":"Freilos"},{"$f":"ROUNDUP(H3,0)","v":0},{"$f":"ROUNDUP(H3,0)-I3","v":0},{"$f":"L3","v":0},0,2,2,8]
[{"$f":"null!A4","v":"Klaus M."},"SP 3","Bennet B.",{"$f":"RAND()","v":0.48372269696382963},null,"Bennet B.",0,{"$f":"'Tabelle 7er'!Q82","v":0},0,"Bennet B.",0,0,0,0,3,3,10]
[{"$f":"null!A5","v":"Stefan S."},"SP 4","Manni B.",{"$f":"RAND()","v":0.46809579373858923},null,"Manni B.",0,{"$f":"'Tabelle 7er'!Q83","v":0},0,"Manni B.",0,0,0,0,4,4]
[{"$f":"null!A6","v":"Andrea S."},"SP 5","Siggi",{"$f":"RAND()","v":0.6842677405522698},null,"Siggi",0,{"$f":"'Tabelle 7er'!Q84","v":0},0,"Siggi",0,0,0,0,5,5]
[{"$f":"null!A7","v":"Sasha J."},"SP 6","Nicole E.",{"$f":"RAND()","v":0.9762683899138257},null,"Nicole E.",0,{"$f":"'Tabelle 7er'!Q85","v":0},0,"Nicole E.",0,0,0,0,6,6]
[{"$f":"null!A8","v":"Erich"},"SP 7","Nadine D.",{"$f":"RAND()","v":4.4132836004625586E-2},null,"Nadine D.",0,{"$f":"'Tabelle 7er'!Q86","v":0},0,"Nadine D.",0,0,0,0,7,7]
[{"$f":"null!A9","v":"Anja K."},"SP 8","Lukas R.",{"$f":"RAND()","v":0.79712998992321571},null,"Lukas R.",0,{"$f":"'Tabelle 7er'!Q87","v":0},0,"Lukas R.",0,0,0,0,8]
[{"$f":"null!A10","v":"Vincent U."},"SP 9","Klaus M.",{"$f":"RAND()","v":0.66509455821395524},null,"Klaus M.",0,{"$f":"'Tabelle 7er'!Q88","v":0},0,"Klaus M.",0,0,0,0,9]
[{"$f":"null!A11","v":"Phil K."},"SP 10","Volker S.",{"$f":"RAND()","v":0.37331850008167899},null,"Volker S.",0,{"$f":"'Tabelle 7er'!Q89","v":0},0,"Volker S.",0,0,0,0,10]
[{"$f":"null!A12","v":"Werner E."},"SP 11","Sasha J.",{"$f":"RAND()","v":0.86041527826754127},null,"Sasha J.",0,{"$f":"'Tabelle 7er'!Q90","v":0},0,"Sasha J.",0,0,0,0,11]
[{"$f":"null!A13","v":"Frank E."},"SP 12","Erich",{"$f":"RAND()","v":5.3077460298178503E-2},null,"Erich",0,{"$f":"'Tabelle 7er'!Q91","v":0},0,"Erich",0,0,0,0,12]
[{"$f":"null!A14","v":"Nicole E."},"SP 13","Ralf M.",{"$f":"RAND()","v":0.33673586785058529},null,"Ralf M.",0,{"$f":"'Tabelle 7er'!Q92","v":0},0,"Ralf M.",0,0,0,0]
[{"$f":"null!A15","v":"Daniela E."},"SP 14","Werner E.",{"$f":"RAND()","v":0.60599433660234736},null,"Werner E.",0,{"$f":"'Tabelle 7er'!Q93","v":0},0,"Werner E.",0,0,0,0]
[{"$f":"null!A16","v":"Dirk N."},"SP 15","Anja K.",{"$f":"RAND()","v":0.73148731670230027},null,"Anja K.",0,{"$f":"'Tabelle 7er'!Q94","v":0},0,"Anja K.",0,0,0,0]
[{"$f":"null!A17","v":"Roswitha N."},"SP 16","Sascha D.",{"$f":"RAND()","v":0.42103010355635795},null,"Sascha D.",0,{"$f":"'Tabelle 7er'!Q95","v":0},0,"Sascha D.",0,0,0,0]
[{"$f":"null!A18","v":"Kevin N."},"SP 17","Dirk N.",{"$f":"RAND()","v":0.27091427997162532},null,"Dirk N.",0,{"$f":"'Tabelle 7er'!Q96","v":0},0,"Dirk N.",0,0,0,0]
[{"$f":"null!A19","v":"Ralf M."},"SP 18","Roswitha N.",{"$f":"RAND()","v":0.91225986844389084},null,"Roswitha N.",0,{"$f":"'Tabelle 7er'!Q97","v":0},0,"Roswitha N.",0,0,0,0]
[{"$f":"null!A20","v":"Kerstin P."},"SP 19","Maurice L.",{"$f":"RAND()","v":0.15695590669001058},null,"Maurice L.",0,{"$f":"'Tabelle 7er'!Q98","v":0},0,"Maurice L.",0,0,0,0]
[{"$f":"null!A21","v":"Christian F."},"SP 20","Stefan E.",{"$f":"RAND()","v":0.34134610847071223},null,"Stefan E.",0,{"$f":"'Tabelle 7er'!Q99","v":0},0,"Stefan E.",0,0,0,0]
[{"$f":"null!A22","v":"Volker S."},"SP 21","Stefan S.",{"$f":"RAND()","v":0.93691758028712202},null,"Stefan S.",0,{"$f":"'Tabelle 7er'!Q100","v":0},0,"Stefan S.",0,0,0,0]
[{"$f":"null!A23","v":"Rene S."},"SP 22","Patrick G.",{"$f":"RAND()","v":0.78919447032282686},null,"Patrick G.",0,{"$f":"'Tabelle 7er'!Q101","v":0},0,"Patrick G.",0,0,0,0]
[{"$f":"null!A24","v":"Manni B."},"SP 23","Manue R.",{"$f":"RAND()","v":0.45151617659189747},null,"Manue R.",0,{"$f":"'Tabelle 7er'!Q102","v":0},0,"Manue R.",0,0,0,0]
[{"$f":"null!A25","v":"Lukas R."},"SP 24","Christian F.",{"$f":"RAND()","v":0.6944166793506924},null,"Christian F.",0,{"$f":"'Tabelle 7er'!Q103","v":0},0,"Christian F.",0,0,0,0]
[{"$f":"null!A26","v":"Bennet B."},"SP 25","Johannes J.",{"$f":"RAND()","v":0.8195792219377529},null,"Johannes J.",0,{"$f":"'Tabelle 7er'!Q104","v":0},0,"Johannes J.",0,0,0,0]
[{"$f":"null!A27","v":"Maurice L."},"SP 26","Andrea S.",{"$f":"RAND()","v":0.97793282470502296},null,"Andrea S.",0,{"$f":"'Tabelle 7er'!Q105","v":0},0,"Andrea S.",0,0,0,0]
[{"$f":"null!A28","v":"Johannes J."},"SP 27","Daniela E.",{"$f":"RAND()","v":7.6549368554462704E-2},null,"Daniela E.",0,{"$f":"'Tabelle 7er'!Q106","v":0},0,"Daniela E.",0,0,0,0]
[{"$f":"null!A29","v":"Patrick G."},"SP 28","Vincent U.",{"$f":"RAND()","v":2.3177644008054776E-2},null,"Vincent U.",0,{"$f":"'Tabelle 7er'!Q107","v":0},0,"Vincent U.",0,0,0,0]
[{"$f":"null!A30","v":"Stefan E."},"SP 29","Frank E.",{"$f":"RAND()","v":0.96825877367931035},null,"Frank E.",0,{"$f":"'Tabelle 7er'!Q108","v":0},0,"Frank E.",0,{"$f":"ROUNDUP(H30,0)-I30","v":0},0,0]
[{"$f":"null!A31","v":"Sascha D."},"SP 30","Kevin N.",{"$f":"RAND()","v":0.68557352836174923},null,"Kevin N.",0,{"$f":"'Tabelle 7er'!Q109","v":0},0,"Kevin N.",0,0,0,0]
[{"$f":"null!A32","v":"Nadine D."},"SP 31","Rene S.",{"$f":"RAND()","v":0.24252877597581202},null,"Rene S.",0,{"$f":"'Tabelle 7er'!Q110","v":0},0,"Rene S.",0,0,0,0]
[{"$f":"null!A33","v":"Freilos"},"SP 32","Phil K.",{"$f":"RAND()","v":0.32205611079110819},null,"Phil K.",0,{"$f":"'Tabelle 7er'!Q111","v":0},0,"Phil K.",0,0,0,0]
[null,null,null,null,null,null,{"$f":"SUM(G2:G33)","v":0},{"$f":"SUM(H2:H33)","v":0},{"$f":"SUM(I2:I33)","v":0},"Spielgeld Ergebnisse",null,{"$f":"'Tabelle 7er'!S112","v":0},null,{"$f":"SUM(N2:N33)","v":0}]
[null,null,null,null,null,null,"Überschuß",null,null,"Spielgeld Vorkasse",null,{"$f":"SUM(I34)","v":0},null,{"$f":"SUM(N2:N33)","v":0}]
[null,null,null,null,"Preisgeld","Startgeld","Spielgeld",null,null,"Spielgeld Überschuß",null,{"$f":"SUM(L34)-L35","v":0}]
[null,null,"Sieger",{"$f":"'Tabelle 7er'!M72","v":{"$error":"#NUM!"}},{"$f":"SUM(F37:G37)","v":0},{"$f":"SUM(G34)/2","v":0},{"$f":"SUM(L36/2)","v":0},null,null,null,{"$f":"SUM(M2:M33)","v":0}]
[null,null,"Zweiter",{"$f":"'Tabelle 7er'!M73","v":{"$error":"#NUM!"}},{"$f":"SUM(F38:G38)","v":0},{"$f":"SUM(G34)/100*30","v":0},{"$f":"SUM(L36/100*30)","v":0}]
[null,null,"Dritter",{"$f":"'Tabelle 7er'!M65","v":{"$error":"#NUM!"}},0,{"$f":"SUM(G34)/100*10","v":0},{"$f":"SUM(L36/100*10)","v":0}]
[null,null,"Vierter",{"$f":"'Tabelle 7er'!M66","v":{"$error":"#NUM!"}},0,{"$f":"SUM(G34)/100*10","v":0},{"$f":"SUM(L36/100*10)","v":0}]
[null,null,null,{"$f":"RAND()","v":0.62767204721103176}]
[null,"AUTOM.rechts innen",null,{"$f":"RAND()","v":2.2891563749073196E-2}]
[null,"AUTOM.rechts aussen",null,{"$f":"RAND()","v":0.16868339798950072}]
[null,"AUTOM.links aussen",null,{"$f":"RAND()","v":0.74552052688404735}]
[null,"AUTOM.links innen",null,{"$f":"RAND()","v":0.76962871076155359}]

{"sheet":"Tabelle 7er","index":1,"n_rows":112,"n_cols":27,"rows_kept":112,"cut":false,"hidden":false,"merged":[[102,2,102,3],[102,4,102,5],[102,6,102,7],[102,8,102,9],[102,10,102,11],[102,13,102,14],[110,4,110,5],[106,2,106,3],[106,6,106,7],[106,8,106,9],[106,10,106,11],[110,10,110,11],[107,13,107,14],[108,13,108,14],[109,13,109,14],[110,13,110,14],[108,2,108,3],[109,2,109,3],[110,2,110,3],[108,6,108,7],[109,6,109,7],[110,6,110,7],[108,8,108,9],[109,8,109,9],[110,8,110,9],[107,10,107,11],[108,10,108,11],[109,10,109,11],[106,4,106,5],[106,13,106,14],[108,4,108,5],[109,4,109,5],[104,2,104,3],[104,4,104,5],[104,6,104,7],[104,8,104,9],[104,10,104,11],[104,13,104,14],[103,2,103,3],[103,4,103,5],[103,6,103,7],[103,8,103,9],[103,10,103,11],[103,13,103,14],[107,2,107,3],[107,6,107,7],[107,8,107,9],[105,2,105,3],[105,4,105,5],[105,6,105,7],[105,8,105,9],[105,10,105,11],[105,13,105,14],[107,4,107,5],[101,2,101,3],[101,4,101,5],[101,6,101,7],[101,8,101,9],[101,10,101,11],[101,13,101,14],[100,2,100,3],[100,4,100,5],[100,6,100,7],[100,8,100,9],[100,10,100,11],[100,13,100,14],[99,2,99,3],[99,4,99,5],[99,6,99,7],[99,8,99,9],[99,10,99,11],[99,13,99,14],[98,2,98,3],[98,4,98,5],[98,6,98,7],[98,8,98,9],[98,10,98,11],[98,13,98,14],[97,2,97,3],[97,4,97,5],[97,6,97,7],[97,8,97,9],[97,10,97,11],[97,13,97,14],[96,2,96,3],[96,4,96,5],[96,6,96,7],[96,8,96,9],[96,10,96,11],[96,13,96,14],[95,2,95,3],[95,4,95,5],[95,6,95,7],[95,8,95,9],[95,10,95,11],[95,13,95,14],[94,2,94,3],[94,4,94,5],[94,6,94,7],[94,8,94,9],[94,10,94,11],[94,13,94,14],[93,2,93,3],[93,4,93,5],[93,6,93,7],[93,8,93,9],[93,10,93,11],[93,13,93,14],[92,2,92,3],[92,4,92,5],[92,6,92,7],[92,8,92,9],[92,10,92,11],[92,13,92,14],[91,2,91,3],[91,4,91,5],[91,6,91,7],[91,8,91,9],[91,10,91,11],[91,13,91,14],[90,2,90,3],[90,4,90,5],[90,6,90,7],[90,8,90,9],[90,10,90,11],[90,13,90,14],[89,2,89,3],[89,4,89,5],[89,6,89,7],[89,8,89,9],[89,10,89,11],[89,13,89,14],[88,2,88,3],[88,4,88,5],[88,6,88,7],[88,8,88,9],[88,10,88,11],[88,13,88,14],[87,2,87,3],[87,4,87,5],[87,6,87,7],[87,8,87,9],[87,10,87,11],[87,13,87,14],[86,2,86,3],[86,4,86,5],[86,6,86,7],[86,8,86,9],[86,10,86,11],[86,13,86,14],[85,2,85,3],[85,4,85,5],[85,6,85,7],[85,8,85,9],[85,10,85,11],[85,13,85,14],[84,2,84,3],[84,4,84,5],[84,6,84,7],[84,8,84,9],[84,10,84,11],[84,13,84,14],[83,2,83,3],[83,4,83,5],[83,6,83,7],[83,8,83,9],[83,10,83,11],[83,13,83,14],[82,2,82,3],[82,4,82,5],[82,6,82,7],[82,8,82,9],[82,10,82,11],[82,13,82,14],[81,2,81,3],[81,4,81,5],[81,6,81,7],[81,8,81,9],[81,10,81,11],[81,13,81,14],[80,2,80,3],[80,4,80,5],[80,6,80,7],[80,8,80,9],[80,10,80,11],[80,13,80,14],[79,2,79,3],[79,4,79,5],[79,6,79,7],[79,8,79,9],[79,10,79,11],[79,13,79,14],[72,7,72,8],[72,10,72,11],[72,13,72,14],[75,0,76,18],[78,2,78,3],[78,4,78,5],[78,6,78,7],[78,8,78,9],[78,10,78,11],[78,13,78,14],[78,15,78,16],[64,15,64,16],[71,15,71,16],[64,17,64,18],[71,17,71,18],[69,7,70,14],[71,7,71,8],[71,10,71,11],[71,13,71,14],[62,7,63,14],[64,7,64,8],[64,10,64,11],[64,13,64,14],[65,7,65,8],[65,10,65,11],[65,13,65,14],[58,0,58,10],[58,12,58,22],[54,0,54,4],[54,6,54,10],[54,12,54,16],[54,18,54,22],[59,18,59,22],[60,18,60,22],[59,1,59,2],[59,13,59,14],[59,16,59,17],[60,1,60,2],[60,13,60,14],[60,16,60,17],[59,6,59,10],[60,6,60,10],[41,2,41,3],[41,8,41,9],[41,14,41,15],[41,20,41,21],[42,2,42,3],[42,8,42,9],[42,14,42,15],[42,20,42,21],[55,0,55,4],[55,6,55,10],[55,12,55,16],[53,0,53,1],[53,6,53,7],[53,12,53,13],[53,18,53,19],[51,0,51,4],[51,6,51,10],[51,12,51,16],[51,18,51,22],[52,0,52,1],[52,6,52,7],[52,12,52,13],[52,18,52,19],[55,18,55,22]]}
[{"$f":"'Start (2)'!C2","v":"Kerstin P."},null,null,null,null,null,{"$f":"'Start (2)'!C10","v":"Klaus M."},null,null,null,null,null,{"$f":"'Start (2)'!C18","v":"Dirk N."},null,null,null,null,null,{"$f":"'Start (2)'!C26","v":"Johannes J."}]
[{"$f":"'Start (2)'!C3","v":"Freilos"},null,null,null,null,null,{"$f":"'Start (2)'!C11","v":"Volker S."},null,null,null,null,null,{"$f":"'Start (2)'!C19","v":"Roswitha N."},null,null,null,null,null,{"$f":"'Start (2)'!C27","v":"Andrea S."}]
[{"$f":"'Start (2)'!C4","v":"Bennet B."},null,null,null,null,null,{"$f":"'Start (2)'!C12","v":"Sasha J."},null,null,null,null,null,{"$f":"'Start (2)'!C20","v":"Maurice L."},null,null,null,null,null,{"$f":"'Start (2)'!C28","v":"Daniela E."}]
[{"$f":"'Start (2)'!C5","v":"Manni B."},null,null,null,null,null,{"$f":"'Start (2)'!C13","v":"Erich"},null,null,null,null,null,{"$f":"'Start (2)'!C21","v":"Stefan E."},null,null,null,null,null,{"$f":"'Start (2)'!C29","v":"Vincent U."}]
[{"$f":"'Start (2)'!C6","v":"Siggi"},null,null,null,null,null,{"$f":"'Start (2)'!C14","v":"Ralf M."},null,null,null,null,null,{"$f":"'Start (2)'!C22","v":"Stefan S."},null,null,null,null,null,{"$f":"'Start (2)'!C30","v":"Frank E."}]
[{"$f":"'Start (2)'!C7","v":"Nicole E."},null,null,null,null,null,{"$f":"'Start (2)'!C15","v":"Werner E."},null,null,null,null,null,{"$f":"'Start (2)'!C23","v":"Patrick G."},null,null,null,null,null,{"$f":"'Start (2)'!C31","v":"Kevin N."}]
[{"$f":"'Start (2)'!C8","v":"Nadine D."},null,null,null,null,null,{"$f":"'Start (2)'!C16","v":"Anja K."},null,null,null,null,null,{"$f":"'Start (2)'!C24","v":"Manue R."},null,null,null,null,null,{"$f":"'Start (2)'!C32","v":"Rene S."}]
[{"$f":"'Start (2)'!C9","v":"Lukas R."},null,null,null,null,null,{"$f":"'Start (2)'!C17","v":"Sascha D."},null,null,null,null,null,{"$f":"'Start (2)'!C25","v":"Christian F."},null,null,null,null,null,{"$f":"'Start (2)'!C33","v":"Phil K."}]
[]
[null,null,null,null,null,null,null,null,null,null,null,null,null,null,null,null,null,null,null,null,null,null,null,"17:00:00"]
["Kerstin P.","Lukas R.",null,null,{"$f":"SUM(C11:D11)","v":0},null,"Klaus M.","Sascha D.",null,null,{"$f":"SUM(I11:J11)","v":0},null,"Dirk N.","Christian F.",null,null,{"$f":"SUM(O11:P11)","v":0},null,"Johannes J.","Phil K.",null,null,null,{"$f":"X10","v":"17:00:00"},"UHR",null,{"$f":"TIME(16,0,0)","v":"16:00:00"}]
["Freilos","Nadine D.",null,null,{"$f":"SUM(C12:D12)","v":0},null,"Volker S.","Anja K.",null,null,{"$f":"SUM(I12:J12)","v":0},null,"Roswitha N.","Manue R.",null,null,{"$f":"SUM(O12:P12)","v":0},null,"Andrea S.","Rene S.",null,null,{"$f":"SUM(U12:V12)","v":0},{"$f":"X11+1/96","v":"17:15:00"},"UHR",null,{"$f":"TIME(17,0,0)","v":"17:00:00"}]
["Bennet B.","Nicole E.",null,null,0,null,"Sasha J.","Werner E.",null,null,0,null,"Maurice L.","Patrick G.",null,null,0,null,"Daniela E.","Kevin N.",null,null,0,{"$f":"X12+1/96","v":"17:30:00"},"UHR",null,{"$f":"TIME(18,0,0)","v":"18:00:00"}]
["Manni B.","Siggi",null,null,0,null,"Erich","Ralf M.",null,null,0,null,"Stefan E.","Stefan S.",null,null,0,null,"Vincent U.","Frank E.",null,null,0,"17:45:00","UHR"]
["Kerstin P.","Nadine D.",null,null,0,null,"Klaus M.","Anja K.",null,null,0,null,"Dirk N.","Manue R.",null,null,0,null,"Johannes J.","Rene S.",null,null,0,"18:00:00","UHR"]
["Lukas R.","Nicole E.",null,null,0,null,"Sascha D.","Werner E.",null,null,0,null,"Christian F.","Patrick G.",null,null,0,null,"Phil K.","Kevin N.",null,null,0,"18:15:00","UHR"]
["Freilos","Siggi",null,null,0,null,"Volker S.","Ralf M.",null,null,0,null,"Roswitha N.","Stefan S.",null,null,0,null,"Andrea S.","Frank E.",null,null,0,"18:30:00","UHR"]
["Bennet B.","Manni B.",null,null,0,null,"Sasha J.","Erich",null,null,0,null,"Maurice L.","Stefan E.",null,null,0,null,"Daniela E.","Vincent U.",null,null,0,"18:45:00","UHR"]
["Kerstin P.","Nicole E.",null,null,0,null,"Klaus M.","Werner E.",null,null,0,null,"Dirk N.","Patrick G.",null,null,0,null,"Johannes J.","Kevin N.",null,null,0,"19:00:00","UHR"]
["Nadine D.","Siggi",null,null,0,null,"Anja K.","Ralf M.",null,null,0,null,"Manue R.","Stefan S.",null,null,0,null,"Rene S.","Frank E.",null,null,0,"19:15:00","UHR"]
["Lukas R.","Manni B.",null,null,0,null,"Sascha D.","Erich",null,null,0,null,"Christian F.","Stefan E.",null,null,0,null,"Phil K.","Vincent U.",null,null,0,"19:30:00","UHR"]
["Freilos","Bennet B.",null,null,0,null,"Volker S.","Sasha J.",null,null,0,null,"Roswitha N.","Maurice L.",null,null,0,null,"Andrea S.","Daniela E.",null,null,0,"19:45:00","UHR"]
["Kerstin P.","Siggi",null,null,0,null,"Klaus M.","Ralf M.",null,null,0,null,"Dirk N.","Stefan S.",null,null,0,null,"Johannes J.","Frank E.",null,null,0,"20:00:00","UHR"]
["Nicole E.","Manni B.",null,null,0,null,"Werner E.","Erich",null,null,0,null,"Patrick G.","Stefan E.",null,null,0,null,"Kevin N.","Vincent U.",null,null,0,"20:15:00","UHR"]
["Nadine D.","Bennet B.",null,null,0,null,"Anja K.","Sasha J.",null,null,0,null,"Manue R.","Maurice L.",null,null,0,null,"Rene S.","Daniela E.",null,null,0,"20:30:00","UHR"]
["Lukas R.","Freilos",null,null,0,null,"Sascha D.","Volker S.",null,null,0,null,"Christian F.","Roswitha N.",null,null,0,null,"Phil K.","Andrea S.",null,null,0,"20:45:00","UHR"]
["Kerstin P.","Manni B.",null,null,0,null,"Klaus M.","Erich",null,null,0,null,"Dirk N.","Stefan E.",null,null,0,null,"Johannes J.","Vincent U.",null,null,0,"21:00:00","UHR"]
["Siggi","Bennet B.",null,null,0,null,"Ralf M.","Sasha J.",null,null,0,null,"Stefan S.","Maurice L.",null,null,0,null,"Frank E.","Daniela E.",null,null,0,"21:15:00","UHR"]
["Nicole E.","Freilos",null,null,0,null,"Werner E.","Volker S.",null,null,0,null,"Patrick G.","Roswitha N.",null,null,0,null,"Kevin N.","Andrea S.",null,null,0,"21:30:00","UHR"]
["Nadine D.","Lukas R.",null,null,0,null,"Anja K.","Sascha D.",null,null,0,null,"Manue R.","Christian F.",null,null,0,null,"Rene S.","Phil K.",null,null,0,"21:45:00","UHR"]
["Kerstin P.","Bennet B.",null,null,0,null,"Klaus M.","Sasha J.",null,null,0,null,"Dirk N.","Maurice L.",null,null,0,null,"Johannes J.","Daniela E.",null,null,0,"22:00:00","UHR"]
["Manni B.","Freilos",null,null,0,null,"Erich","Volker S.",null,null,0,null,"Stefan E.","Roswitha N.",null,null,0,null,"Vincent U.","Andrea S.",null,null,0,"22:15:00","UHR"]
["Siggi","Lukas R.",null,null,0,null,"Ralf M.","Sascha D.",null,null,0,null,"Stefan S.","Christian F.",null,null,0,null,"Frank E.","Phil K.",null,null,0,"22:30:00","UHR"]
["Nicole E.","Nadine D.",null,null,0,null,"Werner E.","Anja K.",null,null,0,null,"Patrick G.","Manue R.",null,null,0,null,"Kevin N.","Rene S.",null,null,0,"22:45:00","UHR"]
["Kerstin P.","Freilos",null,null,0,null,"Klaus M.","Volker S.",null,null,0,null,"Dirk N.","Roswitha N.",null,null,0,null,"Johannes J.","Andrea S.",null,null,0,"23:00:00","UHR"]
["Bennet B.","Lukas R.",null,null,0,null,"Sasha J.","Sascha D.",null,null,0,null,"Maurice L.","Christian F.",null,null,0,null,"Daniela E.","Phil K.",null,null,0,"23:15:00","UHR"]
["Manni B.","Nadine D.",null,null,0,null,"Erich","Anja K.",null,null,0,null,"Stefan E.","Manue R.",null,null,0,null,"Vincent U.","Rene S.",null,null,0,"23:30:00","UHR"]
["Siggi","Nicole E.",null,null,0,null,"Ralf M.","Werner E.",null,null,0,null,"Stefan S.","Patrick G.",null,null,0,null,"Frank E.","Kevin N.",null,null,0,{"$f":"X37+1/96","v":"23:45:00"},"UHR"]
[null,null,null,null,{"$f":"SUM(E11:E38)","v":0},null,null,null,null,null,{"$f":"SUM(K11:K38)","v":0},null,null,null,null,null,{"$f":"SUM(Q11:Q38)","v":0},null,null,null,null,null,{"$f":"SUM(W11:W38)","v":0},{"$f":"X38+1/96","v":0.999999999999999}]
[]
[]
[{"$f":"A1","v":"Kerstin P."},{"$f":"SUM(C11-D11,C15-D15,C19-D19,C23-D23,C27-D27,C31-D31,C35-D35)","v":0},"Sieger",null,{"$f":"INDEX(A42:A49,MATCH(LARGE(B42:B49,1),B42:B49,0))","v":"Kerstin P."},null,{"$f":"G1","v":"Klaus M."},{"$f":"SUM(I11-J11,I15-J15,I19-J19,I23-J23,I27-J27,I31-J31,I35-J35)","v":0},"Sieger",null,{"$f":"INDEX(G42:G49,MATCH(LARGE(H42:H49,1),H42:H49,0))","v":"Klaus M."},null,{"$f":"M1","v":"Dirk N."},{"$f":"SUM(O11-P11,O15-P15,O19-P19,O23-P23,O27-P27,O31-P31,O35-P35)","v":0},"Sieger",null,{"$f":"INDEX(M42:M49,MATCH(LARGE(N42:N49,1),N42:N49,0))","v":"Dirk N."},null,{"$f":"S1","v":"Johannes J."},{"$f":"SUM(U11-V11,U15-V15,U19-V19,U23-V23,U27-V27,U31-V31,U35-V35)","v":0},"Sieger",null,{"$f":"INDEX(S42:S49,MATCH(LARGE(T42:T49,1),T42:T49,0))","v":"Johannes J."}]
["Freilos",{"$f":"SUM(C12-D12,C17-D17,D22-C22,D26-C26,D29-C29,D32-C32,D35-C35)","v":0},"Zweiter",null,{"$f":"INDEX(A42:A49,MATCH(LARGE(B42:B49,2),B42:B49,0))","v":"Kerstin P."},null,"Volker S.",{"$f":"SUM(I12-J12,I17-J17,J22-I22,J26-I26,J29-I29,J32-I32,J35-I35)","v":0},"Zweiter",null,{"$f":"INDEX(G42:G49,MATCH(LARGE(H42:H49,2),H42:H49,0))","v":"Klaus M."},null,"Roswitha N.",{"$f":"SUM(O12-P12,O17-P17,P22-O22,P26-O26,P29-O29,P32-O32,P35-O35)","v":0},"Zweiter",null,{"$f":"INDEX(M42:M49,MATCH(LARGE(N42:N49,2),N42:N49,0))","v":"Dirk N."},null,"Andrea S.",{"$f":"SUM(U12-V12,U17-V17,V22-U22,V26-U26,V29-U29,V32-U32,V35-U35)","v":0},"Zweiter",null,{"$f":"INDEX(S42:S49,MATCH(LARGE(T42:T49,2),T42:T49,0))","v":"Johannes J."}]
["Bennet B.",{"$f":"SUM(C13-D13,C18-D18,D22-C22,D25-C25,D28-C28,D31-C31,C36-D36)","v":0},null,null,{"$f":"INDEX(A42:A49,MATCH(LARGE(B42:B49,3),B42:B49,0))","v":"Kerstin P."},null,"Sasha J.",{"$f":"SUM(I13-J13,I18-J18,J22-I22,J25-I25,J28-I28,J31-I31,I36-J36)","v":0},null,null,{"$f":"INDEX(G42:G49,MATCH(LARGE(H42:H49,3),H42:H49,0))","v":"Klaus M."},null,"Maurice L.",{"$f":"SUM(O13-P13,O18-P18,P22-O22,P25-O25,P28-O28,P31-O31,O36-P36)","v":0},null,null,{"$f":"INDEX(M42:M49,MATCH(LARGE(N42:N49,3),N42:N49,0))","v":"Dirk N."},null,"Daniela E.",{"$f":"SUM(U13-V13,U18-V18,V22-U22,V25-U25,V28-U28,V31-U31,U36-V36)","v":0},null,null,{"$f":"INDEX(S42:S49,MATCH(LARGE(T42:T49,3),T42:T49,0))","v":"Johannes J."}]
["Manni B.",{"$f":"SUM(D14-C14,D18-C18,D21-C21,D24-C24,D27-C27,C32-D32,C37-D37)","v":0},null,null,{"$f":"INDEX(A42:A49,MATCH(LARGE(B42:B49,4),B42:B49,0))","v":"Kerstin P."},null,"Erich",{"$f":"SUM(J14-I14,J18-I18,J21-I21,J24-I24,J27-I27,I32-J32,I37-J37)","v":0},null,null,{"$f":"INDEX(G42:G49,MATCH(LARGE(H42:H49,4),H42:H49,0))","v":"Klaus M."},null,"Stefan E.",{"$f":"SUM(P14-O14,P18-O18,P21-O21,P24-O24,P27-O27,O32-P32,O37-P37)","v":0},null,null,{"$f":"INDEX(M42:M49,MATCH(LARGE(N42:N49,4),N42:N49,0))","v":"Dirk N."},null,"Vincent U.",{"$f":"SUM(V14-U14,V18-U18,V21-U21,V24-U24,V27-U27,U32-V32,U37-V37)","v":0},null,null,{"$f":"INDEX(S42:S49,MATCH(LARGE(T42:T49,4),T42:T49,0))","v":"Johannes J."}]
["Siggi",{"$f":"SUM(D14-C14,D17-C17,D20-C20,D23-C23,C28-D28,C33-D33,C38-D38)","v":0},null,null,{"$f":"INDEX(A42:A49,MATCH(LARGE(B42:B49,5),B42:B49,0))","v":"Kerstin P."},null,"Ralf M.",{"$f":"SUM(J14-I14,J17-I17,J20-I20,J23-I23,I28-J28,I33-J33,I38-J38)","v":0},null,null,{"$f":"INDEX(G42:G49,MATCH(LARGE(H42:H49,5),H42:H49,0))","v":"Klaus M."},null,"Stefan S.",{"$f":"SUM(P14-O14,P17-O17,P20-O20,P23-O23,O28-P28,O33-P33,O38-P38)","v":0},null,null,{"$f":"INDEX(M42:M49,MATCH(LARGE(N42:N49,5),N42:N49,0))","v":"Dirk N."},null,"Frank E.",{"$f":"SUM(V14-U14,V17-U17,V20-U20,V23-U23,U28-V28,U33-V33,U38-V38)","v":0},null,null,{"$f":"INDEX(S42:S49,MATCH(LARGE(T42:T49,5),T42:T49,0))","v":"Johannes J."}]
["Nicole E.",{"$f":"SUM(D13-C13,D16-C16,D19-C19,C24-D24,C29-D29,C34-D34,D38-C38)","v":0},null,null,{"$f":"INDEX(A42:A49,MATCH(LARGE(B42:B49,6),B42:B49,0))","v":"Kerstin P."},null,"Werner E.",{"$f":"SUM(J13-I13,J16-I16,J19-I19,I24-J24,I29-J29,I34-J34,J38-I38)","v":0},null,null,{"$f":"INDEX(G42:G49,MATCH(LARGE(H42:H49,6),H42:H49,0))","v":"Klaus M."},null,"Patrick G.",{"$f":"SUM(P13-O13,P16-O16,P19-O19,O24-P24,O29-P29,O34-P34,P38-O38)","v":0},null,null,{"$f":"INDEX(M42:M49,MATCH(LARGE(N42:N49,6),N42:N49,0))","v":"Dirk N."},null,"Kevin N.",{"$f":"SUM(V13-U13,V16-U16,V19-U19,U24-V24,U29-V29,U34-V34,V38-U38)","v":0},null,null,{"$f":"INDEX(S42:S49,MATCH(LARGE(T42:T49,6),T42:T49,0))","v":"Johannes J."}]
["Nadine D.",{"$f":"SUM(D12-C12,D15-C15,C20-D20,C25-D25,C30-D30,D34-C34,D37-C37)","v":0},null,null,{"$f":"INDEX(A42:A49,MATCH(LARGE(B42:B49,7),B42:B49,0))","v":"Kerstin P."},null,"Anja K.",{"$f":"SUM(J12-I12,J15-I15,I20-J20,I25-J25,I30-J30,J34-I34,J37-I37)","v":0},null,null,{"$f":"INDEX(G42:G49,MATCH(LARGE(H42:H49,7),H42:H49,0))","v":"Klaus M."},null,"Manue R.",{"$f":"SUM(P12-O12,P15-O15,O20-P20,O25-P25,O30-P30,P34-O34,P37-O37)","v":0},null,null,{"$f":"INDEX(M42:M49,MATCH(LARGE(N42:N49,7),N42:N49,0))","v":"Dirk N."},null,"Rene S.",{"$f":"SUM(V12-U12,V15-U15,U20-V20,U25-V25,U30-V30,V34-U34,V37-U37)","v":0},null,null,{"$f":"INDEX(S42:S49,MATCH(LARGE(T42:T49,7),T42:T49,0))","v":"Johannes J."}]
["Lukas R.",{"$f":"SUM(D11-C11,C16-D16,C21-D21,C26-D26,D30-C30,D33-C33,D36-C36)","v":0},null,null,{"$f":"INDEX(A42:A49,MATCH(LARGE(B42:B49,8),B42:B49,0))","v":"Kerstin P."},null,"Sascha D.",{"$f":"SUM(J11-I11,I16-J16,I21-J21,I26-J26,J30-I30,J33-I33,J36-I36)","v":0},null,null,{"$f":"INDEX(G42:G49,MATCH(LARGE(H42:H49,8),H42:H49,0))","v":"Klaus M."},null,"Christian F.",{"$f":"SUM(P11-O11,O16-P16,O21-P21,O26-P26,P30-O30,P33-O33,P36-O36)","v":0},null,null,{"$f":"INDEX(M42:M49,MATCH(LARGE(N42:N49,8),N42:N49,0))","v":"Dirk N."},null,"Phil K.",{"$f":"SUM(V11-U11,U16-V16,U21-V21,U26-V26,V30-U30,V33-U33,V36-U36)","v":0},null,null,{"$f":"INDEX(S42:S49,MATCH(LARGE(T42:T49,8),T42:T49,0))","v":"Johannes J."}]
[{"$f":"A9","v":0}]
[null,{"$f":"SUM(E39)","v":0},null,null,null,null,null,{"$f":"SUM(K39)","v":0},null,null,null,null,null,{"$f":"SUM(Q39)","v":0},null,null,null,null,null,{"$f":"SUM(W39)","v":0}]
["Viertelfinale 1",null,null,null,null,null,"Viertelfinale 2",null,null,null,null,null,"Viertelfinale 3",null,null,null,null,null,"Viertelfinale 3"]
["Sieger Gruppe 1",null,{"$f":"E42","v":"Kerstin P."},null,{"$f":"INDEX(C53:C54,MATCH(LARGE(D53:D54,1),D53:D54,0))","v":{"$error":"#NUM!"}},null,"Sieger Gruppe 3",null,{"$f":"Q42","v":"Dirk N."},null,{"$f":"INDEX(I53:I54,MATCH(LARGE(J53:J54,1),J53:J54,0))","v":{"$error":"#NUM!"}},null,"Sieger Gruppe 2",null,{"$f":"K42","v":"Klaus M."},null,{"$f":"INDEX(O53:O54,MATCH(LARGE(P53:P54,1),P53:P54,0))","v":{"$error":"#NUM!"}},null,"Sieger Gruppe 4",null,{"$f":"W42","v":"Johannes J."},null,{"$f":"INDEX(U53:U54,MATCH(LARGE(V53:V54,1),V53:V54,0))","v":{"$error":"#NUM!"}}]
["Zweiter Gruppe 3",null,{"$f":"Q43","v":"Dirk N."},null,{"$f":"INDEX(C53:C54,MATCH(LARGE(D53:D54,2),D53:D54,0))","v":{"$error":"#NUM!"}},null,"Zweiter Gruppe 1",null,{"$f":"E43","v":"Kerstin P."},null,{"$f":"INDEX(I53:I54,MATCH(LARGE(J53:J54,2),J53:J54,0))","v":{"$error":"#NUM!"}},null,"Zweiter Gruppe 4",null,{"$f":"W43","v":"Johannes J."},null,{"$f":"INDEX(O53:O54,MATCH(LARGE(P53:P54,2),P53:P54,0))","v":{"$error":"#NUM!"}},null,"Zweiter Gruppe 2",null,{"$f":"K43","v":"Klaus M."},null,{"$f":"INDEX(U53:U54,MATCH(LARGE(V53:V54,2),V53:V54,0))","v":{"$error":"#NUM!"}},{"$f":"X38+1/96","v":0.999999999999999},"UHR"]
["Sieger",null,null,null,null,null,"Sieger",null,null,null,null,null,"Sieger",null,null,null,null,null,"Sieger"]
[{"$f":"E53","v":{"$error":"#NUM!"}},null,null,null,null,null,{"$f":"K53","v":{"$error":"#NUM!"}},null,null,null,null,null,{"$f":"O53","v":"Klaus M."},null,null,null,null,null,{"$f":"U53","v":"Johannes J."}]
[null,null,null,{"$f":"SUM(D53:D54)","v":0},{"$f":"SUM(D$57)/2*0.5","v":0},null,null,null,null,{"$f":"SUM(J53:J54)","v":0},{"$f":"SUM(J$57)/2*0.5","v":0},null,null,null,null,{"$f":"SUM(P53:P54)","v":0},{"$f":"SUM(P$57)/2*0.5","v":0},null,null,null,null,{"$f":"SUM(V53:V54)","v":0},{"$f":"SUM(V$57)/2*0.5","v":0}]
[null,null,null,null,{"$f":"SUM(D$57)/2*0.5","v":0},null,null,null,null,null,{"$f":"SUM(J$57)/2*0.5","v":0},null,null,null,null,null,{"$f":"SUM(P$57)/2*0.5","v":0},null,null,null,null,null,{"$f":"SUM(V$57)/2*0.5","v":0}]
["Halbfinale 1",null,null,null,null,null,null,null,null,null,null,null,"Halbfinale 2"]
[null,{"$f":"E53","v":{"$error":"#NUM!"}},null,null,"Sieger:",null,{"$f":"INDEX(B60:B61,MATCH(LARGE(D60:D61,1),D60:D61,0))","v":{"$error":"#NUM!"}},null,null,null,null,null,null,{"$f":"Q53","v":{"$error":"#NUM!"}},null,null,"Sieger:",null,{"$f":"INDEX(N60:N61,MATCH(LARGE(P60:P61,1),P60:P61,0))","v":{"$error":"#NUM!"}},null,null,null,null,{"$f":"X54+1/96","v":1.0104166666666656},"UHR"]
[null,{"$f":"W53","v":{"$error":"#NUM!"}},null,null,"Zweiter:",null,{"$f":"INDEX(B60:B61,MATCH(LARGE(D60:D61,2),D60:D61,0))","v":{"$error":"#NUM!"}},null,null,null,null,null,null,{"$f":"K53","v":{"$error":"#NUM!"}},null,null,"Zweiter:",null,{"$f":"INDEX(N60:N61,MATCH(LARGE(P60:P61,2),P60:P61,0))","v":{"$error":"#NUM!"}}]
[null,null,null,{"$f":"SUM(D60:D61)","v":0},{"$f":"SUM(D62)/2*0.5","v":0},null,null,null,null,null,null,null,null,null,null,null,{"$f":"SUM(P60:P61)","v":0},null,{"$f":"SUM(Q$62)/2*0.5","v":0}]
[null,null,null,{"$f":"SUM(D60:D61)","v":0},{"$f":"SUM(D62)/2*0.5","v":0},null,null,"Spiel um Platz 3",null,null,null,null,null,null,null,null,{"$f":"SUM(P60:P61)","v":0},null,{"$f":"SUM(Q$62)/2*0.5","v":0}]
[]
[null,null,null,null,null,null,null,{"$f":"G61","v":{"$error":"#NUM!"}},null,null,null,null,{"$f":"INDEX(H65:H66,MATCH(LARGE(J65:J66,1),J65:J66,0))","v":{"$error":"#NUM!"}},"Dritter",null,{"$f":"X60+1.35/96","v":1.0244791666666657},null,"UHR"]
[null,null,null,null,null,null,null,{"$f":"S61","v":{"$error":"#NUM!"}},null,null,null,null,{"$f":"INDEX(H65:H66,MATCH(LARGE(J65:J66,2),J65:J66,0))","v":{"$error":"#NUM!"}},"Vierter"]
[null,null,null,null,null,null,null,null,null,{"$f":"SUM(J65:J66)","v":0},{"$f":"SUM(J$67)/2*0.5","v":0}]
[null,null,null,null,null,null,null,null,null,null,{"$f":"SUM(J$67)/2*0.5","v":0}]
[]
[null,null,null,null,null,null,null,"Finale"]
[]
[null,null,null,null,null,null,null,{"$f":"G60","v":{"$error":"#NUM!"}},null,null,null,null,{"$f":"INDEX(H72:H73,MATCH(LARGE(J72:J73,1),J72:J73,0))","v":{"$error":"#NUM!"}},"Sieger",null,{"$f":"X60+1.35/96","v":1.0244791666666657},null,"UHR"]
[null,null,null,null,null,null,null,{"$f":"S60","v":{"$error":"#NUM!"}},null,null,null,null,{"$f":"INDEX(H72:H73,MATCH(LARGE(J72:J73,2),J72:J73,0))","v":{"$error":"#NUM!"}},"Zweiter"]
[null,null,null,null,null,null,null,null,null,{"$f":"SUM(J72:J73)","v":0},{"$f":"SUM(J$74)/2*0.5","v":0}]
[null,null,null,null,null,null,null,null,null,null,{"$f":"SUM(J$74)/2*0.5","v":0}]
["Spielgelder"]
[]
[]
[null,"Vorunde","Viertelfinale 1",null,"Viertelfinale 2",null,"Viertelfinale 3",null,"Viertelfinale 4",null,"Halbfinale 1",null,"Halbfinale 2","Spiel um Platz 3",null,"Finale"]
[{"$f":"A1","v":"Kerstin P."},{"$f":"SUM(B51)/8*0.5","v":0},{"$f":"SUMIF(C$53:C$54,A80,E$57:E$58)","v":0},null,{"$f":"SUMIF(I$53:I$54,A80,K$57:K$58)","v":0},null,{"$f":"SUMIF(O$53:O$54,A80,Q$57:Q$58)","v":0},null,{"$f":"SUMIF(U$53:U$54,A80,W$57:W$58)","v":0},null,{"$f":"SUMIF(B$60:B$61,A80,E$62:E$63)","v":0},null,{"$f":"SUMIF(N$60:N$61,A80,S$62:S$63)","v":0},{"$f":"SUMIF(H$65:H$66,A80,K$67:K$68)","v":0},null,{"$f":"SUMIF(H$72:H$73,A80,K$74:K$75)","v":0},{"$f":"SUM(B80:P80)","v":0},null,{"$f":"ROUNDUP(Q80,0)","v":0}]
["Freilos",{"$f":"SUM(B51)/8*0.5","v":0},{"$f":"SUMIF(C$53:C$54,A81,E$57:E$58)","v":0},null,{"$f":"SUMIF(I$53:I$54,A81,K$57:K$58)","v":0},null,{"$f":"SUMIF(O$53:O$54,A81,Q$57:Q$58)","v":0},null,{"$f":"SUMIF(U$53:U$54,A81,W$57:W$58)","v":0},null,{"$f":"SUMIF(B$60:B$61,A81,E$62:E$63)","v":0},null,{"$f":"SUMIF(N$60:N$61,A81,S$62:S$63)","v":0},{"$f":"SUMIF(H$65:H$66,A81,K$67:K$68)","v":0},null,{"$f":"SUMIF(H$72:H$73,A81,K$74:K$75)","v":0},{"$f":"SUM(B81:P81)","v":0},null,{"$f":"ROUNDUP(Q81,0)","v":0}]
["Bennet B.",{"$f":"SUM(B51)/8*0.5","v":0},0,null,0,null,0,null,0,null,0,null,0,0,null,0,0,null,{"$f":"ROUNDUP(Q82,0)","v":0}]
["Manni B.",{"$f":"SUM(B51)/8*0.5","v":0},0,null,0,null,0,null,0,null,0,null,0,0,null,0,0,null,{"$f":"ROUNDUP(Q83,0)","v":0}]
["Siggi",{"$f":"SUM(B51)/8*0.5","v":0},0,null,0,null,0,null,0,null,0,null,0,0,null,0,0,null,0]
["Nicole E.",{"$f":"SUM(B51)/8*0.5","v":0},0,null,0,null,0,null,0,null,0,null,0,0,null,0,0,null,0]
["Nadine D.",{"$f":"SUM(B51)/8*0.5","v":0},0,null,0,null,0,null,0,null,0,null,0,0,null,0,0,null,0]
["Lukas R.",{"$f":"SUM(B51)/8*0.5","v":0},0,null,0,null,0,null,0,null,0,null,0,0,null,0,0,null,0]
[{"$f":"G1","v":"Klaus M."},{"$f":"SUM(H51/8*0.5)","v":0},0,null,0,null,0,null,0,null,0,null,0,0,null,0,0,null,0]
[{"$f":"G2","v":"Volker S."},{"$f":"SUM(H51/8*0.5)","v":0},0,null,0,null,0,null,0,null,0,null,0,0,null,0,0,null,0]
["Sasha J.",{"$f":"SUM(H51/8*0.5)","v":0},0,null,0,null,0,null,0,null,0,null,0,0,null,0,0,null,0]
["Erich",{"$f":"SUM(H51/8*0.5)","v":0},0,null,0,null,0,null,0,null,0,null,0,0,null,0,0,null,0]
["Ralf M.",{"$f":"SUM(H51/8*0.5)","v":0},0,null,0,null,0,null,0,null,0,null,0,0,null,0,0,null,0]
["Werner E.",{"$f":"SUM(H51/8*0.5)","v":0},0,null,0,null,0,null,0,null,0,null,0,0,null,0,0,null,0]
["Anja K.",{"$f":"SUM(H51/8*0.5)","v":0},0,null,0,null,0,null,0,null,0,null,0,0,null,0,0,null,0]
["Sascha D.",{"$f":"SUM(H51/8*0.5)","v":0},0,null,0,null,0,null,0,null,0,null,0,0,null,0,0,null,0]
[{"$f":"M1","v":"Dirk N."},{"$f":"SUM(N51)/8*0.5","v":0},0,null,0,null,0,null,0,null,0,null,0,0,null,0,0,null,0]
[{"$f":"M2","v":"Roswitha N."},{"$f":"SUM(N51)/8*0.5","v":0},0,null,0,null,0,null,0,null,0,null,0,0,null,0,0,null,0]
["Maurice L.",{"$f":"SUM(N51)/8*0.5","v":0},0,null,0,null,0,null,0,null,0,null,0,0,null,0,0,null,0]
["Stefan E.",{"$f":"SUM(N51)/8*0.5","v":0},0,null,0,null,0,null,0,null,0,null,0,0,null,0,0,null,0]
["Stefan S.",{"$f":"SUM(N51)/8*0.5","v":0},0,null,0,null,0,null,0,null,0,null,0,0,null,0,0,null,0]
["Patrick G.",{"$f":"SUM(N51)/8*0.5","v":0},0,null,0,null,0,null,0,null,0,null,0,0,null,0,0,null,0]
["Manue R.",{"$f":"SUM(N51)/8*0.5","v":0},0,null,0,null,0,null,0,null,0,null,0,0,null,0,0,null,0]
["Christian F.",{"$f":"SUM(N51)/8*0.5","v":0},0,null,0,null,0,null,0,null,0,null,0,0,null,0,0,null,0]
[{"$f":"S1","v":"Johannes J."},{"$f":"SUM(T51)/8*0.5","v":0},0,null,0,null,0,null,0,null,0,null,0,0,null,0,0,null,0]
[{"$f":"S2","v":"Andrea S."},{"$f":"SUM(T51)/8*0.5","v":0},0,null,0,null,0,null,0,null,0,null,0,0,null,0,0,null,0]
["Daniela E.",{"$f":"SUM(T51)/8*0.5","v":0},0,null,0,null,0,null,0,null,0,null,0,0,null,0,0,null,0]
["Vincent U.",{"$f":"SUM(T51)/8*0.5","v":0},0,null,0,null,0,null,0,null,0,null,0,0,null,0,0,null,0]
["Frank E.",{"$f":"SUM(T51)/8*0.5","v":0},0,null,0,null,0,null,0,null,0,null,0,0,null,0,0,null,0]
["Kevin N.",{"$f":"SUM(T51)/8*0.5","v":0},0,null,0,null,0,null,0,null,0,null,0,0,null,0,0,null,0]
["Rene S.",{"$f":"SUM(T51)/8*0.5","v":0},0,null,0,null,0,null,0,null,0,null,0,0,null,0,0,null,0]
["Phil K.",{"$f":"SUM(T51)/8*0.5","v":0},0,null,0,null,0,null,0,null,0,null,0,0,null,{"$f":"SUMIF(H72:H73,A111,K74)","v":0},0,null,0]
[null,null,null,null,null,null,null,null,null,null,null,null,null,null,null,null,{"$f":"SUM(Q80:Q111)","v":0},null,{"$f":"SUM(S80:S111)","v":0}]

{"sheet":"null","index":2,"n_rows":33,"n_cols":1,"rows_kept":33,"cut":false,"hidden":false,"merged":[]}
[]
["Siggi"]
["Manue R."]
["Klaus M."]
["Stefan S."]
["Andrea S."]
["Sasha J."]
["Erich"]
["Anja K."]
["Vincent U."]
["Phil K."]
["Werner E."]
["Frank E."]
["Nicole E."]
["Daniela E."]
["Dirk N."]
["Roswitha N."]
["Kevin N."]
["Ralf M."]
["Kerstin P."]
["Christian F."]
["Volker S."]
["Rene S."]
["Manni B."]
["Lukas R."]
["Bennet B."]
["Maurice L."]
["Johannes J."]
["Patrick G."]
["Stefan E."]
["Sascha D."]
["Nadine D."]
["Freilos"]