{"text_format":"1","workbook":"xlsx","n_sheets":3,"sheets":["Gant_Verfahren","Farben","Farbskala"],"not_rendered":{"charts":0,"images":2,"macros":1,"external_links":0,"defined_names":7,"comments":0,"pivot_tables":0},"unopened":[],"bounds":{"document_bytes":16777216,"sheet_cells":100000,"rows_first":2000,"rows_last":500,"rows_between":2000,"halvings":0,"cell_chars":16384,"cell_head_chars":4096},"cells_cut":0,"cells_raw":0,"read":"whole","date_system":"1900"}

{"sheet":"Gant_Verfahren","index":0,"n_rows":22,"n_cols":460,"rows_kept":22,"cut":false,"hidden":false,"merged":[]}
[]
[null,"Statusübersicht"]
[]
[null,"Datum Betrachtung:",null,"2025-01-22"]
[null,null,null,null,null,null,null,{"$f":"IF(WEEKDAY(H7,11)=7,TEXT(_xlfn.ISOWEEKNUM(H7),\"KW ##\"),\"\")","v":""},"","","",{"$f":"IF(WEEKDAY(L7,11)=7,TEXT(_xlfn.ISOWEEKNUM(L7),\"KW ##\"),\"\")","v":"KW 52"},{"$f":"IF(WEEKDAY(M7,11)=7,TEXT(_xlfn.ISOWEEKNUM(M7),\"KW ##\"),\"\")","v":""},"","","","","",{"$f":"IF(WEEKDAY(S7,11)=7,TEXT(_xlfn.ISOWEEKNUM(S7),\"KW ##\"),\"\")","v":"KW 1"},"","","","","","","KW 2","","","","","","",{"$f":"IF(WEEKDAY(AG7,11)=7,TEXT(_xlfn.ISOWEEKNUM(AG7),\"KW ##\"),\"\")","v":"KW 3"},"","","","","","","KW 4","","","","","","","KW 5","","","","","","","KW 6","","","","","","","KW 7","","","","","","","KW 8","","","","","","","KW 9","",{"$f":"IF(WEEKDAY(BY7,11)=7,TEXT(_xlfn.ISOWEEKNUM(BY7),\"KW ##\"),\"\")","v":""},"","","","","KW 10","","","","","","","KW 11","","","","","","","KW 12","","","","","","","KW 13","","","","","","","KW 14","","","","","","","KW 15","","","","","","","KW 16","","","","","","","KW 17","","","","","","","KW 18","","",{"$f":"IF(WEEKDAY(EK7,11)=7,TEXT(_xlfn.ISOWEEKNUM(EK7),\"KW ##\"),\"\")","v":""},"","","","KW 19","","","","","","","KW 20","","","","","","","KW 21","","","","","","","KW 22","","","","","","","KW 23","","","","","","","KW 24","","","","","","","KW 25","","","","","","","KW 26","","","","","","","KW 27","","","",{"$f":"IF(WEEKDAY(GW7,11)=7,TEXT(_xlfn.ISOWEEKNUM(GW7),\"KW ##\"),\"\")","v":""},"","","KW 28","","","","","","","KW 29","","","","","","","KW 30","","","","","","","KW 31","","","","","","","KW 32","","","","","","","KW 33","","","","","","","KW 34","","","","","","","KW 35","","","","","","","KW 36","","","","",{"$f":"IF(WEEKDAY(JI7,11)=7,TEXT(_xlfn.ISOWEEKNUM(JI7),\"KW ##\"),\"\")","v":""},"","KW 37","","","","","","","KW 38","","","","","","","KW 39","","","","","","","KW 40","","","","","","","KW 41","","","","","","","KW 42","","","","","","","KW 43","","","","","","","KW 44","","","","","","","KW 45","","","","","",{"$f":"IF(WEEKDAY(LU7,11)=7,TEXT(_xlfn.ISOWEEKNUM(LU7),\"KW ##\"),\"\")","v":""},"KW 46","","","","","","","KW 47","","","","","","","KW 48","","","","","","","KW 49","","","","","","","KW 50","","","","","","","KW 51","","","","","","","KW 52","","","","","","","KW 1","","","","","","","KW 2","","","","","","",{"$f":"IF(WEEKDAY(OG7,11)=7,TEXT(_xlfn.ISOWEEKNUM(OG7),\"KW ##\"),\"\")","v":"KW 3"},"","","","","","","KW 4","","",{"$f":"CONCATENATE(\"KW \",_xlfn.ISOWEEKNUM(OQ7))","v":"KW 5"},"KW 5","KW 5","KW 5","KW 5","KW 6","KW 6","KW 6","KW 6","KW 6","KW 6","KW 6","KW 7","KW 7","KW 7","KW 7","KW 7","KW 7","KW 7","KW 8","KW 8","KW 8","KW 8","KW 8","KW 8","KW 8","KW 9","KW 9","KW 9","KW 9","KW 9","KW 9","KW 9","KW 10","KW 10","KW 10","KW 10","KW 10","KW 10","KW 10","KW 11","KW 11","KW 11","KW 11","KW 11","KW 11","KW 11","KW 12","KW 12","KW 12",{"$f":"CONCATENATE(\"KW \",_xlfn.ISOWEEKNUM(QO7))","v":"KW 12"},"KW 12","KW 12","KW 12"]
[null,null,null,null,null,null,null,{"$f":"H7","v":"2024-12-25"},{"$f":"I7","v":"2024-12-26"},"2024-12-27","2024-12-28","2024-12-29","2024-12-30","2024-12-31","2025-01-01","2025-01-02","2025-01-03","2025-01-04","2025-01-05","2025-01-06","2025-01-07","2025-01-08",{"$f":"W7","v":"2025-01-09"},{"$f":"X7","v":"2025-01-10"},{"$f":"Y7","v":"2025-01-11"},{"$f":"Z7","v":"2025-01-12"},{"$f":"AA7","v":"2025-01-13"},{"$f":"AB7","v":"2025-01-14"},{"$f":"AC7","v":"2025-01-15"},{"$f":"AD7","v":"2025-01-16"},{"$f":"AE7","v":"2025-01-17"},{"$f":"AF7","v":"2025-01-18"},{"$f":"AG7","v":"2025-01-19"},{"$f":"AH7","v":"2025-01-20"},{"$f":"AI7","v":"2025-01-21"},"2025-01-22",{"$f":"AK7","v":"2025-01-23"},{"$f":"AL7","v":"2025-01-24"},{"$f":"AM7","v":"2025-01-25"},{"$f":"AN7","v":"2025-01-26"},{"$f":"AO7","v":"2025-01-27"},{"$f":"AP7","v":"2025-01-28"},{"$f":"AQ7","v":"2025-01-29"},{"$f":"AR7","v":"2025-01-30"},{"$f":"AS7","v":"2025-01-31"},{"$f":"AT7","v":"2025-02-01"},{"$f":"AU7","v":"2025-02-02"},{"$f":"AV7","v":"2025-02-03"},{"$f":"AW7","v":"2025-02-04"},"2025-02-05",{"$f":"AY7","v":"2025-02-06"},{"$f":"AZ7","v":"2025-02-07"},{"$f":"BA7","v":"2025-02-08"},{"$f":"BB7","v":"2025-02-09"},{"$f":"BC7","v":"2025-02-10"},{"$f":"BD7","v":"2025-02-11"},{"$f":"BE7","v":"2025-02-12"},{"$f":"BF7","v":"2025-02-13"},{"$f":"BG7","v":"2025-02-14"},{"$f":"BH7","v":"2025-02-15"},{"$f":"BI7","v":"2025-02-16"},{"$f":"BJ7","v":"2025-02-17"},{"$f":"BK7","v":"2025-02-18"},"2025-02-19",{"$f":"BM7","v":"2025-02-20"},{"$f":"BN7","v":"2025-02-21"},{"$f":"BO7","v":"2025-02-22"},{"$f":"BP7","v":"2025-02-23"},{"$f":"BQ7","v":"2025-02-24"},{"$f":"BR7","v":"2025-02-25"},{"$f":"BS7","v":"2025-02-26"},{"$f":"BT7","v":"2025-02-27"},{"$f":"BU7","v":"2025-02-28"},{"$f":"BV7","v":"2025-03-01"},{"$f":"BW7","v":"2025-03-02"},{"$f":"BX7","v":"2025-03-03"},{"$f":"BY7","v":"2025-03-04"},"2025-03-05",{"$f":"CA7","v":"2025-03-06"},{"$f":"CB7","v":"2025-03-07"},{"$f":"CC7","v":"2025-03-08"},{"$f":"CD7","v":"2025-03-09"},{"$f":"CE7","v":"2025-03-10"},{"$f":"CF7","v":"2025-03-11"},{"$f":"CG7","v":"2025-03-12"},{"$f":"CH7","v":"2025-03-13"},{"$f":"CI7","v":"2025-03-14"},{"$f":"CJ7","v":"2025-03-15"},{"$f":"CK7","v":"2025-03-16"},{"$f":"CL7","v":"2025-03-17"},{"$f":"CM7","v":"2025-03-18"},"2025-03-19",{"$f":"CO7","v":"2025-03-20"},{"$f":"CP7","v":"2025-03-21"},{"$f":"CQ7","v":"2025-03-22"},{"$f":"CR7","v":"2025-03-23"},{"$f":"CS7","v":"2025-03-24"},{"$f":"CT7","v":"2025-03-25"},{"$f":"CU7","v":"2025-03-26"},{"$f":"CV7","v":"2025-03-27"},{"$f":"CW7","v":"2025-03-28"},{"$f":"CX7","v":"2025-03-29"},{"$f":"CY7","v":"2025-03-30"},{"$f":"CZ7","v":"2025-03-31"},{"$f":"DA7","v":"2025-04-01"},"2025-04-02",{"$f":"DC7","v":"2025-04-03"},{"$f":"DD7","v":"2025-04-04"},{"$f":"DE7","v":"2025-04-05"},{"$f":"DF7","v":"2025-04-06"},{"$f":"DG7","v":"2025-04-07"},{"$f":"DH7","v":"2025-04-08"},{"$f":"DI7","v":"2025-04-09"},{"$f":"DJ7","v":"2025-04-10"},{"$f":"DK7","v":"2025-04-11"},{"$f":"DL7","v":"2025-04-12"},{"$f":"DM7","v":"2025-04-13"},{"$f":"DN7","v":"2025-04-14"},{"$f":"DO7","v":"2025-04-15"},"2025-04-16",{"$f":"DQ7","v":"2025-04-17"},{"$f":"DR7","v":"2025-04-18"},{"$f":"DS7","v":"2025-04-19"},{"$f":"DT7","v":"2025-04-20"},{"$f":"DU7","v":"2025-04-21"},{"$f":"DV7","v":"2025-04-22"},{"$f":"DW7","v":"2025-04-23"},{"$f":"DX7","v":"2025-04-24"},{"$f":"DY7","v":"2025-04-25"},{"$f":"DZ7","v":"2025-04-26"},{"$f":"EA7","v":"2025-04-27"},{"$f":"EB7","v":"2025-04-28"},{"$f":"EC7","v":"2025-04-29"},"2025-04-30",{"$f":"EE7","v":"2025-05-01"},{"$f":"EF7","v":"2025-05-02"},{"$f":"EG7","v":"2025-05-03"},{"$f":"EH7","v":"2025-05-04"},{"$f":"EI7","v":"2025-05-05"},{"$f":"EJ7","v":"2025-05-06"},{"$f":"EK7","v":"2025-05-07"},{"$f":"EL7","v":"2025-05-08"},{"$f":"EM7","v":"2025-05-09"},{"$f":"EN7","v":"2025-05-10"},{"$f":"EO7","v":"2025-05-11"},{"$f":"EP7","v":"2025-05-12"},{"$f":"EQ7","v":"2025-05-13"},"2025-05-14",{"$f":"ES7","v":"2025-05-15"},{"$f":"ET7","v":"2025-05-16"},{"$f":"EU7","v":"2025-05-17"},{"$f":"EV7","v":"2025-05-18"},{"$f":"EW7","v":"2025-05-19"},{"$f":"EX7","v":"2025-05-20"},{"$f":"EY7","v":"2025-05-21"},{"$f":"EZ7","v":"2025-05-22"},{"$f":"FA7","v":"2025-05-23"},{"$f":"FB7","v":"2025-05-24"},{"$f":"FC7","v":"2025-05-25"},{"$f":"FD7","v":"2025-05-26"},{"$f":"FE7","v":"2025-05-27"},"2025-05-28",{"$f":"FG7","v":"2025-05-29"},{"$f":"FH7","v":"2025-05-30"},{"$f":"FI7","v":"2025-05-31"},{"$f":"FJ7","v":"2025-06-01"},{"$f":"FK7","v":"2025-06-02"},{"$f":"FL7","v":"2025-06-03"},{"$f":"FM7","v":"2025-06-04"},{"$f":"FN7","v":"2025-06-05"},{"$f":"FO7","v":"2025-06-06"},{"$f":"FP7","v":"2025-06-07"},{"$f":"FQ7","v":"2025-06-08"},{"$f":"FR7","v":"2025-06-09"},{"$f":"FS7","v":"2025-06-10"},"2025-06-11",{"$f":"FU7","v":"2025-06-12"},{"$f":"FV7","v":"2025-06-13"},{"$f":"FW7","v":"2025-06-14"},{"$f":"FX7","v":"2025-06-15"},{"$f":"FY7","v":"2025-06-16"},{"$f":"FZ7","v":"2025-06-17"},{"$f":"GA7","v":"2025-06-18"},{"$f":"GB7","v":"2025-06-19"},{"$f":"GC7","v":"2025-06-20"},{"$f":"GD7","v":"2025-06-21"},{"$f":"GE7","v":"2025-06-22"},{"$f":"GF7","v":"2025-06-23"},{"$f":"GG7","v":"2025-06-24"},"2025-06-25",{"$f":"GI7","v":"2025-06-26"},{"$f":"GJ7","v":"2025-06-27"},{"$f":"GK7","v":"2025-06-28"},{"$f":"GL7","v":"2025-06-29"},{"$f":"GM7","v":"2025-06-30"},{"$f":"GN7","v":"2025-07-01"},{"$f":"GO7","v":"2025-07-02"},{"$f":"GP7","v":"2025-07-03"},{"$f":"GQ7","v":"2025-07-04"},{"$f":"GR7","v":"2025-07-05"},{"$f":"GS7","v":"2025-07-06"},{"$f":"GT7","v":"2025-07-07"},{"$f":"GU7","v":"2025-07-08"},"2025-07-09",{"$f":"GW7","v":"2025-07-10"},{"$f":"GX7","v":"2025-07-11"},{"$f":"GY7","v":"2025-07-12"},{"$f":"GZ7","v":"2025-07-13"},{"$f":"HA7","v":"2025-07-14"},{"$f":"HB7","v":"2025-07-15"},{"$f":"HC7","v":"2025-07-16"},{"$f":"HD7","v":"2025-07-17"},{"$f":"HE7","v":"2025-07-18"},{"$f":"HF7","v":"2025-07-19"},{"$f":"HG7","v":"2025-07-20"},{"$f":"HH7","v":"2025-07-21"},{"$f":"HI7","v":"2025-07-22"},"2025-07-23",{"$f":"HK7","v":"2025-07-24"},{"$f":"HL7","v":"2025-07-25"},{"$f":"HM7","v":"2025-07-26"},{"$f":"HN7","v":"2025-07-27"},{"$f":"HO7","v":"2025-07-28"},{"$f":"HP7","v":"2025-07-29"},{"$f":"HQ7","v":"2025-07-30"},{"$f":"HR7","v":"2025-07-31"},{"$f":"HS7","v":"2025-08-01"},{"$f":"HT7","v":"2025-08-02"},{"$f":"HU7","v":"2025-08-03"},{"$f":"HV7","v":"2025-08-04"},{"$f":"HW7","v":"2025-08-05"},"2025-08-06",{"$f":"HY7","v":"2025-08-07"},{"$f":"HZ7","v":"2025-08-08"},{"$f":"IA7","v":"2025-08-09"},{"$f":"IB7","v":"2025-08-10"},{"$f":"IC7","v":"2025-08-11"},{"$f":"ID7","v":"2025-08-12"},{"$f":"IE7","v":"2025-08-13"},{"$f":"IF7","v":"2025-08-14"},{"$f":"IG7","v":"2025-08-15"},{"$f":"IH7","v":"2025-08-16"},{"$f":"II7","v":"2025-08-17"},{"$f":"IJ7","v":"2025-08-18"},{"$f":"IK7","v":"2025-08-19"},"2025-08-20",{"$f":"IM7","v":"2025-08-21"},{"$f":"IN7","v":"2025-08-22"},{"$f":"IO7","v":"2025-08-23"},{"$f":"IP7","v":"2025-08-24"},{"$f":"IQ7","v":"2025-08-25"},{"$f":"IR7","v":"2025-08-26"},{"$f":"IS7","v":"2025-08-27"},{"$f":"IT7","v":"2025-08-28"},{"$f":"IU7","v":"2025-08-29"},{"$f":"IV7","v":"2025-08-30"},{"$f":"IW7","v":"2025-08-31"},{"$f":"IX7","v":"2025-09-01"},{"$f":"IY7","v":"2025-09-02"},"2025-09-03",{"$f":"JA7","v":"2025-09-04"},{"$f":"JB7","v":"2025-09-05"},{"$f":"JC7","v":"2025-09-06"},{"$f":"JD7","v":"2025-09-07"},{"$f":"JE7","v":"2025-09-08"},{"$f":"JF7","v":"2025-09-09"},{"$f":"JG7","v":"2025-09-10"},{"$f":"JH7","v":"2025-09-11"},{"$f":"JI7","v":"2025-09-12"},{"$f":"JJ7","v":"2025-09-13"},{"$f":"JK7","v":"2025-09-14"},{"$f":"JL7","v":"2025-09-15"},{"$f":"JM7","v":"2025-09-16"},"2025-09-17",{"$f":"JO7","v":"2025-09-18"},{"$f":"JP7","v":"2025-09-19"},{"$f":"JQ7","v":"2025-09-20"},{"$f":"JR7","v":"2025-09-21"},{"$f":"JS7","v":"2025-09-22"},{"$f":"JT7","v":"2025-09-23"},{"$f":"JU7","v":"2025-09-24"},{"$f":"JV7","v":"2025-09-25"},{"$f":"JW7","v":"2025-09-26"},{"$f":"JX7","v":"2025-09-27"},{"$f":"JY7","v":"2025-09-28"},{"$f":"JZ7","v":"2025-09-29"},{"$f":"KA7","v":"2025-09-30"},"2025-10-01",{"$f":"KC7","v":"2025-10-02"},{"$f":"KD7","v":"2025-10-03"},{"$f":"KE7","v":"2025-10-04"},{"$f":"KF7","v":"2025-10-05"},{"$f":"KG7","v":"2025-10-06"},{"$f":"KH7","v":"2025-10-07"},{"$f":"KI7","v":"2025-10-08"},{"$f":"KJ7","v":"2025-10-09"},{"$f":"KK7","v":"2025-10-10"},{"$f":"KL7","v":"2025-10-11"},{"$f":"KM7","v":"2025-10-12"},{"$f":"KN7","v":"2025-10-13"},{"$f":"KO7","v":"2025-10-14"},"2025-10-15",{"$f":"KQ7","v":"2025-10-16"},{"$f":"KR7","v":"2025-10-17"},{"$f":"KS7","v":"2025-10-18"},{"$f":"KT7","v":"2025-10-19"},{"$f":"KU7","v":"2025-10-20"},{"$f":"KV7","v":"2025-10-21"},{"$f":"KW7","v":"2025-10-22"},{"$f":"KX7","v":"2025-10-23"},{"$f":"KY7","v":"2025-10-24"},{"$f":"KZ7","v":"2025-10-25"},{"$f":"LA7","v":"2025-10-26"},{"$f":"LB7","v":"2025-10-27"},{"$f":"LC7","v":"2025-10-28"},"2025-10-29",{"$f":"LE7","v":"2025-10-30"},{"$f":"LF7","v":"2025-10-31"},{"$f":"LG7","v":"2025-11-01"},{"$f":"LH7","v":"2025-11-02"},{"$f":"LI7","v":"2025-11-03"},{"$f":"LJ7","v":"2025-11-04"},{"$f":"LK7","v":"2025-11-05"},{"$f":"LL7","v":"2025-11-06"},{"$f":"LM7","v":"2025-11-07"},{"$f":"LN7","v":"2025-11-08"},{"$f":"LO7","v":"2025-11-09"},{"$f":"LP7","v":"2025-11-10"},{"$f":"LQ7","v":"2025-11-11"},"2025-11-12",{"$f":"LS7","v":"2025-11-13"},{"$f":"LT7","v":"2025-11-14"},{"$f":"LU7","v":"2025-11-15"},{"$f":"LV7","v":"2025-11-16"},{"$f":"LW7","v":"2025-11-17"},{"$f":"LX7","v":"2025-11-18"},{"$f":"LY7","v":"2025-11-19"},{"$f":"LZ7","v":"2025-11-20"},{"$f":"MA7","v":"2025-11-21"},{"$f":"MB7","v":"2025-11-22"},{"$f":"MC7","v":"2025-11-23"},{"$f":"MD7","v":"2025-11-24"},{"$f":"ME7","v":"2025-11-25"},"2025-11-26",{"$f":"MG7","v":"2025-11-27"},{"$f":"MH7","v":"2025-11-28"},{"$f":"MI7","v":"2025-11-29"},{"$f":"MJ7","v":"2025-11-30"},{"$f":"MK7","v":"2025-12-01"},{"$f":"ML7","v":"2025-12-02"},{"$f":"MM7","v":"2025-12-03"},{"$f":"MN7","v":"2025-12-04"},{"$f":"MO7","v":"2025-12-05"},{"$f":"MP7","v":"2025-12-06"},{"$f":"MQ7","v":"2025-12-07"},{"$f":"MR7","v":"2025-12-08"},{"$f":"MS7","v":"2025-12-09"},"2025-12-10",{"$f":"MU7","v":"2025-12-11"},{"$f":"MV7","v":"2025-12-12"},{"$f":"MW7","v":"2025-12-13"},{"$f":"MX7","v":"2025-12-14"},{"$f":"MY7","v":"2025-12-15"},{"$f":"MZ7","v":"2025-12-16"},{"$f":"NA7","v":"2025-12-17"},{"$f":"NB7","v":"2025-12-18"},{"$f":"NC7","v":"2025-12-19"},{"$f":"ND7","v":"2025-12-20"},{"$f":"NE7","v":"2025-12-21"},{"$f":"NF7","v":"2025-12-22"},{"$f":"NG7","v":"2025-12-23"},"2025-12-24",{"$f":"NI7","v":"2025-12-25"},{"$f":"NJ7","v":"2025-12-26"},{"$f":"NK7","v":"2025-12-27"},{"$f":"NL7","v":"2025-12-28"},{"$f":"NM7","v":"2025-12-29"},{"$f":"NN7","v":"2025-12-30"},{"$f":"NO7","v":"2025-12-31"},{"$f":"NP7","v":"2026-01-01"},{"$f":"NQ7","v":"2026-01-02"},{"$f":"NR7","v":"2026-01-03"},{"$f":"NS7","v":"2026-01-04"},{"$f":"NT7","v":"2026-01-05"},{"$f":"NU7","v":"2026-01-06"},"2026-01-07",{"$f":"NW7","v":"2026-01-08"},{"$f":"NX7","v":"2026-01-09"},{"$f":"NY7","v":"2026-01-10"},{"$f":"NZ7","v":"2026-01-11"},{"$f":"OA7","v":"2026-01-12"},{"$f":"OB7","v":"2026-01-13"},{"$f":"OC7","v":"2026-01-14"},{"$f":"OD7","v":"2026-01-15"},{"$f":"OE7","v":"2026-01-16"},{"$f":"OF7","v":"2026-01-17"},{"$f":"OG7","v":"2026-01-18"},{"$f":"OH7","v":"2026-01-19"},{"$f":"OI7","v":"2026-01-20"},"2026-01-21",{"$f":"OK7","v":"2026-01-22"},{"$f":"OL7","v":"2026-01-23"},{"$f":"OM7","v":"2026-01-24"},{"$f":"ON7","v":"2026-01-25"},{"$f":"OO7","v":"2026-01-26"},{"$f":"OP7","v":"2026-01-27"},{"$f":"OQ7","v":"2026-01-28"},{"$f":"OR7","v":"2026-01-29"},{"$f":"OS7","v":"2026-01-30"},{"$f":"OT7","v":"2026-01-31"},{"$f":"OU7","v":"2026-02-01"},{"$f":"OV7","v":"2026-02-02"},{"$f":"OW7","v":"2026-02-03"},"2026-02-04",{"$f":"OY7","v":"2026-02-05"},{"$f":"OZ7","v":"2026-02-06"},{"$f":"PA7","v":"2026-02-07"},{"$f":"PB7","v":"2026-02-08"},{"$f":"PC7","v":"2026-02-09"},{"$f":"PD7","v":"2026-02-10"},{"$f":"PE7","v":"2026-02-11"},{"$f":"PF7","v":"2026-02-12"},{"$f":"PG7","v":"2026-02-13"},{"$f":"PH7","v":"2026-02-14"},{"$f":"PI7","v":"2026-02-15"},{"$f":"PJ7","v":"2026-02-16"},{"$f":"PK7","v":"2026-02-17"},"2026-02-18",{"$f":"PM7","v":"2026-02-19"},{"$f":"PN7","v":"2026-02-20"},{"$f":"PO7","v":"2026-02-21"},{"$f":"PP7","v":"2026-02-22"},{"$f":"PQ7","v":"2026-02-23"},{"$f":"PR7","v":"2026-02-24"},{"$f":"PS7","v":"2026-02-25"},{"$f":"PT7","v":"2026-02-26"},{"$f":"PU7","v":"2026-02-27"},{"$f":"PV7","v":"2026-02-28"},{"$f":"PW7","v":"2026-03-01"},{"$f":"PX7","v":"2026-03-02"},{"$f":"PY7","v":"2026-03-03"},"2026-03-04",{"$f":"QA7","v":"2026-03-05"},{"$f":"QB7","v":"2026-03-06"},{"$f":"QC7","v":"2026-03-07"},{"$f":"QD7","v":"2026-03-08"},{"$f":"QE7","v":"2026-03-09"},{"$f":"QF7","v":"2026-03-10"},{"$f":"QG7","v":"2026-03-11"},{"$f":"QH7","v":"2026-03-12"},{"$f":"QI7","v":"2026-03-13"},{"$f":"QJ7","v":"2026-03-14"},{"$f":"QK7","v":"2026-03-15"},{"$f":"QL7","v":"2026-03-16"},{"$f":"QM7","v":"2026-03-17"},"2026-03-18",{"$f":"QO7","v":"2026-03-19"},{"$f":"QP7","v":"2026-03-20"},{"$f":"QQ7","v":"2026-03-21"},{"$f":"QR7","v":"2026-03-22"}]
[null,null,null,null,null,null,null,{"$f":"I7-1","v":"2024-12-25"},"2024-12-26","2024-12-27","2024-12-28","2024-12-29","2024-12-30","2024-12-31","2025-01-01","2025-01-02","2025-01-03","2025-01-04","2025-01-05","2025-01-06","2025-01-07","2025-01-08","2025-01-09","2025-01-10","2025-01-11","2025-01-12","2025-01-13","2025-01-14","2025-01-15","2025-01-16","2025-01-17","2025-01-18","2025-01-19","2025-01-20",{"$f":"AJ7-1","v":"2025-01-21"},{"$f":"D4","v":"2025-01-22"},{"$f":"AJ7+1","v":"2025-01-23"},{"$f":"AK7+1","v":"2025-01-24"},"2025-01-25","2025-01-26","2025-01-27","2025-01-28","2025-01-29","2025-01-30","2025-01-31","2025-02-01","2025-02-02","2025-02-03","2025-02-04",{"$f":"AW7+1","v":"2025-02-05"},"2025-02-06","2025-02-07","2025-02-08","2025-02-09","2025-02-10","2025-02-11","2025-02-12","2025-02-13","2025-02-14","2025-02-15","2025-02-16","2025-02-17","2025-02-18",{"$f":"BK7+1","v":"2025-02-19"},"2025-02-20","2025-02-21","2025-02-22","2025-02-23","2025-02-24","2025-02-25","2025-02-26","2025-02-27","2025-02-28","2025-03-01","2025-03-02","2025-03-03","2025-03-04","2025-03-05","2025-03-06","2025-03-07","2025-03-08","2025-03-09","2025-03-10","2025-03-11","2025-03-12","2025-03-13","2025-03-14","2025-03-15","2025-03-16","2025-03-17","2025-03-18",{"$f":"CM7+1","v":"2025-03-19"},"2025-03-20","2025-03-21","2025-03-22","2025-03-23","2025-03-24","2025-03-25","2025-03-26","2025-03-27","2025-03-28","2025-03-29","2025-03-30","2025-03-31","2025-04-01","2025-04-02","2025-04-03","2025-04-04","2025-04-05","2025-04-06","2025-04-07","2025-04-08","2025-04-09","2025-04-10","2025-04-11","2025-04-12","2025-04-13","2025-04-14","2025-04-15","2025-04-16","2025-04-17","2025-04-18","2025-04-19","2025-04-20","2025-04-21","2025-04-22","2025-04-23","2025-04-24","2025-04-25","2025-04-26","2025-04-27","2025-04-28","2025-04-29","2025-04-30","2025-05-01","2025-05-02","2025-05-03","2025-05-04","2025-05-05","2025-05-06","2025-05-07","2025-05-08","2025-05-09","2025-05-10","2025-05-11","2025-05-12","2025-05-13","2025-05-14","2025-05-15","2025-05-16","2025-05-17","2025-05-18","2025-05-19","2025-05-20","2025-05-21",{"$f":"EY7+1","v":"2025-05-22"},"2025-05-23","2025-05-24","2025-05-25","2025-05-26","2025-05-27","2025-05-28","2025-05-29","2025-05-30","2025-05-31","2025-06-01","2025-06-02","2025-06-03","2025-06-04","2025-06-05","2025-06-06","2025-06-07","2025-06-08","2025-06-09","2025-06-10","2025-06-11","2025-06-12","2025-06-13","2025-06-14","2025-06-15","2025-06-16","2025-06-17","2025-06-18","2025-06-19","2025-06-20","2025-06-21","2025-06-22","2025-06-23","2025-06-24","2025-06-25","2025-06-26","2025-06-27","2025-06-28","2025-06-29","2025-06-30","2025-07-01","2025-07-02","2025-07-03","2025-07-04","2025-07-05","2025-07-06","2025-07-07","2025-07-08","2025-07-09","2025-07-10","2025-07-11","2025-07-12","2025-07-13","2025-07-14","2025-07-15","2025-07-16","2025-07-17","2025-07-18","2025-07-19","2025-07-20","2025-07-21","2025-07-22","2025-07-23","2025-07-24",{"$f":"HK7+1","v":"2025-07-25"},"2025-07-26","2025-07-27","2025-07-28","2025-07-29","2025-07-30","2025-07-31","2025-08-01","2025-08-02","2025-08-03","2025-08-04","2025-08-05","2025-08-06","2025-08-07","2025-08-08","2025-08-09","2025-08-10","2025-08-11","2025-08-12","2025-08-13","2025-08-14","2025-08-15","2025-08-16","2025-08-17","2025-08-18","2025-08-19","2025-08-20","2025-08-21","2025-08-22","2025-08-23","2025-08-24","2025-08-25","2025-08-26","2025-08-27","2025-08-28","2025-08-29","2025-08-30","2025-08-31","2025-09-01","2025-09-02","2025-09-03","2025-09-04","2025-09-05","2025-09-06","2025-09-07","2025-09-08","2025-09-09","2025-09-10","2025-09-11","2025-09-12","2025-09-13","2025-09-14","2025-09-15","2025-09-16","2025-09-17","2025-09-18","2025-09-19","2025-09-20","2025-09-21","2025-09-22","2025-09-23","2025-09-24","2025-09-25","2025-09-26",{"$f":"JW7+1","v":"2025-09-27"},"2025-09-28","2025-09-29","2025-09-30","2025-10-01","2025-10-02","2025-10-03","2025-10-04","2025-10-05","2025-10-06","2025-10-07","2025-10-08","2025-10-09","2025-10-10","2025-10-11","2025-10-12","2025-10-13","2025-10-14","2025-10-15","2025-10-16","2025-10-17","2025-10-18","2025-10-19","2025-10-20","2025-10-21","2025-10-22","2025-10-23","2025-10-24","2025-10-25","2025-10-26","2025-10-27","2025-10-28","2025-10-29","2025-10-30","2025-10-31","2025-11-01","2025-11-02","2025-11-03","2025-11-04","2025-11-05","2025-11-06","2025-11-07","2025-11-08","2025-11-09","2025-11-10","2025-11-11","2025-11-12","2025-11-13","2025-11-14","2025-11-15","2025-11-16","2025-11-17","2025-11-18","2025-11-19","2025-11-20","2025-11-21","2025-11-22","2025-11-23","2025-11-24","2025-11-25","2025-11-26","2025-11-27","2025-11-28","2025-11-29",{"$f":"MI7+1","v":"2025-11-30"},"2025-12-01","2025-12-02","2025-12-03","2025-12-04","2025-12-05","2025-12-06","2025-12-07","2025-12-08","2025-12-09","2025-12-10","2025-12-11","2025-12-12","2025-12-13","2025-12-14","2025-12-15","2025-12-16","2025-12-17","2025-12-18","2025-12-19","2025-12-20","2025-12-21","2025-12-22","2025-12-23","2025-12-24","2025-12-25","2025-12-26","2025-12-27","2025-12-28","2025-12-29","2025-12-30","2025-12-31","2026-01-01","2026-01-02","2026-01-03","2026-01-04","2026-01-05","2026-01-06","2026-01-07","2026-01-08","2026-01-09","2026-01-10","2026-01-11","2026-01-12","2026-01-13","2026-01-14","2026-01-15","2026-01-16","2026-01-17","2026-01-18","2026-01-19","2026-01-20","2026-01-21","2026-01-22","2026-01-23","2026-01-24","2026-01-25","2026-01-26","2026-01-27","2026-01-28","2026-01-29","2026-01-30","2026-01-31","2026-02-01",{"$f":"OU7+1","v":"2026-02-02"},"2026-02-03","2026-02-04","2026-02-05","2026-02-06","2026-02-07","2026-02-08","2026-02-09","2026-02-10","2026-02-11","2026-02-12","2026-02-13","2026-02-14","2026-02-15","2026-02-16","2026-02-17","2026-02-18","2026-02-19","2026-02-20","2026-02-21","2026-02-22","2026-02-23","2026-02-24","2026-02-25","2026-02-26","2026-02-27","2026-02-28","2026-03-01","2026-03-02","2026-03-03","2026-03-04","2026-03-05","2026-03-06","2026-03-07","2026-03-08","2026-03-09","2026-03-10","2026-03-11","2026-03-12","2026-03-13","2026-03-14","2026-03-15","2026-03-16","2026-03-17","2026-03-18","2026-03-19","2026-03-20","2026-03-21","2026-03-22"]
[null,"Bezirk","Mitarbeiter","Phase","Start","Ende","Dauer"]
[null,"A","Hans","Phase 1","2025-01-01","2025-01-31"]
[null,"A","Hans","Phase 2","2025-02-01","2025-02-28"]
[null,"A","Hans","Phase 3","2025-03-01","2025-03-31"]
[null,"A","Hans","Phase 4","2025-04-01","2025-05-31"]
[null,"B","Wilhelm","Phase 1","2025-02-01","2025-11-30"]
[null,"B","Wilhelm","Phase 2","2025-12-01","2026-09-30"]
[null,"B","Wilhelm","Phase 3","2026-10-01","2026-11-30"]
[null,"A","Erna","Phase 4","2025-01-01","2025-07-30"]
[null,"A","Erna","Phase 5","2025-08-01","2026-04-30"]
[null,"C","Friedrich","Phase 1","2025-02-16","2025-03-16"]
[null,"C","Friedrich","Phase 2","2025-03-17","2025-09-15"]
[null,"C","Friedrich","Phase 3","2025-09-16","2025-09-30"]
[null,"C","Friedrich","Phase 4","2025-10-01","2026-08-31"]
[null,null,null,"Phase 4","2025-03-01","2025-03-28"]

{"sheet":"Farben","index":1,"n_rows":5,"n_cols":6,"rows_kept":5,"cut":false,"hidden":false,"merged":[]}
["Phase","Bezeichnung","Color","TintAndShade","PatternTintAndShade","Formel bedingte Formatierung"]
["Phase 1","Rot",{"$f":"VLOOKUP(B2,Farbskala!$A$2:$B$12,2,FALSE)","v":255},0,0,"UND(H$7>=$E9;H$7<=$F9;$D9=Farben!$A$2)"]
["Phase 2","Pink",{"$f":"VLOOKUP(B3,Farbskala!$A$2:$B$12,2,FALSE)","v":16711935},0,0,"UND(H$7>=$E9;H$7<=$F9;$D9=Farben!$A$3)"]
["Phase 3","Lila",{"$f":"VLOOKUP(B4,Farbskala!$A$2:$B$12,2,FALSE)","v":16737945},0,0,"UND(H$7>=$E9;H$7<=$F9;$D9=Farben!$A$4)"]
["Phase 4","Dunkelgrün",{"$f":"VLOOKUP(B5,Farbskala!$A$2:$B$12,2,FALSE)","v":3394611},0,0,"UND(H$7>=$E9;H$7<=$F9;$D9=Farben!$A$5)"]

{"sheet":"Farbskala","index":2,"n_rows":12,"n_cols":2,"rows_kept":12,"cut":false,"hidden":false,"merged":[]}
["Bezeichnung","Color"]
["Gelb",65535]
["Hellorange",52479]
["Dunkelorange",3381759]
["Rot",255]
["Pink",16711935]
["Lila",16737945]
["Kobaltblau",16737843]
["Mittelblau",16750848]
["Hellblau",16763955]
["Hellgrün",65280]
["Dunkelgrün",3394611]