{"text_format":"1","workbook":"xlsx","n_sheets":4,"sheets":["Übersicht","000001","202501","202502"],"not_rendered":{"charts":0,"images":0,"macros":1,"external_links":1,"defined_names":0,"comments":0,"pivot_tables":0},"unopened":[],"bounds":{"document_bytes":16777216,"sheet_cells":100000,"rows_first":2000,"rows_last":500,"rows_between":2000,"halvings":0,"cell_chars":16384,"cell_head_chars":4096},"cells_cut":0,"cells_raw":0,"read":"whole","date_system":"1900"}

{"sheet":"Übersicht","index":0,"n_rows":48,"n_cols":20,"rows_kept":48,"cut":false,"hidden":false,"merged":[]}
["Mitarbeiter","Telefon-\nnummer","Std./\nWoche","Montag","Dienstag","Mittwoch","Donnerstag","Freitag","Samstag","Sonntag","Eintritt","KW","Raumbelegung","Spalte1","Spalte2","Spalte3",null,null,"Jahr",2025]
["Chef","Nbst","Std./ Woche",null,null,null,null,null,null,null,45292,{"$f":"YEAR(K2) & TEXT(WEEKNUM(K2,11),\"00\")","v":"202401"},"Raum 1+ 2","Raum 3"]
["Mitarbeiter 1","1111",30,{"$f":"IF($D$2=\"JA\",\"DF\",\"\")","v":""},{"$f":"IF($E$2=\"JA\",\"DF\",\"\")","v":""},{"$f":"IF($F$2=\"JA\",\"DF\",\"\")","v":""},{"$f":"IF($G$2=\"JA\",\"DF\",\"\")","v":""},{"$f":"IF($H$2=\"JA\",\"DF\",\"\")","v":""},"DF","DF","2024-01-01",{"$f":"YEAR(K3) & TEXT(WEEKNUM(K3,11),\"00\")","v":"202401"},null,null,"Lier","Lier ",null,null,"Feiertage"]
["Mitarbeiter 2","2222",40,{"$f":"IF($D$2=\"JA\",\"DF\",\"\")","v":""},{"$f":"IF($E$2=\"JA\",\"DF\",\"\")","v":""},{"$f":"IF($F$2=\"JA\",\"DF\",\"\")","v":""},{"$f":"IF($G$2=\"JA\",\"DF\",\"\")","v":""},{"$f":"IF($H$2=\"JA\",\"DF\",\"\")","v":""},"DF","DF","2024-01-01","202401",null,null,"Hober","Hober ",null,null,"2024-12-31","Silvester"]
["GZ",null,null,"",null,null,null,null,null,null,45292,"202401",null,null,null,null,null,null,"2025-01-01","Neujahr"]
["Mitarbeiter 3","3333",20,"",{"$f":"IF($E$2=\"JA\",\"DF\",\"\")","v":""},"",{"$f":"IF($G$2=\"JA\",\"DF\",\"\")","v":""},{"$f":"IF($H$2=\"JA\",\"DF\",\"\")","v":""},"DF","DF","2024-01-01","202401",{"$f":"COUNTIF('000001'!$C$5:$D$400,Übersicht!O6)+COUNTIF('000001'!$C$5:$D$400,Übersicht!P6)","v":0},{"$f":"(COUNTIF('000001'!$E$5:$E$400,Übersicht!O6)+COUNTIF('000001'!$D$5:$E$400,Übersicht!P6))*0.5","v":0},"Schick","Schick ",null,null,"2025-01-06","Heilige Drei Könige"]
["Mitarbeiter 4","4444",25,"","","","","","DF","DF","2024-01-01","202401",{"$f":"COUNTIF('000001'!$C$5:$D$400,Übersicht!O7)+COUNTIF('000001'!$C$5:$D$400,Übersicht!P7)","v":0},{"$f":"(COUNTIF('000001'!$E$5:$E$400,Übersicht!O7)+COUNTIF('000001'!$D$5:$E$400,Übersicht!P7))*0.5","v":0},"Schanz","Schanz ",null,null,"2025-04-18","Karfreitag"]
["AS",null,null,"",null,null,null,null,null,null,"2024-01-01","202401",null,null,null,null,null,null,"2025-04-21","Ostermontag"]
["Mitarbeiter 5","555",null,"","","",{"$f":"IF($G$2=\"JA\",\"DF\",\"\")","v":""},{"$f":"IF($H$2=\"JA\",\"DF\",\"\")","v":""},"DF","DF","2024-01-01","202401",{"$f":"COUNTIF('000001'!$C$5:$D$400,Übersicht!O9)+COUNTIF('000001'!$C$5:$D$400,Übersicht!P9)","v":0},{"$f":"(COUNTIF('000001'!$E$5:$E$400,Übersicht!O9)+COUNTIF('000001'!$D$5:$E$400,Übersicht!P9))*0.5","v":0},"Christiansen","Christiansen ",null,null,"2025-05-01","Tag der Arbeit"]
["Mitarbeiter 6","66666",null,"","","",{"$f":"IF($G$2=\"JA\",\"DF\",\"\")","v":""},{"$f":"IF($H$2=\"JA\",\"DF\",\"\")","v":""},"DF","DF","2024-01-01","202401",{"$f":"COUNTIF('000001'!$C$5:$D$400,Übersicht!O10)+COUNTIF('000001'!$C$5:$D$400,Übersicht!P10)","v":0},{"$f":"(COUNTIF('000001'!$E$5:$E$400,Übersicht!O10)+COUNTIF('000001'!$D$5:$E$400,Übersicht!P10))*0.5","v":0},"Baumeister","Baumeister ",null,null,"2025-05-29","Christi Himmelfahrt"]
["Mitarbeiter 7","77777",null,"","","",{"$f":"IF($G$2=\"JA\",\"DF\",\"\")","v":""},{"$f":"IF($H$2=\"JA\",\"DF\",\"\")","v":""},"DF","DF","2024-01-01","202401",{"$f":"COUNTIF('000001'!$C$5:$D$400,Übersicht!O11)+COUNTIF('000001'!$C$5:$D$400,Übersicht!P11)","v":0},{"$f":"(COUNTIF('000001'!$E$5:$E$400,Übersicht!O11)+COUNTIF('000001'!$D$5:$E$400,Übersicht!P11))*0.5","v":0},"Bausewein","Bausewein ",null,null,"2025-06-09","Pfingstmontag"]
["Mitarbeiter 8","88888",null,"","","",{"$f":"IF($G$2=\"JA\",\"DF\",\"\")","v":""},"DF","DF","DF","2024-01-01","202401",{"$f":"COUNTIF('000001'!$C$5:$D$400,Übersicht!O12)+COUNTIF('000001'!$C$5:$D$400,Übersicht!P12)","v":0},{"$f":"(COUNTIF('000001'!$E$5:$E$400,Übersicht!O12)+COUNTIF('000001'!$D$5:$E$400,Übersicht!P12))*0.5","v":0},"Beck","Beck",null,null,"2025-06-19","Fronleichnam"]
["Mitarbeiter 9","99999",null,"","","",{"$f":"IF($G$2=\"JA\",\"DF\",\"\")","v":""},null,"DF","DF","2024-01-01","202401",{"$f":"COUNTIF('000001'!$C$5:$D$400,Übersicht!O13)+COUNTIF('000001'!$C$5:$D$400,Übersicht!P13)","v":0},{"$f":"(COUNTIF('000001'!$E$5:$E$400,Übersicht!O13)+COUNTIF('000001'!$D$5:$E$400,Übersicht!P13))*0.5","v":0},"Bullmann","Bullmann ",null,null,"2025-08-15","Mariä Himmelfahrt"]
["Mitarbeiter 10","1010101010",null,"","","",null,{"$f":"IF($H$2=\"JA\",\"DF\",\"\")","v":""},"DF","DF","2024-01-01","202401",{"$f":"COUNTIF('000001'!$C$5:$D$400,Übersicht!O14)+COUNTIF('000001'!$C$5:$D$400,Übersicht!P14)","v":0},{"$f":"(COUNTIF('000001'!$E$5:$E$400,Übersicht!O14)+COUNTIF('000001'!$D$5:$E$400,Übersicht!P14))*0.5","v":0},"Darms","Darms ",null,null,"2025-10-03","Tag der Deutschen Einheit"]
["Mitarbeiter 11","1111111111",null,"","","","","","DF","DF","2024-01-01","202401",{"$f":"COUNTIF('000001'!$C$5:$D$400,Übersicht!O15)+COUNTIF('000001'!$C$5:$D$400,Übersicht!P15)","v":0},{"$f":"(COUNTIF('000001'!$E$5:$E$400,Übersicht!O15)+COUNTIF('000001'!$D$5:$E$400,Übersicht!P15))*0.5","v":0},"Döllinger","Döllinger ",null,null,"2025-11-01","Allerheiligen"]
["Mitarbeiter 12","1212121212",null,"","","","","","DF","DF","2024-01-01","202401",{"$f":"COUNTIF('000001'!$C$5:$D$400,Übersicht!O16)+COUNTIF('000001'!$C$5:$D$400,Übersicht!P16)","v":0},{"$f":"(COUNTIF('000001'!$E$5:$E$400,Übersicht!O16)+COUNTIF('000001'!$D$5:$E$400,Übersicht!P16))*0.5","v":0},"Endres","Endres ",null,null,"2025-12-24","Heilig Abend"]
["Mitarbeiter 13","1313131313",null,"","","","","","DF","DF","2024-01-01","202401",{"$f":"COUNTIF('000001'!$C$5:$D$400,Übersicht!O17)+COUNTIF('000001'!$C$5:$D$400,Übersicht!P17)","v":0},{"$f":"(COUNTIF('000001'!$E$5:$E$400,Übersicht!O17)+COUNTIF('000001'!$D$5:$E$400,Übersicht!P17))*0.5","v":0},"Frenzel L.","Frenzel L. ",null,null,"2025-12-25","1. Weihnachtsfeiertag"]
["Mitarbeiter 14","1414141414",null,"","","","","","DF","DF","2024-01-01","202401",{"$f":"COUNTIF('000001'!$C$5:$D$400,Übersicht!O18)+COUNTIF('000001'!$C$5:$D$400,Übersicht!P18)","v":0},{"$f":"(COUNTIF('000001'!$E$5:$E$400,Übersicht!O18)+COUNTIF('000001'!$D$5:$E$400,Übersicht!P18))*0.5","v":0},"Frenzel Y.","Frenzel Y. ",null,null,"2025-12-26","2. Weihnachtsfeiertag"]
["Mitarbeiter 15","1515151515",null,"","","","","","DF","DF","2024-01-01","202401",{"$f":"COUNTIF('000001'!$C$5:$D$400,Übersicht!O19)+COUNTIF('000001'!$C$5:$D$400,Übersicht!P19)","v":0},{"$f":"(COUNTIF('000001'!$E$5:$E$400,Übersicht!O19)+COUNTIF('000001'!$D$5:$E$400,Übersicht!P19))*0.5","v":0},"Gerhard","Gerhard ",null,null,"2025-12-31","Silvester"]
["Mitarbeiter 16","1616161616",null,"","","","","","DF","DF","2024-01-01","202401",{"$f":"COUNTIF('000001'!$C$5:$D$400,Übersicht!O20)+COUNTIF('000001'!$C$5:$D$400,Übersicht!P20)","v":0},{"$f":"(COUNTIF('000001'!$E$5:$E$400,Übersicht!O20)+COUNTIF('000001'!$D$5:$E$400,Übersicht!P20))*0.5","v":0},"Hofmann","Hofmann ",null,null,"2026-01-01","Neujahr"]
["Mitarbeiter 17","1717171717",null,"","","","","","DF","DF","2024-01-01","202401",{"$f":"COUNTIF('000001'!$C$5:$D$400,Übersicht!O21)+COUNTIF('000001'!$C$5:$D$400,Übersicht!P21)","v":0},{"$f":"(COUNTIF('000001'!$E$5:$E$400,Übersicht!O21)+COUNTIF('000001'!$D$5:$E$400,Übersicht!P21))*0.5","v":0},"Kaspar","Kaspar ",null,null,"2026-01-06","Heilige Drei Könige"]
["Mitarbeiter 18","1818181818",null,"","","","","","DF","DF","2024-01-01","202401",{"$f":"COUNTIF('000001'!$C$5:$D$400,Übersicht!O22)+COUNTIF('000001'!$C$5:$D$400,Übersicht!P22)","v":0},{"$f":"(COUNTIF('000001'!$E$5:$E$400,Übersicht!O22)+COUNTIF('000001'!$D$5:$E$400,Übersicht!P22))*0.5","v":0},"Klug","Klug "]
["Mitarbeiter 19","1919191919",null,"","","","","","DF","DF","2024-01-01","202401",{"$f":"COUNTIF('000001'!$C$5:$D$400,Übersicht!O23)+COUNTIF('000001'!$C$5:$D$400,Übersicht!P23)","v":0},{"$f":"(COUNTIF('000001'!$E$5:$E$400,Übersicht!O23)+COUNTIF('000001'!$D$5:$E$400,Übersicht!P23))*0.5","v":0},"Miceli","Miceli "]
["Mitarbeiter 20","2020202020",null,"","","","","","DF","DF","2024-01-01","202401",{"$f":"COUNTIF('000001'!$C$5:$D$400,Übersicht!O24)+COUNTIF('000001'!$C$5:$D$400,Übersicht!P24)","v":0},{"$f":"(COUNTIF('000001'!$E$5:$E$400,Übersicht!O24)+COUNTIF('000001'!$D$5:$E$400,Übersicht!P24))*0.5","v":0},"Ries","Ries "]
["Mitarbeiter 21","2121212121",null,"","","",{"$f":"IF($G$2=\"JA\",\"DF\",\"\")","v":""},"DF","DF","DF","2024-01-01","202401",{"$f":"COUNTIF('000001'!$C$5:$D$400,Übersicht!O25)+COUNTIF('000001'!$C$5:$D$400,Übersicht!P25)","v":0},{"$f":"(COUNTIF('000001'!$E$5:$E$400,Übersicht!O25)+COUNTIF('000001'!$D$5:$E$400,Übersicht!P25))*0.5","v":0},"Robinson-Waye","Robinson-Waye "]
["Mitarbeiter 22","2222222222",null,"","","",{"$f":"IF($G$2=\"JA\",\"DF\",\"\")","v":""},{"$f":"IF($H$2=\"JA\",\"DF\",\"\")","v":""},"DF","DF","2024-01-01","202401",{"$f":"COUNTIF('000001'!$C$5:$D$400,Übersicht!O26)+COUNTIF('000001'!$C$5:$D$400,Übersicht!P26)","v":0},{"$f":"(COUNTIF('000001'!$E$5:$E$400,Übersicht!O26)+COUNTIF('000001'!$D$5:$E$400,Übersicht!P26))*0.5","v":0},"Röder","Röder "]
["Mitarbeiter 23","2323232323",null,"","","","","","DF","DF","2024-01-01","202401",{"$f":"COUNTIF('000001'!$C$5:$D$400,Übersicht!O27)+COUNTIF('000001'!$C$5:$D$400,Übersicht!P27)","v":0},{"$f":"(COUNTIF('000001'!$E$5:$E$400,Übersicht!O27)+COUNTIF('000001'!$D$5:$E$400,Übersicht!P27))*0.5","v":0},"Schulz","Schulz "]
["Mitarbeiter 24","2424242424",null,"","","","","DF","DF","DF","2024-01-01","202401",{"$f":"COUNTIF('000001'!$C$5:$D$400,Übersicht!O28)+COUNTIF('000001'!$C$5:$D$400,Übersicht!P28)","v":0},{"$f":"(COUNTIF('000001'!$E$5:$E$400,Übersicht!O28)+COUNTIF('000001'!$D$5:$E$400,Übersicht!P28))*0.5","v":0},"Steimann","Steimann "]
["Mitarbeiter 25","2525252525",null,"","","","","DF","DF","DF","2024-01-01","202401",{"$f":"COUNTIF('000001'!$C$5:$D$400,Übersicht!O29)+COUNTIF('000001'!$C$5:$D$400,Übersicht!P29)","v":0},{"$f":"(COUNTIF('000001'!$E$5:$E$400,Übersicht!O29)+COUNTIF('000001'!$D$5:$E$400,Übersicht!P29))*0.5","v":0},"Wander","Wander "]
["BS",null,null,"",null,null,null,null,null,null,45292,"202401"]
["Mitarbeiter 26",null,null,"","","",{"$f":"IF($G$2=\"JA\",\"DF\",\"\")","v":""},{"$f":"IF($H$2=\"JA\",\"DF\",\"\")","v":""},"DF","DF","2024-01-01","202401",{"$f":"COUNTIF('000001'!$C$5:$D$400,Übersicht!O31)+COUNTIF('000001'!$C$5:$D$400,Übersicht!P31)","v":0},{"$f":"(COUNTIF('000001'!$E$5:$E$400,Übersicht!O31)+COUNTIF('000001'!$D$5:$E$400,Übersicht!P31))*0.5","v":0},"Ehehalt","Ehehalt "]
["Mitarbeiter 27",null,null,"","","","","","DF","DF","2024-01-01","202401",{"$f":"COUNTIF('000001'!$C$5:$D$400,Übersicht!O32)+COUNTIF('000001'!$C$5:$D$400,Übersicht!P32)","v":0},{"$f":"(COUNTIF('000001'!$E$5:$E$400,Übersicht!O32)+COUNTIF('000001'!$D$5:$E$400,Übersicht!P32))*0.5","v":0},"Englert","Englert "]
["Mitarbeiter 28",null,null,"","","","","","DF","DF","2024-01-01","202401",{"$f":"COUNTIF('000001'!$C$5:$D$400,Übersicht!O33)+COUNTIF('000001'!$C$5:$D$400,Übersicht!P33)","v":0},{"$f":"(COUNTIF('000001'!$E$5:$E$400,Übersicht!O33)+COUNTIF('000001'!$D$5:$E$400,Übersicht!P33))*0.5","v":0},"Obert","Obert "]
["Mitarbeiter 29",null,null,"","","","","","DF","DF","2024-01-01","202401",{"$f":"COUNTIF('000001'!$C$5:$D$400,Übersicht!O34)+COUNTIF('000001'!$C$5:$D$400,Übersicht!P34)","v":0},{"$f":"(COUNTIF('000001'!$E$5:$E$400,Übersicht!O34)+COUNTIF('000001'!$D$5:$E$400,Übersicht!P34))*0.5","v":0},"Schuhmann","Schuhmann "]
["CS",null,null,"",null,null,null,null,null,null,"2024-01-01","202401"]
["Mitarbeiter 30",null,null,"","","",{"$f":"IF($G$2=\"JA\",\"DF\",\"\")","v":""},{"$f":"IF($H$2=\"JA\",\"DF\",\"\")","v":""},"DF","DF","2024-01-01","202401",{"$f":"COUNTIF('000001'!$C$5:$D$400,Übersicht!O36)+COUNTIF('000001'!$C$5:$D$400,Übersicht!P36)","v":0},{"$f":"(COUNTIF('000001'!$E$5:$E$400,Übersicht!O36)+COUNTIF('000001'!$D$5:$E$400,Übersicht!P36))*0.5","v":0},"Böttcher","Böttcher "]
["M 31",null,null,"","","","","","DF","DF","2024-01-01","202401",{"$f":"COUNTIF('000001'!$C$5:$D$400,Übersicht!O37)+COUNTIF('000001'!$C$5:$D$400,Übersicht!P37)","v":0},{"$f":"(COUNTIF('000001'!$E$5:$E$400,Übersicht!O37)+COUNTIF('000001'!$D$5:$E$400,Übersicht!P37))*0.5","v":0},"Behr","Behr "]
["M32",null,null,"","","","","","DF","DF","2024-01-01","202401",{"$f":"COUNTIF('000001'!$C$5:$D$400,Übersicht!O38)+COUNTIF('000001'!$C$5:$D$400,Übersicht!P38)","v":0},{"$f":"(COUNTIF('000001'!$E$5:$E$400,Übersicht!O38)+COUNTIF('000001'!$D$5:$E$400,Übersicht!P38))*0.5","v":0},"Braun","Braun "]
["M 33",null,null,"","","","","","DF","DF","2024-01-01","202401",{"$f":"COUNTIF('000001'!$C$5:$D$400,Übersicht!O39)+COUNTIF('000001'!$C$5:$D$400,Übersicht!P39)","v":0},{"$f":"(COUNTIF('000001'!$E$5:$E$400,Übersicht!O39)+COUNTIF('000001'!$D$5:$E$400,Übersicht!P39))*0.5","v":0},"Feidel","Feidel "]
["M 34",null,null,"","","","","","DF","DF","2024-01-01","202401",{"$f":"COUNTIF('000001'!$C$5:$D$400,Übersicht!O40)+COUNTIF('000001'!$C$5:$D$400,Übersicht!P40)","v":0},{"$f":"(COUNTIF('000001'!$E$5:$E$400,Übersicht!O40)+COUNTIF('000001'!$D$5:$E$400,Übersicht!P40))*0.5","v":0},"Gull","Gull "]
["M 35",null,null,"","","","","","DF","DF","2024-01-01","202401",{"$f":"COUNTIF('000001'!$C$5:$D$400,Übersicht!O41)+COUNTIF('000001'!$C$5:$D$400,Übersicht!P41)","v":0},{"$f":"(COUNTIF('000001'!$E$5:$E$400,Übersicht!O41)+COUNTIF('000001'!$D$5:$E$400,Übersicht!P41))*0.5","v":0},"Röhrig","Röhrig "]
["SO",null,null,"",null,null,null,null,null,null,45292,"202401"]
["M36",null,null,"","","",{"$f":"IF($G$2=\"JA\",\"DF\",\"\")","v":""},"DF","DF","DF","2024-01-01","202401"]
["M 37",null,null,"DF","","",{"$f":"IF($G$2=\"JA\",\"DF\",\"\")","v":""},{"$f":"IF($H$2=\"JA\",\"DF\",\"\")","v":""},"DF","DF","2024-01-01","202401"]
["Räume",null,null,"",null,null,null,null,null,null,45292,"202401"]
["Raum 1",null,null,{"$f":"IF($D$2=\"JA\",\"DF\",\"\")","v":""},"","",{"$f":"IF($G$2=\"JA\",\"DF\",\"\")","v":""},{"$f":"IF($H$2=\"JA\",\"DF\",\"\")","v":""},"DF","DF","2024-01-01","202401"]
["Raum 2",null,null,"","","","","","DF","DF","2024-01-01","202401"]
["Raum 3",null,null,"","","","","","DF","DF","2024-01-01","202401"]

{"sheet":"000001","index":1,"n_rows":400,"n_cols":6,"rows_kept":400,"cut":false,"hidden":false,"merged":[[0,0,0,4]]}
["Raumbelegung"]
[]
[]
["Wochentag","Datum","Raum 1","Raum 2","Raum 3"]
[{"$f":"TEXT(B5,\"TTTT\")","v":"Mittwoch"},{"$f":"DATE(Übersicht!T1,1,1)","v":"2025-01-01"},null,null,null,{"$f":"IF(MATCH(B5,Übersicht!$S$4:$S$21,0),\"JA\",\"NEIN\")","v":"JA"}]
[{"$f":"TEXT(B6,\"TTTT\")","v":"Donnerstag"},{"$f":"B5+1","v":"2025-01-02"},null,null,null,{"$f":"IF(MATCH(B6,Übersicht!$S$4:$S$21,0),\"JA\",\"NEIN\")","v":{"$error":"#N/A"}}]
["Freitag",{"$f":"B6+1","v":"2025-01-03"},null,null,null,{"$f":"IF(MATCH(B7,Übersicht!$S$4:$S$21,0),\"JA\",\"NEIN\")","v":{"$error":"#N/A"}}]
["Samstag","2025-01-04",null,null,null,{"$f":"IF(MATCH(B8,Übersicht!$S$4:$S$21,0),\"JA\",\"NEIN\")","v":{"$error":"#N/A"}}]
["Sonntag","2025-01-05",null,null,null,{"$f":"IF(MATCH(B9,Übersicht!$S$4:$S$21,0),\"JA\",\"NEIN\")","v":{"$error":"#N/A"}}]
["Montag","2025-01-06",null,null,null,{"$f":"IF(MATCH(B10,Übersicht!$S$4:$S$21,0),\"JA\",\"NEIN\")","v":"JA"}]
["Dienstag","2025-01-07",null,null,null,{"$f":"IF(MATCH(B11,Übersicht!$S$4:$S$21,0),\"JA\",\"NEIN\")","v":{"$error":"#N/A"}}]
["Mittwoch","2025-01-08",null,null,null,{"$f":"IF(MATCH(B12,Übersicht!$S$4:$S$21,0),\"JA\",\"NEIN\")","v":{"$error":"#N/A"}}]
["Donnerstag","2025-01-09",null,null,null,{"$f":"IF(MATCH(B13,Übersicht!$S$4:$S$21,0),\"JA\",\"NEIN\")","v":{"$error":"#N/A"}}]
["Freitag","2025-01-10",null,null,null,{"$f":"IF(MATCH(B14,Übersicht!$S$4:$S$21,0),\"JA\",\"NEIN\")","v":{"$error":"#N/A"}}]
["Samstag","2025-01-11",null,null,null,{"$f":"IF(MATCH(B15,Übersicht!$S$4:$S$21,0),\"JA\",\"NEIN\")","v":{"$error":"#N/A"}}]
["Sonntag","2025-01-12",null,null,null,{"$f":"IF(MATCH(B16,Übersicht!$S$4:$S$21,0),\"JA\",\"NEIN\")","v":{"$error":"#N/A"}}]
["Montag","2025-01-13",null,null,null,{"$f":"IF(MATCH(B17,Übersicht!$S$4:$S$21,0),\"JA\",\"NEIN\")","v":{"$error":"#N/A"}}]
["Dienstag","2025-01-14",null,null,null,{"$f":"IF(MATCH(B18,Übersicht!$S$4:$S$21,0),\"JA\",\"NEIN\")","v":{"$error":"#N/A"}}]
["Mittwoch","2025-01-15",null,null,null,{"$f":"IF(MATCH(B19,Übersicht!$S$4:$S$21,0),\"JA\",\"NEIN\")","v":{"$error":"#N/A"}}]
["Donnerstag","2025-01-16",null,null,null,{"$f":"IF(MATCH(B20,Übersicht!$S$4:$S$21,0),\"JA\",\"NEIN\")","v":{"$error":"#N/A"}}]
["Freitag","2025-01-17",null,null,null,{"$f":"IF(MATCH(B21,Übersicht!$S$4:$S$21,0),\"JA\",\"NEIN\")","v":{"$error":"#N/A"}}]
["Samstag","2025-01-18",null,null,null,{"$f":"IF(MATCH(B22,Übersicht!$S$4:$S$21,0),\"JA\",\"NEIN\")","v":{"$error":"#N/A"}}]
["Sonntag","2025-01-19",null,null,null,{"$f":"IF(MATCH(B23,Übersicht!$S$4:$S$21,0),\"JA\",\"NEIN\")","v":{"$error":"#N/A"}}]
["Montag","2025-01-20",null,null,null,{"$f":"IF(MATCH(B24,Übersicht!$S$4:$S$21,0),\"JA\",\"NEIN\")","v":{"$error":"#N/A"}}]
["Dienstag","2025-01-21",null,null,null,{"$f":"IF(MATCH(B25,Übersicht!$S$4:$S$21,0),\"JA\",\"NEIN\")","v":{"$error":"#N/A"}}]
["Mittwoch","2025-01-22",null,null,null,{"$f":"IF(MATCH(B26,Übersicht!$S$4:$S$21,0),\"JA\",\"NEIN\")","v":{"$error":"#N/A"}}]
["Donnerstag","2025-01-23",null,null,null,{"$f":"IF(MATCH(B27,Übersicht!$S$4:$S$21,0),\"JA\",\"NEIN\")","v":{"$error":"#N/A"}}]
["Freitag","2025-01-24",null,null,null,{"$f":"IF(MATCH(B28,Übersicht!$S$4:$S$21,0),\"JA\",\"NEIN\")","v":{"$error":"#N/A"}}]
["Samstag","2025-01-25",null,null,null,{"$f":"IF(MATCH(B29,Übersicht!$S$4:$S$21,0),\"JA\",\"NEIN\")","v":{"$error":"#N/A"}}]
["Sonntag","2025-01-26",null,null,null,{"$f":"IF(MATCH(B30,Übersicht!$S$4:$S$21,0),\"JA\",\"NEIN\")","v":{"$error":"#N/A"}}]
["Montag","2025-01-27",null,null,null,{"$f":"IF(MATCH(B31,Übersicht!$S$4:$S$21,0),\"JA\",\"NEIN\")","v":{"$error":"#N/A"}}]
["Dienstag","2025-01-28",null,null,null,{"$f":"IF(MATCH(B32,Übersicht!$S$4:$S$21,0),\"JA\",\"NEIN\")","v":{"$error":"#N/A"}}]
["Mittwoch","2025-01-29",null,null,null,{"$f":"IF(MATCH(B33,Übersicht!$S$4:$S$21,0),\"JA\",\"NEIN\")","v":{"$error":"#N/A"}}]
["Donnerstag","2025-01-30",null,null,null,{"$f":"IF(MATCH(B34,Übersicht!$S$4:$S$21,0),\"JA\",\"NEIN\")","v":{"$error":"#N/A"}}]
["Freitag","2025-01-31",null,null,null,{"$f":"IF(MATCH(B35,Übersicht!$S$4:$S$21,0),\"JA\",\"NEIN\")","v":{"$error":"#N/A"}}]
["Samstag","2025-02-01",null,null,null,{"$f":"IF(MATCH(B36,Übersicht!$S$4:$S$21,0),\"JA\",\"NEIN\")","v":{"$error":"#N/A"}}]
["Sonntag","2025-02-02",null,null,null,{"$f":"IF(MATCH(B37,Übersicht!$S$4:$S$21,0),\"JA\",\"NEIN\")","v":{"$error":"#N/A"}}]
["Montag","2025-02-03",null,null,null,{"$f":"IF(MATCH(B38,Übersicht!$S$4:$S$21,0),\"JA\",\"NEIN\")","v":{"$error":"#N/A"}}]
["Dienstag","2025-02-04",null,null,null,{"$f":"IF(MATCH(B39,Übersicht!$S$4:$S$21,0),\"JA\",\"NEIN\")","v":{"$error":"#N/A"}}]
["Mittwoch","2025-02-05",null,null,null,{"$f":"IF(MATCH(B40,Übersicht!$S$4:$S$21,0),\"JA\",\"NEIN\")","v":{"$error":"#N/A"}}]
["Donnerstag","2025-02-06",null,null,null,{"$f":"IF(MATCH(B41,Übersicht!$S$4:$S$21,0),\"JA\",\"NEIN\")","v":{"$error":"#N/A"}}]
["Freitag","2025-02-07",null,null,null,{"$f":"IF(MATCH(B42,Übersicht!$S$4:$S$21,0),\"JA\",\"NEIN\")","v":{"$error":"#N/A"}}]
["Samstag","2025-02-08",null,null,null,{"$f":"IF(MATCH(B43,Übersicht!$S$4:$S$21,0),\"JA\",\"NEIN\")","v":{"$error":"#N/A"}}]
["Sonntag","2025-02-09",null,null,null,{"$f":"IF(MATCH(B44,Übersicht!$S$4:$S$21,0),\"JA\",\"NEIN\")","v":{"$error":"#N/A"}}]
["Montag","2025-02-10",null,null,null,{"$f":"IF(MATCH(B45,Übersicht!$S$4:$S$21,0),\"JA\",\"NEIN\")","v":{"$error":"#N/A"}}]
["Dienstag","2025-02-11",null,null,null,{"$f":"IF(MATCH(B46,Übersicht!$S$4:$S$21,0),\"JA\",\"NEIN\")","v":{"$error":"#N/A"}}]
["Mittwoch","2025-02-12",null,null,null,{"$f":"IF(MATCH(B47,Übersicht!$S$4:$S$21,0),\"JA\",\"NEIN\")","v":{"$error":"#N/A"}}]
["Donnerstag","2025-02-13",null,null,null,{"$f":"IF(MATCH(B48,Übersicht!$S$4:$S$21,0),\"JA\",\"NEIN\")","v":{"$error":"#N/A"}}]
["Freitag","2025-02-14",null,null,null,{"$f":"IF(MATCH(B49,Übersicht!$S$4:$S$21,0),\"JA\",\"NEIN\")","v":{"$error":"#N/A"}}]
["Samstag","2025-02-15",null,null,null,{"$f":"IF(MATCH(B50,Übersicht!$S$4:$S$21,0),\"JA\",\"NEIN\")","v":{"$error":"#N/A"}}]
["Sonntag","2025-02-16",null,null,null,{"$f":"IF(MATCH(B51,Übersicht!$S$4:$S$21,0),\"JA\",\"NEIN\")","v":{"$error":"#N/A"}}]
["Montag","2025-02-17",null,null,null,{"$f":"IF(MATCH(B52,Übersicht!$S$4:$S$21,0),\"JA\",\"NEIN\")","v":{"$error":"#N/A"}}]
["Dienstag","2025-02-18",null,null,null,{"$f":"IF(MATCH(B53,Übersicht!$S$4:$S$21,0),\"JA\",\"NEIN\")","v":{"$error":"#N/A"}}]
["Mittwoch","2025-02-19",null,null,null,{"$f":"IF(MATCH(B54,Übersicht!$S$4:$S$21,0),\"JA\",\"NEIN\")","v":{"$error":"#N/A"}}]
["Donnerstag","2025-02-20",null,null,null,{"$f":"IF(MATCH(B55,Übersicht!$S$4:$S$21,0),\"JA\",\"NEIN\")","v":{"$error":"#N/A"}}]
["Freitag","2025-02-21",null,null,null,{"$f":"IF(MATCH(B56,Übersicht!$S$4:$S$21,0),\"JA\",\"NEIN\")","v":{"$error":"#N/A"}}]
["Samstag","2025-02-22",null,null,null,{"$f":"IF(MATCH(B57,Übersicht!$S$4:$S$21,0),\"JA\",\"NEIN\")","v":{"$error":"#N/A"}}]
["Sonntag","2025-02-23",null,null,null,{"$f":"IF(MATCH(B58,Übersicht!$S$4:$S$21,0),\"JA\",\"NEIN\")","v":{"$error":"#N/A"}}]
["Montag","2025-02-24",null,null,null,{"$f":"IF(MATCH(B59,Übersicht!$S$4:$S$21,0),\"JA\",\"NEIN\")","v":{"$error":"#N/A"}}]
["Dienstag","2025-02-25",null,null,null,{"$f":"IF(MATCH(B60,Übersicht!$S$4:$S$21,0),\"JA\",\"NEIN\")","v":{"$error":"#N/A"}}]
["Mittwoch","2025-02-26",null,null,null,{"$f":"IF(MATCH(B61,Übersicht!$S$4:$S$21,0),\"JA\",\"NEIN\")","v":{"$error":"#N/A"}}]
["Donnerstag","2025-02-27",null,null,null,{"$f":"IF(MATCH(B62,Übersicht!$S$4:$S$21,0),\"JA\",\"NEIN\")","v":{"$error":"#N/A"}}]
["Freitag","2025-02-28",null,null,null,{"$f":"IF(MATCH(B63,Übersicht!$S$4:$S$21,0),\"JA\",\"NEIN\")","v":{"$error":"#N/A"}}]
["Samstag","2025-03-01",null,null,null,{"$f":"IF(MATCH(B64,Übersicht!$S$4:$S$21,0),\"JA\",\"NEIN\")","v":{"$error":"#N/A"}}]
["Sonntag","2025-03-02",null,null,null,{"$f":"IF(MATCH(B65,Übersicht!$S$4:$S$21,0),\"JA\",\"NEIN\")","v":{"$error":"#N/A"}}]
["Montag","2025-03-03",null,null,null,{"$f":"IF(MATCH(B66,Übersicht!$S$4:$S$21,0),\"JA\",\"NEIN\")","v":{"$error":"#N/A"}}]
["Dienstag","2025-03-04",null,null,null,{"$f":"IF(MATCH(B67,Übersicht!$S$4:$S$21,0),\"JA\",\"NEIN\")","v":{"$error":"#N/A"}}]
["Mittwoch","2025-03-05",null,null,null,{"$f":"IF(MATCH(B68,Übersicht!$S$4:$S$21,0),\"JA\",\"NEIN\")","v":{"$error":"#N/A"}}]
["Donnerstag","2025-03-06",null,null,null,{"$f":"IF(MATCH(B69,Übersicht!$S$4:$S$21,0),\"JA\",\"NEIN\")","v":{"$error":"#N/A"}}]
[{"$f":"TEXT(B70,\"TTTT\")","v":"Freitag"},"2025-03-07",null,null,null,{"$f":"IF(MATCH(B70,Übersicht!$S$4:$S$21,0),\"JA\",\"NEIN\")","v":{"$error":"#N/A"}}]
["Samstag",{"$f":"B70+1","v":"2025-03-08"},null,null,null,{"$f":"IF(MATCH(B71,Übersicht!$S$4:$S$21,0),\"JA\",\"NEIN\")","v":{"$error":"#N/A"}}]
["Sonntag","2025-03-09",null,null,null,{"$f":"IF(MATCH(B72,Übersicht!$S$4:$S$21,0),\"JA\",\"NEIN\")","v":{"$error":"#N/A"}}]
["Montag","2025-03-10",null,null,null,{"$f":"IF(MATCH(B73,Übersicht!$S$4:$S$21,0),\"JA\",\"NEIN\")","v":{"$error":"#N/A"}}]
["Dienstag","2025-03-11",null,null,null,{"$f":"IF(MATCH(B74,Übersicht!$S$4:$S$21,0),\"JA\",\"NEIN\")","v":{"$error":"#N/A"}}]
["Mittwoch","2025-03-12",null,null,null,{"$f":"IF(MATCH(B75,Übersicht!$S$4:$S$21,0),\"JA\",\"NEIN\")","v":{"$error":"#N/A"}}]
["Donnerstag","2025-03-13",null,null,null,{"$f":"IF(MATCH(B76,Übersicht!$S$4:$S$21,0),\"JA\",\"NEIN\")","v":{"$error":"#N/A"}}]
["Freitag","2025-03-14",null,null,null,{"$f":"IF(MATCH(B77,Übersicht!$S$4:$S$21,0),\"JA\",\"NEIN\")","v":{"$error":"#N/A"}}]
["Samstag","2025-03-15",null,null,null,{"$f":"IF(MATCH(B78,Übersicht!$S$4:$S$21,0),\"JA\",\"NEIN\")","v":{"$error":"#N/A"}}]
["Sonntag","2025-03-16",null,null,null,{"$f":"IF(MATCH(B79,Übersicht!$S$4:$S$21,0),\"JA\",\"NEIN\")","v":{"$error":"#N/A"}}]
["Montag","2025-03-17",null,null,null,{"$f":"IF(MATCH(B80,Übersicht!$S$4:$S$21,0),\"JA\",\"NEIN\")","v":{"$error":"#N/A"}}]
["Dienstag","2025-03-18",null,null,null,{"$f":"IF(MATCH(B81,Übersicht!$S$4:$S$21,0),\"JA\",\"NEIN\")","v":{"$error":"#N/A"}}]
["Mittwoch","2025-03-19",null,null,null,{"$f":"IF(MATCH(B82,Übersicht!$S$4:$S$21,0),\"JA\",\"NEIN\")","v":{"$error":"#N/A"}}]
["Donnerstag","2025-03-20",null,null,null,{"$f":"IF(MATCH(B83,Übersicht!$S$4:$S$21,0),\"JA\",\"NEIN\")","v":{"$error":"#N/A"}}]
["Freitag","2025-03-21",null,null,null,{"$f":"IF(MATCH(B84,Übersicht!$S$4:$S$21,0),\"JA\",\"NEIN\")","v":{"$error":"#N/A"}}]
["Samstag","2025-03-22",null,null,null,{"$f":"IF(MATCH(B85,Übersicht!$S$4:$S$21,0),\"JA\",\"NEIN\")","v":{"$error":"#N/A"}}]
["Sonntag","2025-03-23",null,null,null,{"$f":"IF(MATCH(B86,Übersicht!$S$4:$S$21,0),\"JA\",\"NEIN\")","v":{"$error":"#N/A"}}]
["Montag","2025-03-24",null,null,null,{"$f":"IF(MATCH(B87,Übersicht!$S$4:$S$21,0),\"JA\",\"NEIN\")","v":{"$error":"#N/A"}}]
["Dienstag","2025-03-25",null,null,null,{"$f":"IF(MATCH(B88,Übersicht!$S$4:$S$21,0),\"JA\",\"NEIN\")","v":{"$error":"#N/A"}}]
["Mittwoch","2025-03-26",null,null,null,{"$f":"IF(MATCH(B89,Übersicht!$S$4:$S$21,0),\"JA\",\"NEIN\")","v":{"$error":"#N/A"}}]
["Donnerstag","2025-03-27",null,null,null,{"$f":"IF(MATCH(B90,Übersicht!$S$4:$S$21,0),\"JA\",\"NEIN\")","v":{"$error":"#N/A"}}]
["Freitag","2025-03-28",null,null,null,{"$f":"IF(MATCH(B91,Übersicht!$S$4:$S$21,0),\"JA\",\"NEIN\")","v":{"$error":"#N/A"}}]
["Samstag","2025-03-29",null,null,null,{"$f":"IF(MATCH(B92,Übersicht!$S$4:$S$21,0),\"JA\",\"NEIN\")","v":{"$error":"#N/A"}}]
["Sonntag","2025-03-30",null,null,null,{"$f":"IF(MATCH(B93,Übersicht!$S$4:$S$21,0),\"JA\",\"NEIN\")","v":{"$error":"#N/A"}}]
["Montag","2025-03-31",null,null,null,{"$f":"IF(MATCH(B94,Übersicht!$S$4:$S$21,0),\"JA\",\"NEIN\")","v":{"$error":"#N/A"}}]
["Dienstag","2025-04-01",null,null,null,{"$f":"IF(MATCH(B95,Übersicht!$S$4:$S$21,0),\"JA\",\"NEIN\")","v":{"$error":"#N/A"}}]
["Mittwoch","2025-04-02",null,null,null,{"$f":"IF(MATCH(B96,Übersicht!$S$4:$S$21,0),\"JA\",\"NEIN\")","v":{"$error":"#N/A"}}]
["Donnerstag","2025-04-03",null,null,null,{"$f":"IF(MATCH(B97,Übersicht!$S$4:$S$21,0),\"JA\",\"NEIN\")","v":{"$error":"#N/A"}}]
["Freitag","2025-04-04",null,null,null,{"$f":"IF(MATCH(B98,Übersicht!$S$4:$S$21,0),\"JA\",\"NEIN\")","v":{"$error":"#N/A"}}]
["Samstag","2025-04-05",null,null,null,{"$f":"IF(MATCH(B99,Übersicht!$S$4:$S$21,0),\"JA\",\"NEIN\")","v":{"$error":"#N/A"}}]
["Sonntag","2025-04-06",null,null,null,{"$f":"IF(MATCH(B100,Übersicht!$S$4:$S$21,0),\"JA\",\"NEIN\")","v":{"$error":"#N/A"}}]
["Montag","2025-04-07",null,null,null,{"$f":"IF(MATCH(B101,Übersicht!$S$4:$S$21,0),\"JA\",\"NEIN\")","v":{"$error":"#N/A"}}]
["Dienstag","2025-04-08",null,null,null,{"$f":"IF(MATCH(B102,Übersicht!$S$4:$S$21,0),\"JA\",\"NEIN\")","v":{"$error":"#N/A"}}]
["Mittwoch","2025-04-09",null,null,null,{"$f":"IF(MATCH(B103,Übersicht!$S$4:$S$21,0),\"JA\",\"NEIN\")","v":{"$error":"#N/A"}}]
["Donnerstag","2025-04-10",null,null,null,{"$f":"IF(MATCH(B104,Übersicht!$S$4:$S$21,0),\"JA\",\"NEIN\")","v":{"$error":"#N/A"}}]
["Freitag","2025-04-11",null,null,null,{"$f":"IF(MATCH(B105,Übersicht!$S$4:$S$21,0),\"JA\",\"NEIN\")","v":{"$error":"#N/A"}}]
["Samstag","2025-04-12",null,null,null,{"$f":"IF(MATCH(B106,Übersicht!$S$4:$S$21,0),\"JA\",\"NEIN\")","v":{"$error":"#N/A"}}]
["Sonntag","2025-04-13",null,null,null,{"$f":"IF(MATCH(B107,Übersicht!$S$4:$S$21,0),\"JA\",\"NEIN\")","v":{"$error":"#N/A"}}]
["Montag","2025-04-14",null,null,null,{"$f":"IF(MATCH(B108,Übersicht!$S$4:$S$21,0),\"JA\",\"NEIN\")","v":{"$error":"#N/A"}}]
["Dienstag","2025-04-15",null,null,null,{"$f":"IF(MATCH(B109,Übersicht!$S$4:$S$21,0),\"JA\",\"NEIN\")","v":{"$error":"#N/A"}}]
["Mittwoch","2025-04-16",null,null,null,{"$f":"IF(MATCH(B110,Übersicht!$S$4:$S$21,0),\"JA\",\"NEIN\")","v":{"$error":"#N/A"}}]
["Donnerstag","2025-04-17",null,null,null,{"$f":"IF(MATCH(B111,Übersicht!$S$4:$S$21,0),\"JA\",\"NEIN\")","v":{"$error":"#N/A"}}]
["Freitag","2025-04-18",null,null,null,{"$f":"IF(MATCH(B112,Übersicht!$S$4:$S$21,0),\"JA\",\"NEIN\")","v":"JA"}]
["Samstag","2025-04-19",null,null,null,{"$f":"IF(MATCH(B113,Übersicht!$S$4:$S$21,0),\"JA\",\"NEIN\")","v":{"$error":"#N/A"}}]
["Sonntag","2025-04-20",null,null,null,{"$f":"IF(MATCH(B114,Übersicht!$S$4:$S$21,0),\"JA\",\"NEIN\")","v":{"$error":"#N/A"}}]
["Montag","2025-04-21",null,null,null,{"$f":"IF(MATCH(B115,Übersicht!$S$4:$S$21,0),\"JA\",\"NEIN\")","v":"JA"}]
["Dienstag","2025-04-22",null,null,null,{"$f":"IF(MATCH(B116,Übersicht!$S$4:$S$21,0),\"JA\",\"NEIN\")","v":{"$error":"#N/A"}}]
["Mittwoch","2025-04-23",null,null,null,{"$f":"IF(MATCH(B117,Übersicht!$S$4:$S$21,0),\"JA\",\"NEIN\")","v":{"$error":"#N/A"}}]
["Donnerstag","2025-04-24",null,null,null,{"$f":"IF(MATCH(B118,Übersicht!$S$4:$S$21,0),\"JA\",\"NEIN\")","v":{"$error":"#N/A"}}]
["Freitag","2025-04-25",null,null,null,{"$f":"IF(MATCH(B119,Übersicht!$S$4:$S$21,0),\"JA\",\"NEIN\")","v":{"$error":"#N/A"}}]
["Samstag","2025-04-26",null,null,null,{"$f":"IF(MATCH(B120,Übersicht!$S$4:$S$21,0),\"JA\",\"NEIN\")","v":{"$error":"#N/A"}}]
["Sonntag","2025-04-27",null,null,null,{"$f":"IF(MATCH(B121,Übersicht!$S$4:$S$21,0),\"JA\",\"NEIN\")","v":{"$error":"#N/A"}}]
["Montag","2025-04-28",null,null,null,{"$f":"IF(MATCH(B122,Übersicht!$S$4:$S$21,0),\"JA\",\"NEIN\")","v":{"$error":"#N/A"}}]
["Dienstag","2025-04-29",null,null,null,{"$f":"IF(MATCH(B123,Übersicht!$S$4:$S$21,0),\"JA\",\"NEIN\")","v":{"$error":"#N/A"}}]
["Mittwoch","2025-04-30",null,null,null,{"$f":"IF(MATCH(B124,Übersicht!$S$4:$S$21,0),\"JA\",\"NEIN\")","v":{"$error":"#N/A"}}]
["Donnerstag","2025-05-01",null,null,null,{"$f":"IF(MATCH(B125,Übersicht!$S$4:$S$21,0),\"JA\",\"NEIN\")","v":"JA"}]
["Freitag","2025-05-02",null,null,null,{"$f":"IF(MATCH(B126,Übersicht!$S$4:$S$21,0),\"JA\",\"NEIN\")","v":{"$error":"#N/A"}}]
["Samstag","2025-05-03",null,null,null,{"$f":"IF(MATCH(B127,Übersicht!$S$4:$S$21,0),\"JA\",\"NEIN\")","v":{"$error":"#N/A"}}]
["Sonntag","2025-05-04",null,null,null,{"$f":"IF(MATCH(B128,Übersicht!$S$4:$S$21,0),\"JA\",\"NEIN\")","v":{"$error":"#N/A"}}]
["Montag","2025-05-05",null,null,null,{"$f":"IF(MATCH(B129,Übersicht!$S$4:$S$21,0),\"JA\",\"NEIN\")","v":{"$error":"#N/A"}}]
["Dienstag","2025-05-06",null,null,null,{"$f":"IF(MATCH(B130,Übersicht!$S$4:$S$21,0),\"JA\",\"NEIN\")","v":{"$error":"#N/A"}}]
["Mittwoch","2025-05-07",null,null,null,{"$f":"IF(MATCH(B131,Übersicht!$S$4:$S$21,0),\"JA\",\"NEIN\")","v":{"$error":"#N/A"}}]
["Donnerstag","2025-05-08",null,null,null,{"$f":"IF(MATCH(B132,Übersicht!$S$4:$S$21,0),\"JA\",\"NEIN\")","v":{"$error":"#N/A"}}]
["Freitag","2025-05-09",null,null,null,{"$f":"IF(MATCH(B133,Übersicht!$S$4:$S$21,0),\"JA\",\"NEIN\")","v":{"$error":"#N/A"}}]
[{"$f":"TEXT(B134,\"TTTT\")","v":"Samstag"},"2025-05-10",null,null,null,{"$f":"IF(MATCH(B134,Übersicht!$S$4:$S$21,0),\"JA\",\"NEIN\")","v":{"$error":"#N/A"}}]
["Sonntag",{"$f":"B134+1","v":"2025-05-11"},null,null,null,{"$f":"IF(MATCH(B135,Übersicht!$S$4:$S$21,0),\"JA\",\"NEIN\")","v":{"$error":"#N/A"}}]
["Montag","2025-05-12",null,null,null,{"$f":"IF(MATCH(B136,Übersicht!$S$4:$S$21,0),\"JA\",\"NEIN\")","v":{"$error":"#N/A"}}]
["Dienstag","2025-05-13",null,null,null,{"$f":"IF(MATCH(B137,Übersicht!$S$4:$S$21,0),\"JA\",\"NEIN\")","v":{"$error":"#N/A"}}]
["Mittwoch","2025-05-14",null,null,null,{"$f":"IF(MATCH(B138,Übersicht!$S$4:$S$21,0),\"JA\",\"NEIN\")","v":{"$error":"#N/A"}}]
["Donnerstag","2025-05-15",null,null,null,{"$f":"IF(MATCH(B139,Übersicht!$S$4:$S$21,0),\"JA\",\"NEIN\")","v":{"$error":"#N/A"}}]
["Freitag","2025-05-16",null,null,null,{"$f":"IF(MATCH(B140,Übersicht!$S$4:$S$21,0),\"JA\",\"NEIN\")","v":{"$error":"#N/A"}}]
["Samstag","2025-05-17",null,null,null,{"$f":"IF(MATCH(B141,Übersicht!$S$4:$S$21,0),\"JA\",\"NEIN\")","v":{"$error":"#N/A"}}]
["Sonntag","2025-05-18",null,null,null,{"$f":"IF(MATCH(B142,Übersicht!$S$4:$S$21,0),\"JA\",\"NEIN\")","v":{"$error":"#N/A"}}]
["Montag","2025-05-19",null,null,null,{"$f":"IF(MATCH(B143,Übersicht!$S$4:$S$21,0),\"JA\",\"NEIN\")","v":{"$error":"#N/A"}}]
["Dienstag","2025-05-20",null,null,null,{"$f":"IF(MATCH(B144,Übersicht!$S$4:$S$21,0),\"JA\",\"NEIN\")","v":{"$error":"#N/A"}}]
["Mittwoch","2025-05-21",null,null,null,{"$f":"IF(MATCH(B145,Übersicht!$S$4:$S$21,0),\"JA\",\"NEIN\")","v":{"$error":"#N/A"}}]
["Donnerstag","2025-05-22",null,null,null,{"$f":"IF(MATCH(B146,Übersicht!$S$4:$S$21,0),\"JA\",\"NEIN\")","v":{"$error":"#N/A"}}]
["Freitag","2025-05-23",null,null,null,{"$f":"IF(MATCH(B147,Übersicht!$S$4:$S$21,0),\"JA\",\"NEIN\")","v":{"$error":"#N/A"}}]
["Samstag","2025-05-24",null,null,null,{"$f":"IF(MATCH(B148,Übersicht!$S$4:$S$21,0),\"JA\",\"NEIN\")","v":{"$error":"#N/A"}}]
["Sonntag","2025-05-25",null,null,null,{"$f":"IF(MATCH(B149,Übersicht!$S$4:$S$21,0),\"JA\",\"NEIN\")","v":{"$error":"#N/A"}}]
["Montag","2025-05-26",null,null,null,{"$f":"IF(MATCH(B150,Übersicht!$S$4:$S$21,0),\"JA\",\"NEIN\")","v":{"$error":"#N/A"}}]
["Dienstag","2025-05-27",null,null,null,{"$f":"IF(MATCH(B151,Übersicht!$S$4:$S$21,0),\"JA\",\"NEIN\")","v":{"$error":"#N/A"}}]
["Mittwoch","2025-05-28",null,null,null,{"$f":"IF(MATCH(B152,Übersicht!$S$4:$S$21,0),\"JA\",\"NEIN\")","v":{"$error":"#N/A"}}]
["Donnerstag","2025-05-29",null,null,null,{"$f":"IF(MATCH(B153,Übersicht!$S$4:$S$21,0),\"JA\",\"NEIN\")","v":"JA"}]
["Freitag","2025-05-30",null,null,null,{"$f":"IF(MATCH(B154,Übersicht!$S$4:$S$21,0),\"JA\",\"NEIN\")","v":{"$error":"#N/A"}}]
["Samstag","2025-05-31",null,null,null,{"$f":"IF(MATCH(B155,Übersicht!$S$4:$S$21,0),\"JA\",\"NEIN\")","v":{"$error":"#N/A"}}]
["Sonntag","2025-06-01",null,null,null,{"$f":"IF(MATCH(B156,Übersicht!$S$4:$S$21,0),\"JA\",\"NEIN\")","v":{"$error":"#N/A"}}]
["Montag","2025-06-02",null,null,null,{"$f":"IF(MATCH(B157,Übersicht!$S$4:$S$21,0),\"JA\",\"NEIN\")","v":{"$error":"#N/A"}}]
["Dienstag","2025-06-03",null,null,null,{"$f":"IF(MATCH(B158,Übersicht!$S$4:$S$21,0),\"JA\",\"NEIN\")","v":{"$error":"#N/A"}}]
["Mittwoch","2025-06-04",null,null,null,{"$f":"IF(MATCH(B159,Übersicht!$S$4:$S$21,0),\"JA\",\"NEIN\")","v":{"$error":"#N/A"}}]
["Donnerstag","2025-06-05",null,null,null,{"$f":"IF(MATCH(B160,Übersicht!$S$4:$S$21,0),\"JA\",\"NEIN\")","v":{"$error":"#N/A"}}]
["Freitag","2025-06-06",null,null,null,{"$f":"IF(MATCH(B161,Übersicht!$S$4:$S$21,0),\"JA\",\"NEIN\")","v":{"$error":"#N/A"}}]
["Samstag","2025-06-07",null,null,null,{"$f":"IF(MATCH(B162,Übersicht!$S$4:$S$21,0),\"JA\",\"NEIN\")","v":{"$error":"#N/A"}}]
["Sonntag","2025-06-08",null,null,null,{"$f":"IF(MATCH(B163,Übersicht!$S$4:$S$21,0),\"JA\",\"NEIN\")","v":{"$error":"#N/A"}}]
["Montag","2025-06-09",null,null,null,{"$f":"IF(MATCH(B164,Übersicht!$S$4:$S$21,0),\"JA\",\"NEIN\")","v":"JA"}]
["Dienstag","2025-06-10",null,null,null,{"$f":"IF(MATCH(B165,Übersicht!$S$4:$S$21,0),\"JA\",\"NEIN\")","v":{"$error":"#N/A"}}]
["Mittwoch","2025-06-11",null,null,null,{"$f":"IF(MATCH(B166,Übersicht!$S$4:$S$21,0),\"JA\",\"NEIN\")","v":{"$error":"#N/A"}}]
["Donnerstag","2025-06-12",null,null,null,{"$f":"IF(MATCH(B167,Übersicht!$S$4:$S$21,0),\"JA\",\"NEIN\")","v":{"$error":"#N/A"}}]
["Freitag","2025-06-13",null,null,null,{"$f":"IF(MATCH(B168,Übersicht!$S$4:$S$21,0),\"JA\",\"NEIN\")","v":{"$error":"#N/A"}}]
["Samstag","2025-06-14",null,null,null,{"$f":"IF(MATCH(B169,Übersicht!$S$4:$S$21,0),\"JA\",\"NEIN\")","v":{"$error":"#N/A"}}]
["Sonntag","2025-06-15",null,null,null,{"$f":"IF(MATCH(B170,Übersicht!$S$4:$S$21,0),\"JA\",\"NEIN\")","v":{"$error":"#N/A"}}]
["Montag","2025-06-16",null,null,null,{"$f":"IF(MATCH(B171,Übersicht!$S$4:$S$21,0),\"JA\",\"NEIN\")","v":{"$error":"#N/A"}}]
["Dienstag","2025-06-17",null,null,null,{"$f":"IF(MATCH(B172,Übersicht!$S$4:$S$21,0),\"JA\",\"NEIN\")","v":{"$error":"#N/A"}}]
["Mittwoch","2025-06-18",null,null,null,{"$f":"IF(MATCH(B173,Übersicht!$S$4:$S$21,0),\"JA\",\"NEIN\")","v":{"$error":"#N/A"}}]
["Donnerstag","2025-06-19",null,null,null,{"$f":"IF(MATCH(B174,Übersicht!$S$4:$S$21,0),\"JA\",\"NEIN\")","v":"JA"}]
["Freitag","2025-06-20",null,null,null,{"$f":"IF(MATCH(B175,Übersicht!$S$4:$S$21,0),\"JA\",\"NEIN\")","v":{"$error":"#N/A"}}]
["Samstag","2025-06-21",null,null,null,{"$f":"IF(MATCH(B176,Übersicht!$S$4:$S$21,0),\"JA\",\"NEIN\")","v":{"$error":"#N/A"}}]
["Sonntag","2025-06-22",null,null,null,{"$f":"IF(MATCH(B177,Übersicht!$S$4:$S$21,0),\"JA\",\"NEIN\")","v":{"$error":"#N/A"}}]
["Montag","2025-06-23",null,null,null,{"$f":"IF(MATCH(B178,Übersicht!$S$4:$S$21,0),\"JA\",\"NEIN\")","v":{"$error":"#N/A"}}]
["Dienstag","2025-06-24",null,null,null,{"$f":"IF(MATCH(B179,Übersicht!$S$4:$S$21,0),\"JA\",\"NEIN\")","v":{"$error":"#N/A"}}]
["Mittwoch","2025-06-25",null,null,null,{"$f":"IF(MATCH(B180,Übersicht!$S$4:$S$21,0),\"JA\",\"NEIN\")","v":{"$error":"#N/A"}}]
["Donnerstag","2025-06-26",null,null,null,{"$f":"IF(MATCH(B181,Übersicht!$S$4:$S$21,0),\"JA\",\"NEIN\")","v":{"$error":"#N/A"}}]
["Freitag","2025-06-27",null,null,null,{"$f":"IF(MATCH(B182,Übersicht!$S$4:$S$21,0),\"JA\",\"NEIN\")","v":{"$error":"#N/A"}}]
["Samstag","2025-06-28",null,null,null,{"$f":"IF(MATCH(B183,Übersicht!$S$4:$S$21,0),\"JA\",\"NEIN\")","v":{"$error":"#N/A"}}]
["Sonntag","2025-06-29",null,null,null,{"$f":"IF(MATCH(B184,Übersicht!$S$4:$S$21,0),\"JA\",\"NEIN\")","v":{"$error":"#N/A"}}]
["Montag","2025-06-30",null,null,null,{"$f":"IF(MATCH(B185,Übersicht!$S$4:$S$21,0),\"JA\",\"NEIN\")","v":{"$error":"#N/A"}}]
["Dienstag","2025-07-01",null,null,null,{"$f":"IF(MATCH(B186,Übersicht!$S$4:$S$21,0),\"JA\",\"NEIN\")","v":{"$error":"#N/A"}}]
["Mittwoch","2025-07-02",null,null,null,{"$f":"IF(MATCH(B187,Übersicht!$S$4:$S$21,0),\"JA\",\"NEIN\")","v":{"$error":"#N/A"}}]
["Donnerstag","2025-07-03",null,null,null,{"$f":"IF(MATCH(B188,Übersicht!$S$4:$S$21,0),\"JA\",\"NEIN\")","v":{"$error":"#N/A"}}]
["Freitag","2025-07-04",null,null,null,{"$f":"IF(MATCH(B189,Übersicht!$S$4:$S$21,0),\"JA\",\"NEIN\")","v":{"$error":"#N/A"}}]
["Samstag","2025-07-05",null,null,null,{"$f":"IF(MATCH(B190,Übersicht!$S$4:$S$21,0),\"JA\",\"NEIN\")","v":{"$error":"#N/A"}}]
["Sonntag","2025-07-06",null,null,null,{"$f":"IF(MATCH(B191,Übersicht!$S$4:$S$21,0),\"JA\",\"NEIN\")","v":{"$error":"#N/A"}}]
["Montag","2025-07-07",null,null,null,{"$f":"IF(MATCH(B192,Übersicht!$S$4:$S$21,0),\"JA\",\"NEIN\")","v":{"$error":"#N/A"}}]
["Dienstag","2025-07-08",null,null,null,{"$f":"IF(MATCH(B193,Übersicht!$S$4:$S$21,0),\"JA\",\"NEIN\")","v":{"$error":"#N/A"}}]
["Mittwoch","2025-07-09",null,null,null,{"$f":"IF(MATCH(B194,Übersicht!$S$4:$S$21,0),\"JA\",\"NEIN\")","v":{"$error":"#N/A"}}]
["Donnerstag","2025-07-10",null,null,null,{"$f":"IF(MATCH(B195,Übersicht!$S$4:$S$21,0),\"JA\",\"NEIN\")","v":{"$error":"#N/A"}}]
["Freitag","2025-07-11",null,null,null,{"$f":"IF(MATCH(B196,Übersicht!$S$4:$S$21,0),\"JA\",\"NEIN\")","v":{"$error":"#N/A"}}]
["Samstag","2025-07-12",null,null,null,{"$f":"IF(MATCH(B197,Übersicht!$S$4:$S$21,0),\"JA\",\"NEIN\")","v":{"$error":"#N/A"}}]
[{"$f":"TEXT(B198,\"TTTT\")","v":"Sonntag"},"2025-07-13",null,null,null,{"$f":"IF(MATCH(B198,Übersicht!$S$4:$S$21,0),\"JA\",\"NEIN\")","v":{"$error":"#N/A"}}]
["Montag",{"$f":"B198+1","v":"2025-07-14"},null,null,null,{"$f":"IF(MATCH(B199,Übersicht!$S$4:$S$21,0),\"JA\",\"NEIN\")","v":{"$error":"#N/A"}}]
["Dienstag","2025-07-15",null,null,null,{"$f":"IF(MATCH(B200,Übersicht!$S$4:$S$21,0),\"JA\",\"NEIN\")","v":{"$error":"#N/A"}}]
["Mittwoch","2025-07-16",null,null,null,{"$f":"IF(MATCH(B201,Übersicht!$S$4:$S$21,0),\"JA\",\"NEIN\")","v":{"$error":"#N/A"}}]
["Donnerstag","2025-07-17",null,null,null,{"$f":"IF(MATCH(B202,Übersicht!$S$4:$S$21,0),\"JA\",\"NEIN\")","v":{"$error":"#N/A"}}]
["Freitag","2025-07-18",null,null,null,{"$f":"IF(MATCH(B203,Übersicht!$S$4:$S$21,0),\"JA\",\"NEIN\")","v":{"$error":"#N/A"}}]
["Samstag","2025-07-19",null,null,null,{"$f":"IF(MATCH(B204,Übersicht!$S$4:$S$21,0),\"JA\",\"NEIN\")","v":{"$error":"#N/A"}}]
["Sonntag","2025-07-20",null,null,null,{"$f":"IF(MATCH(B205,Übersicht!$S$4:$S$21,0),\"JA\",\"NEIN\")","v":{"$error":"#N/A"}}]
["Montag","2025-07-21",null,null,null,{"$f":"IF(MATCH(B206,Übersicht!$S$4:$S$21,0),\"JA\",\"NEIN\")","v":{"$error":"#N/A"}}]
["Dienstag","2025-07-22",null,null,null,{"$f":"IF(MATCH(B207,Übersicht!$S$4:$S$21,0),\"JA\",\"NEIN\")","v":{"$error":"#N/A"}}]
["Mittwoch","2025-07-23",null,null,null,{"$f":"IF(MATCH(B208,Übersicht!$S$4:$S$21,0),\"JA\",\"NEIN\")","v":{"$error":"#N/A"}}]
["Donnerstag","2025-07-24",null,null,null,{"$f":"IF(MATCH(B209,Übersicht!$S$4:$S$21,0),\"JA\",\"NEIN\")","v":{"$error":"#N/A"}}]
["Freitag","2025-07-25",null,null,null,{"$f":"IF(MATCH(B210,Übersicht!$S$4:$S$21,0),\"JA\",\"NEIN\")","v":{"$error":"#N/A"}}]
["Samstag","2025-07-26",null,null,null,{"$f":"IF(MATCH(B211,Übersicht!$S$4:$S$21,0),\"JA\",\"NEIN\")","v":{"$error":"#N/A"}}]
["Sonntag","2025-07-27",null,null,null,{"$f":"IF(MATCH(B212,Übersicht!$S$4:$S$21,0),\"JA\",\"NEIN\")","v":{"$error":"#N/A"}}]
["Montag","2025-07-28",null,null,null,{"$f":"IF(MATCH(B213,Übersicht!$S$4:$S$21,0),\"JA\",\"NEIN\")","v":{"$error":"#N/A"}}]
["Dienstag","2025-07-29",null,null,null,{"$f":"IF(MATCH(B214,Übersicht!$S$4:$S$21,0),\"JA\",\"NEIN\")","v":{"$error":"#N/A"}}]
["Mittwoch","2025-07-30",null,null,null,{"$f":"IF(MATCH(B215,Übersicht!$S$4:$S$21,0),\"JA\",\"NEIN\")","v":{"$error":"#N/A"}}]
["Donnerstag","2025-07-31",null,null,null,{"$f":"IF(MATCH(B216,Übersicht!$S$4:$S$21,0),\"JA\",\"NEIN\")","v":{"$error":"#N/A"}}]
["Freitag","2025-08-01",null,null,null,{"$f":"IF(MATCH(B217,Übersicht!$S$4:$S$21,0),\"JA\",\"NEIN\")","v":{"$error":"#N/A"}}]
["Samstag","2025-08-02",null,null,null,{"$f":"IF(MATCH(B218,Übersicht!$S$4:$S$21,0),\"JA\",\"NEIN\")","v":{"$error":"#N/A"}}]
["Sonntag","2025-08-03",null,null,null,{"$f":"IF(MATCH(B219,Übersicht!$S$4:$S$21,0),\"JA\",\"NEIN\")","v":{"$error":"#N/A"}}]
["Montag","2025-08-04",null,null,null,{"$f":"IF(MATCH(B220,Übersicht!$S$4:$S$21,0),\"JA\",\"NEIN\")","v":{"$error":"#N/A"}}]
["Dienstag","2025-08-05",null,null,null,{"$f":"IF(MATCH(B221,Übersicht!$S$4:$S$21,0),\"JA\",\"NEIN\")","v":{"$error":"#N/A"}}]
["Mittwoch","2025-08-06",null,null,null,{"$f":"IF(MATCH(B222,Übersicht!$S$4:$S$21,0),\"JA\",\"NEIN\")","v":{"$error":"#N/A"}}]
["Donnerstag","2025-08-07",null,null,null,{"$f":"IF(MATCH(B223,Übersicht!$S$4:$S$21,0),\"JA\",\"NEIN\")","v":{"$error":"#N/A"}}]
["Freitag","2025-08-08",null,null,null,{"$f":"IF(MATCH(B224,Übersicht!$S$4:$S$21,0),\"JA\",\"NEIN\")","v":{"$error":"#N/A"}}]
["Samstag","2025-08-09",null,null,null,{"$f":"IF(MATCH(B225,Übersicht!$S$4:$S$21,0),\"JA\",\"NEIN\")","v":{"$error":"#N/A"}}]
["Sonntag","2025-08-10",null,null,null,{"$f":"IF(MATCH(B226,Übersicht!$S$4:$S$21,0),\"JA\",\"NEIN\")","v":{"$error":"#N/A"}}]
["Montag","2025-08-11",null,null,null,{"$f":"IF(MATCH(B227,Übersicht!$S$4:$S$21,0),\"JA\",\"NEIN\")","v":{"$error":"#N/A"}}]
["Dienstag","2025-08-12",null,null,null,{"$f":"IF(MATCH(B228,Übersicht!$S$4:$S$21,0),\"JA\",\"NEIN\")","v":{"$error":"#N/A"}}]
["Mittwoch","2025-08-13",null,null,null,{"$f":"IF(MATCH(B229,Übersicht!$S$4:$S$21,0),\"JA\",\"NEIN\")","v":{"$error":"#N/A"}}]
["Donnerstag","2025-08-14",null,null,null,{"$f":"IF(MATCH(B230,Übersicht!$S$4:$S$21,0),\"JA\",\"NEIN\")","v":{"$error":"#N/A"}}]
["Freitag","2025-08-15",null,null,null,{"$f":"IF(MATCH(B231,Übersicht!$S$4:$S$21,0),\"JA\",\"NEIN\")","v":"JA"}]
["Samstag","2025-08-16",null,null,null,{"$f":"IF(MATCH(B232,Übersicht!$S$4:$S$21,0),\"JA\",\"NEIN\")","v":{"$error":"#N/A"}}]
["Sonntag","2025-08-17",null,null,null,{"$f":"IF(MATCH(B233,Übersicht!$S$4:$S$21,0),\"JA\",\"NEIN\")","v":{"$error":"#N/A"}}]
["Montag","2025-08-18",null,null,null,{"$f":"IF(MATCH(B234,Übersicht!$S$4:$S$21,0),\"JA\",\"NEIN\")","v":{"$error":"#N/A"}}]
["Dienstag","2025-08-19",null,null,null,{"$f":"IF(MATCH(B235,Übersicht!$S$4:$S$21,0),\"JA\",\"NEIN\")","v":{"$error":"#N/A"}}]
["Mittwoch","2025-08-20",null,null,null,{"$f":"IF(MATCH(B236,Übersicht!$S$4:$S$21,0),\"JA\",\"NEIN\")","v":{"$error":"#N/A"}}]
["Donnerstag","2025-08-21",null,null,null,{"$f":"IF(MATCH(B237,Übersicht!$S$4:$S$21,0),\"JA\",\"NEIN\")","v":{"$error":"#N/A"}}]
["Freitag","2025-08-22",null,null,null,{"$f":"IF(MATCH(B238,Übersicht!$S$4:$S$21,0),\"JA\",\"NEIN\")","v":{"$error":"#N/A"}}]
["Samstag","2025-08-23",null,null,null,{"$f":"IF(MATCH(B239,Übersicht!$S$4:$S$21,0),\"JA\",\"NEIN\")","v":{"$error":"#N/A"}}]
["Sonntag","2025-08-24",null,null,null,{"$f":"IF(MATCH(B240,Übersicht!$S$4:$S$21,0),\"JA\",\"NEIN\")","v":{"$error":"#N/A"}}]
["Montag","2025-08-25",null,null,null,{"$f":"IF(MATCH(B241,Übersicht!$S$4:$S$21,0),\"JA\",\"NEIN\")","v":{"$error":"#N/A"}}]
["Dienstag","2025-08-26",null,null,null,{"$f":"IF(MATCH(B242,Übersicht!$S$4:$S$21,0),\"JA\",\"NEIN\")","v":{"$error":"#N/A"}}]
["Mittwoch","2025-08-27",null,null,null,{"$f":"IF(MATCH(B243,Übersicht!$S$4:$S$21,0),\"JA\",\"NEIN\")","v":{"$error":"#N/A"}}]
["Donnerstag","2025-08-28",null,null,null,{"$f":"IF(MATCH(B244,Übersicht!$S$4:$S$21,0),\"JA\",\"NEIN\")","v":{"$error":"#N/A"}}]
["Freitag","2025-08-29",null,null,null,{"$f":"IF(MATCH(B245,Übersicht!$S$4:$S$21,0),\"JA\",\"NEIN\")","v":{"$error":"#N/A"}}]
["Samstag","2025-08-30",null,null,null,{"$f":"IF(MATCH(B246,Übersicht!$S$4:$S$21,0),\"JA\",\"NEIN\")","v":{"$error":"#N/A"}}]
["Sonntag","2025-08-31",null,null,null,{"$f":"IF(MATCH(B247,Übersicht!$S$4:$S$21,0),\"JA\",\"NEIN\")","v":{"$error":"#N/A"}}]
["Montag","2025-09-01",null,null,null,{"$f":"IF(MATCH(B248,Übersicht!$S$4:$S$21,0),\"JA\",\"NEIN\")","v":{"$error":"#N/A"}}]
["Dienstag","2025-09-02",null,null,null,{"$f":"IF(MATCH(B249,Übersicht!$S$4:$S$21,0),\"JA\",\"NEIN\")","v":{"$error":"#N/A"}}]
["Mittwoch","2025-09-03",null,null,null,{"$f":"IF(MATCH(B250,Übersicht!$S$4:$S$21,0),\"JA\",\"NEIN\")","v":{"$error":"#N/A"}}]
["Donnerstag","2025-09-04",null,null,null,{"$f":"IF(MATCH(B251,Übersicht!$S$4:$S$21,0),\"JA\",\"NEIN\")","v":{"$error":"#N/A"}}]
["Freitag","2025-09-05",null,null,null,{"$f":"IF(MATCH(B252,Übersicht!$S$4:$S$21,0),\"JA\",\"NEIN\")","v":{"$error":"#N/A"}}]
["Samstag","2025-09-06",null,null,null,{"$f":"IF(MATCH(B253,Übersicht!$S$4:$S$21,0),\"JA\",\"NEIN\")","v":{"$error":"#N/A"}}]
["Sonntag","2025-09-07",null,null,null,{"$f":"IF(MATCH(B254,Übersicht!$S$4:$S$21,0),\"JA\",\"NEIN\")","v":{"$error":"#N/A"}}]
["Montag","2025-09-08",null,null,null,{"$f":"IF(MATCH(B255,Übersicht!$S$4:$S$21,0),\"JA\",\"NEIN\")","v":{"$error":"#N/A"}}]
["Dienstag","2025-09-09",null,null,null,{"$f":"IF(MATCH(B256,Übersicht!$S$4:$S$21,0),\"JA\",\"NEIN\")","v":{"$error":"#N/A"}}]
["Mittwoch","2025-09-10",null,null,null,{"$f":"IF(MATCH(B257,Übersicht!$S$4:$S$21,0),\"JA\",\"NEIN\")","v":{"$error":"#N/A"}}]
["Donnerstag","2025-09-11",null,null,null,{"$f":"IF(MATCH(B258,Übersicht!$S$4:$S$21,0),\"JA\",\"NEIN\")","v":{"$error":"#N/A"}}]
["Freitag","2025-09-12",null,null,null,{"$f":"IF(MATCH(B259,Übersicht!$S$4:$S$21,0),\"JA\",\"NEIN\")","v":{"$error":"#N/A"}}]
["Samstag","2025-09-13",null,null,null,{"$f":"IF(MATCH(B260,Übersicht!$S$4:$S$21,0),\"JA\",\"NEIN\")","v":{"$error":"#N/A"}}]
["Sonntag","2025-09-14",null,null,null,{"$f":"IF(MATCH(B261,Übersicht!$S$4:$S$21,0),\"JA\",\"NEIN\")","v":{"$error":"#N/A"}}]
[{"$f":"TEXT(B262,\"TTTT\")","v":"Montag"},"2025-09-15",null,null,null,{"$f":"IF(MATCH(B262,Übersicht!$S$4:$S$21,0),\"JA\",\"NEIN\")","v":{"$error":"#N/A"}}]
["Dienstag",{"$f":"B262+1","v":"2025-09-16"},null,null,null,{"$f":"IF(MATCH(B263,Übersicht!$S$4:$S$21,0),\"JA\",\"NEIN\")","v":{"$error":"#N/A"}}]
["Mittwoch","2025-09-17",null,null,null,{"$f":"IF(MATCH(B264,Übersicht!$S$4:$S$21,0),\"JA\",\"NEIN\")","v":{"$error":"#N/A"}}]
["Donnerstag","2025-09-18",null,null,null,{"$f":"IF(MATCH(B265,Übersicht!$S$4:$S$21,0),\"JA\",\"NEIN\")","v":{"$error":"#N/A"}}]
["Freitag","2025-09-19",null,null,null,{"$f":"IF(MATCH(B266,Übersicht!$S$4:$S$21,0),\"JA\",\"NEIN\")","v":{"$error":"#N/A"}}]
["Samstag","2025-09-20",null,null,null,{"$f":"IF(MATCH(B267,Übersicht!$S$4:$S$21,0),\"JA\",\"NEIN\")","v":{"$error":"#N/A"}}]
["Sonntag","2025-09-21",null,null,null,{"$f":"IF(MATCH(B268,Übersicht!$S$4:$S$21,0),\"JA\",\"NEIN\")","v":{"$error":"#N/A"}}]
["Montag","2025-09-22",null,null,null,{"$f":"IF(MATCH(B269,Übersicht!$S$4:$S$21,0),\"JA\",\"NEIN\")","v":{"$error":"#N/A"}}]
["Dienstag","2025-09-23",null,null,null,{"$f":"IF(MATCH(B270,Übersicht!$S$4:$S$21,0),\"JA\",\"NEIN\")","v":{"$error":"#N/A"}}]
["Mittwoch","2025-09-24",null,null,null,{"$f":"IF(MATCH(B271,Übersicht!$S$4:$S$21,0),\"JA\",\"NEIN\")","v":{"$error":"#N/A"}}]
["Donnerstag","2025-09-25",null,null,null,{"$f":"IF(MATCH(B272,Übersicht!$S$4:$S$21,0),\"JA\",\"NEIN\")","v":{"$error":"#N/A"}}]
["Freitag","2025-09-26",null,null,null,{"$f":"IF(MATCH(B273,Übersicht!$S$4:$S$21,0),\"JA\",\"NEIN\")","v":{"$error":"#N/A"}}]
["Samstag","2025-09-27",null,null,null,{"$f":"IF(MATCH(B274,Übersicht!$S$4:$S$21,0),\"JA\",\"NEIN\")","v":{"$error":"#N/A"}}]
["Sonntag","2025-09-28",null,null,null,{"$f":"IF(MATCH(B275,Übersicht!$S$4:$S$21,0),\"JA\",\"NEIN\")","v":{"$error":"#N/A"}}]
["Montag","2025-09-29",null,null,null,{"$f":"IF(MATCH(B276,Übersicht!$S$4:$S$21,0),\"JA\",\"NEIN\")","v":{"$error":"#N/A"}}]
["Dienstag","2025-09-30",null,null,null,{"$f":"IF(MATCH(B277,Übersicht!$S$4:$S$21,0),\"JA\",\"NEIN\")","v":{"$error":"#N/A"}}]
["Mittwoch","2025-10-01",null,null,null,{"$f":"IF(MATCH(B278,Übersicht!$S$4:$S$21,0),\"JA\",\"NEIN\")","v":{"$error":"#N/A"}}]
["Donnerstag","2025-10-02",null,null,null,{"$f":"IF(MATCH(B279,Übersicht!$S$4:$S$21,0),\"JA\",\"NEIN\")","v":{"$error":"#N/A"}}]
["Freitag","2025-10-03",null,null,null,{"$f":"IF(MATCH(B280,Übersicht!$S$4:$S$21,0),\"JA\",\"NEIN\")","v":"JA"}]
["Samstag","2025-10-04",null,null,null,{"$f":"IF(MATCH(B281,Übersicht!$S$4:$S$21,0),\"JA\",\"NEIN\")","v":{"$error":"#N/A"}}]
["Sonntag","2025-10-05",null,null,null,{"$f":"IF(MATCH(B282,Übersicht!$S$4:$S$21,0),\"JA\",\"NEIN\")","v":{"$error":"#N/A"}}]
["Montag","2025-10-06",null,null,null,{"$f":"IF(MATCH(B283,Übersicht!$S$4:$S$21,0),\"JA\",\"NEIN\")","v":{"$error":"#N/A"}}]
["Dienstag","2025-10-07",null,null,null,{"$f":"IF(MATCH(B284,Übersicht!$S$4:$S$21,0),\"JA\",\"NEIN\")","v":{"$error":"#N/A"}}]
["Mittwoch","2025-10-08",null,null,null,{"$f":"IF(MATCH(B285,Übersicht!$S$4:$S$21,0),\"JA\",\"NEIN\")","v":{"$error":"#N/A"}}]
["Donnerstag","2025-10-09",null,null,null,{"$f":"IF(MATCH(B286,Übersicht!$S$4:$S$21,0),\"JA\",\"NEIN\")","v":{"$error":"#N/A"}}]
["Freitag","2025-10-10",null,null,null,{"$f":"IF(MATCH(B287,Übersicht!$S$4:$S$21,0),\"JA\",\"NEIN\")","v":{"$error":"#N/A"}}]
["Samstag","2025-10-11",null,null,null,{"$f":"IF(MATCH(B288,Übersicht!$S$4:$S$21,0),\"JA\",\"NEIN\")","v":{"$error":"#N/A"}}]
["Sonntag","2025-10-12",null,null,null,{"$f":"IF(MATCH(B289,Übersicht!$S$4:$S$21,0),\"JA\",\"NEIN\")","v":{"$error":"#N/A"}}]
["Montag","2025-10-13",null,null,null,{"$f":"IF(MATCH(B290,Übersicht!$S$4:$S$21,0),\"JA\",\"NEIN\")","v":{"$error":"#N/A"}}]
["Dienstag","2025-10-14",null,null,null,{"$f":"IF(MATCH(B291,Übersicht!$S$4:$S$21,0),\"JA\",\"NEIN\")","v":{"$error":"#N/A"}}]
["Mittwoch","2025-10-15",null,null,null,{"$f":"IF(MATCH(B292,Übersicht!$S$4:$S$21,0),\"JA\",\"NEIN\")","v":{"$error":"#N/A"}}]
["Donnerstag","2025-10-16",null,null,null,{"$f":"IF(MATCH(B293,Übersicht!$S$4:$S$21,0),\"JA\",\"NEIN\")","v":{"$error":"#N/A"}}]
["Freitag","2025-10-17",null,null,null,{"$f":"IF(MATCH(B294,Übersicht!$S$4:$S$21,0),\"JA\",\"NEIN\")","v":{"$error":"#N/A"}}]
["Samstag","2025-10-18",null,null,null,{"$f":"IF(MATCH(B295,Übersicht!$S$4:$S$21,0),\"JA\",\"NEIN\")","v":{"$error":"#N/A"}}]
["Sonntag","2025-10-19",null,null,null,{"$f":"IF(MATCH(B296,Übersicht!$S$4:$S$21,0),\"JA\",\"NEIN\")","v":{"$error":"#N/A"}}]
["Montag","2025-10-20",null,null,null,{"$f":"IF(MATCH(B297,Übersicht!$S$4:$S$21,0),\"JA\",\"NEIN\")","v":{"$error":"#N/A"}}]
["Dienstag","2025-10-21",null,null,null,{"$f":"IF(MATCH(B298,Übersicht!$S$4:$S$21,0),\"JA\",\"NEIN\")","v":{"$error":"#N/A"}}]
["Mittwoch","2025-10-22",null,null,null,{"$f":"IF(MATCH(B299,Übersicht!$S$4:$S$21,0),\"JA\",\"NEIN\")","v":{"$error":"#N/A"}}]
["Donnerstag","2025-10-23",null,null,null,{"$f":"IF(MATCH(B300,Übersicht!$S$4:$S$21,0),\"JA\",\"NEIN\")","v":{"$error":"#N/A"}}]
["Freitag","2025-10-24",null,null,null,{"$f":"IF(MATCH(B301,Übersicht!$S$4:$S$21,0),\"JA\",\"NEIN\")","v":{"$error":"#N/A"}}]
["Samstag","2025-10-25",null,null,null,{"$f":"IF(MATCH(B302,Übersicht!$S$4:$S$21,0),\"JA\",\"NEIN\")","v":{"$error":"#N/A"}}]
["Sonntag","2025-10-26",null,null,null,{"$f":"IF(MATCH(B303,Übersicht!$S$4:$S$21,0),\"JA\",\"NEIN\")","v":{"$error":"#N/A"}}]
["Montag","2025-10-27",null,null,null,{"$f":"IF(MATCH(B304,Übersicht!$S$4:$S$21,0),\"JA\",\"NEIN\")","v":{"$error":"#N/A"}}]
["Dienstag","2025-10-28",null,null,null,{"$f":"IF(MATCH(B305,Übersicht!$S$4:$S$21,0),\"JA\",\"NEIN\")","v":{"$error":"#N/A"}}]
["Mittwoch","2025-10-29",null,null,null,{"$f":"IF(MATCH(B306,Übersicht!$S$4:$S$21,0),\"JA\",\"NEIN\")","v":{"$error":"#N/A"}}]
["Donnerstag","2025-10-30",null,null,null,{"$f":"IF(MATCH(B307,Übersicht!$S$4:$S$21,0),\"JA\",\"NEIN\")","v":{"$error":"#N/A"}}]
["Freitag","2025-10-31",null,null,null,{"$f":"IF(MATCH(B308,Übersicht!$S$4:$S$21,0),\"JA\",\"NEIN\")","v":{"$error":"#N/A"}}]
["Samstag","2025-11-01",null,null,null,{"$f":"IF(MATCH(B309,Übersicht!$S$4:$S$21,0),\"JA\",\"NEIN\")","v":"JA"}]
["Sonntag","2025-11-02",null,null,null,{"$f":"IF(MATCH(B310,Übersicht!$S$4:$S$21,0),\"JA\",\"NEIN\")","v":{"$error":"#N/A"}}]
["Montag","2025-11-03",null,null,null,{"$f":"IF(MATCH(B311,Übersicht!$S$4:$S$21,0),\"JA\",\"NEIN\")","v":{"$error":"#N/A"}}]
["Dienstag","2025-11-04",null,null,null,{"$f":"IF(MATCH(B312,Übersicht!$S$4:$S$21,0),\"JA\",\"NEIN\")","v":{"$error":"#N/A"}}]
["Mittwoch","2025-11-05",null,null,null,{"$f":"IF(MATCH(B313,Übersicht!$S$4:$S$21,0),\"JA\",\"NEIN\")","v":{"$error":"#N/A"}}]
["Donnerstag","2025-11-06",null,null,null,{"$f":"IF(MATCH(B314,Übersicht!$S$4:$S$21,0),\"JA\",\"NEIN\")","v":{"$error":"#N/A"}}]
["Freitag","2025-11-07",null,null,null,{"$f":"IF(MATCH(B315,Übersicht!$S$4:$S$21,0),\"JA\",\"NEIN\")","v":{"$error":"#N/A"}}]
["Samstag","2025-11-08",null,null,null,{"$f":"IF(MATCH(B316,Übersicht!$S$4:$S$21,0),\"JA\",\"NEIN\")","v":{"$error":"#N/A"}}]
["Sonntag","2025-11-09",null,null,null,{"$f":"IF(MATCH(B317,Übersicht!$S$4:$S$21,0),\"JA\",\"NEIN\")","v":{"$error":"#N/A"}}]
["Montag","2025-11-10",null,null,null,{"$f":"IF(MATCH(B318,Übersicht!$S$4:$S$21,0),\"JA\",\"NEIN\")","v":{"$error":"#N/A"}}]
["Dienstag","2025-11-11",null,null,null,{"$f":"IF(MATCH(B319,Übersicht!$S$4:$S$21,0),\"JA\",\"NEIN\")","v":{"$error":"#N/A"}}]
["Mittwoch","2025-11-12",null,null,null,{"$f":"IF(MATCH(B320,Übersicht!$S$4:$S$21,0),\"JA\",\"NEIN\")","v":{"$error":"#N/A"}}]
["Donnerstag","2025-11-13",null,null,null,{"$f":"IF(MATCH(B321,Übersicht!$S$4:$S$21,0),\"JA\",\"NEIN\")","v":{"$error":"#N/A"}}]
["Freitag","2025-11-14",null,null,null,{"$f":"IF(MATCH(B322,Übersicht!$S$4:$S$21,0),\"JA\",\"NEIN\")","v":{"$error":"#N/A"}}]
["Samstag","2025-11-15",null,null,null,{"$f":"IF(MATCH(B323,Übersicht!$S$4:$S$21,0),\"JA\",\"NEIN\")","v":{"$error":"#N/A"}}]
["Sonntag","2025-11-16",null,null,null,{"$f":"IF(MATCH(B324,Übersicht!$S$4:$S$21,0),\"JA\",\"NEIN\")","v":{"$error":"#N/A"}}]
["Montag","2025-11-17",null,null,null,{"$f":"IF(MATCH(B325,Übersicht!$S$4:$S$21,0),\"JA\",\"NEIN\")","v":{"$error":"#N/A"}}]
[{"$f":"TEXT(B326,\"TTTT\")","v":"Dienstag"},"2025-11-18",null,null,null,{"$f":"IF(MATCH(B326,Übersicht!$S$4:$S$21,0),\"JA\",\"NEIN\")","v":{"$error":"#N/A"}}]
["Mittwoch",{"$f":"B326+1","v":"2025-11-19"},null,null,null,{"$f":"IF(MATCH(B327,Übersicht!$S$4:$S$21,0),\"JA\",\"NEIN\")","v":{"$error":"#N/A"}}]
["Donnerstag","2025-11-20",null,null,null,{"$f":"IF(MATCH(B328,Übersicht!$S$4:$S$21,0),\"JA\",\"NEIN\")","v":{"$error":"#N/A"}}]
["Freitag","2025-11-21",null,null,null,{"$f":"IF(MATCH(B329,Übersicht!$S$4:$S$21,0),\"JA\",\"NEIN\")","v":{"$error":"#N/A"}}]
["Samstag","2025-11-22",null,null,null,{"$f":"IF(MATCH(B330,Übersicht!$S$4:$S$21,0),\"JA\",\"NEIN\")","v":{"$error":"#N/A"}}]
["Sonntag","2025-11-23",null,null,null,{"$f":"IF(MATCH(B331,Übersicht!$S$4:$S$21,0),\"JA\",\"NEIN\")","v":{"$error":"#N/A"}}]
["Montag","2025-11-24",null,null,null,{"$f":"IF(MATCH(B332,Übersicht!$S$4:$S$21,0),\"JA\",\"NEIN\")","v":{"$error":"#N/A"}}]
["Dienstag","2025-11-25",null,null,null,{"$f":"IF(MATCH(B333,Übersicht!$S$4:$S$21,0),\"JA\",\"NEIN\")","v":{"$error":"#N/A"}}]
["Mittwoch","2025-11-26",null,null,null,{"$f":"IF(MATCH(B334,Übersicht!$S$4:$S$21,0),\"JA\",\"NEIN\")","v":{"$error":"#N/A"}}]
["Donnerstag","2025-11-27",null,null,null,{"$f":"IF(MATCH(B335,Übersicht!$S$4:$S$21,0),\"JA\",\"NEIN\")","v":{"$error":"#N/A"}}]
["Freitag","2025-11-28",null,null,null,{"$f":"IF(MATCH(B336,Übersicht!$S$4:$S$21,0),\"JA\",\"NEIN\")","v":{"$error":"#N/A"}}]
["Samstag","2025-11-29",null,null,null,{"$f":"IF(MATCH(B337,Übersicht!$S$4:$S$21,0),\"JA\",\"NEIN\")","v":{"$error":"#N/A"}}]
["Sonntag","2025-11-30",null,null,null,{"$f":"IF(MATCH(B338,Übersicht!$S$4:$S$21,0),\"JA\",\"NEIN\")","v":{"$error":"#N/A"}}]
["Montag","2025-12-01",null,null,null,{"$f":"IF(MATCH(B339,Übersicht!$S$4:$S$21,0),\"JA\",\"NEIN\")","v":{"$error":"#N/A"}}]
["Dienstag","2025-12-02",null,null,null,{"$f":"IF(MATCH(B340,Übersicht!$S$4:$S$21,0),\"JA\",\"NEIN\")","v":{"$error":"#N/A"}}]
["Mittwoch","2025-12-03",null,null,null,{"$f":"IF(MATCH(B341,Übersicht!$S$4:$S$21,0),\"JA\",\"NEIN\")","v":{"$error":"#N/A"}}]
["Donnerstag","2025-12-04",null,null,null,{"$f":"IF(MATCH(B342,Übersicht!$S$4:$S$21,0),\"JA\",\"NEIN\")","v":{"$error":"#N/A"}}]
["Freitag","2025-12-05",null,null,null,{"$f":"IF(MATCH(B343,Übersicht!$S$4:$S$21,0),\"JA\",\"NEIN\")","v":{"$error":"#N/A"}}]
["Samstag","2025-12-06",null,null,null,{"$f":"IF(MATCH(B344,Übersicht!$S$4:$S$21,0),\"JA\",\"NEIN\")","v":{"$error":"#N/A"}}]
["Sonntag","2025-12-07",null,null,null,{"$f":"IF(MATCH(B345,Übersicht!$S$4:$S$21,0),\"JA\",\"NEIN\")","v":{"$error":"#N/A"}}]
["Montag","2025-12-08",null,null,null,{"$f":"IF(MATCH(B346,Übersicht!$S$4:$S$21,0),\"JA\",\"NEIN\")","v":{"$error":"#N/A"}}]
["Dienstag","2025-12-09",null,null,null,{"$f":"IF(MATCH(B347,Übersicht!$S$4:$S$21,0),\"JA\",\"NEIN\")","v":{"$error":"#N/A"}}]
["Mittwoch","2025-12-10",null,null,null,{"$f":"IF(MATCH(B348,Übersicht!$S$4:$S$21,0),\"JA\",\"NEIN\")","v":{"$error":"#N/A"}}]
["Donnerstag","2025-12-11",null,null,null,{"$f":"IF(MATCH(B349,Übersicht!$S$4:$S$21,0),\"JA\",\"NEIN\")","v":{"$error":"#N/A"}}]
["Freitag","2025-12-12",null,null,null,{"$f":"IF(MATCH(B350,Übersicht!$S$4:$S$21,0),\"JA\",\"NEIN\")","v":{"$error":"#N/A"}}]
["Samstag","2025-12-13",null,null,null,{"$f":"IF(MATCH(B351,Übersicht!$S$4:$S$21,0),\"JA\",\"NEIN\")","v":{"$error":"#N/A"}}]
["Sonntag","2025-12-14",null,null,null,{"$f":"IF(MATCH(B352,Übersicht!$S$4:$S$21,0),\"JA\",\"NEIN\")","v":{"$error":"#N/A"}}]
["Montag","2025-12-15",null,null,null,{"$f":"IF(MATCH(B353,Übersicht!$S$4:$S$21,0),\"JA\",\"NEIN\")","v":{"$error":"#N/A"}}]
["Dienstag","2025-12-16",null,null,null,{"$f":"IF(MATCH(B354,Übersicht!$S$4:$S$21,0),\"JA\",\"NEIN\")","v":{"$error":"#N/A"}}]
["Mittwoch","2025-12-17",null,null,null,{"$f":"IF(MATCH(B355,Übersicht!$S$4:$S$21,0),\"JA\",\"NEIN\")","v":{"$error":"#N/A"}}]
["Donnerstag","2025-12-18",null,null,null,{"$f":"IF(MATCH(B356,Übersicht!$S$4:$S$21,0),\"JA\",\"NEIN\")","v":{"$error":"#N/A"}}]
["Freitag","2025-12-19",null,null,null,{"$f":"IF(MATCH(B357,Übersicht!$S$4:$S$21,0),\"JA\",\"NEIN\")","v":{"$error":"#N/A"}}]
["Samstag","2025-12-20",null,null,null,{"$f":"IF(MATCH(B358,Übersicht!$S$4:$S$21,0),\"JA\",\"NEIN\")","v":{"$error":"#N/A"}}]
["Sonntag","2025-12-21",null,null,null,{"$f":"IF(MATCH(B359,Übersicht!$S$4:$S$21,0),\"JA\",\"NEIN\")","v":{"$error":"#N/A"}}]
["Montag","2025-12-22",null,null,null,{"$f":"IF(MATCH(B360,Übersicht!$S$4:$S$21,0),\"JA\",\"NEIN\")","v":{"$error":"#N/A"}}]
["Dienstag","2025-12-23",null,null,null,{"$f":"IF(MATCH(B361,Übersicht!$S$4:$S$21,0),\"JA\",\"NEIN\")","v":{"$error":"#N/A"}}]
["Mittwoch","2025-12-24",null,null,null,{"$f":"IF(MATCH(B362,Übersicht!$S$4:$S$21,0),\"JA\",\"NEIN\")","v":"JA"}]
["Donnerstag","2025-12-25",null,null,null,{"$f":"IF(MATCH(B363,Übersicht!$S$4:$S$21,0),\"JA\",\"NEIN\")","v":"JA"}]
["Freitag","2025-12-26",null,null,null,{"$f":"IF(MATCH(B364,Übersicht!$S$4:$S$21,0),\"JA\",\"NEIN\")","v":"JA"}]
["Samstag","2025-12-27",null,null,null,{"$f":"IF(MATCH(B365,Übersicht!$S$4:$S$21,0),\"JA\",\"NEIN\")","v":{"$error":"#N/A"}}]
["Sonntag","2025-12-28",null,null,null,{"$f":"IF(MATCH(B366,Übersicht!$S$4:$S$21,0),\"JA\",\"NEIN\")","v":{"$error":"#N/A"}}]
["Montag","2025-12-29",null,null,null,{"$f":"IF(MATCH(B367,Übersicht!$S$4:$S$21,0),\"JA\",\"NEIN\")","v":{"$error":"#N/A"}}]
["Dienstag","2025-12-30",null,null,null,{"$f":"IF(MATCH(B368,Übersicht!$S$4:$S$21,0),\"JA\",\"NEIN\")","v":{"$error":"#N/A"}}]
["Mittwoch","2025-12-31",null,null,null,{"$f":"IF(MATCH(B369,Übersicht!$S$4:$S$21,0),\"JA\",\"NEIN\")","v":"JA"}]
["Donnerstag","2026-01-01",null,null,null,{"$f":"IF(MATCH(B370,Übersicht!$S$4:$S$21,0),\"JA\",\"NEIN\")","v":"JA"}]
["Freitag","2026-01-02",null,null,null,{"$f":"IF(MATCH(B371,Übersicht!$S$4:$S$21,0),\"JA\",\"NEIN\")","v":{"$error":"#N/A"}}]
["Samstag","2026-01-03",null,null,null,{"$f":"IF(MATCH(B372,Übersicht!$S$4:$S$21,0),\"JA\",\"NEIN\")","v":{"$error":"#N/A"}}]
["Sonntag","2026-01-04",null,null,null,{"$f":"IF(MATCH(B373,Übersicht!$S$4:$S$21,0),\"JA\",\"NEIN\")","v":{"$error":"#N/A"}}]
["Montag","2026-01-05",null,null,null,{"$f":"IF(MATCH(B374,Übersicht!$S$4:$S$21,0),\"JA\",\"NEIN\")","v":{"$error":"#N/A"}}]
["Dienstag","2026-01-06",null,null,null,{"$f":"IF(MATCH(B375,Übersicht!$S$4:$S$21,0),\"JA\",\"NEIN\")","v":"JA"}]
["Mittwoch","2026-01-07",null,null,null,{"$f":"IF(MATCH(B376,Übersicht!$S$4:$S$21,0),\"JA\",\"NEIN\")","v":{"$error":"#N/A"}}]
["Donnerstag","2026-01-08",null,null,null,{"$f":"IF(MATCH(B377,Übersicht!$S$4:$S$21,0),\"JA\",\"NEIN\")","v":{"$error":"#N/A"}}]
["Freitag","2026-01-09",null,null,null,{"$f":"IF(MATCH(B378,Übersicht!$S$4:$S$21,0),\"JA\",\"NEIN\")","v":{"$error":"#N/A"}}]
["Samstag","2026-01-10",null,null,null,{"$f":"IF(MATCH(B379,Übersicht!$S$4:$S$21,0),\"JA\",\"NEIN\")","v":{"$error":"#N/A"}}]
["Sonntag","2026-01-11",null,null,null,{"$f":"IF(MATCH(B380,Übersicht!$S$4:$S$21,0),\"JA\",\"NEIN\")","v":{"$error":"#N/A"}}]
["Montag","2026-01-12",null,null,null,{"$f":"IF(MATCH(B381,Übersicht!$S$4:$S$21,0),\"JA\",\"NEIN\")","v":{"$error":"#N/A"}}]
["Dienstag","2026-01-13",null,null,null,{"$f":"IF(MATCH(B382,Übersicht!$S$4:$S$21,0),\"JA\",\"NEIN\")","v":{"$error":"#N/A"}}]
["Mittwoch","2026-01-14",null,null,null,{"$f":"IF(MATCH(B383,Übersicht!$S$4:$S$21,0),\"JA\",\"NEIN\")","v":{"$error":"#N/A"}}]
["Donnerstag","2026-01-15",null,null,null,{"$f":"IF(MATCH(B384,Übersicht!$S$4:$S$21,0),\"JA\",\"NEIN\")","v":{"$error":"#N/A"}}]
["Freitag","2026-01-16",null,null,null,{"$f":"IF(MATCH(B385,Übersicht!$S$4:$S$21,0),\"JA\",\"NEIN\")","v":{"$error":"#N/A"}}]
["Samstag","2026-01-17",null,null,null,{"$f":"IF(MATCH(B386,Übersicht!$S$4:$S$21,0),\"JA\",\"NEIN\")","v":{"$error":"#N/A"}}]
["Sonntag","2026-01-18",null,null,null,{"$f":"IF(MATCH(B387,Übersicht!$S$4:$S$21,0),\"JA\",\"NEIN\")","v":{"$error":"#N/A"}}]
["Montag",{"$f":"B387+1","v":"2026-01-19"},null,null,null,{"$f":"IF(MATCH(B388,Übersicht!$S$4:$S$21,0),\"JA\",\"NEIN\")","v":{"$error":"#N/A"}}]
["Dienstag",{"$f":"B388+1","v":"2026-01-20"},null,null,null,{"$f":"IF(MATCH(B389,Übersicht!$S$4:$S$21,0),\"JA\",\"NEIN\")","v":{"$error":"#N/A"}}]
[{"$f":"TEXT(B390,\"TTTT\")","v":"Mittwoch"},"2026-01-21",null,null,null,{"$f":"IF(MATCH(B390,Übersicht!$S$4:$S$21,0),\"JA\",\"NEIN\")","v":{"$error":"#N/A"}}]
["Donnerstag","2026-01-22",null,null,null,{"$f":"IF(MATCH(B391,Übersicht!$S$4:$S$21,0),\"JA\",\"NEIN\")","v":{"$error":"#N/A"}}]
["Freitag","2026-01-23",null,null,null,{"$f":"IF(MATCH(B392,Übersicht!$S$4:$S$21,0),\"JA\",\"NEIN\")","v":{"$error":"#N/A"}}]
["Samstag","2026-01-24",null,null,null,{"$f":"IF(MATCH(B393,Übersicht!$S$4:$S$21,0),\"JA\",\"NEIN\")","v":{"$error":"#N/A"}}]
["Sonntag","2026-01-25",null,null,null,{"$f":"IF(MATCH(B394,Übersicht!$S$4:$S$21,0),\"JA\",\"NEIN\")","v":{"$error":"#N/A"}}]
["Montag","2026-01-26",null,null,null,{"$f":"IF(MATCH(B395,Übersicht!$S$4:$S$21,0),\"JA\",\"NEIN\")","v":{"$error":"#N/A"}}]
["Dienstag","2026-01-27",null,null,null,{"$f":"IF(MATCH(B396,Übersicht!$S$4:$S$21,0),\"JA\",\"NEIN\")","v":{"$error":"#N/A"}}]
["Mittwoch","2026-01-28",null,null,null,{"$f":"IF(MATCH(B397,Übersicht!$S$4:$S$21,0),\"JA\",\"NEIN\")","v":{"$error":"#N/A"}}]
["Donnerstag","2026-01-29",null,null,null,{"$f":"IF(MATCH(B398,Übersicht!$S$4:$S$21,0),\"JA\",\"NEIN\")","v":{"$error":"#N/A"}}]
["Freitag","2026-01-30",null,null,null,{"$f":"IF(MATCH(B399,Übersicht!$S$4:$S$21,0),\"JA\",\"NEIN\")","v":{"$error":"#N/A"}}]
["Samstag","2026-01-31",null,null,null,{"$f":"IF(MATCH(B400,Übersicht!$S$4:$S$21,0),\"JA\",\"NEIN\")","v":{"$error":"#N/A"}}]

{"sheet":"202501","index":2,"n_rows":4,"n_cols":11,"rows_kept":4,"cut":false,"hidden":false,"merged":[]}
[null,null,null,{"$f":"IF(MATCH(D3,Übersicht!$S$4:$S$21,0),\"JA\",\"NEIN\")","v":{"$error":"#N/A"}},{"$f":"IF(MATCH(E3,Übersicht!$S$4:$S$21,0),\"JA\",\"NEIN\")","v":"JA"},{"$f":"IF(MATCH(F3,Übersicht!$S$4:$S$21,0),\"JA\",\"NEIN\")","v":"JA"},{"$f":"IF(MATCH(G3,Übersicht!$S$4:$S$21,0),\"JA\",\"NEIN\")","v":{"$error":"#N/A"}},{"$f":"IF(MATCH(H3,Übersicht!$S$4:$S$21,0),\"JA\",\"NEIN\")","v":{"$error":"#N/A"}},{"$f":"IF(MATCH(I3,Übersicht!$S$4:$S$21,0),\"JA\",\"NEIN\")","v":{"$error":"#N/A"}},{"$f":"IF(MATCH(J3,Übersicht!$S$4:$S$21,0),\"JA\",\"NEIN\")","v":{"$error":"#N/A"}}]
[null,null,null,{"$f":"IFERROR(D1:D1,\"\")","v":""},{"$f":"IFERROR(E1:E1,\"\")","v":"JA"},{"$f":"IFERROR(F1:F1,\"\")","v":"JA"},{"$f":"IFERROR(G1:G1,\"\")","v":""},{"$f":"IFERROR(H1:H1,\"\")","v":""},{"$f":"IFERROR(I1:I1,\"\")","v":""},{"$f":"IFERROR(J1:J1,\"\")","v":""}]
["KW",null,null,{"$f":"DATE(Übersicht!T1,1,1)+(A4-1)*7+1-WEEKDAY(DATE(Übersicht!T1,1,1)-1)","v":"2024-12-30"},{"$f":"D3+1","v":"2024-12-31"},{"$f":"E3+1","v":"2025-01-01"},{"$f":"F3+1","v":"2025-01-02"},"2025-01-03","2025-01-04","2025-01-05"]
[1,null,null,"Montag","Dienstag","Mittwoch","Donnerstag","Freitag","Samstag","Sonntag","Platz für Notizen:"]

{"sheet":"202502","index":3,"n_rows":4,"n_cols":11,"rows_kept":4,"cut":false,"hidden":false,"merged":[]}
[null,null,null,{"$f":"IF(MATCH(D3,[1]Übersicht!$H$6:$H$22,0),\"JA\",\"NEIN\")","v":"JA"},{"$f":"IF(MATCH(E3,[1]Übersicht!$H$6:$H$22,0),\"JA\",\"NEIN\")","v":{"$error":"#N/A"}},{"$f":"IF(MATCH(F3,[1]Übersicht!$H$6:$H$22,0),\"JA\",\"NEIN\")","v":{"$error":"#N/A"}},{"$f":"IF(MATCH(G3,[1]Übersicht!$H$6:$H$22,0),\"JA\",\"NEIN\")","v":{"$error":"#N/A"}},{"$f":"IF(MATCH(H3,[1]Übersicht!$H$6:$H$22,0),\"JA\",\"NEIN\")","v":{"$error":"#N/A"}},{"$f":"IF(MATCH(I3,[1]Übersicht!$H$6:$H$22,0),\"JA\",\"NEIN\")","v":{"$error":"#N/A"}},{"$f":"IF(MATCH(J3,[1]Übersicht!$H$6:$H$22,0),\"JA\",\"NEIN\")","v":{"$error":"#N/A"}}]
[null,null,null,{"$f":"IFERROR(D1:D1,\"\")","v":"JA"},{"$f":"IFERROR(E1:E1,\"\")","v":""},{"$f":"IFERROR(F1:F1,\"\")","v":""},{"$f":"IFERROR(G1:G1,\"\")","v":""},{"$f":"IFERROR(H1:H1,\"\")","v":""},{"$f":"IFERROR(I1:I1,\"\")","v":""},{"$f":"IFERROR(J1:J1,\"\")","v":""}]
["KW",null,null,{"$f":"DATE(Übersicht!T1,1,1)+(A4-1)*7+1-WEEKDAY(DATE(Übersicht!T1,1,1)-1)","v":"2025-01-06"},{"$f":"D3+1","v":"2025-01-07"},{"$f":"E3+1","v":"2025-01-08"},{"$f":"F3+1","v":"2025-01-09"},"2025-01-10","2025-01-11","2025-01-12"]
[2,null,null,"Montag","Dienstag","Mittwoch","Donnerstag","Freitag","Samstag","Sonntag","Platz für Notizen:"]