{"text_format":"1","workbook":"xlsx","n_sheets":4,"sheets":["Übersicht","000001","202501","202502"],"not_rendered":{"charts":0,"images":0,"macros":1,"external_links":1,"defined_names":0,"comments":0,"pivot_tables":0},"unopened":[],"bounds":{"document_bytes":16777216,"sheet_cells":100000,"rows_first":2000,"rows_last":500,"rows_between":2000,"halvings":0,"cell_chars":16384,"cell_head_chars":4096},"cells_cut":0,"cells_raw":0,"read":"whole","date_system":"1900"}

{"sheet":"Übersicht","index":0,"n_rows":48,"n_cols":20,"rows_kept":48,"cut":false,"hidden":false,"merged":[]}
["Mitarbeiter","Telefon-\nnummer","Std./\nWoche","Montag","Dienstag","Mittwoch","Donnerstag","Freitag","Samstag","Sonntag","Eintritt","KW","Raumbelegung","Spalte1","Spalte2","Spalte3",null,null,"Jahr",2025]
["Chef","Nbst","Std./ Woche",null,null,null,null,null,null,null,45292,{"$f":"YEAR(K2) & TEXT(WEEKNUM(K2,11),\"00\")","v":"202401"},"Raum 1+ 2","Raum 3"]
["Mitarbeiter 1","1111",30,{"$f":"IF($D$2=\"JA\",\"DF\",\"\")","v":""},{"$f":"IF($E$2=\"JA\",\"DF\",\"\")","v":""},{"$f":"IF($F$2=\"JA\",\"DF\",\"\")","v":""},{"$f":"IF($G$2=\"JA\",\"DF\",\"\")","v":""},{"$f":"IF($H$2=\"JA\",\"DF\",\"\")","v":""},"DF","DF","2024-01-01",{"$f":"YEAR(K3) & TEXT(WEEKNUM(K3,11),\"00\")","v":"202401"},null,null,"Lier","Lier ",null,null,"Feiertage"]
["Mitarbeiter 2","2222",40,{"$f":"IF($D$2=\"JA\",\"DF\",\"\")","v":""},{"$f":"IF($E$2=\"JA\",\"DF\",\"\")","v":""},{"$f":"IF($F$2=\"JA\",\"DF\",\"\")","v":""},{"$f":"IF($G$2=\"JA\",\"DF\",\"\")","v":""},{"$f":"IF($H$2=\"JA\",\"DF\",\"\")","v":""},"DF","DF","2024-01-01","202401",null,null,"Hober","Hober ",null,null,"2024-12-31","Silvester"]
["GZ",null,null,"",null,null,null,null,null,null,45292,"202401",null,null,null,null,null,null,"2025-01-01","Neujahr"]
["Mitarbeiter 3","3333",20,"",{"$f":"IF($E$2=\"JA\",\"DF\",\"\")","v":""},"",{"$f":"IF($G$2=\"JA\",\"DF\",\"\")","v":""},{"$f":"IF($H$2=\"JA\",\"DF\",\"\")","v":""},"DF","DF","2024-01-01","202401",{"$f":"COUNTIF('000001'!$C$5:$D$400,Übersicht!O6)+COUNTIF('000001'!$C$5:$D$400,Übersicht!P6)","v":0},{"$f":"(COUNTIF('000001'!$E$5:$E$400,Übersicht!O6)+COUNTIF('000001'!$D$5:$E$400,Übersicht!P6))*0.5","v":0},"Schick","Schick ",null,null,"2025-01-06","Heilige Drei Könige"]
["Mitarbeiter 4","4444",25,"","","","","","DF","DF","2024-01-01","202401",{"$f":"COUNTIF('000001'!$C$5:$D$400,Übersicht!O7)+COUNTIF('000001'!$C$5:$D$400,Übersicht!P7)","v":0},{"$f":"(COUNTIF('000001'!$E$5:$E$400,Übersicht!O7)+COUNTIF('000001'!$D$5:$E$400,Übersicht!P7))*0.5","v":0},"Schanz","Schanz ",null,null,"2025-04-18","Karfreitag"]
["AS",null,null,"",null,null,null,null,null,null,"2024-01-01","202401",null,null,null,null,null,null,"2025-04-21","Ostermontag"]
["Mitarbeiter 5","555",null,"","","",{"$f":"IF($G$2=\"JA\",\"DF\",\"\")","v":""},{"$f":"IF($H$2=\"JA\",\"DF\",\"\")","v":""},"DF","DF","2024-01-01","202401",{"$f":"COUNTIF('000001'!$C$5:$D$400,Übersicht!O9)+COUNTIF('000001'!$C$5:$D$400,Übersicht!P9)","v":0},{"$f":"(COUNTIF('000001'!$E$5:$E$400,Übersicht!O9)+COUNTIF('000001'!$D$5:$E$400,Übersicht!P9))*0.5","v":0},"Christiansen","Christiansen ",null,null,"2025-05-01","Tag der Arbeit"]
["Mitarbeiter 6","66666",null,"","","",{"$f":"IF($G$2=\"JA\",\"DF\",\"\")","v":""},{"$f":"IF($H$2=\"JA\",\"DF\",\"\")","v":""},"DF","DF","2024-01-01","202401",{"$f":"COUNTIF('000001'!$C$5:$D$400,Übersicht!O10)+COUNTIF('000001'!$C$5:$D$400,Übersicht!P10)","v":0},{"$f":"(COUNTIF('000001'!$E$5:$E$400,Übersicht!O10)+COUNTIF('000001'!$D$5:$E$400,Übersicht!P10))*0.5","v":0},"Baumeister","Baumeister ",null,null,"2025-05-29","Christi Himmelfahrt"]
["Mitarbeiter 7","77777",null,"","","",{"$f":"IF($G$2=\"JA\",\"DF\",\"\")","v":""},{"$f":"IF($H$2=\"JA\",\"DF\",\"\")","v":""},"DF","DF","2024-01-01","202401",{"$f":"COUNTIF('000001'!$C$5:$D$400,Übersicht!O11)+COUNTIF('000001'!$C$5:$D$400,Übersicht!P11)","v":0},{"$f":"(COUNTIF('000001'!$E$5:$E$400,Übersicht!O11)+COUNTIF('000001'!$D$5:$E$400,Übersicht!P11))*0.5","v":0},"Bausewein","Bausewein ",null,null,"2025-06-09","Pfingstmontag"]
["Mitarbeiter 8","88888",null,"","","",{"$f":"IF($G$2=\"JA\",\"DF\",\"\")","v":""},"DF","DF","DF","2024-01-01","202401",{"$f":"COUNTIF('000001'!$C$5:$D$400,Übersicht!O12)+COUNTIF('000001'!$C$5:$D$400,Übersicht!P12)","v":0},{"$f":"(COUNTIF('000001'!$E$5:$E$400,Übersicht!O12)+COUNTIF('000001'!$D$5:$E$400,Übersicht!P12))*0.5","v":0},"Beck","Beck",null,null,"2025-06-19","Fronleichnam"]
["Mitarbeiter 9","99999",null,"","","",{"$f":"IF($G$2=\"JA\",\"DF\",\"\")","v":""},null,"DF","DF","2024-01-01","202401",{"$f":"COUNTIF('000001'!$C$5:$D$400,Übersicht!O13)+COUNTIF('000001'!$C$5:$D$400,Übersicht!P13)","v":0},{"$f":"(COUNTIF('000001'!$E$5:$E$400,Übersicht!O13)+COUNTIF('000001'!$D$5:$E$400,Übersicht!P13))*0.5","v":0},"Bullmann","Bullmann ",null,null,"2025-08-15","Mariä Himmelfahrt"]
["Mitarbeiter 10","1010101010",null,"","","",null,{"$f":"IF($H$2=\"JA\",\"DF\",\"\")","v":""},"DF","DF","2024-01-01","202401",{"$f":"COUNTIF('000001'!$C$5:$D$400,Übersicht!O14)+COUNTIF('000001'!$C$5:$D$400,Übersicht!P14)","v":0},{"$f":"(COUNTIF('000001'!$E$5:$E$400,Übersicht!O14)+COUNTIF('000001'!$D$5:$E$400,Übersicht!P14))*0.5","v":0},"Darms","Darms ",null,null,"2025-10-03","Tag der Deutschen Einheit"]
["Mitarbeiter 11","1111111111",null,"","","","","","DF","DF","2024-01-01","202401",{"$f":"COUNTIF('000001'!$C$5:$D$400,Übersicht!O15)+COUNTIF('000001'!$C$5:$D$400,Übersicht!P15)","v":0},{"$f":"(COUNTIF('000001'!$E$5:$E$400,Übersicht!O15)+COUNTIF('000001'!$D$5:$E$400,Übersicht!P15))*0.5","v":0},"Döllinger","Döllinger ",null,null,"2025-11-01","Allerheiligen"]
["Mitarbeiter 12","1212121212",null,"","","","","","DF","DF","2024-01-01","202401",{"$f":"COUNTIF('000001'!$C$5:$D$400,Übersicht!O16)+COUNTIF('000001'!$C$5:$D$400,Übersicht!P16)","v":0},{"$f":"(COUNTIF('000001'!$E$5:$E$400,Übersicht!O16)+COUNTIF('000001'!$D$5:$E$400,Übersicht!P16))*0.5","v":0},"Endres","Endres ",null,null,"2025-12-24","Heilig Abend"]
["Mitarbeiter 13","1313131313",null,"","","","","","DF","DF","2024-01-01","202401",{"$f":"COUNTIF('000001'!$C$5:$D$400,Übersicht!O17)+COUNTIF('000001'!$C$5:$D$400,Übersicht!P17)","v":0},{"$f":"(COUNTIF('000001'!$E$5:$E$400,Übersicht!O17)+COUNTIF('000001'!$D$5:$E$400,Übersicht!P17))*0.5","v":0},"Frenzel L.","Frenzel L. ",null,null,"2025-12-25","1. Weihnachtsfeiertag"]
["Mitarbeiter 14","1414141414",null,"","","","","","DF","DF","2024-01-01","202401",{"$f":"COUNTIF('000001'!$C$5:$D$400,Übersicht!O18)+COUNTIF('000001'!$C$5:$D$400,Übersicht!P18)","v":0},{"$f":"(COUNTIF('000001'!$E$5:$E$400,Übersicht!O18)+COUNTIF('000001'!$D$5:$E$400,Übersicht!P18))*0.5","v":0},"Frenzel Y.","Frenzel Y. ",null,null,"2025-12-26","2. Weihnachtsfeiertag"]
["Mitarbeiter 15","1515151515",null,"","","","","","DF","DF","2024-01-01","202401",{"$f":"COUNTIF('000001'!$C$5:$D$400,Übersicht!O19)+COUNTIF('000001'!$C$5:$D$400,Übersicht!P19)","v":0},{"$f":"(COUNTIF('000001'!$E$5:$E$400,Übersicht!O19)+COUNTIF('000001'!$D$5:$E$400,Übersicht!P19))*0.5","v":0},"Gerhard","Gerhard ",null,null,"2025-12-31","Silvester"]
["Mitarbeiter 16","1616161616",null,"","","","","","DF","DF","2024-01-01","202401",{"$f":"COUNTIF('000001'!$C$5:$D$400,Übersicht!O20)+COUNTIF('000001'!$C$5:$D$400,Übersicht!P20)","v":0},{"$f":"(COUNTIF('000001'!$E$5:$E$400,Übersicht!O20)+COUNTIF('000001'!$D$5:$E$400,Übersicht!P20))*0.5","v":0},"Hofmann","Hofmann ",null,null,"2026-01-01","Neujahr"]
["Mitarbeiter 17","1717171717",null,"","","","","","DF","DF","2024-01-01","202401",{"$f":"COUNTIF('000001'!$C$5:$D$400,Übersicht!O21)+COUNTIF('000001'!$C$5:$D$400,Übersicht!P21)","v":0},{"$f":"(COUNTIF('000001'!$E$5:$E$400,Übersicht!O21)+COUNTIF('000001'!$D$5:$E$400,Übersicht!P21))*0.5","v":0},"Kaspar","Kaspar ",null,null,"2026-01-06","Heilige Drei Könige"]
["Mitarbeiter 18","1818181818",null,"","","","","","DF","DF","2024-01-01","202401",{"$f":"COUNTIF('000001'!$C$5:$D$400,Übersicht!O22)+COUNTIF('000001'!$C$5:$D$400,Übersicht!P22)","v":0},{"$f":"(COUNTIF('000001'!$E$5:$E$400,Übersicht!O22)+COUNTIF('000001'!$D$5:$E$400,Übersicht!P22))*0.5","v":0},"Klug","Klug "]
["Mitarbeiter 19","1919191919",null,"","","","","","DF","DF","2024-01-01","202401",{"$f":"COUNTIF('000001'!$C$5:$D$400,Übersicht!O23)+COUNTIF('000001'!$C$5:$D$400,Übersicht!P23)","v":0},{"$f":"(COUNTIF('000001'!$E$5:$E$400,Übersicht!O23)+COUNTIF('000001'!$D$5:$E$400,Übersicht!P23))*0.5","v":0},"Miceli","Miceli "]
["Mitarbeiter 20","2020202020",null,"","","","","","DF","DF","2024-01-01","202401",{"$f":"COUNTIF('000001'!$C$5:$D$400,Übersicht!O24)+COUNTIF('000001'!$C$5:$D$400,Übersicht!P24)","v":0},{"$f":"(COUNTIF('000001'!$E$5:$E$400,Übersicht!O24)+COUNTIF('000001'!$D$5:$E$400,Übersicht!P24))*0.5","v":0},"Ries","Ries "]
["Mitarbeiter 21","2121212121",null,"","","",{"$f":"IF($G$2=\"JA\",\"DF\",\"\")","v":""},"DF","DF","DF","2024-01-01","202401",{"$f":"COUNTIF('000001'!$C$5:$D$400,Übersicht!O25)+COUNTIF('000001'!$C$5:$D$400,Übersicht!P25)","v":0},{"$f":"(COUNTIF('000001'!$E$5:$E$400,Übersicht!O25)+COUNTIF('000001'!$D$5:$E$400,Übersicht!P25))*0.5","v":0},"Robinson-Waye","Robinson-Waye "]
["Mitarbeiter 22","2222222222",null,"","","",{"$f":"IF($G$2=\"JA\",\"DF\",\"\")","v":""},{"$f":"IF($H$2=\"JA\",\"DF\",\"\")","v":""},"DF","DF","2024-01-01","202401",{"$f":"COUNTIF('000001'!$C$5:$D$400,Übersicht!O26)+COUNTIF('000001'!$C$5:$D$400,Übersicht!P26)","v":0},{"$f":"(COUNTIF('000001'!$E$5:$E$400,Übersicht!O26)+COUNTIF('000001'!$D$5:$E$400,Übersicht!P26))*0.5","v":0},"Röder","Röder "]
["Mitarbeiter 23","2323232323",null,"","","","","","DF","DF","2024-01-01","202401",{"$f":"COUNTIF('000001'!$C$5:$D$400,Übersicht!O27)+COUNTIF('000001'!$C$5:$D$400,Übersicht!P27)","v":0},{"$f":"(COUNTIF('000001'!$E$5:$E$400,Übersicht!O27)+COUNTIF('000001'!$D$5:$E$400,Übersicht!P27))*0.5","v":0},"Schulz","Schulz "]
["Mitarbeiter 24","2424242424",null,"","","","","DF","DF","DF","2024-01-01","202401",{"$f":"COUNTIF('000001'!$C$5:$D$400,Übersicht!O28)+COUNTIF('000001'!$C$5:$D$400,Übersicht!P28)","v":0},{"$f":"(COUNTIF('000001'!$E$5:$E$400,Übersicht!O28)+COUNTIF('000001'!$D$5:$E$400,Übersicht!P28))*0.5","v":0},"Steimann","Steimann "]
["Mitarbeiter 25","2525252525",null,"","","","","DF","DF","DF","2024-01-01","202401",{"$f":"COUNTIF('000001'!$C$5:$D$400,Übersicht!O29)+COUNTIF('000001'!$C$5:$D$400,Übersicht!P29)","v":0},{"$f":"(COUNTIF('000001'!$E$5:$E$400,Übersicht!O29)+COUNTIF('000001'!$D$5:$E$400,Übersicht!P29))*0.5","v":0},"Wander","Wander "]
["BS",null,null,"",null,null,null,null,null,null,45292,"202401"]
["Mitarbeiter 26",null,null,"","","",{"$f":"IF($G$2=\"JA\",\"DF\",\"\")","v":""},{"$f":"IF($H$2=\"JA\",\"DF\",\"\")","v":""},"DF","DF","2024-01-01","202401",{"$f":"COUNTIF('000001'!$C$5:$D$400,Übersicht!O31)+COUNTIF('000001'!$C$5:$D$400,Übersicht!P31)","v":0},{"$f":"(COUNTIF('000001'!$E$5:$E$400,Übersicht!O31)+COUNTIF('000001'!$D$5:$E$400,Übersicht!P31))*0.5","v":0},"Ehehalt","Ehehalt "]
["Mitarbeiter 27",null,null,"","","","","","DF","DF","2024-01-01","202401",{"$f":"COUNTIF('000001'!$C$5:$D$400,Übersicht!O32)+COUNTIF('000001'!$C$5:$D$400,Übersicht!P32)","v":0},{"$f":"(COUNTIF('000001'!$E$5:$E$400,Übersicht!O32)+COUNTIF('000001'!$D$5:$E$400,Übersicht!P32))*0.5","v":0},"Englert","Englert "]
["Mitarbeiter 28",null,null,"","","","","","DF","DF","2024-01-01","202401",{"$f":"COUNTIF('000001'!$C$5:$D$400,Übersicht!O33)+COUNTIF('000001'!$C$5:$D$400,Übersicht!P33)","v":0},{"$f":"(COUNTIF('000001'!$E$5:$E$400,Übersicht!O33)+COUNTIF('000001'!$D$5:$E$400,Übersicht!P33))*0.5","v":0},"Obert","Obert "]
["Mitarbeiter 29",null,null,"","","","","","DF","DF","2024-01-01","202401",{"$f":"COUNTIF('000001'!$C$5:$D$400,Übersicht!O34)+COUNTIF('000001'!$C$5:$D$400,Übersicht!P34)","v":0},{"$f":"(COUNTIF('000001'!$E$5:$E$400,Übersicht!O34)+COUNTIF('000001'!$D$5:$E$400,Übersicht!P34))*0.5","v":0},"Schuhmann","Schuhmann "]
["CS",null,null,"",null,null,null,null,null,null,"2024-01-01","202401"]
["Mitarbeiter 30",null,null,"","","",{"$f":"IF($G$2=\"JA\",\"DF\",\"\")","v":""},{"$f":"IF($H$2=\"JA\",\"DF\",\"\")","v":""},"DF","DF","2024-01-01","202401",{"$f":"COUNTIF('000001'!$C$5:$D$400,Übersicht!O36)+COUNTIF('000001'!$C$5:$D$400,Übersicht!P36)","v":0},{"$f":"(COUNTIF('000001'!$E$5:$E$400,Übersicht!O36)+COUNTIF('000001'!$D$5:$E$400,Übersicht!P36))*0.5","v":0},"Böttcher","Böttcher "]
["M 31",null,null,"","","","","","DF","DF","2024-01-01","202401",{"$f":"COUNTIF('000001'!$C$5:$D$400,Übersicht!O37)+COUNTIF('000001'!$C$5:$D$400,Übersicht!P37)","v":0},{"$f":"(COUNTIF('000001'!$E$5:$E$400,Übersicht!O37)+COUNTIF('000001'!$D$5:$E$400,Übersicht!P37))*0.5","v":0},"Behr","Behr "]
["M32",null,null,"","","","","","DF","DF","2024-01-01","202401",{"$f":"COUNTIF('000001'!$C$5:$D$400,Übersicht!O38)+COUNTIF('000001'!$C$5:$D$400,Übersicht!P38)","v":0},{"$f":"(COUNTIF('000001'!$E$5:$E$400,Übersicht!O38)+COUNTIF('000001'!$D$5:$E$400,Übersicht!P38))*0.5","v":0},"Braun","Braun "]
["M 33",null,null,"","","","","","DF","DF","2024-01-01","202401",{"$f":"COUNTIF('000001'!$C$5:$D$400,Übersicht!O39)+COUNTIF('000001'!$C$5:$D$400,Übersicht!P39)","v":0},{"$f":"(COUNTIF('000001'!$E$5:$E$400,Übersicht!O39)+COUNTIF('000001'!$D$5:$E$400,Übersicht!P39))*0.5","v":0},"Feidel","Feidel "]
["M 34",null,null,"","","","","","DF","DF","2024-01-01","202401",{"$f":"COUNTIF('000001'!$C$5:$D$400,Übersicht!O40)+COUNTIF('000001'!$C$5:$D$400,Übersicht!P40)","v":0},{"$f":"(COUNTIF('000001'!$E$5:$E$400,Übersicht!O40)+COUNTIF('000001'!$D$5:$E$400,Übersicht!P40))*0.5","v":0},"Gull","Gull "]
["M 35",null,null,"","","","","","DF","DF","2024-01-01","202401",{"$f":"COUNTIF('000001'!$C$5:$D$400,Übersicht!O41)+COUNTIF('000001'!$C$5:$D$400,Übersicht!P41)","v":0},{"$f":"(COUNTIF('000001'!$E$5:$E$400,Übersicht!O41)+COUNTIF('000001'!$D$5:$E$400,Übersicht!P41))*0.5","v":0},"Röhrig","Röhrig "]
["SO",null,null,"",null,null,null,null,null,null,45292,"202401"]
["M36",null,null,"","","",{"$f":"IF($G$2=\"JA\",\"DF\",\"\")","v":""},"DF","DF","DF","2024-01-01","202401"]
["M 37",null,null,"DF","","",{"$f":"IF($G$2=\"JA\",\"DF\",\"\")","v":""},{"$f":"IF($H$2=\"JA\",\"DF\",\"\")","v":""},"DF","DF","2024-01-01","202401"]
["Räume",null,null,"",null,null,null,null,null,null,45292,"202401"]
["Raum 1",null,null,{"$f":"IF($D$2=\"JA\",\"DF\",\"\")","v":""},"","",{"$f":"IF($G$2=\"JA\",\"DF\",\"\")","v":""},{"$f":"IF($H$2=\"JA\",\"DF\",\"\")","v":""},"DF","DF","2024-01-01","202401"]
["Raum 2",null,null,"","","","","","DF","DF","2024-01-01","202401"]
["Raum 3",null,null,"","","","","","DF","DF","2024-01-01","202401"]

{"sheet":"000001","index":1,"n_rows":400,"n_cols":6,"rows_kept":400,"cut":false,"hidden":false,"merged":[[0,0,0,4]]}
["Raumbelegung"]
[]
[]
["Wochentag","Datum","Raum 1","Raum 2","Raum 3"]
[{"$f":"TEXT(B5,\"TTTT\")","v":"Mittwoch"},{"$f":"DATE(Übersicht!T1,1,1)","v":"2025-01-01"},null,null,null,{"$f":"IF(MATCH(B5,Übersicht!$S$4:$S$21,0),\"JA\",\"NEIN\")","v":"JA"}]
[{"$f":"TEXT(B6,\"TTTT\")","v":"Donnerstag"},{"$f":"B5+1","v":"2025-01-02"},null,null,null,{"$f":"IF(MATCH(B6,Übersicht!$S$4:$S$21,0),\"JA\",\"NEIN\")","v":{"$error":"#N/A"}}]
["Freitag",{"$f":"B6+1","v":"2025-01-03"},null,null,null,{"$f":"IF(MATCH(B7,Übersicht!$S$4:$S$21,0),\"JA\",\"NEIN\")","v":{"$error":"#N/A"}}]
["Samstag","2025-01-04",null,null,null,{"$f":"IF(MATCH(B8,Übersicht!$S$4:$S$21,0),\"JA\",\"NEIN\")","v":{"$error":"#N/A"}}]
["Sonntag","2025-01-05",null,null,null,{"$f":"IF(MATCH(B9,Übersicht!$S$4:$S$21,0),\"JA\",\"NEIN\")","v":{"$error":"#N/A"}}]
["Montag","2025-01-06",null,null,null,{"$f":"IF(MATCH(B10,Übersicht!$S$4:$S$21,0),\"JA\",\"NEIN\")","v":"JA"}]
["Dienstag","2025-01-07",null,null,null,{"$f":"IF(MATCH(B11,Übersicht!$S$4:$S$21,0),\"JA\",\"NEIN\")","v":{"$error":"#N/A"}}]
["Mittwoch","2025-01-08",null,null,null,{"$f":"IF(MATCH(B12,Übersicht!$S$4:$S$21,0),\"JA\",\"NEIN\")","v":{"$error":"#N/A"}}]
["Donnerstag","2025-01-09",null,null,null,{"$f":"IF(MATCH(B13,Übersicht!$S$4:$S$21,0),\"JA\",\"NEIN\")","v":{"$error":"#N/A"}}]
["Freitag","2025-01-10",null,null,null,{"$f":"IF(MATCH(B14,Übersicht!$S$4:$S$21,0),\"JA\",\"NEIN\")","v":{"$error":"#N/A"}}]
["Samstag","2025-01-11",null,null,null,{"$f":"IF(MATCH(B15,Übersicht!$S$4:$S$21,0),\"JA\",\"NEIN\")","v":{"$error":"#N/A"}}]
["Sonntag","2025-01-12",null,null,null,{"$f":"IF(MATCH(B16,Übersicht!$S$4:$S$21,0),\"JA\",\"NEIN\")","v":{"$error":"#N/A"}}]
["Montag","2025-01-13",null,null,null,{"$f":"IF(MATCH(B17,Übersicht!$S$4:$S$21,0),\"JA\",\"NEIN\")","v":{"$error":"#N/A"}}]
["Dienstag","2025-01-14",null,null,null,{"$f":"IF(MATCH(B18,Übersicht!$S$4:$S$21,0),\"JA\",\"NEIN\")","v":{"$error":"#N/A"}}]
["Mittwoch","2025-01-15",null,null,null,{"$f":"IF(MATCH(B19,Übersicht!$S$4:$S$21,0),\"JA\",\"NEIN\")","v":{"$error":"#N/A"}}]
["Donnerstag","2025-01-16",null,null,null,{"$f":"IF(MATCH(B20,Übersicht!$S$4:$S$21,0),\"JA\",\"NEIN\")","v":{"$error":"#N/A"}}]
["Freitag","2025-01-17",null,null,null,{"$f":"IF(MATCH(B21,Übersicht!$S$4:$S$21,0),\"JA\",\"NEIN\")","v":{"$error":"#N/A"}}]
["Samstag","2025-01-18",null,null,null,{"$f":"IF(MATCH(B22,Übersicht!$S$4:$S$21,0),\"JA\",\"NEIN\")","v":{"$error":"#N/A"}}]
["Sonntag","2025-01-19",null,null,null,{"$f":"IF(MATCH(B23,Übersicht!$S$4:$S$21,0),\"JA\",\"NEIN\")","v":{"$error":"#N/A"}}]
["Montag","2025-01-20",null,null,null,{"$f":"IF(MATCH(B24,Übersicht!$S$4:$S$21,0),\"JA\",\"NEIN\")","v":{"$error":"#N/A"}}]
["Dienstag","2025-01-21",null,null,null,{"$f":"IF(MATCH(B25,Übersicht!$S$4:$S$21,0),\"JA\",\"NEIN\")","v":{"$error":"#N/A"}}]
["Mittwoch","2025-01-22",null,null,null,{"$f":"IF(MATCH(B26,Übersicht!$S$4:$S$21,0),\"JA\",\"NEIN\")","v":{"$error":"#N/A"}}]
["Donnerstag","2025-01-23",null,null,null,{"$f":"IF(MATCH(B27,Übersicht!$S$4:$S$21,0),\"JA\",\"NEIN\")","v":{"$error":"#N/A"}}]
["Freitag","2025-01-24",null,null,null,{"$f":"IF(MATCH(B28,Übersicht!$S$4:$S$21,0),\"JA\",\"NEIN\")","v":{"$error":"#N/A"}}]
["Samstag","2025-01-25",null,null,null,{"$f":"IF(MATCH(B29,Übersicht!$S$4:$S$21,0),\"JA\",\"NEIN\")","v":{"$error":"#N/A"}}]
["Sonntag","2025-01-26",null,null,null,{"$f":"IF(MATCH(B30,Übersicht!$S$4:$S$21,0),\"JA\",\"NEIN\")","v":{"$error":"#N/A"}}]
["Montag","2025-01-27",null,null,null,{"$f":"IF(MATCH(B31,Übersicht!$S$4:$S$21,0),\"JA\",\"NEIN\")","v":{"$error":"#N/A"}}]
["Dienstag","2025-01-28",null,null,null,{"$f":"IF(MATCH(B32,Übersicht!$S$4:$S$21,0),\"JA\",\"NEIN\")","v":{"$error":"#N/A"}}]
["Mittwoch","2025-01-29",null,null,null,{"$f":"IF(MATCH(B33,Übersicht!$S$4:$S$21,0),\"JA\",\"NEIN\")","v":{"$error":"#N/A"}}]
["Donnerstag","2025-01-30",null,null,null,{"$f":"IF(MATCH(B34,Übersicht!$S$4:$S$21,0),\"JA\",\"NEIN\")","v":{"$error":"#N/A"}}]
["Freitag","2025-01-31",null,null,null,{"$f":"IF(MATCH(B35,Übersicht!$S$4:$S$21,0),\"JA\",\"NEIN\")","v":{"$error":"#N/A"}}]
["Samstag","2025-02-01",null,null,null,{"$f":"IF(MATCH(B36,Übersicht!$S$4:$S$21,0),\"JA\",\"NEIN\")","v":{"$error":"#N/A"}}]
["Sonntag","2025-02-02",null,null,null,{"$f":"IF(MATCH(B37,Übersicht!$S$4:$S$21,0),\"JA\",\"NEIN\")","v":{"$error":"#N/A"}}]
["Montag","2025-02-03",null,null,null,{"$f":"IF(MATCH(B38,Übersicht!$S$4:$S$21,0),\"JA\",\"NEIN\")","v":{"$error":"#N/A"}}]
["Dienstag","2025-02-04",null,null,null,{"$f":"IF(MATCH(B39,Übersicht!$S$4:$S$21,0),\"JA\",\"NEIN\")","v":{"$error":"#N/A"}}]
["Mittwoch","2025-02-05",null,null,null,{"$f":"IF(MATCH(B40,Übersicht!$S$4:$S$21,0),\"JA\",\"NEIN\")","v":{"$error":"#N/A"}}]
["Donnerstag","2025-02-06",null,null,null,{"$f":"IF(MATCH(B41,Übersicht!$S$4:$S$21,0),\"JA\",\"NEIN\")","v":{"$error":"#N/A"}}]
["Freitag","2025-02-07",null,null,null,{"$f":"IF(MATCH(B42,Übersicht!$S$4:$S$21,0),\"JA\",\"NEIN\")","v":{"$error":"#N/A"}}]
["Samstag","2025-02-08",null,null,null,{"$f":"IF(MATCH(B43,Übersicht!$S$4:$S$21,0),\"JA\",\"NEIN\")","v":{"$error":"#N/A"}}]
["Sonntag","2025-02-09",null,null,null,{"$f":"IF(MATCH(B44,Übersicht!$S$4:$S$21,0),\"JA\",\"NEIN\")","v":{"$error":"#N/A"}}]
["Montag","2025-02-10",null,null,null,{"$f":"IF(MATCH(B45,Übersicht!$S$4:$S$21,0),\"JA\",\"NEIN\")","v":{"$error":"#N/A"}}]
["Dienstag","2025-02-11",null,null,null,{"$f":"IF(MATCH(B46,Übersicht!$S$4:$S$21,0),\"JA\",\"NEIN\")","v":{"$error":"#N/A"}}]
["Mittwoch","2025-02-12",null,null,null,{"$f":"IF(MATCH(B47,Übersicht!$S$4:$S$21,0),\"JA\",\"NEIN\")","v":{"$error":"#N/A"}}]
["Donnerstag","2025-02-13",null,null,null,{"$f":"IF(MATCH(B48,Übersicht!$S$4:$S$21,0),\"JA\",\"NEIN\")","v":{"$error":"#N/A"}}]
["Freitag","2025-02-14",null,null,null,{"$f":"IF(MATCH(B49,Übersicht!$S$4:$S$21,0),\"JA\",\"NEIN\")","v":{"$error":"#N/A"}}]
["Samstag","2025-02-15",null,null,null,{"$f":"IF(MATCH(B50,Übersicht!$S$4:$S$21,0),\"JA\",\"NEIN\")","v":{"$error":"#N/A"}}]
["Sonntag","2025-02-16",null,null,null,{"$f":"IF(MATCH(B51,Übersicht!$S$4:$S$21,0),\"JA\",\"NEIN\")","v":{"$error":"#N/A"}}]
["Montag","2025-02-17",null,null,null,{"$f":"IF(MATCH(B52,Übersicht!$S$4:$S$21,0),\"JA\",\"NEIN\")","v":{"$error":"#N/A"}}]
["Dienstag","2025-02-18",null,null,null,{"$f":"IF(MATCH(B53,Übersicht!$S$4:$S$21,0),\"JA\",\"NEIN\")","v":{"$error":"#N/A"}}]
["Mittwoch","2025-02-19",null,null,null,{"$f":"IF(MATCH(B54,Übersicht!$S$4:$S$21,0),\"JA\",\"NEIN\")","v":{"$error":"#N/A"}}]
["Donnerstag","2025-02-20",null,null,null,{"$f":"IF(MATCH(B55,Übersicht!$S$4:$S$21,0),\"JA\",\"NEIN\")","v":{"$error":"#N/A"}}]
["Freitag","2025-02-21",null,null,null,{"$f":"IF(MATCH(B56,Übersicht!$S$4:$S$21,0),\"JA\",\"NEIN\")","v":{"$error":"#N/A"}}]
["Samstag","2025-02-22",null,null,null,{"$f":"IF(MATCH(B57,Übersicht!$S$4:$S$21,0),\"JA\",\"NEIN\")","v":{"$error":"#N/A"}}]
["Sonntag","2025-02-23",null,null,null,{"$f":"IF(MATCH(B58,Übersicht!$S$4:$S$21,0),\"JA\",\"NEIN\")","v":{"$error":"#N/A"}}]
["Montag","2025-02-24",null,null,null,{"$f":"IF(MATCH(B59,Übersicht!$S$4:$S$21,0),\"JA\",\"NEIN\")","v":{"$error":"#N/A"}}]
["Dienstag","2025-02-25",null,null,null,{"$f":"IF(MATCH(B60,Übersicht!$S$4:$S$21,0),\"JA\",\"NEIN\")","v":{"$error":"#N/A"}}]
{"$rows_left_out":341}
{"sheet":"202501","index":2,"n_rows":4,"n_cols":11,"rows_kept":4,"cut":false,"hidden":false,"merged":[]}
[null,null,null,{"$f":"IF(MATCH(D3,Übersicht!$S$4:$S$21,0),\"JA\",\"NEIN\")","v":{"$error":"#N/A"}},{"$f":"IF(MATCH(E3,Übersicht!$S$4:$S$21,0),\"JA\",\"NEIN\")","v":"JA"},{"$f":"IF(MATCH(F3,Übersicht!$S$4:$S$21,0),\"JA\",\"NEIN\")","v":"JA"},{"$f":"IF(MATCH(G3,Übersicht!$S$4:$S$21,0),\"JA\",\"NEIN\")","v":{"$error":"#N/A"}},{"$f":"IF(MATCH(H3,Übersicht!$S$4:$S$21,0),\"JA\",\"NEIN\")","v":{"$error":"#N/A"}},{"$f":"IF(MATCH(I3,Übersicht!$S$4:$S$21,0),\"JA\",\"NEIN\")","v":{"$error":"#N/A"}},{"$f":"IF(MATCH(J3,Übersicht!$S$4:$S$21,0),\"JA\",\"NEIN\")","v":{"$error":"#N/A"}}]
[null,null,null,{"$f":"IFERROR(D1:D1,\"\")","v":""},{"$f":"IFERROR(E1:E1,\"\")","v":"JA"},{"$f":"IFERROR(F1:F1,\"\")","v":"JA"},{"$f":"IFERROR(G1:G1,\"\")","v":""},{"$f":"IFERROR(H1:H1,\"\")","v":""},{"$f":"IFERROR(I1:I1,\"\")","v":""},{"$f":"IFERROR(J1:J1,\"\")","v":""}]
["KW",null,null,{"$f":"DATE(Übersicht!T1,1,1)+(A4-1)*7+1-WEEKDAY(DATE(Übersicht!T1,1,1)-1)","v":"2024-12-30"},{"$f":"D3+1","v":"2024-12-31"},{"$f":"E3+1","v":"2025-01-01"},{"$f":"F3+1","v":"2025-01-02"},"2025-01-03","2025-01-04","2025-01-05"]
[1,null,null,"Montag","Dienstag","Mittwoch","Donnerstag","Freitag","Samstag","Sonntag","Platz für Notizen:"]

{"sheet":"202502","index":3,"n_rows":4,"n_cols":11,"rows_kept":4,"cut":false,"hidden":false,"merged":[]}
[null,null,null,{"$f":"IF(MATCH(D3,[1]Übersicht!$H$6:$H$22,0),\"JA\",\"NEIN\")","v":"JA"},{"$f":"IF(MATCH(E3,[1]Übersicht!$H$6:$H$22,0),\"JA\",\"NEIN\")","v":{"$error":"#N/A"}},{"$f":"IF(MATCH(F3,[1]Übersicht!$H$6:$H$22,0),\"JA\",\"NEIN\")","v":{"$error":"#N/A"}},{"$f":"IF(MATCH(G3,[1]Übersicht!$H$6:$H$22,0),\"JA\",\"NEIN\")","v":{"$error":"#N/A"}},{"$f":"IF(MATCH(H3,[1]Übersicht!$H$6:$H$22,0),\"JA\",\"NEIN\")","v":{"$error":"#N/A"}},{"$f":"IF(MATCH(I3,[1]Übersicht!$H$6:$H$22,0),\"JA\",\"NEIN\")","v":{"$error":"#N/A"}},{"$f":"IF(MATCH(J3,[1]Übersicht!$H$6:$H$22,0),\"JA\",\"NEIN\")","v":{"$error":"#N/A"}}]
[null,null,null,{"$f":"IFERROR(D1:D1,\"\")","v":"JA"},{"$f":"IFERROR(E1:E1,\"\")","v":""},{"$f":"IFERROR(F1:F1,\"\")","v":""},{"$f":"IFERROR(G1:G1,\"\")","v":""},{"$f":"IFERROR(H1:H1,\"\")","v":""},{"$f":"IFERROR(I1:I1,\"\")","v":""},{"$f":"IFERROR(J1:J1,\"\")","v":""}]
["KW",null,null,{"$f":"DATE(Übersicht!T1,1,1)+(A4-1)*7+1-WEEKDAY(DATE(Übersicht!T1,1,1)-1)","v":"2025-01-06"},{"$f":"D3+1","v":"2025-01-07"},{"$f":"E3+1","v":"2025-01-08"},{"$f":"F3+1","v":"2025-01-09"},"2025-01-10","2025-01-11","2025-01-12"]
[2,null,null,"Montag","Dienstag","Mittwoch","Donnerstag","Freitag","Samstag","Sonntag","Platz für Notizen:"]