{"text_format":"1","workbook":"xlsx","n_sheets":5,"sheets":["Aktien","Kursentwicklung","FEFonds","Kurse","Währung"],"not_rendered":{"charts":1,"images":0,"macros":1,"external_links":0,"defined_names":6,"comments":0,"pivot_tables":0},"unopened":[],"bounds":{"document_bytes":16777216,"sheet_cells":100000,"rows_first":2000,"rows_last":500,"rows_between":2000,"halvings":0,"cell_chars":16384,"cell_head_chars":4096},"cells_cut":0,"cells_raw":0,"read":"whole","date_system":"1900"}

{"sheet":"Aktien","index":0,"n_rows":50,"n_cols":20,"rows_kept":50,"cut":false,"hidden":false,"merged":[]}
[]
[null,null,null,null,null,null,null,null,null,null,null,{"$f":"NOW()","v":"2025-04-10T22:27:46.750"},{"$f":"SUM(M4:M16)-SUM(N4:N16)","v":48260.082557885456},null,{"$f":"SUM(O4:O16)-SUM(P4:P16)","v":18883.321557885462},null,{"$f":"Kursentwicklung!M4","v":0.64280000000000004}]
[null,null,"Aktie","WKN","Anzahl",null,"Kaufkurs","Kosten",null,"Dividende","Kosten (abs.)","Istkurs","Wert (aktuell)","Verkaufserlös","Gewinn/Verlust",null,"min.Kurs",null,"Gewinn pro Jahr","Gewinn absolut"]
[null,null,"Telefonaktiebolaget LM Ericsson Class B",850001,{"$f":"IF((SUMIFS(H$20:H$19833,D$20:D$19833,D4,E$20:E$19833,\"Splitt\")>0),SUMIFS(H$20:H$19833,D$20:D$19833,D4,E$20:E$19833,\"Splitt\"),SUMIFS(H$20:H$19833,D$20:D$19833,D4,E$20:E$19833,\"Kauf\"))-F4","v":500},{"$f":"SUMIFS(H$20:H$19833,D$20:D$19833,D4,E$20:E$19833,\"Verkauf\")","v":0},{"$f":"IFERROR(SUMIF(D20:D19833,D4,J20:J19833)/COUNTIFS(D20:D19833,D4,E20:E19833,\"Kauf\"),\"\")","v":1},{"$f":"SUMIFS(G$20:G$19833,D$20:D$19833,D4,E$20:E$19833,\"Kauf\")","v":500},null,{"$f":"SUMIFS(G$20:G$19833,D$20:D$19833,D4,E$20:E$19833,J$3)","v":25.689999999999998},{"$f":"IF(H4-J4 < 0,0,H4-J4)","v":474.31},{"$f":"IFERROR(VLOOKUP(C4,Kurse!A:F,3,0)*VLOOKUP(R4,Währung!C:D,2,0),\" \")","v":6.37},{"$f":"IF(N4>0,N4,IF(E4<1,\" \",E4*L4))","v":3185},{"$f":"SUMIFS(G$20:G$19833,D$20:D$19833,D4,E$20:E$19833,\"Verkauf\")","v":0},{"$f":"IF(E4<1,\" \",(IF(N4>0,N4-H4+J4,M4-H4+J4)))","v":2710.69},{"$f":"IF(N4>0,O4,0)","v":0},{"$f":"IF(N4>0,\" \",IF(E4<1,\" \",IF((H4-J4)/E4<0,\" \",(H4-J4)/E4)))","v":0.94862000000000002},{"$f":"VLOOKUP(C4,Kurse!A:F,4,0)","v":"EUR"},{"$f":"IFERROR(O4/H4/((TODAY()-_xlfn.MINIFS(B$20:B$386,C$20:C$386,C4))/365),\"\")","v":0.2580936089735229},{"$f":"IF(ISERROR((M4+J4)/H4-100%),\" \",(M4+J4)/H4-100%)","v":5.4213800000000001}]
[null,null,"Deutsche Telekom AG",555750,{"$f":"IF((SUMIFS(H$20:H$19833,D$20:D$19833,D5,E$20:E$19833,\"Splitt\")>0),SUMIFS(H$20:H$19833,D$20:D$19833,D5,E$20:E$19833,\"Splitt\"),SUMIFS(H$20:H$19833,D$20:D$19833,D5,E$20:E$19833,\"Kauf\"))-F5","v":1},{"$f":"SUMIFS(H$20:H$19833,D$20:D$19833,D5,E$20:E$19833,\"Verkauf\")","v":0},{"$f":"IFERROR(SUMIF(D20:D19834,D5,J20:J19834)/COUNTIFS(D20:D19834,D5,E20:E19834,\"Kauf\"),\"\")","v":0},{"$f":"SUMIFS(G$20:G$19833,D$20:D$19833,D5,E$20:E$19833,\"Kauf\")","v":0},null,{"$f":"SUMIFS(G$20:G$19833,D$20:D$19833,D5,E$20:E$19833,J$3)","v":0.77},{"$f":"IF(H5-J5 < 0,0,H5-J5)","v":0},{"$f":"IFERROR(VLOOKUP(C5,Kurse!A:F,3,0)*VLOOKUP(R5,Währung!C:D,2,0),\" \")","v":30.949296406960002},30.949296406960002,{"$f":"SUMIFS(G$20:G$19833,D$20:D$19833,D5,E$20:E$19833,\"Verkauf\")","v":0},31.719296406960002,{"$f":"IF(N5>0,O5,0)","v":0},{"$f":"IF(N5>0,\" \",IF(E5<1,\" \",IF((H5-J5)/E5<0,\" \",(H5-J5)/E5)))","v":" "},{"$f":"VLOOKUP(C5,Kurse!A:F,4,0)","v":"USD"},{"$f":"IFERROR(O5/H5/((TODAY()-_xlfn.MINIFS(B$20:B$386,C$20:C$386,C5))/365),\"\")","v":""},{"$f":"IF(ISERROR((M5+J5)/H5-100%),\" \",(M5+J5)/H5-100%)","v":" "}]
[null,null,"Kraft Heinz Co","A14TU4",{"$f":"IF((SUMIFS(H$20:H$19833,D$20:D$19833,D6,E$20:E$19833,\"Splitt\")>0),SUMIFS(H$20:H$19833,D$20:D$19833,D6,E$20:E$19833,\"Splitt\"),SUMIFS(H$20:H$19833,D$20:D$19833,D6,E$20:E$19833,\"Kauf\"))-F6","v":350},{"$f":"SUMIFS(H$20:H$19833,D$20:D$19833,D6,E$20:E$19833,\"Verkauf\")","v":0},{"$f":"IFERROR(SUMIF(D20:D19835,D6,J20:J19835)/COUNTIFS(D20:D19835,D6,E20:E19835,\"Kauf\"),\"\")","v":15},{"$f":"SUMIFS(G$20:G$19833,D$20:D$19833,D6,E$20:E$19833,\"Kauf\")","v":5250},null,{"$f":"SUMIFS(G$20:G$19833,D$20:D$19833,D6,E$20:E$19833,J$3)","v":638.71},4611.29,{"$f":"IFERROR(VLOOKUP(C6,Kurse!A:F,3,0)*VLOOKUP(R6,Währung!C:D,2,0),\" \")","v":25.767254860760001},9018.5392012660013,{"$f":"SUMIFS(G$20:G$19833,D$20:D$19833,D6,E$20:E$19833,\"Verkauf\")","v":0},4407.2492012660014,0,13.175114285714285,{"$f":"VLOOKUP(C6,Kurse!A:F,4,0)","v":"USD"},{"$f":"IFERROR(O6/H6/((TODAY()-_xlfn.MINIFS(B$20:B$386,C$20:C$386,C6))/365),\"\")","v":0.15609208048536891},0.83947603833638107]
[null,null,"BRITISH AMERICAN TOBACCO PLC ADS Common Stock",916018,{"$f":"IF((SUMIFS(H$20:H$19833,D$20:D$19833,D7,E$20:E$19833,\"Splitt\")>0),SUMIFS(H$20:H$19833,D$20:D$19833,D7,E$20:E$19833,\"Splitt\"),SUMIFS(H$20:H$19833,D$20:D$19833,D7,E$20:E$19833,\"Kauf\"))-F7","v":450},{"$f":"SUMIFS(H$20:H$19833,D$20:D$19833,D7,E$20:E$19833,\"Verkauf\")","v":0},{"$f":"IFERROR(SUMIF(D20:D19836,D7,J20:J19836)/COUNTIFS(D20:D19836,D7,E20:E19836,\"Kauf\"),\"\")","v":19},{"$f":"SUMIFS(G$20:G$19833,D$20:D$19833,D7,E$20:E$19833,\"Kauf\")","v":8700},null,{"$f":"SUMIFS(G$20:G$19833,D$20:D$19833,D7,E$20:E$19833,J$3)","v":1551.3899999999999},7148.6100000000006,{"$f":"IFERROR(VLOOKUP(C7,Kurse!A:F,3,0)*VLOOKUP(R7,Währung!C:D,2,0),\" \")","v":37.301764578250001},16785.794060212502,{"$f":"SUMIFS(G$20:G$19833,D$20:D$19833,D7,E$20:E$19833,\"Verkauf\")","v":0},9637.1840602125012,0,15.885800000000001,{"$f":"VLOOKUP(C7,Kurse!A:F,4,0)","v":"USD"},{"$f":"IFERROR(O7/H7/((TODAY()-_xlfn.MINIFS(B$20:B$386,C$20:C$386,C7))/365),\"\")","v":0.20596976138900483},1.107722305771552]
[null,null,"Prosiebensat 1 Media SE","PSM777",{"$f":"IF((SUMIFS(H$20:H$19833,D$20:D$19833,D8,E$20:E$19833,\"Splitt\")>0),SUMIFS(H$20:H$19833,D$20:D$19833,D8,E$20:E$19833,\"Splitt\"),SUMIFS(H$20:H$19833,D$20:D$19833,D8,E$20:E$19833,\"Kauf\"))-F8","v":750},{"$f":"SUMIFS(H$20:H$19833,D$20:D$19833,D8,E$20:E$19833,\"Verkauf\")","v":0},{"$f":"IFERROR(SUMIF(D20:D19837,D8,J20:J19837)/COUNTIFS(D20:D19837,D8,E20:E19837,\"Kauf\"),\"\")","v":5},{"$f":"SUMIFS(G$20:G$19833,D$20:D$19833,D8,E$20:E$19833,\"Kauf\")","v":3750},null,{"$f":"SUMIFS(G$20:G$19833,D$20:D$19833,D8,E$20:E$19833,J$3)","v":37.5},3712.5,{"$f":"IFERROR(VLOOKUP(C8,Kurse!A:F,3,0)*VLOOKUP(R8,Währung!C:D,2,0),\" \")","v":5.68},4260,{"$f":"SUMIFS(G$20:G$19833,D$20:D$19833,D8,E$20:E$19833,\"Verkauf\")","v":0},547.5,0,4.95,{"$f":"VLOOKUP(C8,Kurse!A:F,4,0)","v":"EUR"},{"$f":"IFERROR(O8/H8/((TODAY()-_xlfn.MINIFS(B$20:B$386,C$20:C$386,C8))/365),\"\")","v":2.7174910759816418E-2},0.14599999999999991]
[null,null,"Dow Inc","A2PFRC",{"$f":"IF((SUMIFS(H$20:H$19833,D$20:D$19833,D9,E$20:E$19833,\"Splitt\")>0),SUMIFS(H$20:H$19833,D$20:D$19833,D9,E$20:E$19833,\"Splitt\"),SUMIFS(H$20:H$19833,D$20:D$19833,D9,E$20:E$19833,\"Kauf\"))-F9","v":619},{"$f":"SUMIFS(H$20:H$19833,D$20:D$19833,D9,E$20:E$19833,\"Verkauf\")","v":0},{"$f":"IFERROR(SUMIF(D20:D19838,D9,J20:J19838)/COUNTIFS(D20:D19838,D9,E20:E19838,\"Kauf\"),\"\")","v":23.5},{"$f":"SUMIFS(G$20:G$19833,D$20:D$19833,D9,E$20:E$19833,\"Kauf\")","v":15319},null,{"$f":"SUMIFS(G$20:G$19833,D$20:D$19833,D9,E$20:E$19833,J$3)","v":1888.1789999999999},13430.821,{"$f":"IFERROR(VLOOKUP(C9,Kurse!A:F,3,0)*VLOOKUP(R9,Währung!C:D,2,0),\" \")","v":24.2},{"$f":"IF(N9>0,N9,IF(E9<1,\" \",E9*L9))","v":14979.8},{"$f":"SUMIFS(G$20:G$19833,D$20:D$19833,D9,E$20:E$19833,\"Verkauf\")","v":0},{"$f":"IF(E9<1,\" \",(IF(N9>0,N9-H9+J9,M9-H9+J9)))","v":1548.9789999999991},0,21.697610662358642,{"$f":"VLOOKUP(C9,Kurse!A:F,4,0)","v":"EUR"},{"$f":"IFERROR(O9/H9/((TODAY()-_xlfn.MINIFS(B$20:B$386,C$20:C$386,C9))/365),\"\")","v":3.0152724552405533E-2},0.10111489000587492]
[null,null,null,null,{"$f":"IF((SUMIFS(H$20:H$19833,D$20:D$19833,D10,E$20:E$19833,\"Splitt\")>0),SUMIFS(H$20:H$19833,D$20:D$19833,D10,E$20:E$19833,\"Splitt\"),SUMIFS(H$20:H$19833,D$20:D$19833,D10,E$20:E$19833,\"Kauf\"))-F10","v":0},{"$f":"SUMIFS(H$20:H$19833,D$20:D$19833,D10,E$20:E$19833,\"Verkauf\")","v":0},{"$f":"IFERROR(SUMIF(D20:D19839,D10,J20:J19839)/COUNTIFS(D20:D19839,D10,E20:E19839,\"Kauf\"),\"\")","v":""},{"$f":"SUMIFS(G$20:G$19833,D$20:D$19833,D10,E$20:E$19833,\"Kauf\")","v":0},null,{"$f":"SUMIFS(G$20:G$19833,D$20:D$19833,D10,E$20:E$19833,J$3)","v":0},0,{"$f":"IFERROR(VLOOKUP(C10,Kurse!A:F,3,0)*VLOOKUP(R10,Währung!C:D,2,0),\" \")","v":" "}," ",{"$f":"SUMIFS(G$20:G$19833,D$20:D$19833,D10,E$20:E$19833,\"Verkauf\")","v":0},{"$f":"IF(E10<1,\" \",(IF(N10>0,N10-H10+J10,M10-H10+J10)))","v":" "},0," ",{"$f":"VLOOKUP(C10,Kurse!A:F,4,0)","v":{"$error":"#N/A"}},{"$f":"IFERROR(O10/H10/((TODAY()-_xlfn.MINIFS(B$20:B$386,C$20:C$386,C10))/365),\"\")","v":""}," "]
[null,null,null,null,{"$f":"IF((SUMIFS(H$20:H$19833,D$20:D$19833,D11,E$20:E$19833,\"Splitt\")>0),SUMIFS(H$20:H$19833,D$20:D$19833,D11,E$20:E$19833,\"Splitt\"),SUMIFS(H$20:H$19833,D$20:D$19833,D11,E$20:E$19833,\"Kauf\"))-F11","v":0},{"$f":"SUMIFS(H$20:H$19833,D$20:D$19833,D11,E$20:E$19833,\"Verkauf\")","v":0},{"$f":"IFERROR(SUMIF(D20:D19840,D11,J20:J19840)/COUNTIFS(D20:D19840,D11,E20:E19840,\"Kauf\"),\"\")","v":""},{"$f":"SUMIFS(G$20:G$19833,D$20:D$19833,D11,E$20:E$19833,\"Kauf\")","v":0},null,{"$f":"SUMIFS(G$20:G$19833,D$20:D$19833,D11,E$20:E$19833,J$3)","v":0},0,{"$f":"IFERROR(VLOOKUP(C11,Kurse!A:F,3,0)*VLOOKUP(R11,Währung!C:D,2,0),\" \")","v":" "}," ",{"$f":"SUMIFS(G$20:G$19833,D$20:D$19833,D11,E$20:E$19833,\"Verkauf\")","v":0}," ",0," ",{"$f":"VLOOKUP(C11,Kurse!A:F,4,0)","v":{"$error":"#N/A"}},{"$f":"IFERROR(O11/H11/((TODAY()-_xlfn.MINIFS(B$20:B$386,C$20:C$386,C11))/365),\"\")","v":""}," "]
[null,null,null,null,{"$f":"IF((SUMIFS(H$20:H$19833,D$20:D$19833,D12,E$20:E$19833,\"Splitt\")>0),SUMIFS(H$20:H$19833,D$20:D$19833,D12,E$20:E$19833,\"Splitt\"),SUMIFS(H$20:H$19833,D$20:D$19833,D12,E$20:E$19833,\"Kauf\"))-F12","v":0},{"$f":"SUMIFS(H$20:H$19833,D$20:D$19833,D12,E$20:E$19833,\"Verkauf\")","v":0},{"$f":"IFERROR(SUMIF(D20:D19841,D12,J20:J19841)/COUNTIFS(D20:D19841,D12,E20:E19841,\"Kauf\"),\"\")","v":""},{"$f":"SUMIFS(G$20:G$19833,D$20:D$19833,D12,E$20:E$19833,\"Kauf\")","v":0},null,{"$f":"SUMIFS(G$20:G$19833,D$20:D$19833,D12,E$20:E$19833,J$3)","v":0},0,{"$f":"IFERROR(VLOOKUP(C12,Kurse!A:F,3,0)*VLOOKUP(R12,Währung!C:D,2,0),\" \")","v":" "}," ",{"$f":"SUMIFS(G$20:G$19833,D$20:D$19833,D12,E$20:E$19833,\"Verkauf\")","v":0}," ",0," ",{"$f":"VLOOKUP(C12,Kurse!A:F,4,0)","v":{"$error":"#N/A"}},{"$f":"IFERROR(O12/H12/((TODAY()-_xlfn.MINIFS(B$20:B$386,C$20:C$386,C12))/365),\"\")","v":""}," "]
[null,null,null,null,{"$f":"IF((SUMIFS(H$20:H$19833,D$20:D$19833,D13,E$20:E$19833,\"Splitt\")>0),SUMIFS(H$20:H$19833,D$20:D$19833,D13,E$20:E$19833,\"Splitt\"),SUMIFS(H$20:H$19833,D$20:D$19833,D13,E$20:E$19833,\"Kauf\"))-F13","v":0},{"$f":"SUMIFS(H$20:H$19833,D$20:D$19833,D13,E$20:E$19833,\"Verkauf\")","v":0},{"$f":"IFERROR(SUMIF(D20:D19842,D13,J20:J19842)/COUNTIFS(D20:D19842,D13,E20:E19842,\"Kauf\"),\"\")","v":""},{"$f":"SUMIFS(G$20:G$19833,D$20:D$19833,D13,E$20:E$19833,\"Kauf\")","v":0},null,{"$f":"SUMIFS(G$20:G$19833,D$20:D$19833,D13,E$20:E$19833,J$3)","v":0},{"$f":"IF(H13-J13 < 0,0,H13-J13)","v":0},{"$f":"IFERROR(VLOOKUP(C13,Kurse!A:F,3,0)*VLOOKUP(R13,Währung!C:D,2,0),\" \")","v":" "},{"$f":"IF(N13>0,N13,IF(E13<1,\" \",E13*L13))","v":" "},{"$f":"SUMIFS(G$20:G$19833,D$20:D$19833,D13,E$20:E$19833,\"Verkauf\")","v":0},{"$f":"IF(E13<1,\" \",(IF(N13>0,N13-H13+J13,M13-H13+J13)))","v":" "},0," ",{"$f":"VLOOKUP(C13,Kurse!A:F,4,0)","v":{"$error":"#N/A"}},{"$f":"IFERROR(O13/H13/((TODAY()-_xlfn.MINIFS(B$20:B$386,C$20:C$386,C13))/365),\"\")","v":""}," "]
[null,null,null,null,{"$f":"IF((SUMIFS(H$20:H$19833,D$20:D$19833,D14,E$20:E$19833,\"Splitt\")>0),SUMIFS(H$20:H$19833,D$20:D$19833,D14,E$20:E$19833,\"Splitt\"),SUMIFS(H$20:H$19833,D$20:D$19833,D14,E$20:E$19833,\"Kauf\"))-F14","v":0},{"$f":"SUMIFS(H$20:H$19833,D$20:D$19833,D14,E$20:E$19833,\"Verkauf\")","v":0},{"$f":"IFERROR(SUMIF(D21:D19843,D14,J21:J19843)/COUNTIFS(D21:D19843,D14,E21:E19843,\"Kauf\"),\"\")","v":""},{"$f":"SUMIFS(G$20:G$19833,D$20:D$19833,D14,E$20:E$19833,\"Kauf\")","v":0},null,{"$f":"SUMIFS(G$20:G$19833,D$20:D$19833,D14,E$20:E$19833,J$3)","v":0},0,{"$f":"IFERROR(VLOOKUP(C14,Kurse!A:F,3,0)*VLOOKUP(R14,Währung!C:D,2,0),\" \")","v":" "}," ",{"$f":"SUMIFS(G$20:G$19833,D$20:D$19833,D14,E$20:E$19833,\"Verkauf\")","v":0}," ",0," ",{"$f":"VLOOKUP(C14,Kurse!A:F,4,0)","v":{"$error":"#N/A"}},{"$f":"IFERROR(O14/H14/((TODAY()-_xlfn.MINIFS(B$20:B$386,C$20:C$386,C14))/365),\"\")","v":""}," "]
[null,null,null,null,{"$f":"IF((SUMIFS(H$20:H$19833,D$20:D$19833,D15,E$20:E$19833,\"Splitt\")>0),SUMIFS(H$20:H$19833,D$20:D$19833,D15,E$20:E$19833,\"Splitt\"),SUMIFS(H$20:H$19833,D$20:D$19833,D15,E$20:E$19833,\"Kauf\"))-F15","v":0},{"$f":"SUMIFS(H$20:H$19833,D$20:D$19833,D15,E$20:E$19833,\"Verkauf\")","v":0},{"$f":"IFERROR(SUMIF(D21:D19844,D15,J21:J19844)/COUNTIFS(D21:D19844,D15,E21:E19844,\"Kauf\"),\"\")","v":""},{"$f":"SUMIFS(G$20:G$19833,D$20:D$19833,D15,E$20:E$19833,\"Kauf\")","v":0},null,{"$f":"SUMIFS(G$20:G$19833,D$20:D$19833,D15,E$20:E$19833,J$3)","v":0},0,{"$f":"IFERROR(VLOOKUP(C15,Kurse!A:F,3,0)*VLOOKUP(R15,Währung!C:D,2,0),\" \")","v":" "}," ",{"$f":"SUMIFS(G$20:G$19833,D$20:D$19833,D15,E$20:E$19833,\"Verkauf\")","v":0}," ",0," ",{"$f":"VLOOKUP(C15,Kurse!A:F,4,0)","v":{"$error":"#N/A"}},{"$f":"IFERROR(O15/H15/((TODAY()-_xlfn.MINIFS(B$20:B$386,C$20:C$386,C15))/365),\"\")","v":""}," "]
[null,null,null,null,{"$f":"IF((SUMIFS(H$20:H$19833,D$20:D$19833,D16,E$20:E$19833,\"Splitt\")>0),SUMIFS(H$20:H$19833,D$20:D$19833,D16,E$20:E$19833,\"Splitt\"),SUMIFS(H$20:H$19833,D$20:D$19833,D16,E$20:E$19833,\"Kauf\"))-F16","v":0},{"$f":"SUMIFS(H$20:H$19833,D$20:D$19833,D16,E$20:E$19833,\"Verkauf\")","v":0},{"$f":"IFERROR(SUMIF(D22:D19845,D16,J22:J19845)/COUNTIFS(D22:D19845,D16,E22:E19845,\"Kauf\"),\"\")","v":""},{"$f":"SUMIFS(G$20:G$19833,D$20:D$19833,D16,E$20:E$19833,\"Kauf\")","v":0},null,{"$f":"SUMIFS(G$20:G$19833,D$20:D$19833,D16,E$20:E$19833,J$3)","v":0},{"$f":"IF(H16-J16 < 0,0,H16-J16)","v":0},{"$f":"IFERROR(VLOOKUP(C16,Kurse!A:F,3,0)*VLOOKUP(R16,Währung!C:D,2,0),\" \")","v":" "},{"$f":"IF(N16>0,N16,IF(E16<1,\" \",E16*L16))","v":" "},{"$f":"SUMIFS(G$20:G$19833,D$20:D$19833,D16,E$20:E$19833,\"Verkauf\")","v":0},{"$f":"IF(E16<1,\" \",(IF(N16>0,N16-H16+J16,M16-H16+J16)))","v":" "},{"$f":"IF(N16>0,O16,0)","v":0}," ",{"$f":"VLOOKUP(C16,Kurse!A:F,4,0)","v":{"$error":"#N/A"}},{"$f":"IFERROR(O16/H16/((TODAY()-_xlfn.MINIFS(B$20:B$386,C$20:C$386,C16))/365),\"\")","v":""}," "]
[]
[null,null,null,null,null,null,{"$f":"SUBTOTAL(9,G20:G1833)","v":37661.239000000009},{"$f":"IF(SUBTOTAL(9,H20:H1833)<1,\" \",SUBTOTAL(9,H20:H1833))","v":2670}]
[null,"Datum","Aktie","WKN","Aktion","Spalte2","Kosten","Anzahl","Spalte3","Kurs","Dividende/Aktie"]
[null,38090,"Telefonaktiebolaget LM Ericsson Class B",850001,"Kauf",{"$f":"IF(Tabelle5[[#This Row],[Aktion]] = \"Verkauf\",\" \",IF(Tabelle5[[#This Row],[Aktion]] = \"Kauf\",\" \",Tabelle5[[#This Row],[Kosten]]))","v":" "},{"$f":"IF(Tabelle5[[#This Row],[Aktion]] = \"Verkauf\",Tabelle5[[#This Row],[Anzahl]]*Tabelle5[[#This Row],[Kurs]],IF(Tabelle5[[#This Row],[Aktion]] = \"Kauf\",Tabelle5[[#This Row],[Anzahl]]*Tabelle5[[#This Row],[Kurs]]))","v":500},500,{"$f":"IF(\"Dividende\" = E20,SUMIFS(H$20:H20,D$20:D20,D20,E$20:E20,\"Kauf\"),\" \")","v":" "},1,{"$f":"IF(\"Dividende\" = E20,G20/SUMIFS(H$20:H20,D$20:D20,D20,E$20:E20,\"Kauf\"),\" \")","v":" "}]
{"$rows_left_out":31}
{"sheet":"Kursentwicklung","index":1,"n_rows":164,"n_cols":14,"rows_kept":164,"cut":false,"hidden":false,"merged":[[8,3,10,10]]}
[]
[null,null,{"$f":"Aktien!C4","v":"Telefonaktiebolaget LM Ericsson Class B"},{"$f":"Aktien!C5","v":"Deutsche Telekom AG"},{"$f":"Aktien!C6","v":"Kraft Heinz Co"},{"$f":"Aktien!C7","v":"BRITISH AMERICAN TOBACCO PLC ADS Common Stock"},{"$f":"Aktien!C8","v":"Prosiebensat 1 Media SE"},{"$f":"Aktien!C9","v":"Dow Inc"},{"$f":"Aktien!C16","v":0}]
[null,null,{"$f":"CONCATENATE(\"WKN\",\" \",Aktien!D4)","v":"WKN 850001"},{"$f":"CONCATENATE(\"WKN\",\" \",Aktien!D5)","v":"WKN 555750"},{"$f":"CONCATENATE(\"WKN\",\" \",Aktien!D6)","v":"WKN A14TU4"},{"$f":"CONCATENATE(\"WKN\",\" \",Aktien!D7)","v":"WKN 916018"},{"$f":"CONCATENATE(\"WKN\",\" \",Aktien!D8)","v":"WKN PSM777"},{"$f":"CONCATENATE(\"WKN\",\" \",Aktien!D9)","v":"WKN A2PFRC"},{"$f":"CONCATENATE(\"WKN\",\" \",Aktien!D16)","v":"WKN "},"Gesamt",{"$f":"Aktien!O3","v":"Gewinn/Verlust"},"Kapital","Gewinn (%)"]
[{"$f":"B4","v":45757.935957754627},{"$f":"Aktien!L2","v":45757.935957754627},{"$f":"ROUND(Aktien!L4,4)","v":6.37},{"$f":"ROUND(Aktien!L5,4)","v":30.949300000000001},{"$f":"ROUND(Aktien!L6,4)","v":25.767299999999999},{"$f":"ROUND(Aktien!L7,4)","v":37.3018},{"$f":"ROUND(Aktien!L8,4)","v":5.68},{"$f":"ROUND(Aktien!L9,4)","v":24.2},{"$f":"ROUND(Aktien!L16,4)","v":{"$error":"#VALUE!"}},{"$f":"ROUND(Aktien!M2,2)","v":48260.08},{"$f":"ROUND(Aktien!O2,2)","v":18883.32},{"$f":"ROUND(J4-K4,2)","v":29376.76},{"$f":"ROUND((J4/L4)-100%,4)","v":0.64280000000000004},{"$f":"IF(AND(INDIRECT(\"L33\")-L4 < 0.1,INDIRECT(\"L33\")-L4 > -0.1),\" \",INDIRECT(\"L33\")-L4)","v":" "}]
[null,"Diff. min",{"$f":"C4-MIN(C23:C164)","v":0.33999999999999986},{"$f":"D4-MIN(D23:D176)","v":2.8231000000000002},{"$f":"E4-MIN(E23:E164)","v":0.67119999999999891},{"$f":"F4-MIN(F23:F164)","v":3.4273000000000025},{"$f":"G4-MIN(G23:G164)","v":0.89999999999999947},{"$f":"H4-MIN(H23:H164)","v":1.3000000000000007},{"$f":"I4-MIN(I18:I164)","v":{"$error":"#VALUE!"}}]
[null,"Diff.max",{"$f":"C4-MAX(C23:C164)","v":-2.12},{"$f":"D4-MAX(D23:D176)","v":-4.3903999999999996},{"$f":"E4-MAX(E23:E176)","v":-4.6972000000000023},{"$f":"F4-MAX(F23:F176)","v":-4.8759000000000015},{"$f":"G4-MAX(G23:G176)","v":-1.2000000000000002},{"$f":"H4-MAX(H23:H176)","v":-16.23},{"$f":"I4-MAX(I18:I176)","v":{"$error":"#VALUE!"}}]
[null,null,{"$f":"C5+C6","v":-1.7800000000000002},{"$f":"D5+D6","v":-1.5672999999999995},-4.0260000000000034,-1.448599999999999,-0.30000000000000071,-14.93]
[]
[null,null,null,"Daten werden aktualisiert, einen Moment."]
[]
[]
[]
[]
[]
[null,"Spalte1","Spalte2","Spalte3","Spalte4","Spalte5","Spalte6","Spalte7","Spalte8","Spalte9","Spalte10","Spalte11","Spalte12"," "]
[null,null,null,null,null,null,null,null,null,null,null,null,null," "]
[null,null,null,null,null,null,null,null,null,null,null,null,null," "]
[null,null,{"$f":"C3","v":"WKN 850001"},{"$f":"D3","v":"WKN 555750"},"WKN A14TU4","WKN 916018","WKN PSM777","WKN A2PFRC","WKN ","Gesamt","Gewinn/Verlust","Kapital","Gewinn (%)"]
[null,"max. Kurs",{"$f":"MAX((INDIRECT(\"C21\")) :#REF!)","v":{"$error":"#REF!"}},{"$f":"MAX((INDIRECT(\"D21\")) : D170)","v":35.339700000000001},{"$f":"MAX((INDIRECT(\"E21\")) : E170)","v":30.464500000000001},{"$f":"MAX((INDIRECT(\"F21\")) : F170)","v":42.177700000000002},{"$f":"MAX((INDIRECT(\"G21\")) : G170)","v":6.88},{"$f":"MAX((INDIRECT(\"H21\")) : H170)","v":40.43},{"$f":"MAX((INDIRECT(\"I21\")) : I170)","v":{"$error":"#VALUE!"}},{"$f":"MAX((INDIRECT(\"J21\")) : J170)","v":57136.17},{"$f":"MAX((INDIRECT(\"K21\")) : K170)","v":27759.409999999996},{"$f":"MAX((INDIRECT(\"L21\")) : L170)","v":30361.969999999998},{"$f":"MAX((INDIRECT(\"M21\")) :M170)","v":0.92721043013658255}]
[null,null,{"$f":"AVERAGE(INDIRECT(\"C32\"):INDIRECT(\"C52\"))-AVERAGE(INDIRECT(\"C32\"):INDIRECT(\"C92\"))","v":-0.47116315378610629},{"$f":"AVERAGE(INDIRECT(\"D32\"):INDIRECT(\"D52\"))-AVERAGE(INDIRECT(\"D32\"):INDIRECT(\"D92\"))","v":-0.33732326307571725},{"$f":"AVERAGE(INDIRECT(\"E32\"):INDIRECT(\"E52\"))-AVERAGE(INDIRECT(\"E32\"):INDIRECT(\"E92\"))","v":-0.96205089773614461},{"$f":"AVERAGE(INDIRECT(\"F32\"):INDIRECT(\"F52\"))-AVERAGE(INDIRECT(\"F32\"):INDIRECT(\"F92\"))","v":0.3674584699453618},{"$f":"AVERAGE(INDIRECT(\"G32\"):INDIRECT(\"G52\"))-AVERAGE(INDIRECT(\"G32\"):INDIRECT(\"G92\"))","v":-0.16815768930522879},{"$f":"AVERAGE(INDIRECT(\"H32\"):INDIRECT(\"H52\"))-AVERAGE(INDIRECT(\"H32\"):INDIRECT(\"H92\"))","v":-3.4811631537861061},{"$f":"TREND(I147:I164)","v":249.83555555555563}]
{"$rows_left_out":145}
{"sheet":"FEFonds","index":2,"n_rows":9,"n_cols":3,"rows_kept":9,"cut":false,"hidden":false,"merged":[]}
["Column1","Column2"]
["WKN:","847805"]
["ISIN:","DE0008478058"]
["Region:","Welt"]
["Typ:","Aktienfonds"]
["Column1","Column2","Column3"]
["aktueller Kurs:","243,46  EUR",{"$f":"MID(Table_2[[#This Row],[Column2]],1,6)","v":"243,46"}]
["Veränderung:","-17,07  EUR",{"$f":"MID(Table_2[[#This Row],[Column2]],1,6)","v":"-17,07"}]
["Veränderung in %:","-6,55 %",{"$f":"MID(Table_2[[#This Row],[Column2]],1,6)","v":"-6,55 "}]

{"sheet":"Kurse","index":3,"n_rows":527,"n_cols":6,"rows_kept":527,"cut":false,"hidden":false,"merged":[]}
["Firma","Aktie","Kurs  ","WÃ¤hrung","Handelsvolumen","Gewinn/Aktie"]
["1&1 AG","1U1",14.14,"EUR",97640,"1,2"]
["2G Energy AG","2GB",24.75,"EUR",48442,"1"]
["7C Solarparken AG","HRPK",1.96,"EUR",38975,"0,03"]
["A2A SpA","A2A",1.97,"EUR",21006126,"0,3"]
["Aalberts NV","AALB",27.5,"EUR",415749,"1,62"]
["ABM Industries Inc","ABM",44.37,"USD",1790996,"1,27"]
["ABN Amro Bank NV","ABN",17.309999999999999,"EUR",4629138,"2,72"]
["ABO Energy GmbH & Co KgaA","AB9",36.299999999999997,"EUR",1490,"3,22"]
["Acciona SA","ANA",111.4,"EUR",126309,"7,75"]
["Ackermans & van Haaren NV","ACKB",189.5,"EUR",45816,"14,05"]
["Acomo NV","ACOMO",20.2,"EUR",38740,"1,53"]
["Addnode Group AB (publ)","AR7",7.67,"EUR",0,"#N/A"]
["Addtech AB","AZZ2",25.98,"EUR",0,"#N/A"]
["ADDvise Group AB (publ) Class B","Q3I",0.08,"EUR",0,"#N/A"]
["adesso SE","ADN1",90.7,"EUR",7599,"1,25"]
["Adler Group SA","ADJ",0.22,"EUR",37331,"6,41"]
["Advance Terrafund ADSITS","11b",0,"EUR",0,"#N/A"]
["Adyen NV","ADYEN",1353.2,"EUR",157261,"29,59"]
["Aedifica NV","AED",60.9,"EUR",82335,"4,31"]
{"$rows_left_out":508}
{"sheet":"Währung","index":4,"n_rows":11,"n_cols":4,"rows_kept":11,"cut":false,"hidden":false,"merged":[]}
["Column1","Column2","Column3","Column4"]
["",1,"Währung","Umrechnung"]
["",2,"EUR","1"]
["",3,"CHF","1,08308"]
["",4,"GBP","1,15828"]
["",5,"USD","0,893455439"]
["",6,null,"#NV"]
["",7,null,"#NV"]
["",8,null,"#NV"]
["",9,null,"#NV"]
["",10,null,"#NV"]