{"text_format":"1","workbook":"xlsx","n_sheets":2,"sheets":["Terminplanung","Teilnehmer Soll"],"not_rendered":{"charts":0,"images":0,"macros":1,"external_links":0,"defined_names":1,"comments":0,"pivot_tables":0},"unopened":[],"bounds":{"document_bytes":16777216,"sheet_cells":100000,"rows_first":2000,"rows_last":500,"rows_between":2000,"halvings":0,"cell_chars":16384,"cell_head_chars":4096},"cells_cut":0,"cells_raw":0,"read":"whole","date_system":"1900"}

{"sheet":"Terminplanung","index":0,"n_rows":100,"n_cols":20,"rows_kept":100,"cut":false,"hidden":false,"merged":[[24,17,26,17],[5,13,7,13],[5,17,6,19],[5,14,7,14],[5,15,7,15],[9,17,11,17],[20,17,22,17],[16,17,18,17],[13,17,14,17],[9,19,12,19],[5,0,6,0],[5,1,6,1],[5,3,6,3],[5,2,6,2],[5,4,6,4],[5,12,7,12],[5,11,7,11],[2,11,2,15],[5,6,6,9],[5,5,6,5],[2,6,2,9]]}
[]
[]
[null,null,null,null,null,null,"Hier mit Namen eintragen",null,null,null,null,"Hier nur für Buchungsverantwortliche(n)"]
[]
[null,null,null,null,null,null,null,null,null,null,null,null,null,true,true,true,null,null,"Ja"]
["Seminar-ID","Thema","Beginn","Wochentag","Ort","Max. Plätze","Teilnehmer Eintragungen",null,null,null,null,"Teilnehmer\nSoll","Termin","PV","Platz\nRes","Excel",null,"Legende Farben"]
[]
[null,null,null,null,null,null,1,2,3,4,null,null,null,null,"BayZeit",null,null,"Teilnehmer",null,"Buchung"]
[316412,"Fortbildung 1","2025-05-12T08:00:00","Montag"," Unterrichtsraum",4,"Teilnehmer 1","Teilnehmer 4",null,null,null,{"$f":"IF('Teilnehmer Soll'!B9=\"\",#N/A,'Teilnehmer Soll'!B9)","v":"Teilnehmer 1"},{"$f":"IF(ISERROR(IF(COUNTIF($G$9:$G$100,$L9),INDEX($C$9:$C$100,MATCH($L9,$G$9:$G$100,0)),IF(COUNTIF($H$9:$H$100,$L9),INDEX($C$9:$C$100,MATCH($L9,$H$9:$H$100,0)),IF(COUNTIF($I$9:$I$100,$L9),INDEX($C$9:$C$100,MATCH($L9,$I$9:$I$100,0)),INDEX($C$9:$C$100,MATCH($L9,$J$9:$J$100,0)))))),\"\",(IF(COUNTIF($G$9:$G$100,$L9),INDEX($C$9:$C$100,MATCH($L9,$G$9:$G$100,0)),IF(COUNTIF($H$9:$H$100,$L9),INDEX($C$9:$C$100,MATCH($L9,$H$9:$H$100,0)),IF(COUNTIF($I$9:$I$100,$L9),INDEX($C$9:$C$100,MATCH($L9,$I$9:$I$100,0)),INDEX($C$9:$C$100,MATCH($L9,$J$9:$J$100,0)))))))","v":"2025-05-12T08:00:00"},"Ja"]
[316960,"Fortbildung 2","2025-05-15T08:00:00","Donnerstag"," Unterrichtsraum",4,null,null,null,null,null,{"$f":"IF('Teilnehmer Soll'!B10=\"\",#N/A,'Teilnehmer Soll'!B10)","v":"Teilnehmer 2"},"2025-05-27T07:59:59.995","Ja",null,null,null,"mehrfach eingetragen /\nkein Termin",null,"\"Ja\", obwohl\nTermin oder Teilnehmer fehlt"]
[317508,"Fortbildung 3","2025-05-18T07:59:59.995","Sonntag"," Unterrichtsraum",4,"Teilnehmer 7",null,null,null,null,{"$f":"IF('Teilnehmer Soll'!B11=\"\",#N/A,'Teilnehmer Soll'!B11)","v":"Teilnehmer 3"},""]
[318056,"Fortbildung 4","2025-05-21T07:59:59.995","Mittwoch"," Unterrichtsraum",4,"Teilnehmer 12",null,null,null,null,{"$f":"IF('Teilnehmer Soll'!B12=\"\",#N/A,'Teilnehmer Soll'!B12)","v":"Teilnehmer 4"},"2025-05-12T08:00:00"]
[318604,"Fortbildung 5","2025-05-24T07:59:59.995","Samstag"," Unterrichtsraum",4,null,null,null,null,null,{"$f":"IF('Teilnehmer Soll'!B13=\"\",#N/A,'Teilnehmer Soll'!B13)","v":"Teilnehmer 5"},"2025-05-27T07:59:59.995","Ja","Ja"]
[319152,"Fortbildung 6","2025-05-27T07:59:59.995","Dienstag"," Unterrichtsraum",4,"Teilnehmer 2","Teilnehmer 5","Teilnehmer 18","Teilnehmer 17",null,{"$f":"IF('Teilnehmer Soll'!B14=\"\",#N/A,'Teilnehmer Soll'!B14)","v":"Teilnehmer 6"},"",null,null,null,null,"noch nicht eingetragen"]
[319700,"Fortbildung 7","2025-05-30T07:59:59.995","Freitag"," Unterrichtsraum",4,null,null,null,null,null,{"$f":"IF('Teilnehmer Soll'!B15=\"\",#N/A,'Teilnehmer Soll'!B15)","v":"Teilnehmer 7"},"2025-05-18T07:59:59.995"]
[320248,"Fortbildung 8","2025-06-02T07:59:59.995","Montag"," Unterrichtsraum",4,null,null,null,null,null,{"$f":"IF('Teilnehmer Soll'!B16=\"\",#N/A,'Teilnehmer Soll'!B16)","v":"Teilnehmer 8"},""]
[320796,"Fortbildung 9","2025-06-05T07:59:59.995","Donnerstag"," Unterrichtsraum",4,null,null,null,null,null,{"$f":"IF('Teilnehmer Soll'!B17=\"\",#N/A,'Teilnehmer Soll'!B17)","v":"Teilnehmer 9"},"",null,null,null,null,"eingetragen, aber fehlende Buchung(en)"]
[321344,"Fortbildung 10","2025-06-08T07:59:59.995","Sonntag"," Unterrichtsraum",4,null,null,null,null,null,{"$f":"IF('Teilnehmer Soll'!B18=\"\",#N/A,'Teilnehmer Soll'!B18)","v":"Teilnehmer 10"},""]
[null,null,null,null,null,null,null,null,null,null,null,{"$f":"IF('Teilnehmer Soll'!B19=\"\",#N/A,'Teilnehmer Soll'!B19)","v":"Teilnehmer 11"},""]
[null,null,null,null,null,null,null,null,null,null,null,{"$f":"IF('Teilnehmer Soll'!B20=\"\",#N/A,'Teilnehmer Soll'!B20)","v":"Teilnehmer 12"},"2025-05-21T07:59:59.995","Ja","Ja","Ja"]
[null,null,null,null,null,null,null,null,null,null,null,{"$f":"IF('Teilnehmer Soll'!B21=\"\",#N/A,'Teilnehmer Soll'!B21)","v":"Teilnehmer 13"},"",null,null,null,null,"Buchung PV / \nPlatz Res erfolgt"]
[null,null,null,null,null,null,null,null,null,null,null,{"$f":"IF('Teilnehmer Soll'!B22=\"\",#N/A,'Teilnehmer Soll'!B22)","v":"Teilnehmer 14"},""]
[null,null,null,null,null,null,null,null,null,null,null,{"$f":"IF('Teilnehmer Soll'!B23=\"\",#N/A,'Teilnehmer Soll'!B23)","v":"Teilnehmer 15"},""]
[null,null,null,null,null,null,null,null,null,null,null,{"$f":"IF('Teilnehmer Soll'!B24=\"\",#N/A,'Teilnehmer Soll'!B24)","v":"Teilnehmer 16"},""]
[null,null,null,null,null,null,null,null,null,null,null,{"$f":"IF('Teilnehmer Soll'!B25=\"\",#N/A,'Teilnehmer Soll'!B25)","v":"Teilnehmer 17"},"2025-05-27T07:59:59.995",null,null,null,null,"(zusätzlich) \nin Excel eingetragen"]
[null,null,null,null,null,null,null,null,null,null,null,{"$f":"IF('Teilnehmer Soll'!B26=\"\",#N/A,'Teilnehmer Soll'!B26)","v":"Teilnehmer 18"},"2025-05-27T07:59:59.995",null,"Ja"]
[null,null,null,null,null,null,null,null,null,null,null,{"$f":"IF('Teilnehmer Soll'!B27=\"\",#N/A,'Teilnehmer Soll'!B27)","v":"Teilnehmer 19"},""]
[null,null,null,null,null,null,null,null,null,null,null,{"$f":"IF('Teilnehmer Soll'!B28=\"\",#N/A,'Teilnehmer Soll'!B28)","v":"Teilnehmer 20"},""]
[null,null,null,null,null,null,null,null,null,null,null,{"$f":"IF('Teilnehmer Soll'!B29=\"\",#N/A,'Teilnehmer Soll'!B29)","v":"Teilnehmer 21"},""]
[null,null,null,null,null,null,null,null,null,null,null,{"$f":"IF('Teilnehmer Soll'!B30=\"\",#N/A,'Teilnehmer Soll'!B30)","v":"Teilnehmer 22"},""]
[null,null,null,null,null,null,null,null,null,null,null,{"$f":"IF('Teilnehmer Soll'!B31=\"\",#N/A,'Teilnehmer Soll'!B31)","v":"Teilnehmer 23"},""]
[null,null,null,null,null,null,null,null,null,null,null,{"$f":"IF('Teilnehmer Soll'!B32=\"\",#N/A,'Teilnehmer Soll'!B32)","v":"Teilnehmer 24"},""]
[null,null,null,null,null,null,null,null,null,null,null,{"$f":"IF('Teilnehmer Soll'!B33=\"\",#N/A,'Teilnehmer Soll'!B33)","v":"Teilnehmer 25"},""]
[null,null,null,null,null,null,null,null,null,null,null,{"$f":"IF('Teilnehmer Soll'!B34=\"\",#N/A,'Teilnehmer Soll'!B34)","v":"Teilnehmer 26"},""]
[null,null,null,null,null,null,null,null,null,null,null,{"$f":"IF('Teilnehmer Soll'!B35=\"\",#N/A,'Teilnehmer Soll'!B35)","v":"Teilnehmer 27"},""]
[null,null,null,null,null,null,null,null,null,null,null,{"$f":"IF('Teilnehmer Soll'!B36=\"\",#N/A,'Teilnehmer Soll'!B36)","v":"Teilnehmer 28"},""]
[null,null,null,null,null,null,null,null,null,null,null,{"$f":"IF('Teilnehmer Soll'!B37=\"\",#N/A,'Teilnehmer Soll'!B37)","v":"Teilnehmer 29"},""]
[null,null,null,null,null,null,null,null,null,null,null,{"$f":"IF('Teilnehmer Soll'!B38=\"\",#N/A,'Teilnehmer Soll'!B38)","v":"Teilnehmer 30"},""]
[null,null,null,null,null,null,null,null,null,null,null,{"$f":"IF('Teilnehmer Soll'!B39=\"\",#N/A,'Teilnehmer Soll'!B39)","v":"Teilnehmer 31"},""]
[null,null,null,null,null,null,null,null,null,null,null,{"$f":"IF('Teilnehmer Soll'!B40=\"\",#N/A,'Teilnehmer Soll'!B40)","v":"Teilnehmer 32"},""]
{"$rows_left_out":61}
{"sheet":"Teilnehmer Soll","index":1,"n_rows":80,"n_cols":2,"rows_kept":80,"cut":false,"hidden":false,"merged":[]}
[]
[]
[]
[]
[]
[]
[null,"Teilnehmer\nSoll"]
[]
[{"$f":"IF(ISERROR(IF(COUNTIF(INDIRECT(\"Terminplanung!$N$\"&MATCH(B9,Terminplanung!$L$1:$L$80,0)&\":$P$\"&MATCH(B9,Terminplanung!$L$1:$L$80,0)),\"Ja\")>0,\"Eintrag\",\"\")),\"\",(IF(COUNTIF(INDIRECT(\"Terminplanung!$N$\"&MATCH(B9,Terminplanung!$L$1:$L$80,0)&\":$P$\"&MATCH(B9,Terminplanung!$L$1:$L$80,0)),\"Ja\")>0,\"Buchung\",\"\")))","v":"Buchung"},"Teilnehmer 1"]
[{"$f":"IF(ISERROR(IF(COUNTIF(INDIRECT(\"Terminplanung!$N$\"&MATCH(B10,Terminplanung!$L$1:$L$80,0)&\":$P$\"&MATCH(B10,Terminplanung!$L$1:$L$80,0)),\"Ja\")>0,\"Eintrag\",\"\")),\"\",(IF(COUNTIF(INDIRECT(\"Terminplanung!$N$\"&MATCH(B10,Terminplanung!$L$1:$L$80,0)&\":$P$\"&MATCH(B10,Terminplanung!$L$1:$L$80,0)),\"Ja\")>0,\"Buchung\",\"\")))","v":"Buchung"},"Teilnehmer 2"]
[{"$f":"IF(ISERROR(IF(COUNTIF(INDIRECT(\"Terminplanung!$N$\"&MATCH(B11,Terminplanung!$L$1:$L$80,0)&\":$P$\"&MATCH(B11,Terminplanung!$L$1:$L$80,0)),\"Ja\")>0,\"Eintrag\",\"\")),\"\",(IF(COUNTIF(INDIRECT(\"Terminplanung!$N$\"&MATCH(B11,Terminplanung!$L$1:$L$80,0)&\":$P$\"&MATCH(B11,Terminplanung!$L$1:$L$80,0)),\"Ja\")>0,\"Buchung\",\"\")))","v":""},"Teilnehmer 3"]
[{"$f":"IF(ISERROR(IF(COUNTIF(INDIRECT(\"Terminplanung!$N$\"&MATCH(B12,Terminplanung!$L$1:$L$80,0)&\":$P$\"&MATCH(B12,Terminplanung!$L$1:$L$80,0)),\"Ja\")>0,\"Eintrag\",\"\")),\"\",(IF(COUNTIF(INDIRECT(\"Terminplanung!$N$\"&MATCH(B12,Terminplanung!$L$1:$L$80,0)&\":$P$\"&MATCH(B12,Terminplanung!$L$1:$L$80,0)),\"Ja\")>0,\"Buchung\",\"\")))","v":""},"Teilnehmer 4"]
[{"$f":"IF(ISERROR(IF(COUNTIF(INDIRECT(\"Terminplanung!$N$\"&MATCH(B13,Terminplanung!$L$1:$L$80,0)&\":$P$\"&MATCH(B13,Terminplanung!$L$1:$L$80,0)),\"Ja\")>0,\"Eintrag\",\"\")),\"\",(IF(COUNTIF(INDIRECT(\"Terminplanung!$N$\"&MATCH(B13,Terminplanung!$L$1:$L$80,0)&\":$P$\"&MATCH(B13,Terminplanung!$L$1:$L$80,0)),\"Ja\")>0,\"Buchung\",\"\")))","v":"Buchung"},"Teilnehmer 5"]
[{"$f":"IF(ISERROR(IF(COUNTIF(INDIRECT(\"Terminplanung!$N$\"&MATCH(B14,Terminplanung!$L$1:$L$80,0)&\":$P$\"&MATCH(B14,Terminplanung!$L$1:$L$80,0)),\"Ja\")>0,\"Eintrag\",\"\")),\"\",(IF(COUNTIF(INDIRECT(\"Terminplanung!$N$\"&MATCH(B14,Terminplanung!$L$1:$L$80,0)&\":$P$\"&MATCH(B14,Terminplanung!$L$1:$L$80,0)),\"Ja\")>0,\"Buchung\",\"\")))","v":""},"Teilnehmer 6"]
[{"$f":"IF(ISERROR(IF(COUNTIF(INDIRECT(\"Terminplanung!$N$\"&MATCH(B15,Terminplanung!$L$1:$L$80,0)&\":$P$\"&MATCH(B15,Terminplanung!$L$1:$L$80,0)),\"Ja\")>0,\"Eintrag\",\"\")),\"\",(IF(COUNTIF(INDIRECT(\"Terminplanung!$N$\"&MATCH(B15,Terminplanung!$L$1:$L$80,0)&\":$P$\"&MATCH(B15,Terminplanung!$L$1:$L$80,0)),\"Ja\")>0,\"Buchung\",\"\")))","v":""},"Teilnehmer 7"]
[{"$f":"IF(ISERROR(IF(COUNTIF(INDIRECT(\"Terminplanung!$N$\"&MATCH(B16,Terminplanung!$L$1:$L$80,0)&\":$P$\"&MATCH(B16,Terminplanung!$L$1:$L$80,0)),\"Ja\")>0,\"Eintrag\",\"\")),\"\",(IF(COUNTIF(INDIRECT(\"Terminplanung!$N$\"&MATCH(B16,Terminplanung!$L$1:$L$80,0)&\":$P$\"&MATCH(B16,Terminplanung!$L$1:$L$80,0)),\"Ja\")>0,\"Buchung\",\"\")))","v":""},"Teilnehmer 8"]
[{"$f":"IF(ISERROR(IF(COUNTIF(INDIRECT(\"Terminplanung!$N$\"&MATCH(B17,Terminplanung!$L$1:$L$80,0)&\":$P$\"&MATCH(B17,Terminplanung!$L$1:$L$80,0)),\"Ja\")>0,\"Eintrag\",\"\")),\"\",(IF(COUNTIF(INDIRECT(\"Terminplanung!$N$\"&MATCH(B17,Terminplanung!$L$1:$L$80,0)&\":$P$\"&MATCH(B17,Terminplanung!$L$1:$L$80,0)),\"Ja\")>0,\"Buchung\",\"\")))","v":""},"Teilnehmer 9"]
[{"$f":"IF(ISERROR(IF(COUNTIF(INDIRECT(\"Terminplanung!$N$\"&MATCH(B18,Terminplanung!$L$1:$L$80,0)&\":$P$\"&MATCH(B18,Terminplanung!$L$1:$L$80,0)),\"Ja\")>0,\"Eintrag\",\"\")),\"\",(IF(COUNTIF(INDIRECT(\"Terminplanung!$N$\"&MATCH(B18,Terminplanung!$L$1:$L$80,0)&\":$P$\"&MATCH(B18,Terminplanung!$L$1:$L$80,0)),\"Ja\")>0,\"Buchung\",\"\")))","v":""},"Teilnehmer 10"]
[{"$f":"IF(ISERROR(IF(COUNTIF(INDIRECT(\"Terminplanung!$N$\"&MATCH(B19,Terminplanung!$L$1:$L$80,0)&\":$P$\"&MATCH(B19,Terminplanung!$L$1:$L$80,0)),\"Ja\")>0,\"Eintrag\",\"\")),\"\",(IF(COUNTIF(INDIRECT(\"Terminplanung!$N$\"&MATCH(B19,Terminplanung!$L$1:$L$80,0)&\":$P$\"&MATCH(B19,Terminplanung!$L$1:$L$80,0)),\"Ja\")>0,\"Buchung\",\"\")))","v":""},"Teilnehmer 11"]
[{"$f":"IF(ISERROR(IF(COUNTIF(INDIRECT(\"Terminplanung!$N$\"&MATCH(B20,Terminplanung!$L$1:$L$80,0)&\":$P$\"&MATCH(B20,Terminplanung!$L$1:$L$80,0)),\"Ja\")>0,\"Eintrag\",\"\")),\"\",(IF(COUNTIF(INDIRECT(\"Terminplanung!$N$\"&MATCH(B20,Terminplanung!$L$1:$L$80,0)&\":$P$\"&MATCH(B20,Terminplanung!$L$1:$L$80,0)),\"Ja\")>0,\"Buchung\",\"\")))","v":"Buchung"},"Teilnehmer 12"]
[{"$f":"IF(ISERROR(IF(COUNTIF(INDIRECT(\"Terminplanung!$N$\"&MATCH(B21,Terminplanung!$L$1:$L$80,0)&\":$P$\"&MATCH(B21,Terminplanung!$L$1:$L$80,0)),\"Ja\")>0,\"Eintrag\",\"\")),\"\",(IF(COUNTIF(INDIRECT(\"Terminplanung!$N$\"&MATCH(B21,Terminplanung!$L$1:$L$80,0)&\":$P$\"&MATCH(B21,Terminplanung!$L$1:$L$80,0)),\"Ja\")>0,\"Buchung\",\"\")))","v":""},"Teilnehmer 13"]
[{"$f":"IF(ISERROR(IF(COUNTIF(INDIRECT(\"Terminplanung!$N$\"&MATCH(B22,Terminplanung!$L$1:$L$80,0)&\":$P$\"&MATCH(B22,Terminplanung!$L$1:$L$80,0)),\"Ja\")>0,\"Eintrag\",\"\")),\"\",(IF(COUNTIF(INDIRECT(\"Terminplanung!$N$\"&MATCH(B22,Terminplanung!$L$1:$L$80,0)&\":$P$\"&MATCH(B22,Terminplanung!$L$1:$L$80,0)),\"Ja\")>0,\"Buchung\",\"\")))","v":""},"Teilnehmer 14"]
[{"$f":"IF(ISERROR(IF(COUNTIF(INDIRECT(\"Terminplanung!$N$\"&MATCH(B23,Terminplanung!$L$1:$L$80,0)&\":$P$\"&MATCH(B23,Terminplanung!$L$1:$L$80,0)),\"Ja\")>0,\"Eintrag\",\"\")),\"\",(IF(COUNTIF(INDIRECT(\"Terminplanung!$N$\"&MATCH(B23,Terminplanung!$L$1:$L$80,0)&\":$P$\"&MATCH(B23,Terminplanung!$L$1:$L$80,0)),\"Ja\")>0,\"Buchung\",\"\")))","v":""},"Teilnehmer 15"]
[{"$f":"IF(ISERROR(IF(COUNTIF(INDIRECT(\"Terminplanung!$N$\"&MATCH(B24,Terminplanung!$L$1:$L$80,0)&\":$P$\"&MATCH(B24,Terminplanung!$L$1:$L$80,0)),\"Ja\")>0,\"Eintrag\",\"\")),\"\",(IF(COUNTIF(INDIRECT(\"Terminplanung!$N$\"&MATCH(B24,Terminplanung!$L$1:$L$80,0)&\":$P$\"&MATCH(B24,Terminplanung!$L$1:$L$80,0)),\"Ja\")>0,\"Buchung\",\"\")))","v":""},"Teilnehmer 16"]
[{"$f":"IF(ISERROR(IF(COUNTIF(INDIRECT(\"Terminplanung!$N$\"&MATCH(B25,Terminplanung!$L$1:$L$80,0)&\":$P$\"&MATCH(B25,Terminplanung!$L$1:$L$80,0)),\"Ja\")>0,\"Eintrag\",\"\")),\"\",(IF(COUNTIF(INDIRECT(\"Terminplanung!$N$\"&MATCH(B25,Terminplanung!$L$1:$L$80,0)&\":$P$\"&MATCH(B25,Terminplanung!$L$1:$L$80,0)),\"Ja\")>0,\"Buchung\",\"\")))","v":""},"Teilnehmer 17"]
[{"$f":"IF(ISERROR(IF(COUNTIF(INDIRECT(\"Terminplanung!$N$\"&MATCH(B26,Terminplanung!$L$1:$L$80,0)&\":$P$\"&MATCH(B26,Terminplanung!$L$1:$L$80,0)),\"Ja\")>0,\"Eintrag\",\"\")),\"\",(IF(COUNTIF(INDIRECT(\"Terminplanung!$N$\"&MATCH(B26,Terminplanung!$L$1:$L$80,0)&\":$P$\"&MATCH(B26,Terminplanung!$L$1:$L$80,0)),\"Ja\")>0,\"Buchung\",\"\")))","v":"Buchung"},"Teilnehmer 18"]
[{"$f":"IF(ISERROR(IF(COUNTIF(INDIRECT(\"Terminplanung!$N$\"&MATCH(B27,Terminplanung!$L$1:$L$80,0)&\":$P$\"&MATCH(B27,Terminplanung!$L$1:$L$80,0)),\"Ja\")>0,\"Eintrag\",\"\")),\"\",(IF(COUNTIF(INDIRECT(\"Terminplanung!$N$\"&MATCH(B27,Terminplanung!$L$1:$L$80,0)&\":$P$\"&MATCH(B27,Terminplanung!$L$1:$L$80,0)),\"Ja\")>0,\"Buchung\",\"\")))","v":""},"Teilnehmer 19"]
[{"$f":"IF(ISERROR(IF(COUNTIF(INDIRECT(\"Terminplanung!$N$\"&MATCH(B28,Terminplanung!$L$1:$L$80,0)&\":$P$\"&MATCH(B28,Terminplanung!$L$1:$L$80,0)),\"Ja\")>0,\"Eintrag\",\"\")),\"\",(IF(COUNTIF(INDIRECT(\"Terminplanung!$N$\"&MATCH(B28,Terminplanung!$L$1:$L$80,0)&\":$P$\"&MATCH(B28,Terminplanung!$L$1:$L$80,0)),\"Ja\")>0,\"Buchung\",\"\")))","v":""},"Teilnehmer 20"]
[{"$f":"IF(ISERROR(IF(COUNTIF(INDIRECT(\"Terminplanung!$N$\"&MATCH(B29,Terminplanung!$L$1:$L$80,0)&\":$P$\"&MATCH(B29,Terminplanung!$L$1:$L$80,0)),\"Ja\")>0,\"Eintrag\",\"\")),\"\",(IF(COUNTIF(INDIRECT(\"Terminplanung!$N$\"&MATCH(B29,Terminplanung!$L$1:$L$80,0)&\":$P$\"&MATCH(B29,Terminplanung!$L$1:$L$80,0)),\"Ja\")>0,\"Buchung\",\"\")))","v":""},"Teilnehmer 21"]
[{"$f":"IF(ISERROR(IF(COUNTIF(INDIRECT(\"Terminplanung!$N$\"&MATCH(B30,Terminplanung!$L$1:$L$80,0)&\":$P$\"&MATCH(B30,Terminplanung!$L$1:$L$80,0)),\"Ja\")>0,\"Eintrag\",\"\")),\"\",(IF(COUNTIF(INDIRECT(\"Terminplanung!$N$\"&MATCH(B30,Terminplanung!$L$1:$L$80,0)&\":$P$\"&MATCH(B30,Terminplanung!$L$1:$L$80,0)),\"Ja\")>0,\"Buchung\",\"\")))","v":""},"Teilnehmer 22"]
[{"$f":"IF(ISERROR(IF(COUNTIF(INDIRECT(\"Terminplanung!$N$\"&MATCH(B31,Terminplanung!$L$1:$L$80,0)&\":$P$\"&MATCH(B31,Terminplanung!$L$1:$L$80,0)),\"Ja\")>0,\"Eintrag\",\"\")),\"\",(IF(COUNTIF(INDIRECT(\"Terminplanung!$N$\"&MATCH(B31,Terminplanung!$L$1:$L$80,0)&\":$P$\"&MATCH(B31,Terminplanung!$L$1:$L$80,0)),\"Ja\")>0,\"Buchung\",\"\")))","v":""},"Teilnehmer 23"]
[{"$f":"IF(ISERROR(IF(COUNTIF(INDIRECT(\"Terminplanung!$N$\"&MATCH(B32,Terminplanung!$L$1:$L$80,0)&\":$P$\"&MATCH(B32,Terminplanung!$L$1:$L$80,0)),\"Ja\")>0,\"Eintrag\",\"\")),\"\",(IF(COUNTIF(INDIRECT(\"Terminplanung!$N$\"&MATCH(B32,Terminplanung!$L$1:$L$80,0)&\":$P$\"&MATCH(B32,Terminplanung!$L$1:$L$80,0)),\"Ja\")>0,\"Buchung\",\"\")))","v":""},"Teilnehmer 24"]
[{"$f":"IF(ISERROR(IF(COUNTIF(INDIRECT(\"Terminplanung!$N$\"&MATCH(B33,Terminplanung!$L$1:$L$80,0)&\":$P$\"&MATCH(B33,Terminplanung!$L$1:$L$80,0)),\"Ja\")>0,\"Eintrag\",\"\")),\"\",(IF(COUNTIF(INDIRECT(\"Terminplanung!$N$\"&MATCH(B33,Terminplanung!$L$1:$L$80,0)&\":$P$\"&MATCH(B33,Terminplanung!$L$1:$L$80,0)),\"Ja\")>0,\"Buchung\",\"\")))","v":""},"Teilnehmer 25"]
[{"$f":"IF(ISERROR(IF(COUNTIF(INDIRECT(\"Terminplanung!$N$\"&MATCH(B34,Terminplanung!$L$1:$L$80,0)&\":$P$\"&MATCH(B34,Terminplanung!$L$1:$L$80,0)),\"Ja\")>0,\"Eintrag\",\"\")),\"\",(IF(COUNTIF(INDIRECT(\"Terminplanung!$N$\"&MATCH(B34,Terminplanung!$L$1:$L$80,0)&\":$P$\"&MATCH(B34,Terminplanung!$L$1:$L$80,0)),\"Ja\")>0,\"Buchung\",\"\")))","v":""},"Teilnehmer 26"]
[{"$f":"IF(ISERROR(IF(COUNTIF(INDIRECT(\"Terminplanung!$N$\"&MATCH(B35,Terminplanung!$L$1:$L$80,0)&\":$P$\"&MATCH(B35,Terminplanung!$L$1:$L$80,0)),\"Ja\")>0,\"Eintrag\",\"\")),\"\",(IF(COUNTIF(INDIRECT(\"Terminplanung!$N$\"&MATCH(B35,Terminplanung!$L$1:$L$80,0)&\":$P$\"&MATCH(B35,Terminplanung!$L$1:$L$80,0)),\"Ja\")>0,\"Buchung\",\"\")))","v":""},"Teilnehmer 27"]
[{"$f":"IF(ISERROR(IF(COUNTIF(INDIRECT(\"Terminplanung!$N$\"&MATCH(B36,Terminplanung!$L$1:$L$80,0)&\":$P$\"&MATCH(B36,Terminplanung!$L$1:$L$80,0)),\"Ja\")>0,\"Eintrag\",\"\")),\"\",(IF(COUNTIF(INDIRECT(\"Terminplanung!$N$\"&MATCH(B36,Terminplanung!$L$1:$L$80,0)&\":$P$\"&MATCH(B36,Terminplanung!$L$1:$L$80,0)),\"Ja\")>0,\"Buchung\",\"\")))","v":""},"Teilnehmer 28"]
[{"$f":"IF(ISERROR(IF(COUNTIF(INDIRECT(\"Terminplanung!$N$\"&MATCH(B37,Terminplanung!$L$1:$L$80,0)&\":$P$\"&MATCH(B37,Terminplanung!$L$1:$L$80,0)),\"Ja\")>0,\"Eintrag\",\"\")),\"\",(IF(COUNTIF(INDIRECT(\"Terminplanung!$N$\"&MATCH(B37,Terminplanung!$L$1:$L$80,0)&\":$P$\"&MATCH(B37,Terminplanung!$L$1:$L$80,0)),\"Ja\")>0,\"Buchung\",\"\")))","v":""},"Teilnehmer 29"]
[{"$f":"IF(ISERROR(IF(COUNTIF(INDIRECT(\"Terminplanung!$N$\"&MATCH(B38,Terminplanung!$L$1:$L$80,0)&\":$P$\"&MATCH(B38,Terminplanung!$L$1:$L$80,0)),\"Ja\")>0,\"Eintrag\",\"\")),\"\",(IF(COUNTIF(INDIRECT(\"Terminplanung!$N$\"&MATCH(B38,Terminplanung!$L$1:$L$80,0)&\":$P$\"&MATCH(B38,Terminplanung!$L$1:$L$80,0)),\"Ja\")>0,\"Buchung\",\"\")))","v":""},"Teilnehmer 30"]
[{"$f":"IF(ISERROR(IF(COUNTIF(INDIRECT(\"Terminplanung!$N$\"&MATCH(B39,Terminplanung!$L$1:$L$80,0)&\":$P$\"&MATCH(B39,Terminplanung!$L$1:$L$80,0)),\"Ja\")>0,\"Eintrag\",\"\")),\"\",(IF(COUNTIF(INDIRECT(\"Terminplanung!$N$\"&MATCH(B39,Terminplanung!$L$1:$L$80,0)&\":$P$\"&MATCH(B39,Terminplanung!$L$1:$L$80,0)),\"Ja\")>0,\"Buchung\",\"\")))","v":""},"Teilnehmer 31"]
[{"$f":"IF(ISERROR(IF(COUNTIF(INDIRECT(\"Terminplanung!$N$\"&MATCH(B40,Terminplanung!$L$1:$L$80,0)&\":$P$\"&MATCH(B40,Terminplanung!$L$1:$L$80,0)),\"Ja\")>0,\"Eintrag\",\"\")),\"\",(IF(COUNTIF(INDIRECT(\"Terminplanung!$N$\"&MATCH(B40,Terminplanung!$L$1:$L$80,0)&\":$P$\"&MATCH(B40,Terminplanung!$L$1:$L$80,0)),\"Ja\")>0,\"Buchung\",\"\")))","v":""},"Teilnehmer 32"]
{"$rows_left_out":40}