{"text_format":"1","workbook":"xlsx","n_sheets":14,"sheets":["Rd1","Rd2","Rd3","Rd4","Rd5","Rd6","Rd7","Rd8","Rd9","Rd10","Rd11","Rd12","Siegerliste","Tabelle1"],"not_rendered":{"charts":0,"images":1,"macros":1,"external_links":1,"defined_names":11,"comments":0,"pivot_tables":0},"unopened":[],"bounds":{"document_bytes":16777216,"sheet_cells":100000,"rows_first":2000,"rows_last":500,"rows_between":2000,"halvings":0,"cell_chars":16384,"cell_head_chars":4096},"cells_cut":0,"cells_raw":0,"read":"whole","date_system":"1900"}

{"sheet":"Rd1","index":0,"n_rows":54,"n_cols":25,"rows_kept":54,"cut":false,"hidden":false,"merged":[[0,3,0,4],[0,10,0,11],[0,17,0,18],[7,4,7,5],[7,11,7,12],[7,18,7,19],[1,14,1,15],[8,4,9,5],[8,11,9,12],[8,18,9,19],[10,4,12,5],[10,11,12,12],[10,18,12,19],[26,4,30,5],[26,11,30,12],[26,18,30,19],[31,4,32,5],[31,11,32,12],[31,18,32,19],[13,4,16,5],[19,4,25,5],[13,11,16,12],[19,11,25,12],[13,18,16,19],[19,18,25,19]]}
[null,null,null,{"$f":"T42","v":"Thorsten"},null,"Sp. 1",null,null,null,null,{"$f":"T43","v":"Micha"},null,"Sp. 2",null,null,null,null,{"$f":"T44","v":"Stefan"},null,"Sp. 3",{"$f":"K45","v":"Thorsten"}]
[null,null,null,"Punkte",501,"Start",null,null,null,null,"Punkte",501,"Start",null,null,null,null,"Punkte",501,"Start",{"$f":"K46","v":"Micha"}]
[null,null,null,"Geworfen",{"$f":"SUM(D34)","v":484},"Punkte",null,null,null,null,"Geworfen",{"$f":"SUM(K34)","v":440},"Punkte",null,null,null,null,"Geworfen",{"$f":"SUM(R34)","v":430},"Punkte","Stefan"]
["RD 1",{"$f":"COUNT(D4)*1","v":1},{"$f":"COUNT(D4)*3","v":3},22,{"$f":"SUM(E2-E3)","v":17},"Rest",null,"RD 1",{"$f":"COUNT(K4)*1","v":1},{"$f":"COUNT(K4)*3","v":3},33,{"$f":"SUM(L2-L3)","v":61},"Rest",null,"RD 1",{"$f":"COUNT(R4)*1","v":1},{"$f":"COUNT(R4)*3","v":3},44,{"$f":"SUM(S2-S3)","v":71},"Rest"]
["RD 2",1,3,55,null,null,null,"RD 2",1,3,66,null,null,null,"RD 2",1,3,56]
["RD 3",1,3,99,"ø pro Spiel",{"$f":"SUM(E3)/B34","v":69.142857142857139},null,"RD 3",1,3,66,"ø pro Spiel",{"$f":"SUM(L3)/I34","v":62.857142857142854},null,"RD 3",1,3,66,"ø pro Spiel",{"$f":"SUM(S3)/P34","v":71.666666666666671}]
["RD 4",1,3,99,"ø pro Pfeil",{"$f":"SUM(E3)/C34","v":23.047619047619047},null,"RD 4",1,3,66,"ø pro Pfeil",{"$f":"SUM(L3)/J34","v":20.952380952380953},null,"RD 4",1,3,99,"ø pro Pfeil",{"$f":"SUM(S3)/Q34","v":23.888888888888889}]
["RD 5",1,3,77,"Average",null,null,"RD 5",1,3,55,"Average",null,null,"RD 5",1,3,66,"Average"]
["RD 6",1,3,33,{"$f":"SUM(F6)","v":69.142857142857139},null,null,"RD 6",1,3,55,{"$f":"SUM(M6)","v":62.857142857142854},null,null,"RD 6",1,3,99,{"$f":"SUM(T6)","v":71.666666666666671}]
["RD 7",1,3,99,null,null,null,"RD 7",1,3,99,null,null,null,"RD 7",0,0]
["RD 8",0,0,null,{"$f":"IF(F6<40,\"Nicht Gut\",\"\")","v":""},null,null,"RD 8",0,0,null,{"$f":"IF(M6<40,\"Nicht Gut\",\"\")","v":""},null,null,"RD 8",0,0,null,{"$f":"IF(T6<40,\"Nicht Gut\",\"\")","v":""}]
["RD 9",0,0,null,null,null,null,"RD 9",0,0,null,null,null,null,"RD 9",0,0]
["RD 10",0,0,null,null,null,null,"RD 10",0,0,null,null,null,null,"RD 10",0,0,null,null,null,null,null,null,null,501]
["RD 11",0,0,null,{"$f":"IF(AND(F6>=40,F6<=50),\"GUT\",\"\")","v":""},null,null,"RD 11",0,0,null,{"$f":"IF(AND(M6>=40,M6<=50),\"GUT\",\"\")","v":""},null,null,"RD 11",0,0,null,{"$f":"IF(AND(T6>=40,T6<=50),\"GUT\",\"\")","v":""},null,null,"A",{"$f":"F18","v":17},{"$f":"SUM(M18+T18)/2","v":66}]
["RD 12",0,0,null,null,null,null,"RD 12",0,0,null,null,null,null,"RD 12",0,0,null,null,null,null,"B",{"$f":"SUM(M18)","v":61},{"$f":"SUM(F18+T18)/2","v":44}]
["RD 13",0,0,null,null,null,null,"RD 13",0,0,null,null,null,null,"RD 13",0,0,null,null,null,null,"C",{"$f":"SUM(T18)","v":71},{"$f":"SUM(F18+M18)/2","v":39}]
["RD 14",0,0,null,null,null,null,"RD 14",0,0,null,null,null,null,"RD 14",0,0]
["RD 15",0,0,null,{"$f":"D1","v":"Thorsten"},{"$f":"E4","v":17},null,"RD 15",0,0,null,{"$f":"K1","v":"Micha"},{"$f":"L4","v":61},null,"RD 15",0,0,null,{"$f":"R1","v":"Stefan"},{"$f":"S4","v":71}]
["RD 16",0,0,null,null,null,null,"RD 16",0,0,null,null,null,null,"RD 16",0,0]
["RD 17",0,0,null,{"$f":"IF(F6>50,\"Sehr Gut\",\"\")","v":"Sehr Gut"},null,null,"RD 17",0,0,null,{"$f":"IF(M6>50,\"Sehr Gut\",\"\")","v":"Sehr Gut"},null,null,"RD 17",0,0,null,{"$f":"IF(T6>50,\"Sehr Gut\",\"\")","v":"Sehr Gut"}]
["RD 18",0,0,null,null,null,null,"RD 18",0,0,null,null,null,null,"RD 18",0,0]
["RD 19",0,0,null,null,null,null,"RD 19",0,0,null,null,null,null,"RD 19",0,0]
["RD 20",0,0,null,null,null,null,"RD 20",0,0,null,null,null,null,"RD 20",0,0]
["RD 21",0,0,null,null,null,null,"RD 21",0,0,null,null,null,null,"RD 21",0,0]
["RD 22",0,0,null,null,null,null,"RD 22",0,0,null,null,null,null,"RD 22",0,0]
["RD 23",0,0,null,null,null,null,"RD 23",0,0,null,null,null,null,"RD 23",0,0]
["RD 24",0,0,null,null,null,null,"RD 24",0,0,null,null,null,null,"RD 24",0,0]
["RD 25",0,0,null,null,null,null,"RD 25",0,0,null,null,null,null,"RD 25",0,0]
["RD 26",0,0,null,null,null,null,"RD 26",0,0,null,null,null,null,"RD 26",0,0]
["RD 27",0,0,null,null,null,null,"RD 27",0,0,null,null,null,null,"RD 27",0,0]
["RD 28",0,0,null,null,null,null,"RD 28",0,0,null,null,null,null,"RD 28",0,0]
["RD 29",0,0,null,{"$f":"IF(E4=0,\"Sieg\",\"\")","v":""},null,null,"RD 29",0,0,null,{"$f":"IF(L4=0,\"Sieg\",\"\")","v":""},null,null,"RD 29",0,0,null,{"$f":"IF(S4=0,\"Sieg\",\"\")","v":""}]
["RD 30",0,0,null,null,null,null,"RD 30",0,0,null,null,null,null,"RD 30",0,0]
[null,{"$f":"SUM(B4:B33)","v":7},{"$f":"SUM(C4:C33)","v":21},{"$f":"SUM(D4:D33)","v":484},{"$f":"SUM(D4:D32)","v":484},null,null,null,{"$f":"SUM(I4:I33)","v":7},{"$f":"SUM(J4:J33)","v":21},{"$f":"SUM(K4:K33)","v":440},{"$f":"SUM(K4:K32)","v":440},null,null,null,{"$f":"SUM(P4:P33)","v":6},{"$f":"SUM(Q4:Q33)","v":18},{"$f":"SUM(R4:R33)","v":430},{"$f":"SUM(R4:R32)","v":430}]
[]
[]
[]
[null,null,null,null,null,null,null,null,null,null,null,null,null,null,null,null,null,null,null,null,null,null,"Vincent"]
[null,null,null,null,null,null,null,null,null,null,null,null,null,null,null,null,null,null,null,null,null,null,"Anja"]
[null,null,null,null,null,null,null,null,null,null,null,null,null,null,null,null,null,null,null,null,null,null,"Erich"]
[null,null,null,null,null,null,null,null,null,null,null,null,null,null,null,null,null,null,{"$f":"RAND()","v":9.1859867676895468E-2},null,null,null,"Siggi"]
[null,null,null,null,null,null,null,null,null,null,null,null,null,null,null,null,null,null,{"$f":"RAND()","v":0.79560999084346806},"Thorsten",null,null,"Ralf M."]
[null,null,null,null,null,null,null,null,null,null,null,null,null,null,null,null,null,null,{"$f":"RAND()","v":8.0347549996815926E-2},"Micha",null,null,"Ralf Kl."]
[null,null,null,null,null,null,null,null,null,null,null,null,null,null,null,null,null,null,{"$f":"RAND()","v":0.26509824596266807},"Stefan",null,null,"Volker"]
[null,null,null,{"$f":"D1","v":"Thorsten"},null,{"$f":"SUM(D34)","v":484},null,null,null,null,{"$f":"INDEX(D45:E47,MATCH(MAX(F45:F47),F45:F47,0),1)","v":"Thorsten"},null,null,null,null,null,null,null,null,null,null,null,"Rene"]
[null,null,null,{"$f":"K1","v":"Micha"},null,{"$f":"SUM(K34)","v":440},null,null,null,null,{"$f":"INDEX(D45:E47,MATCH(MEDIAN(F45:F47),F45:F47,0),1)","v":"Micha"},null,null,null,null,null,null,null,null,null,null,null,"Nicole"]
[null,null,null,{"$f":"R1","v":"Stefan"},null,{"$f":"SUM(S3)","v":430},null,null,null,null,{"$f":"INDEX(D45:E47,MATCH(MIN(F45:F47),F45:F47,0),1)","v":"Stefan"},null,null,null,null,null,null,null,null,null,null,null,"Frank"]
[null,null,null,"MAX(B2:B7",null,{"$f":"MAX(F45:F47)","v":484},null,null,null,null,null,null,null,null,null,null,null,null,null,null,null,null,"Rosi"]
[null,null,null,null,null,null,null,null,null,null,null,null,null,null,null,null,null,null,null,null,null,null,"Werner"]
[null,null,null,null,null,null,null,null,null,null,null,null,null,null,null,null,null,null,null,null,null,null,"Gast"]
[null,null,null,null,null,null,null,null,null,null,null,null,null,null,null,null,null,null,null,null,null,null,"Dirk B."]
[null,null,null,null,null,null,null,null,null,null,null,null,null,null,null,null,null,null,null,null,null,null,"Stefan"]
[null,null,null,null,null,null,null,null,null,null,null,null,null,null,null,null,null,null,null,null,null,null,"Micha"]
[null,null,null,null,null,null,null,null,null,null,null,null,null,null,null,null,null,null,null,null,null,null,"Thorsten"]

{"sheet":"Rd2","index":1,"n_rows":48,"n_cols":21,"rows_kept":48,"cut":false,"hidden":false,"merged":[[0,3,0,4],[0,10,0,11],[0,17,0,18],[7,4,7,5],[7,11,7,12],[7,18,7,19],[1,14,1,15],[8,4,9,5],[8,11,9,12],[8,18,9,19],[10,4,12,5],[10,11,12,12],[10,18,12,19],[44,3,44,4],[45,3,45,4],[46,3,46,4],[26,4,30,5],[26,11,30,12],[26,18,30,19],[31,4,32,5],[31,11,32,12],[31,18,32,19],[13,4,16,5],[13,11,16,12],[13,18,16,19],[19,4,25,5],[19,11,25,12],[19,18,25,19]]}
[null,null,null,{"$f":"'Rd1'!U3","v":"Stefan"},null,"Sp. 1",null,null,null,null,{"$f":"'Rd1'!U2","v":"Micha"},null,"Sp. 2",null,null,null,null,{"$f":"'Rd1'!U1","v":"Thorsten"},null,"Sp. 3",{"$f":"K45","v":"Stefan"}]
[null,null,null,"Punkte",501,"Start",null,null,null,null,"Punkte",501,"Start",null,null,null,null,"Punkte",501,"Start",{"$f":"K46","v":"Stefan"}]
[null,null,null,"Geworfen",{"$f":"SUM(D34)","v":0},"Punkte",null,null,null,null,"Geworfen",{"$f":"SUM(K34)","v":0},"Punkte",null,null,null,null,"Geworfen",{"$f":"SUM(R34)","v":0},"Punkte","Stefan"]
["RD 1",{"$f":"COUNT(D4)*1","v":0},{"$f":"COUNT(D4)*3","v":0},null,{"$f":"SUM(E2)-E3","v":501},"Rest",null,"RD 1",{"$f":"COUNT(K4)*1","v":0},{"$f":"COUNT(K4)*3","v":0},null,{"$f":"SUM(L2-L3)","v":501},"Rest",null,"RD 1",{"$f":"COUNT(R4)*1","v":0},{"$f":"COUNT(R4)*3","v":0},null,{"$f":"SUM(S2-S3)","v":501},"Rest"]
["RD 2",0,0,null,null,null,null,"RD 2",0,0,null,null,null,null,"RD 2",0,0]
["RD 3",0,0,null,"ø pro Spiel",{"$f":"SUM(E3)/B34","v":{"$error":"#DIV/0!"}},null,"RD 3",0,0,null,"ø pro Spiel",{"$f":"SUM(L3)/I34","v":{"$error":"#DIV/0!"}},null,"RD 3",0,0,null,"ø pro Spiel",{"$f":"SUM(S3)/P34","v":{"$error":"#DIV/0!"}}]
["RD 4",0,0,null,"ø pro Pfeil",{"$f":"SUM(E3)/C34","v":{"$error":"#DIV/0!"}},null,"RD 4",0,0,null,"ø pro Pfeil",{"$f":"SUM(L3)/J34","v":{"$error":"#DIV/0!"}},null,"RD 4",0,0,null,"ø pro Pfeil",{"$f":"SUM(S3)/Q34","v":{"$error":"#DIV/0!"}}]
["RD 5",0,0,null,"Average",null,null,"RD 5",0,0,null,"Average",null,null,"RD 5",0,0,null,"Average"]
["RD 6",0,0,null,{"$f":"SUM(F6)","v":{"$error":"#DIV/0!"}},null,null,"RD 6",0,0,null,{"$f":"SUM(M6)","v":{"$error":"#DIV/0!"}},null,null,"RD 6",0,0,null,{"$f":"SUM(T6)","v":{"$error":"#DIV/0!"}}]
["RD 7",0,0,null,null,null,null,"RD 7",0,0,null,null,null,null,"RD 7",0,0]
["RD 8",0,0,null,{"$f":"IF(F6<40,\"Nicht Gut\",\"\")","v":{"$error":"#DIV/0!"}},null,null,"RD 8",0,0,null,{"$f":"IF(M6<40,\"Nicht Gut\",\"\")","v":{"$error":"#DIV/0!"}},null,null,"RD 8",0,0,null,{"$f":"IF(T6<40,\"Nicht Gut\",\"\")","v":{"$error":"#DIV/0!"}}]
["RD 9",0,0,null,null,null,null,"RD 9",0,0,null,null,null,null,"RD 9",0,0]
["RD 10",0,0,null,null,null,null,"RD 10",0,0,null,null,null,null,"RD 10",0,0]
["RD 11",0,0,null,{"$f":"IF(F6>40,\"Gut\",\"\")","v":{"$error":"#DIV/0!"}},null,null,"RD 11",0,0,null,{"$f":"IF(M6>40,\"Gut\",\"\")","v":{"$error":"#DIV/0!"}},null,null,"RD 11",0,0,null,{"$f":"IF(T6>40,\"Gut\",\"\")","v":{"$error":"#DIV/0!"}}]
["RD 12",0,0,null,null,null,null,"RD 12",0,0,null,null,null,null,"RD 12",0,0]
["RD 13",0,0,null,null,null,null,"RD 13",0,0,null,null,null,null,"RD 13",0,0]
["RD 14",0,0,null,null,null,null,"RD 14",0,0,null,null,null,null,"RD 14",0,0]
["RD 15",0,0,null,{"$f":"D1","v":"Stefan"},{"$f":"E4","v":501},null,"RD 15",0,0,null,{"$f":"K1","v":"Micha"},{"$f":"L4","v":501},null,"RD 15",0,0,null,{"$f":"R1","v":"Thorsten"},{"$f":"S4","v":501}]
["RD 16",0,0,null,null,null,null,"RD 16",0,0,null,null,null,null,"RD 16",0,0]
["RD 17",0,0,null,{"$f":"IF(F6>50,\"Sehr Gut\",\"\")","v":{"$error":"#DIV/0!"}},null,null,"RD 17",0,0,null,{"$f":"IF(M6>50,\"Sehr Gut\",\"\")","v":{"$error":"#DIV/0!"}},null,null,"RD 17",0,0,null,{"$f":"IF(T6>50,\"Sehr Gut\",\"\")","v":{"$error":"#DIV/0!"}}]
["RD 18",0,0,null,null,null,null,"RD 18",0,0,null,null,null,null,"RD 18",0,0]
["RD 19",0,0,null,null,null,null,"RD 19",0,0,null,null,null,null,"RD 19",0,0]
["RD 20",0,0,null,null,null,null,"RD 20",0,0,null,null,null,null,"RD 20",0,0]
["RD 21",0,0,null,null,null,null,"RD 21",0,0,null,null,null,null,"RD 21",0,0]
["RD 22",0,0,null,null,null,null,"RD 22",0,0,null,null,null,null,"RD 22",0,0]
["RD 23",0,0,null,null,null,null,"RD 23",0,0,null,null,null,null,"RD 23",0,0]
["RD 24",0,0,null,null,null,null,"RD 24",0,0,null,null,null,null,"RD 24",0,0]
["RD 25",0,0,null,null,null,null,"RD 25",0,0,null,null,null,null,"RD 25",0,0]
["RD 26",0,0,null,null,null,null,"RD 26",0,0,null,null,null,null,"RD 26",0,0]
["RD 27",0,0,null,null,null,null,"RD 27",0,0,null,null,null,null,"RD 27",0,0]
["RD 28",0,0,null,null,null,null,"RD 28",0,0,null,null,null,null,"RD 28",0,0]
["RD 29",0,0,null,{"$f":"IF(E4=0,\"Sieg\",\"\")","v":""},null,null,"RD 29",0,0,null,{"$f":"IF(L4=0,\"Sieg\",\"\")","v":""},null,null,"RD 29",0,0,null,{"$f":"IF(S4=0,\"Sieg\",\"\")","v":""}]
["RD 30",0,0,null,null,null,null,"RD 30",0,0,null,null,null,null,"RD 30",0,0]
[null,{"$f":"SUM(B4:B33)","v":0},{"$f":"SUM(C4:C33)","v":0},{"$f":"SUM(D4:D33)","v":0},{"$f":"SUM(D4:D32)","v":0},null,null,null,{"$f":"SUM(I4:I33)","v":0},{"$f":"SUM(J4:J33)","v":0},{"$f":"SUM(K4:K33)","v":0},{"$f":"SUM(K4:K32)","v":0},null,null,null,{"$f":"SUM(P4:P33)","v":0},{"$f":"SUM(Q4:Q33)","v":0},{"$f":"SUM(R4:R33)","v":0},{"$f":"SUM(R4:R32)","v":0}]
[]
[]
[]
[]
[]
[]
[]
[]
[]
[]
[null,null,null,{"$f":"D1","v":"Stefan"},null,{"$f":"SUM(D34)","v":0},null,null,null,null,{"$f":"INDEX(D45:E47,MATCH(MAX(F45:F47),F45:F47,0),1)","v":"Stefan"}]
[null,null,null,{"$f":"K1","v":"Micha"},null,{"$f":"SUM(K34)","v":0},null,null,null,null,{"$f":"INDEX(D45:E47,MATCH(MEDIAN(F45:F47),F45:F47,0),1)","v":"Stefan"}]
[null,null,null,{"$f":"R1","v":"Thorsten"},null,{"$f":"SUM(S3)","v":0},null,null,null,null,{"$f":"INDEX(D45:E47,MATCH(MIN(F45:F47),F45:F47,0),1)","v":"Stefan"}]
[null,null,null,"MAX(B2:B7",null,{"$f":"MAX(F45:F47)","v":0}]

{"sheet":"Rd3","index":2,"n_rows":48,"n_cols":21,"rows_kept":48,"cut":false,"hidden":false,"merged":[[0,22,0,25],[0,3,0,4],[0,10,0,11],[0,17,0,18],[7,4,7,5],[7,11,7,12],[7,18,7,19],[1,14,1,15],[8,4,9,5],[8,11,9,12],[8,18,9,19],[10,4,12,5],[10,11,12,12],[10,18,12,19],[44,3,44,4],[45,3,45,4],[46,3,46,4],[26,4,30,5],[26,11,30,12],[26,18,30,19],[31,4,32,5],[31,11,32,12],[31,18,32,19],[13,4,16,5],[13,11,16,12],[13,18,16,19],[19,4,25,5],[19,11,25,12],[19,18,25,19]]}
[null,null,null,{"$f":"'Rd2'!U3","v":"Stefan"},null,"Sp. 1",null,null,null,null,{"$f":"'Rd2'!U2","v":"Stefan"},null,"Sp. 2",null,null,null,null,{"$f":"'Rd2'!U1","v":"Stefan"},null,"Sp. 3",{"$f":"K45","v":"Stefan"}]
[null,null,null,"Punkte",501,"Start",null,null,null,null,"Punkte",501,"Start",null,null,null,null,"Punkte",501,"Start",{"$f":"K46","v":"Stefan"}]
[null,null,null,"Geworfen",{"$f":"SUM(D34)","v":0},"Punkte",null,null,null,null,"Geworfen",{"$f":"SUM(K34)","v":0},"Punkte",null,null,null,null,"Geworfen",{"$f":"SUM(R34)","v":0},"Punkte","Stefan"]
["RD 1",{"$f":"COUNT(D4)*1","v":0},{"$f":"COUNT(D4)*3","v":0},null,{"$f":"SUM(E2-E3)","v":501},"Rest",null,"RD 1",{"$f":"COUNT(K4)*1","v":0},{"$f":"COUNT(K4)*3","v":0},null,{"$f":"SUM(L2-L3)","v":501},"Rest",null,"RD 1",{"$f":"COUNT(R4)*1","v":0},{"$f":"COUNT(R4)*3","v":0},null,{"$f":"SUM(S2-S3)","v":501},"Rest"]
["RD 2",0,0,null,null,null,null,"RD 2",0,0,null,null,null,null,"RD 2",0,0]
["RD 3",0,0,null,"ø pro Spiel",{"$f":"SUM(E3)/B34","v":{"$error":"#DIV/0!"}},null,"RD 3",0,0,null,"ø pro Spiel",{"$f":"SUM(L3)/I34","v":{"$error":"#DIV/0!"}},null,"RD 3",0,0,null,"ø pro Spiel",{"$f":"SUM(S3)/P34","v":{"$error":"#DIV/0!"}}]
["RD 4",0,0,null,"ø pro Pfeil",{"$f":"SUM(E3)/C34","v":{"$error":"#DIV/0!"}},null,"RD 4",0,0,null,"ø pro Pfeil",{"$f":"SUM(L3)/J34","v":{"$error":"#DIV/0!"}},null,"RD 4",0,0,null,"ø pro Pfeil",{"$f":"SUM(S3)/Q34","v":{"$error":"#DIV/0!"}}]
["RD 5",0,0,null,"Average",null,null,"RD 5",0,0,null,"Average",null,null,"RD 5",0,0,null,"Average"]
["RD 6",0,0,null,{"$f":"SUM(F6)","v":{"$error":"#DIV/0!"}},null,null,"RD 6",0,0,null,{"$f":"SUM(M6)","v":{"$error":"#DIV/0!"}},null,null,"RD 6",0,0,null,{"$f":"SUM(T6)","v":{"$error":"#DIV/0!"}}]
["RD 7",0,0,null,null,null,null,"RD 7",0,0,null,null,null,null,"RD 7",0,0]
["RD 8",0,0,null,{"$f":"IF(F6<40,\"Nicht Gut\",\"\")","v":{"$error":"#DIV/0!"}},null,null,"RD 8",0,0,null,{"$f":"IF(M6<40,\"Nicht Gut\",\"\")","v":{"$error":"#DIV/0!"}},null,null,"RD 8",0,0,null,{"$f":"IF(T6<40,\"Nicht Gut\",\"\")","v":{"$error":"#DIV/0!"}}]
["RD 9",0,0,null,null,null,null,"RD 9",0,0,null,null,null,null,"RD 9",0,0]
["RD 10",0,0,null,null,null,null,"RD 10",0,0,null,null,null,null,"RD 10",0,0]
["RD 11",0,0,null,{"$f":"IF(F6>40,\"Gut\",\"\")","v":{"$error":"#DIV/0!"}},null,null,"RD 11",0,0,null,{"$f":"IF(M6>40,\"Gut\",\"\")","v":{"$error":"#DIV/0!"}},null,null,"RD 11",0,0,null,{"$f":"IF(T6>40,\"Gut\",\"\")","v":{"$error":"#DIV/0!"}}]
["RD 12",0,0,null,null,null,null,"RD 12",0,0,null,null,null,null,"RD 12",0,0]
["RD 13",0,0,null,null,null,null,"RD 13",0,0,null,null,null,null,"RD 13",0,0]
["RD 14",0,0,null,null,null,null,"RD 14",0,0,null,null,null,null,"RD 14",0,0]
["RD 15",0,0,null,{"$f":"D1","v":"Stefan"},{"$f":"E4","v":501},null,"RD 15",0,0,null,{"$f":"K1","v":"Stefan"},{"$f":"L4","v":501},null,"RD 15",0,0,null,{"$f":"R1","v":"Stefan"},{"$f":"S4","v":501}]
["RD 16",0,0,null,null,null,null,"RD 16",0,0,null,null,null,null,"RD 16",0,0]
["RD 17",0,0,null,{"$f":"IF(F6>50,\"Sehr Gut\",\"\")","v":{"$error":"#DIV/0!"}},null,null,"RD 17",0,0,null,{"$f":"IF(M6>50,\"Sehr Gut\",\"\")","v":{"$error":"#DIV/0!"}},null,null,"RD 17",0,0,null,{"$f":"IF(T6>50,\"Sehr Gut\",\"\")","v":{"$error":"#DIV/0!"}}]
["RD 18",0,0,null,null,null,null,"RD 18",0,0,null,null,null,null,"RD 18",0,0]
["RD 19",0,0,null,null,null,null,"RD 19",0,0,null,null,null,null,"RD 19",0,0]
["RD 20",0,0,null,null,null,null,"RD 20",0,0,null,null,null,null,"RD 20",0,0]
["RD 21",0,0,null,null,null,null,"RD 21",0,0,null,null,null,null,"RD 21",0,0]
["RD 22",0,0,null,null,null,null,"RD 22",0,0,null,null,null,null,"RD 22",0,0]
["RD 23",0,0,null,null,null,null,"RD 23",0,0,null,null,null,null,"RD 23",0,0]
["RD 24",0,0,null,null,null,null,"RD 24",0,0,null,null,null,null,"RD 24",0,0]
["RD 25",0,0,null,null,null,null,"RD 25",0,0,null,null,null,null,"RD 25",0,0]
["RD 26",0,0,null,null,null,null,"RD 26",0,0,null,null,null,null,"RD 26",0,0]
["RD 27",0,0,null,null,null,null,"RD 27",0,0,null,null,null,null,"RD 27",0,0]
["RD 28",0,0,null,null,null,null,"RD 28",0,0,null,null,null,null,"RD 28",0,0]
["RD 29",0,0,null,{"$f":"IF(E4=0,\"Sieg\",\"\")","v":""},null,null,"RD 29",0,0,null,{"$f":"IF(L4=0,\"Sieg\",\"\")","v":""},null,null,"RD 29",0,0,null,{"$f":"IF(S4=0,\"Sieg\",\"\")","v":""}]
["RD 30",0,0,null,null,null,null,"RD 30",0,0,null,null,null,null,"RD 30",0,0]
[null,{"$f":"SUM(B4:B33)","v":0},{"$f":"SUM(C4:C33)","v":0},{"$f":"SUM(D4:D33)","v":0},{"$f":"SUM(D4:D32)","v":0},null,null,null,{"$f":"SUM(I4:I33)","v":0},{"$f":"SUM(J4:J33)","v":0},{"$f":"SUM(K4:K33)","v":0},{"$f":"SUM(K4:K32)","v":0},null,null,null,{"$f":"SUM(P4:P33)","v":0},{"$f":"SUM(Q4:Q33)","v":0},{"$f":"SUM(R4:R33)","v":0},{"$f":"SUM(R4:R32)","v":0}]
[]
[]
[]
[]
[]
[]
[]
[]
[]
[]
[null,null,null,{"$f":"D1","v":"Stefan"},null,{"$f":"SUM(D34)","v":0},null,null,null,null,{"$f":"INDEX(D45:E47,MATCH(MAX(F45:F47),F45:F47,0),1)","v":"Stefan"}]
[null,null,null,{"$f":"K1","v":"Stefan"},null,{"$f":"SUM(K34)","v":0},null,null,null,null,{"$f":"INDEX(D45:E47,MATCH(MEDIAN(F45:F47),F45:F47,0),1)","v":"Stefan"}]
[null,null,null,{"$f":"R1","v":"Stefan"},null,{"$f":"SUM(S3)","v":0},null,null,null,null,{"$f":"INDEX(D45:E47,MATCH(MIN(F45:F47),F45:F47,0),1)","v":"Stefan"}]
[null,null,null,"MAX(B2:B7",null,{"$f":"MAX(F45:F47)","v":0}]

{"sheet":"Rd4","index":3,"n_rows":48,"n_cols":21,"rows_kept":48,"cut":false,"hidden":false,"merged":[[0,3,0,4],[0,10,0,11],[0,17,0,18],[7,4,7,5],[7,11,7,12],[7,18,7,19],[1,14,1,15],[8,4,9,5],[8,11,9,12],[8,18,9,19],[10,4,12,5],[10,11,12,12],[10,18,12,19],[44,3,44,4],[45,3,45,4],[46,3,46,4],[26,4,30,5],[26,11,30,12],[26,18,30,19],[31,4,32,5],[31,11,32,12],[31,18,32,19],[13,4,16,5],[13,11,16,12],[13,18,16,19],[19,4,25,5],[19,11,25,12],[19,18,25,19]]}
[null,null,null,{"$f":"'Rd3'!U3","v":"Stefan"},null,"Sp. 1",null,null,null,null,{"$f":"'Rd3'!U2","v":"Stefan"},null,"Sp. 2",null,null,null,null,{"$f":"'Rd3'!U1","v":"Stefan"},null,"Sp. 3",{"$f":"K45","v":"Stefan"}]
[null,null,null,"Punkte",501,"Start",null,null,null,null,"Punkte",501,"Start",null,null,null,null,"Punkte",501,"Start",{"$f":"K46","v":"Stefan"}]
[null,null,null,"Geworfen",{"$f":"SUM(D34)","v":0},"Punkte",null,null,null,null,"Geworfen",{"$f":"SUM(K34)","v":0},"Punkte",null,null,null,null,"Geworfen",{"$f":"SUM(R34)","v":0},"Punkte","Stefan"]
["RD 1",{"$f":"COUNT(D4)*1","v":0},{"$f":"COUNT(D4)*3","v":0},null,{"$f":"SUM(E2-E3)","v":501},"Rest",null,"RD 1",{"$f":"COUNT(K4)*1","v":0},{"$f":"COUNT(K4)*3","v":0},null,{"$f":"SUM(L2-L3)","v":501},"Rest",null,"RD 1",{"$f":"COUNT(R4)*1","v":0},{"$f":"COUNT(R4)*3","v":0},null,{"$f":"SUM(S2-S3)","v":501},"Rest"]
["RD 2",0,0,null,null,null,null,"RD 2",0,0,null,null,null,null,"RD 2",0,0]
["RD 3",0,0,null,"ø pro Spiel",{"$f":"SUM(E3)/B34","v":{"$error":"#DIV/0!"}},null,"RD 3",0,0,null,"ø pro Spiel",{"$f":"SUM(L3)/I34","v":{"$error":"#DIV/0!"}},null,"RD 3",0,0,null,"ø pro Spiel",{"$f":"SUM(S3)/P34","v":{"$error":"#DIV/0!"}}]
["RD 4",0,0,null,"ø pro Pfeil",{"$f":"SUM(E3)/C34","v":{"$error":"#DIV/0!"}},null,"RD 4",0,0,null,"ø pro Pfeil",{"$f":"SUM(L3)/J34","v":{"$error":"#DIV/0!"}},null,"RD 4",0,0,null,"ø pro Pfeil",{"$f":"SUM(S3)/Q34","v":{"$error":"#DIV/0!"}}]
["RD 5",0,0,null,"Average",null,null,"RD 5",0,0,null,"Average",null,null,"RD 5",0,0,null,"Average"]
["RD 6",0,0,null,{"$f":"SUM(F6)","v":{"$error":"#DIV/0!"}},null,null,"RD 6",0,0,null,{"$f":"SUM(M6)","v":{"$error":"#DIV/0!"}},null,null,"RD 6",0,0,null,{"$f":"SUM(T6)","v":{"$error":"#DIV/0!"}}]
["RD 7",0,0,null,null,null,null,"RD 7",0,0,null,null,null,null,"RD 7",0,0]
["RD 8",0,0,null,{"$f":"IF(F6<40,\"Nicht Gut\",\"\")","v":{"$error":"#DIV/0!"}},null,null,"RD 8",0,0,null,{"$f":"IF(M6<40,\"Nicht Gut\",\"\")","v":{"$error":"#DIV/0!"}},null,null,"RD 8",0,0,null,{"$f":"IF(T6<40,\"Nicht Gut\",\"\")","v":{"$error":"#DIV/0!"}}]
["RD 9",0,0,null,null,null,null,"RD 9",0,0,null,null,null,null,"RD 9",0,0]
["RD 10",0,0,null,null,null,null,"RD 10",0,0,null,null,null,null,"RD 10",0,0]
["RD 11",0,0,null,{"$f":"IF(F6>40,\"Gut\",\"\")","v":{"$error":"#DIV/0!"}},null,null,"RD 11",0,0,null,{"$f":"IF(M6>40,\"Gut\",\"\")","v":{"$error":"#DIV/0!"}},null,null,"RD 11",0,0,null,{"$f":"IF(T6>40,\"Gut\",\"\")","v":{"$error":"#DIV/0!"}}]
["RD 12",0,0,null,null,null,null,"RD 12",0,0,null,null,null,null,"RD 12",0,0]
["RD 13",0,0,null,null,null,null,"RD 13",0,0,null,null,null,null,"RD 13",0,0]
["RD 14",0,0,null,null,null,null,"RD 14",0,0,null,null,null,null,"RD 14",0,0]
["RD 15",0,0,null,{"$f":"D1","v":"Stefan"},{"$f":"E4","v":501},null,"RD 15",0,0,null,{"$f":"K1","v":"Stefan"},{"$f":"L4","v":501},null,"RD 15",0,0,null,{"$f":"R1","v":"Stefan"},{"$f":"S4","v":501}]
["RD 16",0,0,null,null,null,null,"RD 16",0,0,null,null,null,null,"RD 16",0,0]
["RD 17",0,0,null,{"$f":"IF(F6>50,\"Sehr Gut\",\"\")","v":{"$error":"#DIV/0!"}},null,null,"RD 17",0,0,null,{"$f":"IF(M6>50,\"Sehr Gut\",\"\")","v":{"$error":"#DIV/0!"}},null,null,"RD 17",0,0,null,{"$f":"IF(T6>50,\"Sehr Gut\",\"\")","v":{"$error":"#DIV/0!"}}]
["RD 18",0,0,null,null,null,null,"RD 18",0,0,null,null,null,null,"RD 18",0,0]
["RD 19",0,0,null,null,null,null,"RD 19",0,0,null,null,null,null,"RD 19",0,0]
["RD 20",0,0,null,null,null,null,"RD 20",0,0,null,null,null,null,"RD 20",0,0]
["RD 21",0,0,null,null,null,null,"RD 21",0,0,null,null,null,null,"RD 21",0,0]
["RD 22",0,0,null,null,null,null,"RD 22",0,0,null,null,null,null,"RD 22",0,0]
["RD 23",0,0,null,null,null,null,"RD 23",0,0,null,null,null,null,"RD 23",0,0]
["RD 24",0,0,null,null,null,null,"RD 24",0,0,null,null,null,null,"RD 24",0,0]
["RD 25",0,0,null,null,null,null,"RD 25",0,0,null,null,null,null,"RD 25",0,0]
["RD 26",0,0,null,null,null,null,"RD 26",0,0,null,null,null,null,"RD 26",0,0]
["RD 27",0,0,null,null,null,null,"RD 27",0,0,null,null,null,null,"RD 27",0,0]
["RD 28",0,0,null,null,null,null,"RD 28",0,0,null,null,null,null,"RD 28",0,0]
["RD 29",0,0,null,{"$f":"IF(E4=0,\"Sieg\",\"\")","v":""},null,null,"RD 29",0,0,null,{"$f":"IF(L4=0,\"Sieg\",\"\")","v":""},null,null,"RD 29",0,0,null,{"$f":"IF(S4=0,\"Sieg\",\"\")","v":""}]
["RD 30",0,0,null,null,null,null,"RD 30",0,0,null,null,null,null,"RD 30",0,0]
[null,{"$f":"SUM(B4:B33)","v":0},{"$f":"SUM(C4:C33)","v":0},{"$f":"SUM(D4:D33)","v":0},{"$f":"SUM(D4:D32)","v":0},null,null,null,{"$f":"SUM(I4:I33)","v":0},{"$f":"SUM(J4:J33)","v":0},{"$f":"SUM(K4:K33)","v":0},{"$f":"SUM(K4:K32)","v":0},null,null,null,{"$f":"SUM(P4:P33)","v":0},{"$f":"SUM(Q4:Q33)","v":0},{"$f":"SUM(R4:R33)","v":0},{"$f":"SUM(R4:R32)","v":0}]
[]
[]
[]
[]
[]
[]
[]
[]
[]
[]
[null,null,null,{"$f":"D1","v":"Stefan"},null,{"$f":"SUM(D34)","v":0},null,null,null,null,{"$f":"INDEX(D45:E47,MATCH(MAX(F45:F47),F45:F47,0),1)","v":"Stefan"}]
[null,null,null,{"$f":"K1","v":"Stefan"},null,{"$f":"SUM(K34)","v":0},null,null,null,null,{"$f":"INDEX(D45:E47,MATCH(MEDIAN(F45:F47),F45:F47,0),1)","v":"Stefan"}]
[null,null,null,{"$f":"R1","v":"Stefan"},null,{"$f":"SUM(S3)","v":0},null,null,null,null,{"$f":"INDEX(D45:E47,MATCH(MIN(F45:F47),F45:F47,0),1)","v":"Stefan"}]
[null,null,null,"MAX(B2:B7",null,{"$f":"MAX(F45:F47)","v":0}]

{"sheet":"Rd5","index":4,"n_rows":48,"n_cols":21,"rows_kept":48,"cut":false,"hidden":false,"merged":[[0,3,0,4],[0,10,0,11],[0,17,0,18],[7,4,7,5],[7,11,7,12],[7,18,7,19],[1,14,1,15],[8,4,9,5],[8,11,9,12],[8,18,9,19],[10,4,12,5],[10,11,12,12],[10,18,12,19],[44,3,44,4],[45,3,45,4],[46,3,46,4],[26,4,30,5],[26,11,30,12],[26,18,30,19],[31,4,32,5],[31,11,32,12],[31,18,32,19],[13,4,16,5],[13,11,16,12],[13,18,16,19],[19,4,25,5],[19,11,25,12],[19,18,25,19]]}
[null,null,null,{"$f":"'Rd4'!U3","v":"Stefan"},null,"Sp. 1",null,null,null,null,{"$f":"'Rd4'!U2","v":"Stefan"},null,"Sp. 2",null,null,null,null,{"$f":"'Rd4'!U1","v":"Stefan"},null,"Sp. 3",{"$f":"K45","v":"Stefan"}]
[null,null,null,"Punkte",501,"Start",null,null,null,null,"Punkte",501,"Start",null,null,null,null,"Punkte",501,"Start",{"$f":"K46","v":"Stefan"}]
[null,null,null,"Geworfen",{"$f":"SUM(D34)","v":0},"Punkte",null,null,null,null,"Geworfen",{"$f":"SUM(K34)","v":0},"Punkte",null,null,null,null,"Geworfen",{"$f":"SUM(R34)","v":0},"Punkte","Stefan"]
["RD 1",{"$f":"COUNT(D4)*1","v":0},{"$f":"COUNT(D4)*3","v":0},null,{"$f":"SUM(E2-E3)","v":501},"Rest",null,"RD 1",{"$f":"COUNT(K4)*1","v":0},{"$f":"COUNT(K4)*3","v":0},null,{"$f":"SUM(L2-L3)","v":501},"Rest",null,"RD 1",{"$f":"COUNT(R4)*1","v":0},{"$f":"COUNT(R4)*3","v":0},null,{"$f":"SUM(S2-S3)","v":501},"Rest"]
["RD 2",0,0,null,null,null,null,"RD 2",0,0,null,null,null,null,"RD 2",0,0]
["RD 3",0,0,null,"ø pro Spiel",{"$f":"SUM(E3)/B34","v":{"$error":"#DIV/0!"}},null,"RD 3",0,0,null,"ø pro Spiel",{"$f":"SUM(L3)/I34","v":{"$error":"#DIV/0!"}},null,"RD 3",0,0,null,"ø pro Spiel",{"$f":"SUM(S3)/P34","v":{"$error":"#DIV/0!"}}]
["RD 4",0,0,null,"ø pro Pfeil",{"$f":"SUM(E3)/C34","v":{"$error":"#DIV/0!"}},null,"RD 4",0,0,null,"ø pro Pfeil",{"$f":"SUM(L3)/J34","v":{"$error":"#DIV/0!"}},null,"RD 4",0,0,null,"ø pro Pfeil",{"$f":"SUM(S3)/Q34","v":{"$error":"#DIV/0!"}}]
["RD 5",0,0,null,"Average",null,null,"RD 5",0,0,null,"Average",null,null,"RD 5",0,0,null,"Average"]
["RD 6",0,0,null,{"$f":"SUM(F6)","v":{"$error":"#DIV/0!"}},null,null,"RD 6",0,0,null,{"$f":"SUM(M6)","v":{"$error":"#DIV/0!"}},null,null,"RD 6",0,0,null,{"$f":"SUM(T6)","v":{"$error":"#DIV/0!"}}]
["RD 7",0,0,null,null,null,null,"RD 7",0,0,null,null,null,null,"RD 7",0,0]
["RD 8",0,0,null,{"$f":"IF(F6<40,\"Nicht Gut\",\"\")","v":{"$error":"#DIV/0!"}},null,null,"RD 8",0,0,null,{"$f":"IF(M6<40,\"Nicht Gut\",\"\")","v":{"$error":"#DIV/0!"}},null,null,"RD 8",0,0,null,{"$f":"IF(T6<40,\"Nicht Gut\",\"\")","v":{"$error":"#DIV/0!"}}]
["RD 9",0,0,null,null,null,null,"RD 9",0,0,null,null,null,null,"RD 9",0,0]
["RD 10",0,0,null,null,null,null,"RD 10",0,0,null,null,null,null,"RD 10",0,0]
["RD 11",0,0,null,{"$f":"IF(F6>40,\"Gut\",\"\")","v":{"$error":"#DIV/0!"}},null,null,"RD 11",0,0,null,{"$f":"IF(M6>40,\"Gut\",\"\")","v":{"$error":"#DIV/0!"}},null,null,"RD 11",0,0,null,{"$f":"IF(T6>40,\"Gut\",\"\")","v":{"$error":"#DIV/0!"}}]
["RD 12",0,0,null,null,null,null,"RD 12",0,0,null,null,null,null,"RD 12",0,0]
["RD 13",0,0,null,null,null,null,"RD 13",0,0,null,null,null,null,"RD 13",0,0]
["RD 14",0,0,null,null,null,null,"RD 14",0,0,null,null,null,null,"RD 14",0,0]
["RD 15",0,0,null,{"$f":"D1","v":"Stefan"},{"$f":"E4","v":501},null,"RD 15",0,0,null,{"$f":"K1","v":"Stefan"},{"$f":"L4","v":501},null,"RD 15",0,0,null,{"$f":"R1","v":"Stefan"},{"$f":"S4","v":501}]
["RD 16",0,0,null,null,null,null,"RD 16",0,0,null,null,null,null,"RD 16",0,0]
["RD 17",0,0,null,{"$f":"IF(F6>50,\"Sehr Gut\",\"\")","v":{"$error":"#DIV/0!"}},null,null,"RD 17",0,0,null,{"$f":"IF(M6>50,\"Sehr Gut\",\"\")","v":{"$error":"#DIV/0!"}},null,null,"RD 17",0,0,null,{"$f":"IF(T6>50,\"Sehr Gut\",\"\")","v":{"$error":"#DIV/0!"}}]
["RD 18",0,0,null,null,null,null,"RD 18",0,0,null,null,null,null,"RD 18",0,0]
["RD 19",0,0,null,null,null,null,"RD 19",0,0,null,null,null,null,"RD 19",0,0]
["RD 20",0,0,null,null,null,null,"RD 20",0,0,null,null,null,null,"RD 20",0,0]
["RD 21",0,0,null,null,null,null,"RD 21",0,0,null,null,null,null,"RD 21",0,0]
["RD 22",0,0,null,null,null,null,"RD 22",0,0,null,null,null,null,"RD 22",0,0]
["RD 23",0,0,null,null,null,null,"RD 23",0,0,null,null,null,null,"RD 23",0,0]
["RD 24",0,0,null,null,null,null,"RD 24",0,0,null,null,null,null,"RD 24",0,0]
["RD 25",0,0,null,null,null,null,"RD 25",0,0,null,null,null,null,"RD 25",0,0]
["RD 26",0,0,null,null,null,null,"RD 26",0,0,null,null,null,null,"RD 26",0,0]
["RD 27",0,0,null,null,null,null,"RD 27",0,0,null,null,null,null,"RD 27",0,0]
["RD 28",0,0,null,null,null,null,"RD 28",0,0,null,null,null,null,"RD 28",0,0]
["RD 29",0,0,null,{"$f":"IF(E4=0,\"Sieg\",\"\")","v":""},null,null,"RD 29",0,0,null,{"$f":"IF(L4=0,\"Sieg\",\"\")","v":""},null,null,"RD 29",0,0,null,{"$f":"IF(S4=0,\"Sieg\",\"\")","v":""}]
["RD 30",0,0,null,null,null,null,"RD 30",0,0,null,null,null,null,"RD 30",0,0]
[null,{"$f":"SUM(B4:B33)","v":0},{"$f":"SUM(C4:C33)","v":0},{"$f":"SUM(D4:D33)","v":0},{"$f":"SUM(D4:D32)","v":0},null,null,null,{"$f":"SUM(I4:I33)","v":0},{"$f":"SUM(J4:J33)","v":0},{"$f":"SUM(K4:K33)","v":0},{"$f":"SUM(K4:K32)","v":0},null,null,null,{"$f":"SUM(P4:P33)","v":0},{"$f":"SUM(Q4:Q33)","v":0},{"$f":"SUM(R4:R33)","v":0},{"$f":"SUM(R4:R32)","v":0}]
[]
[]
[]
[]
[]
[]
[]
[]
[]
[]
[null,null,null,{"$f":"D1","v":"Stefan"},null,{"$f":"SUM(D34)","v":0},null,null,null,null,{"$f":"INDEX(D45:E47,MATCH(MAX(F45:F47),F45:F47,0),1)","v":"Stefan"}]
[null,null,null,{"$f":"K1","v":"Stefan"},null,{"$f":"SUM(K34)","v":0},null,null,null,null,{"$f":"INDEX(D45:E47,MATCH(MEDIAN(F45:F47),F45:F47,0),1)","v":"Stefan"}]
[null,null,null,{"$f":"R1","v":"Stefan"},null,{"$f":"SUM(S3)","v":0},null,null,null,null,{"$f":"INDEX(D45:E47,MATCH(MIN(F45:F47),F45:F47,0),1)","v":"Stefan"}]
[null,null,null,"MAX(B2:B7",null,{"$f":"MAX(F45:F47)","v":0}]

{"sheet":"Rd6","index":5,"n_rows":48,"n_cols":21,"rows_kept":48,"cut":false,"hidden":false,"merged":[[0,3,0,4],[0,10,0,11],[0,17,0,18],[7,4,7,5],[7,11,7,12],[7,18,7,19],[1,14,1,15],[8,4,9,5],[8,11,9,12],[8,18,9,19],[10,4,12,5],[10,11,12,12],[10,18,12,19],[44,3,44,4],[45,3,45,4],[46,3,46,4],[26,4,30,5],[26,11,30,12],[26,18,30,19],[31,4,32,5],[31,11,32,12],[31,18,32,19],[13,4,16,5],[13,11,16,12],[13,18,16,19],[19,4,25,5],[19,11,25,12],[19,18,25,19]]}
[null,null,null,{"$f":"'Rd5'!U3","v":"Stefan"},null,"Sp. 1",null,null,null,null,{"$f":"'Rd5'!U2","v":"Stefan"},null,"Sp. 2",null,null,null,null,{"$f":"'Rd5'!U1","v":"Stefan"},null,"Sp. 3",{"$f":"K45","v":"Stefan"}]
[null,null,null,"Punkte",501,"Start",null,null,null,null,"Punkte",501,"Start",null,null,null,null,"Punkte",501,"Start",{"$f":"K46","v":"Stefan"}]
[null,null,null,"Geworfen",{"$f":"SUM(D34)","v":0},"Punkte",null,null,null,null,"Geworfen",{"$f":"SUM(K34)","v":0},"Punkte",null,null,null,null,"Geworfen",{"$f":"SUM(R34)","v":0},"Punkte","Stefan"]
["RD 1",{"$f":"COUNT(D4)*1","v":0},{"$f":"COUNT(D4)*3","v":0},null,{"$f":"SUM(E2-E3)","v":501},"Rest",null,"RD 1",{"$f":"COUNT(K4)*1","v":0},{"$f":"COUNT(K4)*3","v":0},null,{"$f":"SUM(L2-L3)","v":501},"Rest",null,"RD 1",{"$f":"COUNT(R4)*1","v":0},{"$f":"COUNT(R4)*3","v":0},null,{"$f":"SUM(S2-S3)","v":501},"Rest"]
["RD 2",0,0,null,null,null,null,"RD 2",0,0,null,null,null,null,"RD 2",0,0]
["RD 3",0,0,null,"ø pro Spiel",{"$f":"SUM(E3)/B34","v":{"$error":"#DIV/0!"}},null,"RD 3",0,0,null,"ø pro Spiel",{"$f":"SUM(L3)/I34","v":{"$error":"#DIV/0!"}},null,"RD 3",0,0,null,"ø pro Spiel",{"$f":"SUM(S3)/P34","v":{"$error":"#DIV/0!"}}]
["RD 4",0,0,null,"ø pro Pfeil",{"$f":"SUM(E3)/C34","v":{"$error":"#DIV/0!"}},null,"RD 4",0,0,null,"ø pro Pfeil",{"$f":"SUM(L3)/J34","v":{"$error":"#DIV/0!"}},null,"RD 4",0,0,null,"ø pro Pfeil",{"$f":"SUM(S3)/Q34","v":{"$error":"#DIV/0!"}}]
["RD 5",0,0,null,"Average",null,null,"RD 5",0,0,null,"Average",null,null,"RD 5",0,0,null,"Average"]
["RD 6",0,0,null,{"$f":"SUM(F6)","v":{"$error":"#DIV/0!"}},null,null,"RD 6",0,0,null,{"$f":"SUM(M6)","v":{"$error":"#DIV/0!"}},null,null,"RD 6",0,0,null,{"$f":"SUM(T6)","v":{"$error":"#DIV/0!"}}]
["RD 7",0,0,null,null,null,null,"RD 7",0,0,null,null,null,null,"RD 7",0,0]
["RD 8",0,0,null,{"$f":"IF(F6<40,\"Nicht Gut\",\"\")","v":{"$error":"#DIV/0!"}},null,null,"RD 8",0,0,null,{"$f":"IF(M6<40,\"Nicht Gut\",\"\")","v":{"$error":"#DIV/0!"}},null,null,"RD 8",0,0,null,{"$f":"IF(T6<40,\"Nicht Gut\",\"\")","v":{"$error":"#DIV/0!"}}]
["RD 9",0,0,null,null,null,null,"RD 9",0,0,null,null,null,null,"RD 9",0,0]
["RD 10",0,0,null,null,null,null,"RD 10",0,0,null,null,null,null,"RD 10",0,0]
["RD 11",0,0,null,{"$f":"IF(F6>40,\"Gut\",\"\")","v":{"$error":"#DIV/0!"}},null,null,"RD 11",0,0,null,{"$f":"IF(M6>40,\"Gut\",\"\")","v":{"$error":"#DIV/0!"}},null,null,"RD 11",0,0,null,{"$f":"IF(T6>40,\"Gut\",\"\")","v":{"$error":"#DIV/0!"}}]
["RD 12",0,0,null,null,null,null,"RD 12",0,0,null,null,null,null,"RD 12",0,0]
["RD 13",0,0,null,null,null,null,"RD 13",0,0,null,null,null,null,"RD 13",0,0]
["RD 14",0,0,null,null,null,null,"RD 14",0,0,null,null,null,null,"RD 14",0,0]
["RD 15",0,0,null,{"$f":"D1","v":"Stefan"},{"$f":"E4","v":501},null,"RD 15",0,0,null,{"$f":"K1","v":"Stefan"},{"$f":"L4","v":501},null,"RD 15",0,0,null,{"$f":"R1","v":"Stefan"},{"$f":"S4","v":501}]
["RD 16",0,0,null,null,null,null,"RD 16",0,0,null,null,null,null,"RD 16",0,0]
["RD 17",0,0,null,{"$f":"IF(F6>50,\"Sehr Gut\",\"\")","v":{"$error":"#DIV/0!"}},null,null,"RD 17",0,0,null,{"$f":"IF(M6>50,\"Sehr Gut\",\"\")","v":{"$error":"#DIV/0!"}},null,null,"RD 17",0,0,null,{"$f":"IF(T6>50,\"Sehr Gut\",\"\")","v":{"$error":"#DIV/0!"}}]
["RD 18",0,0,null,null,null,null,"RD 18",0,0,null,null,null,null,"RD 18",0,0]
["RD 19",0,0,null,null,null,null,"RD 19",0,0,null,null,null,null,"RD 19",0,0]
["RD 20",0,0,null,null,null,null,"RD 20",0,0,null,null,null,null,"RD 20",0,0]
["RD 21",0,0,null,null,null,null,"RD 21",0,0,null,null,null,null,"RD 21",0,0]
["RD 22",0,0,null,null,null,null,"RD 22",0,0,null,null,null,null,"RD 22",0,0]
["RD 23",0,0,null,null,null,null,"RD 23",0,0,null,null,null,null,"RD 23",0,0]
["RD 24",0,0,null,null,null,null,"RD 24",0,0,null,null,null,null,"RD 24",0,0]
["RD 25",0,0,null,null,null,null,"RD 25",0,0,null,null,null,null,"RD 25",0,0]
["RD 26",0,0,null,null,null,null,"RD 26",0,0,null,null,null,null,"RD 26",0,0]
["RD 27",0,0,null,null,null,null,"RD 27",0,0,null,null,null,null,"RD 27",0,0]
["RD 28",0,0,null,null,null,null,"RD 28",0,0,null,null,null,null,"RD 28",0,0]
["RD 29",0,0,null,{"$f":"IF(E4=0,\"Sieg\",\"\")","v":""},null,null,"RD 29",0,0,null,{"$f":"IF(L4=0,\"Sieg\",\"\")","v":""},null,null,"RD 29",0,0,null,{"$f":"IF(S4=0,\"Sieg\",\"\")","v":""}]
["RD 30",0,0,null,null,null,null,"RD 30",0,0,null,null,null,null,"RD 30",0,0]
[null,{"$f":"SUM(B4:B33)","v":0},{"$f":"SUM(C4:C33)","v":0},{"$f":"SUM(D4:D33)","v":0},{"$f":"SUM(D4:D32)","v":0},null,null,null,{"$f":"SUM(I4:I33)","v":0},{"$f":"SUM(J4:J33)","v":0},{"$f":"SUM(K4:K33)","v":0},{"$f":"SUM(K4:K32)","v":0},null,null,null,{"$f":"SUM(P4:P33)","v":0},{"$f":"SUM(Q4:Q33)","v":0},{"$f":"SUM(R4:R33)","v":0},{"$f":"SUM(R4:R32)","v":0}]
[]
[]
[]
[]
[]
[]
[]
[]
[]
[]
[null,null,null,{"$f":"D1","v":"Stefan"},null,{"$f":"SUM(D34)","v":0},null,null,null,null,{"$f":"INDEX(D45:E47,MATCH(MAX(F45:F47),F45:F47,0),1)","v":"Stefan"}]
[null,null,null,{"$f":"K1","v":"Stefan"},null,{"$f":"SUM(K34)","v":0},null,null,null,null,{"$f":"INDEX(D45:E47,MATCH(MEDIAN(F45:F47),F45:F47,0),1)","v":"Stefan"}]
[null,null,null,{"$f":"R1","v":"Stefan"},null,{"$f":"SUM(S3)","v":0},null,null,null,null,{"$f":"INDEX(D45:E47,MATCH(MIN(F45:F47),F45:F47,0),1)","v":"Stefan"}]
[null,null,null,"MAX(B2:B7",null,{"$f":"MAX(F45:F47)","v":0}]

{"sheet":"Rd7","index":6,"n_rows":48,"n_cols":21,"rows_kept":48,"cut":false,"hidden":false,"merged":[[0,3,0,4],[0,10,0,11],[0,17,0,18],[7,4,7,5],[7,11,7,12],[7,18,7,19],[1,14,1,15],[8,4,9,5],[8,11,9,12],[8,18,9,19],[10,4,12,5],[10,11,12,12],[10,18,12,19],[44,3,44,4],[45,3,45,4],[46,3,46,4],[26,4,30,5],[26,11,30,12],[26,18,30,19],[31,4,32,5],[31,11,32,12],[31,18,32,19],[13,4,16,5],[13,11,16,12],[13,18,16,19],[19,4,25,5],[19,11,25,12],[19,18,25,19]]}
[null,null,null,{"$f":"'Rd6'!U3","v":"Stefan"},null,"Sp. 1",null,null,null,null,{"$f":"'Rd6'!U2","v":"Stefan"},null,"Sp. 2",null,null,null,null,{"$f":"'Rd6'!U1","v":"Stefan"},null,"Sp. 3",{"$f":"K45","v":"Stefan"}]
[null,null,null,"Punkte",501,"Start",null,null,null,null,"Punkte",501,"Start",null,null,null,null,"Punkte",501,"Start",{"$f":"K46","v":"Stefan"}]
[null,null,null,"Geworfen",{"$f":"SUM(D34)","v":0},"Punkte",null,null,null,null,"Geworfen",{"$f":"SUM(K34)","v":0},"Punkte",null,null,null,null,"Geworfen",{"$f":"SUM(R34)","v":0},"Punkte","Stefan"]
["RD 1",{"$f":"COUNT(D4)*1","v":0},{"$f":"COUNT(D4)*3","v":0},null,{"$f":"SUM(E2-E3)","v":501},"Rest",null,"RD 1",{"$f":"COUNT(K4)*1","v":0},{"$f":"COUNT(K4)*3","v":0},null,{"$f":"SUM(L2-L3)","v":501},"Rest",null,"RD 1",{"$f":"COUNT(R4)*1","v":0},{"$f":"COUNT(R4)*3","v":0},null,{"$f":"SUM(S2-S3)","v":501},"Rest"]
["RD 2",0,0,null,null,null,null,"RD 2",0,0,null,null,null,null,"RD 2",0,0]
["RD 3",0,0,null,"ø pro Spiel",{"$f":"SUM(E3)/B34","v":{"$error":"#DIV/0!"}},null,"RD 3",0,0,null,"ø pro Spiel",{"$f":"SUM(L3)/I34","v":{"$error":"#DIV/0!"}},null,"RD 3",0,0,null,"ø pro Spiel",{"$f":"SUM(S3)/P34","v":{"$error":"#DIV/0!"}}]
["RD 4",0,0,null,"ø pro Pfeil",{"$f":"SUM(E3)/C34","v":{"$error":"#DIV/0!"}},null,"RD 4",0,0,null,"ø pro Pfeil",{"$f":"SUM(L3)/J34","v":{"$error":"#DIV/0!"}},null,"RD 4",0,0,null,"ø pro Pfeil",{"$f":"SUM(S3)/Q34","v":{"$error":"#DIV/0!"}}]
["RD 5",0,0,null,"Average",null,null,"RD 5",0,0,null,"Average",null,null,"RD 5",0,0,null,"Average"]
["RD 6",0,0,null,{"$f":"SUM(F6)","v":{"$error":"#DIV/0!"}},null,null,"RD 6",0,0,null,{"$f":"SUM(M6)","v":{"$error":"#DIV/0!"}},null,null,"RD 6",0,0,null,{"$f":"SUM(T6)","v":{"$error":"#DIV/0!"}}]
["RD 7",0,0,null,null,null,null,"RD 7",0,0,null,null,null,null,"RD 7",0,0]
["RD 8",0,0,null,{"$f":"IF(F6<40,\"Nicht Gut\",\"\")","v":{"$error":"#DIV/0!"}},null,null,"RD 8",0,0,null,{"$f":"IF(M6<40,\"Nicht Gut\",\"\")","v":{"$error":"#DIV/0!"}},null,null,"RD 8",0,0,null,{"$f":"IF(T6<40,\"Nicht Gut\",\"\")","v":{"$error":"#DIV/0!"}}]
["RD 9",0,0,null,null,null,null,"RD 9",0,0,null,null,null,null,"RD 9",0,0]
["RD 10",0,0,null,null,null,null,"RD 10",0,0,null,null,null,null,"RD 10",0,0]
["RD 11",0,0,null,{"$f":"IF(F6>40,\"Gut\",\"\")","v":{"$error":"#DIV/0!"}},null,null,"RD 11",0,0,null,{"$f":"IF(M6>40,\"Gut\",\"\")","v":{"$error":"#DIV/0!"}},null,null,"RD 11",0,0,null,{"$f":"IF(T6>40,\"Gut\",\"\")","v":{"$error":"#DIV/0!"}}]
["RD 12",0,0,null,null,null,null,"RD 12",0,0,null,null,null,null,"RD 12",0,0]
["RD 13",0,0,null,null,null,null,"RD 13",0,0,null,null,null,null,"RD 13",0,0]
["RD 14",0,0,null,null,null,null,"RD 14",0,0,null,null,null,null,"RD 14",0,0]
["RD 15",0,0,null,{"$f":"D1","v":"Stefan"},{"$f":"E4","v":501},null,"RD 15",0,0,null,{"$f":"K1","v":"Stefan"},{"$f":"L4","v":501},null,"RD 15",0,0,null,{"$f":"R1","v":"Stefan"},{"$f":"S4","v":501}]
["RD 16",0,0,null,null,null,null,"RD 16",0,0,null,null,null,null,"RD 16",0,0]
["RD 17",0,0,null,{"$f":"IF(F6>50,\"Sehr Gut\",\"\")","v":{"$error":"#DIV/0!"}},null,null,"RD 17",0,0,null,{"$f":"IF(M6>50,\"Sehr Gut\",\"\")","v":{"$error":"#DIV/0!"}},null,null,"RD 17",0,0,null,{"$f":"IF(T6>50,\"Sehr Gut\",\"\")","v":{"$error":"#DIV/0!"}}]
["RD 18",0,0,null,null,null,null,"RD 18",0,0,null,null,null,null,"RD 18",0,0]
["RD 19",0,0,null,null,null,null,"RD 19",0,0,null,null,null,null,"RD 19",0,0]
["RD 20",0,0,null,null,null,null,"RD 20",0,0,null,null,null,null,"RD 20",0,0]
["RD 21",0,0,null,null,null,null,"RD 21",0,0,null,null,null,null,"RD 21",0,0]
["RD 22",0,0,null,null,null,null,"RD 22",0,0,null,null,null,null,"RD 22",0,0]
["RD 23",0,0,null,null,null,null,"RD 23",0,0,null,null,null,null,"RD 23",0,0]
["RD 24",0,0,null,null,null,null,"RD 24",0,0,null,null,null,null,"RD 24",0,0]
["RD 25",0,0,null,null,null,null,"RD 25",0,0,null,null,null,null,"RD 25",0,0]
["RD 26",0,0,null,null,null,null,"RD 26",0,0,null,null,null,null,"RD 26",0,0]
["RD 27",0,0,null,null,null,null,"RD 27",0,0,null,null,null,null,"RD 27",0,0]
["RD 28",0,0,null,null,null,null,"RD 28",0,0,null,null,null,null,"RD 28",0,0]
["RD 29",0,0,null,{"$f":"IF(E4=0,\"Sieg\",\"\")","v":""},null,null,"RD 29",0,0,null,{"$f":"IF(L4=0,\"Sieg\",\"\")","v":""},null,null,"RD 29",0,0,null,{"$f":"IF(S4=0,\"Sieg\",\"\")","v":""}]
["RD 30",0,0,null,null,null,null,"RD 30",0,0,null,null,null,null,"RD 30",0,0]
[null,{"$f":"SUM(B4:B33)","v":0},{"$f":"SUM(C4:C33)","v":0},{"$f":"SUM(D4:D33)","v":0},{"$f":"SUM(D4:D32)","v":0},null,null,null,{"$f":"SUM(I4:I33)","v":0},{"$f":"SUM(J4:J33)","v":0},{"$f":"SUM(K4:K33)","v":0},{"$f":"SUM(K4:K32)","v":0},null,null,null,{"$f":"SUM(P4:P33)","v":0},{"$f":"SUM(Q4:Q33)","v":0},{"$f":"SUM(R4:R33)","v":0},{"$f":"SUM(R4:R32)","v":0}]
[]
[]
[]
[]
[]
[]
[]
[]
[]
[]
[null,null,null,{"$f":"D1","v":"Stefan"},null,{"$f":"SUM(D34)","v":0},null,null,null,null,{"$f":"INDEX(D45:E47,MATCH(MAX(F45:F47),F45:F47,0),1)","v":"Stefan"}]
[null,null,null,{"$f":"K1","v":"Stefan"},null,{"$f":"SUM(K34)","v":0},null,null,null,null,{"$f":"INDEX(D45:E47,MATCH(MEDIAN(F45:F47),F45:F47,0),1)","v":"Stefan"}]
[null,null,null,{"$f":"R1","v":"Stefan"},null,{"$f":"SUM(S3)","v":0},null,null,null,null,{"$f":"INDEX(D45:E47,MATCH(MIN(F45:F47),F45:F47,0),1)","v":"Stefan"}]
[null,null,null,"MAX(B2:B7",null,{"$f":"MAX(F45:F47)","v":0}]

{"sheet":"Rd8","index":7,"n_rows":48,"n_cols":21,"rows_kept":48,"cut":false,"hidden":false,"merged":[[0,3,0,4],[0,10,0,11],[0,17,0,18],[7,4,7,5],[7,11,7,12],[7,18,7,19],[1,14,1,15],[8,4,9,5],[8,11,9,12],[8,18,9,19],[10,4,12,5],[10,11,12,12],[10,18,12,19],[44,3,44,4],[45,3,45,4],[46,3,46,4],[26,4,30,5],[26,11,30,12],[26,18,30,19],[31,4,32,5],[31,11,32,12],[31,18,32,19],[13,4,16,5],[13,11,16,12],[13,18,16,19],[19,4,25,5],[19,11,25,12],[19,18,25,19]]}
[null,null,null,{"$f":"'Rd7'!U3","v":"Stefan"},null,"Sp. 1",null,null,null,null,{"$f":"'Rd7'!U2","v":"Stefan"},null,"Sp. 2",null,null,null,null,{"$f":"'Rd7'!U1","v":"Stefan"},null,"Sp. 3",{"$f":"K45","v":"Stefan"}]
[null,null,null,"Punkte",501,"Start",null,null,null,null,"Punkte",501,"Start",null,null,null,null,"Punkte",501,"Start",{"$f":"K46","v":"Stefan"}]
[null,null,null,"Geworfen",{"$f":"SUM(D34)","v":0},"Punkte",null,null,null,null,"Geworfen",{"$f":"SUM(K34)","v":0},"Punkte",null,null,null,null,"Geworfen",{"$f":"SUM(R34)","v":0},"Punkte","Stefan"]
["RD 1",{"$f":"COUNT(D4)*1","v":0},{"$f":"COUNT(D4)*3","v":0},null,{"$f":"SUM(E2-E3)","v":501},"Rest",null,"RD 1",{"$f":"COUNT(K4)*1","v":0},{"$f":"COUNT(K4)*3","v":0},null,{"$f":"SUM(L2-L3)","v":501},"Rest",null,"RD 1",{"$f":"COUNT(R4)*1","v":0},{"$f":"COUNT(R4)*3","v":0},null,{"$f":"SUM(S2-S3)","v":501},"Rest"]
["RD 2",0,0,null,null,null,null,"RD 2",0,0,null,null,null,null,"RD 2",0,0]
["RD 3",0,0,null,"ø pro Spiel",{"$f":"SUM(E3)/B34","v":{"$error":"#DIV/0!"}},null,"RD 3",0,0,null,"ø pro Spiel",{"$f":"SUM(L3)/I34","v":{"$error":"#DIV/0!"}},null,"RD 3",0,0,null,"ø pro Spiel",{"$f":"SUM(S3)/P34","v":{"$error":"#DIV/0!"}}]
["RD 4",0,0,null,"ø pro Pfeil",{"$f":"SUM(E3)/C34","v":{"$error":"#DIV/0!"}},null,"RD 4",0,0,null,"ø pro Pfeil",{"$f":"SUM(L3)/J34","v":{"$error":"#DIV/0!"}},null,"RD 4",0,0,null,"ø pro Pfeil",{"$f":"SUM(S3)/Q34","v":{"$error":"#DIV/0!"}}]
["RD 5",0,0,null,"Average",null,null,"RD 5",0,0,null,"Average",null,null,"RD 5",0,0,null,"Average"]
["RD 6",0,0,null,{"$f":"SUM(F6)","v":{"$error":"#DIV/0!"}},null,null,"RD 6",0,0,null,{"$f":"SUM(M6)","v":{"$error":"#DIV/0!"}},null,null,"RD 6",0,0,null,{"$f":"SUM(T6)","v":{"$error":"#DIV/0!"}}]
["RD 7",0,0,null,null,null,null,"RD 7",0,0,null,null,null,null,"RD 7",0,0]
["RD 8",0,0,null,{"$f":"IF(F6<40,\"Nicht Gut\",\"\")","v":{"$error":"#DIV/0!"}},null,null,"RD 8",0,0,null,{"$f":"IF(M6<40,\"Nicht Gut\",\"\")","v":{"$error":"#DIV/0!"}},null,null,"RD 8",0,0,null,{"$f":"IF(T6<40,\"Nicht Gut\",\"\")","v":{"$error":"#DIV/0!"}}]
["RD 9",0,0,null,null,null,null,"RD 9",0,0,null,null,null,null,"RD 9",0,0]
["RD 10",0,0,null,null,null,null,"RD 10",0,0,null,null,null,null,"RD 10",0,0]
["RD 11",0,0,null,{"$f":"IF(F6>40,\"Gut\",\"\")","v":{"$error":"#DIV/0!"}},null,null,"RD 11",0,0,null,{"$f":"IF(M6>40,\"Gut\",\"\")","v":{"$error":"#DIV/0!"}},null,null,"RD 11",0,0,null,{"$f":"IF(T6>40,\"Gut\",\"\")","v":{"$error":"#DIV/0!"}}]
["RD 12",0,0,null,null,null,null,"RD 12",0,0,null,null,null,null,"RD 12",0,0]
["RD 13",0,0,null,null,null,null,"RD 13",0,0,null,null,null,null,"RD 13",0,0]
["RD 14",0,0,null,null,null,null,"RD 14",0,0,null,null,null,null,"RD 14",0,0]
["RD 15",0,0,null,{"$f":"D1","v":"Stefan"},{"$f":"E4","v":501},null,"RD 15",0,0,null,{"$f":"K1","v":"Stefan"},{"$f":"L4","v":501},null,"RD 15",0,0,null,{"$f":"R1","v":"Stefan"},{"$f":"S4","v":501}]
["RD 16",0,0,null,null,null,null,"RD 16",0,0,null,null,null,null,"RD 16",0,0]
["RD 17",0,0,null,{"$f":"IF(F6>50,\"Sehr Gut\",\"\")","v":{"$error":"#DIV/0!"}},null,null,"RD 17",0,0,null,{"$f":"IF(M6>50,\"Sehr Gut\",\"\")","v":{"$error":"#DIV/0!"}},null,null,"RD 17",0,0,null,{"$f":"IF(T6>50,\"Sehr Gut\",\"\")","v":{"$error":"#DIV/0!"}}]
["RD 18",0,0,null,null,null,null,"RD 18",0,0,null,null,null,null,"RD 18",0,0]
["RD 19",0,0,null,null,null,null,"RD 19",0,0,null,null,null,null,"RD 19",0,0]
["RD 20",0,0,null,null,null,null,"RD 20",0,0,null,null,null,null,"RD 20",0,0]
["RD 21",0,0,null,null,null,null,"RD 21",0,0,null,null,null,null,"RD 21",0,0]
["RD 22",0,0,null,null,null,null,"RD 22",0,0,null,null,null,null,"RD 22",0,0]
["RD 23",0,0,null,null,null,null,"RD 23",0,0,null,null,null,null,"RD 23",0,0]
["RD 24",0,0,null,null,null,null,"RD 24",0,0,null,null,null,null,"RD 24",0,0]
["RD 25",0,0,null,null,null,null,"RD 25",0,0,null,null,null,null,"RD 25",0,0]
["RD 26",0,0,null,null,null,null,"RD 26",0,0,null,null,null,null,"RD 26",0,0]
["RD 27",0,0,null,null,null,null,"RD 27",0,0,null,null,null,null,"RD 27",0,0]
["RD 28",0,0,null,null,null,null,"RD 28",0,0,null,null,null,null,"RD 28",0,0]
["RD 29",0,0,null,{"$f":"IF(E4=0,\"Sieg\",\"\")","v":""},null,null,"RD 29",0,0,null,{"$f":"IF(L4=0,\"Sieg\",\"\")","v":""},null,null,"RD 29",0,0,null,{"$f":"IF(S4=0,\"Sieg\",\"\")","v":""}]
["RD 30",0,0,null,null,null,null,"RD 30",0,0,null,null,null,null,"RD 30",0,0]
[null,{"$f":"SUM(B4:B33)","v":0},{"$f":"SUM(C4:C33)","v":0},{"$f":"SUM(D4:D33)","v":0},{"$f":"SUM(D4:D32)","v":0},null,null,null,{"$f":"SUM(I4:I33)","v":0},{"$f":"SUM(J4:J33)","v":0},{"$f":"SUM(K4:K33)","v":0},{"$f":"SUM(K4:K32)","v":0},null,null,null,{"$f":"SUM(P4:P33)","v":0},{"$f":"SUM(Q4:Q33)","v":0},{"$f":"SUM(R4:R33)","v":0},{"$f":"SUM(R4:R32)","v":0}]
[]
[]
[]
[]
[]
[]
[]
[]
[]
[]
[null,null,null,{"$f":"D1","v":"Stefan"},null,{"$f":"SUM(D34)","v":0},null,null,null,null,{"$f":"INDEX(D45:E47,MATCH(MAX(F45:F47),F45:F47,0),1)","v":"Stefan"}]
[null,null,null,{"$f":"K1","v":"Stefan"},null,{"$f":"SUM(K34)","v":0},null,null,null,null,{"$f":"INDEX(D45:E47,MATCH(MEDIAN(F45:F47),F45:F47,0),1)","v":"Stefan"}]
[null,null,null,{"$f":"R1","v":"Stefan"},null,{"$f":"SUM(S3)","v":0},null,null,null,null,{"$f":"INDEX(D45:E47,MATCH(MIN(F45:F47),F45:F47,0),1)","v":"Stefan"}]
[null,null,null,"MAX(B2:B7",null,{"$f":"MAX(F45:F47)","v":0}]

{"sheet":"Rd9","index":8,"n_rows":48,"n_cols":21,"rows_kept":48,"cut":false,"hidden":false,"merged":[[0,3,0,4],[0,10,0,11],[0,17,0,18],[7,4,7,5],[7,11,7,12],[7,18,7,19],[1,14,1,15],[8,4,9,5],[8,11,9,12],[8,18,9,19],[10,4,12,5],[10,11,12,12],[10,18,12,19],[44,3,44,4],[45,3,45,4],[46,3,46,4],[26,4,30,5],[26,11,30,12],[26,18,30,19],[31,4,32,5],[31,11,32,12],[31,18,32,19],[13,4,16,5],[13,11,16,12],[13,18,16,19],[19,4,25,5],[19,11,25,12],[19,18,25,19]]}
[null,null,null,{"$f":"'Rd8'!U3","v":"Stefan"},null,"Sp. 1",null,null,null,null,{"$f":"'Rd8'!U2","v":"Stefan"},null,"Sp. 2",null,null,null,null,{"$f":"'Rd8'!U1","v":"Stefan"},null,"Sp. 3",{"$f":"K45","v":"Stefan"}]
[null,null,null,"Punkte",501,"Start",null,null,null,null,"Punkte",501,"Start",null,null,null,null,"Punkte",501,"Start",{"$f":"K46","v":"Stefan"}]
[null,null,null,"Geworfen",{"$f":"SUM(D34)","v":0},"Punkte",null,null,null,null,"Geworfen",{"$f":"SUM(K34)","v":0},"Punkte",null,null,null,null,"Geworfen",{"$f":"SUM(R34)","v":0},"Punkte","Stefan"]
["RD 1",{"$f":"COUNT(D4)*1","v":0},{"$f":"COUNT(D4)*3","v":0},null,{"$f":"SUM(E2-E3)","v":501},"Rest",null,"RD 1",{"$f":"COUNT(K4)*1","v":0},{"$f":"COUNT(K4)*3","v":0},null,{"$f":"SUM(L2-L3)","v":501},"Rest",null,"RD 1",{"$f":"COUNT(R4)*1","v":0},{"$f":"COUNT(R4)*3","v":0},null,{"$f":"SUM(S2-S3)","v":501},"Rest"]
["RD 2",0,0,null,null,null,null,"RD 2",0,0,null,null,null,null,"RD 2",0,0]
["RD 3",0,0,null,"ø pro Spiel",{"$f":"SUM(E3)/B34","v":{"$error":"#DIV/0!"}},null,"RD 3",0,0,null,"ø pro Spiel",{"$f":"SUM(L3)/I34","v":{"$error":"#DIV/0!"}},null,"RD 3",0,0,null,"ø pro Spiel",{"$f":"SUM(S3)/P34","v":{"$error":"#DIV/0!"}}]
["RD 4",0,0,null,"ø pro Pfeil",{"$f":"SUM(E3)/C34","v":{"$error":"#DIV/0!"}},null,"RD 4",0,0,null,"ø pro Pfeil",{"$f":"SUM(L3)/J34","v":{"$error":"#DIV/0!"}},null,"RD 4",0,0,null,"ø pro Pfeil",{"$f":"SUM(S3)/Q34","v":{"$error":"#DIV/0!"}}]
["RD 5",0,0,null,"Average",null,null,"RD 5",0,0,null,"Average",null,null,"RD 5",0,0,null,"Average"]
["RD 6",0,0,null,{"$f":"SUM(F6)","v":{"$error":"#DIV/0!"}},null,null,"RD 6",0,0,null,{"$f":"SUM(M6)","v":{"$error":"#DIV/0!"}},null,null,"RD 6",0,0,null,{"$f":"SUM(T6)","v":{"$error":"#DIV/0!"}}]
["RD 7",0,0,null,null,null,null,"RD 7",0,0,null,null,null,null,"RD 7",0,0]
["RD 8",0,0,null,{"$f":"IF(F6<40,\"Nicht Gut\",\"\")","v":{"$error":"#DIV/0!"}},null,null,"RD 8",0,0,null,{"$f":"IF(M6<40,\"Nicht Gut\",\"\")","v":{"$error":"#DIV/0!"}},null,null,"RD 8",0,0,null,{"$f":"IF(T6<40,\"Nicht Gut\",\"\")","v":{"$error":"#DIV/0!"}}]
["RD 9",0,0,null,null,null,null,"RD 9",0,0,null,null,null,null,"RD 9",0,0]
["RD 10",0,0,null,null,null,null,"RD 10",0,0,null,null,null,null,"RD 10",0,0]
["RD 11",0,0,null,{"$f":"IF(F6>40,\"Gut\",\"\")","v":{"$error":"#DIV/0!"}},null,null,"RD 11",0,0,null,{"$f":"IF(M6>40,\"Gut\",\"\")","v":{"$error":"#DIV/0!"}},null,null,"RD 11",0,0,null,{"$f":"IF(T6>40,\"Gut\",\"\")","v":{"$error":"#DIV/0!"}}]
["RD 12",0,0,null,null,null,null,"RD 12",0,0,null,null,null,null,"RD 12",0,0]
["RD 13",0,0,null,null,null,null,"RD 13",0,0,null,null,null,null,"RD 13",0,0]
["RD 14",0,0,null,null,null,null,"RD 14",0,0,null,null,null,null,"RD 14",0,0]
["RD 15",0,0,null,{"$f":"D1","v":"Stefan"},{"$f":"E4","v":501},null,"RD 15",0,0,null,{"$f":"K1","v":"Stefan"},{"$f":"L4","v":501},null,"RD 15",0,0,null,{"$f":"R1","v":"Stefan"},{"$f":"S4","v":501}]
["RD 16",0,0,null,null,null,null,"RD 16",0,0,null,null,null,null,"RD 16",0,0]
["RD 17",0,0,null,{"$f":"IF(F6>50,\"Sehr Gut\",\"\")","v":{"$error":"#DIV/0!"}},null,null,"RD 17",0,0,null,{"$f":"IF(M6>50,\"Sehr Gut\",\"\")","v":{"$error":"#DIV/0!"}},null,null,"RD 17",0,0,null,{"$f":"IF(T6>50,\"Sehr Gut\",\"\")","v":{"$error":"#DIV/0!"}}]
["RD 18",0,0,null,null,null,null,"RD 18",0,0,null,null,null,null,"RD 18",0,0]
["RD 19",0,0,null,null,null,null,"RD 19",0,0,null,null,null,null,"RD 19",0,0]
["RD 20",0,0,null,null,null,null,"RD 20",0,0,null,null,null,null,"RD 20",0,0]
["RD 21",0,0,null,null,null,null,"RD 21",0,0,null,null,null,null,"RD 21",0,0]
["RD 22",0,0,null,null,null,null,"RD 22",0,0,null,null,null,null,"RD 22",0,0]
["RD 23",0,0,null,null,null,null,"RD 23",0,0,null,null,null,null,"RD 23",0,0]
["RD 24",0,0,null,null,null,null,"RD 24",0,0,null,null,null,null,"RD 24",0,0]
["RD 25",0,0,null,null,null,null,"RD 25",0,0,null,null,null,null,"RD 25",0,0]
["RD 26",0,0,null,null,null,null,"RD 26",0,0,null,null,null,null,"RD 26",0,0]
["RD 27",0,0,null,null,null,null,"RD 27",0,0,null,null,null,null,"RD 27",0,0]
["RD 28",0,0,null,null,null,null,"RD 28",0,0,null,null,null,null,"RD 28",0,0]
["RD 29",0,0,null,{"$f":"IF(E4=0,\"Sieg\",\"\")","v":""},null,null,"RD 29",0,0,null,{"$f":"IF(L4=0,\"Sieg\",\"\")","v":""},null,null,"RD 29",0,0,null,{"$f":"IF(S4=0,\"Sieg\",\"\")","v":""}]
["RD 30",0,0,null,null,null,null,"RD 30",0,0,null,null,null,null,"RD 30",0,0]
[null,{"$f":"SUM(B4:B33)","v":0},{"$f":"SUM(C4:C33)","v":0},{"$f":"SUM(D4:D33)","v":0},{"$f":"SUM(D4:D32)","v":0},null,null,null,{"$f":"SUM(I4:I33)","v":0},{"$f":"SUM(J4:J33)","v":0},{"$f":"SUM(K4:K33)","v":0},{"$f":"SUM(K4:K32)","v":0},null,null,null,{"$f":"SUM(P4:P33)","v":0},{"$f":"SUM(Q4:Q33)","v":0},{"$f":"SUM(R4:R33)","v":0},{"$f":"SUM(R4:R32)","v":0}]
[]
[]
[]
[]
[]
[]
[]
[]
[]
[]
[null,null,null,{"$f":"D1","v":"Stefan"},null,{"$f":"SUM(D34)","v":0},null,null,null,null,{"$f":"INDEX(D45:E47,MATCH(MAX(F45:F47),F45:F47,0),1)","v":"Stefan"}]
[null,null,null,{"$f":"K1","v":"Stefan"},null,{"$f":"SUM(K34)","v":0},null,null,null,null,{"$f":"INDEX(D45:E47,MATCH(MEDIAN(F45:F47),F45:F47,0),1)","v":"Stefan"}]
[null,null,null,{"$f":"R1","v":"Stefan"},null,{"$f":"SUM(S3)","v":0},null,null,null,null,{"$f":"INDEX(D45:E47,MATCH(MIN(F45:F47),F45:F47,0),1)","v":"Stefan"}]
[null,null,null,"MAX(B2:B7",null,{"$f":"MAX(F45:F47)","v":0}]

{"sheet":"Rd10","index":9,"n_rows":48,"n_cols":21,"rows_kept":48,"cut":false,"hidden":false,"merged":[[0,3,0,4],[0,10,0,11],[0,17,0,18],[7,4,7,5],[7,11,7,12],[7,18,7,19],[1,14,1,15],[8,4,9,5],[8,11,9,12],[8,18,9,19],[10,4,12,5],[10,11,12,12],[10,18,12,19],[44,3,44,4],[45,3,45,4],[46,3,46,4],[26,4,30,5],[26,11,30,12],[26,18,30,19],[31,4,32,5],[31,11,32,12],[31,18,32,19],[13,4,16,5],[13,11,16,12],[13,18,16,19],[19,4,25,5],[19,11,25,12],[19,18,25,19]]}
[null,null,null,{"$f":"'Rd9'!U3","v":"Stefan"},null,"Sp. 1",null,null,null,null,{"$f":"'Rd9'!U2","v":"Stefan"},null,"Sp. 2",null,null,null,null,{"$f":"'Rd9'!U1","v":"Stefan"},null,"Sp. 3",{"$f":"K45","v":"Stefan"}]
[null,null,null,"Punkte",501,"Start",null,null,null,null,"Punkte",501,"Start",null,null,null,null,"Punkte",501,"Start",{"$f":"K46","v":"Stefan"}]
[null,null,null,"Geworfen",{"$f":"SUM(D34)","v":0},"Punkte",null,null,null,null,"Geworfen",{"$f":"SUM(K34)","v":0},"Punkte",null,null,null,null,"Geworfen",{"$f":"SUM(R34)","v":0},"Punkte","Stefan"]
["RD 1",{"$f":"COUNT(D4)*1","v":0},{"$f":"COUNT(D4)*3","v":0},null,{"$f":"SUM(E2-E3)","v":501},"Rest",null,"RD 1",{"$f":"COUNT(K4)*1","v":0},{"$f":"COUNT(K4)*3","v":0},null,{"$f":"SUM(L2-L3)","v":501},"Rest",null,"RD 1",{"$f":"COUNT(R4)*1","v":0},{"$f":"COUNT(R4)*3","v":0},null,{"$f":"SUM(S2-S3)","v":501},"Rest"]
["RD 2",0,0,null,null,null,null,"RD 2",0,0,null,null,null,null,"RD 2",0,0]
["RD 3",0,0,null,"ø pro Spiel",{"$f":"SUM(E3)/B34","v":{"$error":"#DIV/0!"}},null,"RD 3",0,0,null,"ø pro Spiel",{"$f":"SUM(L3)/I34","v":{"$error":"#DIV/0!"}},null,"RD 3",0,0,null,"ø pro Spiel",{"$f":"SUM(S3)/P34","v":{"$error":"#DIV/0!"}}]
["RD 4",0,0,null,"ø pro Pfeil",{"$f":"SUM(E3)/C34","v":{"$error":"#DIV/0!"}},null,"RD 4",0,0,null,"ø pro Pfeil",{"$f":"SUM(L3)/J34","v":{"$error":"#DIV/0!"}},null,"RD 4",0,0,null,"ø pro Pfeil",{"$f":"SUM(S3)/Q34","v":{"$error":"#DIV/0!"}}]
["RD 5",0,0,null,"Average",null,null,"RD 5",0,0,null,"Average",null,null,"RD 5",0,0,null,"Average"]
["RD 6",0,0,null,{"$f":"SUM(F6)","v":{"$error":"#DIV/0!"}},null,null,"RD 6",0,0,null,{"$f":"SUM(M6)","v":{"$error":"#DIV/0!"}},null,null,"RD 6",0,0,null,{"$f":"SUM(T6)","v":{"$error":"#DIV/0!"}}]
["RD 7",0,0,null,null,null,null,"RD 7",0,0,null,null,null,null,"RD 7",0,0]
["RD 8",0,0,null,{"$f":"IF(F6<40,\"Nicht Gut\",\"\")","v":{"$error":"#DIV/0!"}},null,null,"RD 8",0,0,null,{"$f":"IF(M6<40,\"Nicht Gut\",\"\")","v":{"$error":"#DIV/0!"}},null,null,"RD 8",0,0,null,{"$f":"IF(T6<40,\"Nicht Gut\",\"\")","v":{"$error":"#DIV/0!"}}]
["RD 9",0,0,null,null,null,null,"RD 9",0,0,null,null,null,null,"RD 9",0,0]
["RD 10",0,0,null,null,null,null,"RD 10",0,0,null,null,null,null,"RD 10",0,0]
["RD 11",0,0,null,{"$f":"IF(F6>40,\"Gut\",\"\")","v":{"$error":"#DIV/0!"}},null,null,"RD 11",0,0,null,{"$f":"IF(M6>40,\"Gut\",\"\")","v":{"$error":"#DIV/0!"}},null,null,"RD 11",0,0,null,{"$f":"IF(T6>40,\"Gut\",\"\")","v":{"$error":"#DIV/0!"}}]
["RD 12",0,0,null,null,null,null,"RD 12",0,0,null,null,null,null,"RD 12",0,0]
["RD 13",0,0,null,null,null,null,"RD 13",0,0,null,null,null,null,"RD 13",0,0]
["RD 14",0,0,null,null,null,null,"RD 14",0,0,null,null,null,null,"RD 14",0,0]
["RD 15",0,0,null,{"$f":"D1","v":"Stefan"},{"$f":"E4","v":501},null,"RD 15",0,0,null,{"$f":"K1","v":"Stefan"},{"$f":"L4","v":501},null,"RD 15",0,0,null,{"$f":"R1","v":"Stefan"},{"$f":"S4","v":501}]
["RD 16",0,0,null,null,null,null,"RD 16",0,0,null,null,null,null,"RD 16",0,0]
["RD 17",0,0,null,{"$f":"IF(F6>50,\"Sehr Gut\",\"\")","v":{"$error":"#DIV/0!"}},null,null,"RD 17",0,0,null,{"$f":"IF(M6>50,\"Sehr Gut\",\"\")","v":{"$error":"#DIV/0!"}},null,null,"RD 17",0,0,null,{"$f":"IF(T6>50,\"Sehr Gut\",\"\")","v":{"$error":"#DIV/0!"}}]
["RD 18",0,0,null,null,null,null,"RD 18",0,0,null,null,null,null,"RD 18",0,0]
["RD 19",0,0,null,null,null,null,"RD 19",0,0,null,null,null,null,"RD 19",0,0]
["RD 20",0,0,null,null,null,null,"RD 20",0,0,null,null,null,null,"RD 20",0,0]
["RD 21",0,0,null,null,null,null,"RD 21",0,0,null,null,null,null,"RD 21",0,0]
["RD 22",0,0,null,null,null,null,"RD 22",0,0,null,null,null,null,"RD 22",0,0]
["RD 23",0,0,null,null,null,null,"RD 23",0,0,null,null,null,null,"RD 23",0,0]
["RD 24",0,0,null,null,null,null,"RD 24",0,0,null,null,null,null,"RD 24",0,0]
["RD 25",0,0,null,null,null,null,"RD 25",0,0,null,null,null,null,"RD 25",0,0]
["RD 26",0,0,null,null,null,null,"RD 26",0,0,null,null,null,null,"RD 26",0,0]
["RD 27",0,0,null,null,null,null,"RD 27",0,0,null,null,null,null,"RD 27",0,0]
["RD 28",0,0,null,null,null,null,"RD 28",0,0,null,null,null,null,"RD 28",0,0]
["RD 29",0,0,null,{"$f":"IF(E4=0,\"Sieg\",\"\")","v":""},null,null,"RD 29",0,0,null,{"$f":"IF(L4=0,\"Sieg\",\"\")","v":""},null,null,"RD 29",0,0,null,{"$f":"IF(S4=0,\"Sieg\",\"\")","v":""}]
["RD 30",0,0,null,null,null,null,"RD 30",0,0,null,null,null,null,"RD 30",0,0]
[null,{"$f":"SUM(B4:B33)","v":0},{"$f":"SUM(C4:C33)","v":0},{"$f":"SUM(D4:D33)","v":0},{"$f":"SUM(D4:D32)","v":0},null,null,null,{"$f":"SUM(I4:I33)","v":0},{"$f":"SUM(J4:J33)","v":0},{"$f":"SUM(K4:K33)","v":0},{"$f":"SUM(K4:K32)","v":0},null,null,null,{"$f":"SUM(P4:P33)","v":0},{"$f":"SUM(Q4:Q33)","v":0},{"$f":"SUM(R4:R33)","v":0},{"$f":"SUM(R4:R32)","v":0}]
[]
[]
[]
[]
[]
[]
[]
[]
[]
[]
[null,null,null,{"$f":"D1","v":"Stefan"},null,{"$f":"SUM(D34)","v":0},null,null,null,null,{"$f":"INDEX(D45:E47,MATCH(MAX(F45:F47),F45:F47,0),1)","v":"Stefan"}]
[null,null,null,{"$f":"K1","v":"Stefan"},null,{"$f":"SUM(K34)","v":0},null,null,null,null,{"$f":"INDEX(D45:E47,MATCH(MEDIAN(F45:F47),F45:F47,0),1)","v":"Stefan"}]
[null,null,null,{"$f":"R1","v":"Stefan"},null,{"$f":"SUM(S3)","v":0},null,null,null,null,{"$f":"INDEX(D45:E47,MATCH(MIN(F45:F47),F45:F47,0),1)","v":"Stefan"}]
[null,null,null,"MAX(B2:B7",null,{"$f":"MAX(F45:F47)","v":0}]

{"sheet":"Rd11","index":10,"n_rows":48,"n_cols":21,"rows_kept":48,"cut":false,"hidden":false,"merged":[[0,3,0,4],[0,10,0,11],[0,17,0,18],[7,4,7,5],[7,11,7,12],[7,18,7,19],[1,14,1,15],[8,4,9,5],[8,11,9,12],[8,18,9,19],[10,4,12,5],[10,11,12,12],[10,18,12,19],[44,3,44,4],[45,3,45,4],[46,3,46,4],[26,4,30,5],[26,11,30,12],[26,18,30,19],[31,4,32,5],[31,11,32,12],[31,18,32,19],[13,4,16,5],[13,11,16,12],[13,18,16,19],[19,4,25,5],[19,11,25,12],[19,18,25,19]]}
[null,null,null,{"$f":"'Rd10'!U3","v":"Stefan"},null,"Sp. 1",null,null,null,null,{"$f":"'Rd10'!U2","v":"Stefan"},null,"Sp. 2",null,null,null,null,{"$f":"'Rd10'!U1","v":"Stefan"},null,"Sp. 3",{"$f":"K45","v":"Stefan"}]
[null,null,null,"Punkte",501,"Start",null,null,null,null,"Punkte",501,"Start",null,null,null,null,"Punkte",501,"Start",{"$f":"K46","v":"Stefan"}]
[null,null,null,"Geworfen",{"$f":"SUM(D34)","v":0},"Punkte",null,null,null,null,"Geworfen",{"$f":"SUM(K34)","v":0},"Punkte",null,null,null,null,"Geworfen",{"$f":"SUM(R34)","v":0},"Punkte","Stefan"]
["RD 1",{"$f":"COUNT(D4)*1","v":0},{"$f":"COUNT(D4)*3","v":0},null,{"$f":"SUM(E2-E3)","v":501},"Rest",null,"RD 1",{"$f":"COUNT(K4)*1","v":0},{"$f":"COUNT(K4)*3","v":0},null,{"$f":"SUM(L2-L3)","v":501},"Rest",null,"RD 1",{"$f":"COUNT(R4)*1","v":0},{"$f":"COUNT(R4)*3","v":0},null,{"$f":"SUM(S2-S3)","v":501},"Rest"]
["RD 2",0,0,null,null,null,null,"RD 2",0,0,null,null,null,null,"RD 2",0,0]
["RD 3",0,0,null,"ø pro Spiel",{"$f":"SUM(E3)/B34","v":{"$error":"#DIV/0!"}},null,"RD 3",0,0,null,"ø pro Spiel",{"$f":"SUM(L3)/I34","v":{"$error":"#DIV/0!"}},null,"RD 3",0,0,null,"ø pro Spiel",{"$f":"SUM(S3)/P34","v":{"$error":"#DIV/0!"}}]
["RD 4",0,0,null,"ø pro Pfeil",{"$f":"SUM(E3)/C34","v":{"$error":"#DIV/0!"}},null,"RD 4",0,0,null,"ø pro Pfeil",{"$f":"SUM(L3)/J34","v":{"$error":"#DIV/0!"}},null,"RD 4",0,0,null,"ø pro Pfeil",{"$f":"SUM(S3)/Q34","v":{"$error":"#DIV/0!"}}]
["RD 5",0,0,null,"Average",null,null,"RD 5",0,0,null,"Average",null,null,"RD 5",0,0,null,"Average"]
["RD 6",0,0,null,{"$f":"SUM(F6)","v":{"$error":"#DIV/0!"}},null,null,"RD 6",0,0,null,{"$f":"SUM(M6)","v":{"$error":"#DIV/0!"}},null,null,"RD 6",0,0,null,{"$f":"SUM(T6)","v":{"$error":"#DIV/0!"}}]
["RD 7",0,0,null,null,null,null,"RD 7",0,0,null,null,null,null,"RD 7",0,0]
["RD 8",0,0,null,{"$f":"IF(F6<40,\"Nicht Gut\",\"\")","v":{"$error":"#DIV/0!"}},null,null,"RD 8",0,0,null,{"$f":"IF(M6<40,\"Nicht Gut\",\"\")","v":{"$error":"#DIV/0!"}},null,null,"RD 8",0,0,null,{"$f":"IF(T6<40,\"Nicht Gut\",\"\")","v":{"$error":"#DIV/0!"}}]
["RD 9",0,0,null,null,null,null,"RD 9",0,0,null,null,null,null,"RD 9",0,0]
["RD 10",0,0,null,null,null,null,"RD 10",0,0,null,null,null,null,"RD 10",0,0]
["RD 11",0,0,null,{"$f":"IF(F6>40,\"Gut\",\"\")","v":{"$error":"#DIV/0!"}},null,null,"RD 11",0,0,null,{"$f":"IF(M6>40,\"Gut\",\"\")","v":{"$error":"#DIV/0!"}},null,null,"RD 11",0,0,null,{"$f":"IF(T6>40,\"Gut\",\"\")","v":{"$error":"#DIV/0!"}}]
["RD 12",0,0,null,null,null,null,"RD 12",0,0,null,null,null,null,"RD 12",0,0]
["RD 13",0,0,null,null,null,null,"RD 13",0,0,null,null,null,null,"RD 13",0,0]
["RD 14",0,0,null,null,null,null,"RD 14",0,0,null,null,null,null,"RD 14",0,0]
["RD 15",0,0,null,{"$f":"D1","v":"Stefan"},{"$f":"E4","v":501},null,"RD 15",0,0,null,{"$f":"K1","v":"Stefan"},{"$f":"L4","v":501},null,"RD 15",0,0,null,{"$f":"R1","v":"Stefan"},{"$f":"S4","v":501}]
["RD 16",0,0,null,null,null,null,"RD 16",0,0,null,null,null,null,"RD 16",0,0]
["RD 17",0,0,null,{"$f":"IF(F6>50,\"Sehr Gut\",\"\")","v":{"$error":"#DIV/0!"}},null,null,"RD 17",0,0,null,{"$f":"IF(M6>50,\"Sehr Gut\",\"\")","v":{"$error":"#DIV/0!"}},null,null,"RD 17",0,0,null,{"$f":"IF(T6>50,\"Sehr Gut\",\"\")","v":{"$error":"#DIV/0!"}}]
["RD 18",0,0,null,null,null,null,"RD 18",0,0,null,null,null,null,"RD 18",0,0]
["RD 19",0,0,null,null,null,null,"RD 19",0,0,null,null,null,null,"RD 19",0,0]
["RD 20",0,0,null,null,null,null,"RD 20",0,0,null,null,null,null,"RD 20",0,0]
["RD 21",0,0,null,null,null,null,"RD 21",0,0,null,null,null,null,"RD 21",0,0]
["RD 22",0,0,null,null,null,null,"RD 22",0,0,null,null,null,null,"RD 22",0,0]
["RD 23",0,0,null,null,null,null,"RD 23",0,0,null,null,null,null,"RD 23",0,0]
["RD 24",0,0,null,null,null,null,"RD 24",0,0,null,null,null,null,"RD 24",0,0]
["RD 25",0,0,null,null,null,null,"RD 25",0,0,null,null,null,null,"RD 25",0,0]
["RD 26",0,0,null,null,null,null,"RD 26",0,0,null,null,null,null,"RD 26",0,0]
["RD 27",0,0,null,null,null,null,"RD 27",0,0,null,null,null,null,"RD 27",0,0]
["RD 28",0,0,null,null,null,null,"RD 28",0,0,null,null,null,null,"RD 28",0,0]
["RD 29",0,0,null,{"$f":"IF(E4=0,\"Sieg\",\"\")","v":""},null,null,"RD 29",0,0,null,{"$f":"IF(L4=0,\"Sieg\",\"\")","v":""},null,null,"RD 29",0,0,null,{"$f":"IF(S4=0,\"Sieg\",\"\")","v":""}]
["RD 30",0,0,null,null,null,null,"RD 30",0,0,null,null,null,null,"RD 30",0,0]
[null,{"$f":"SUM(B4:B33)","v":0},{"$f":"SUM(C4:C33)","v":0},{"$f":"SUM(D4:D33)","v":0},{"$f":"SUM(D4:D32)","v":0},null,null,null,{"$f":"SUM(I4:I33)","v":0},{"$f":"SUM(J4:J33)","v":0},{"$f":"SUM(K4:K33)","v":0},{"$f":"SUM(K4:K32)","v":0},null,null,null,{"$f":"SUM(P4:P33)","v":0},{"$f":"SUM(Q4:Q33)","v":0},{"$f":"SUM(R4:R33)","v":0},{"$f":"SUM(R4:R32)","v":0}]
[]
[]
[]
[]
[]
[]
[]
[]
[]
[]
[null,null,null,{"$f":"D1","v":"Stefan"},null,{"$f":"SUM(D34)","v":0},null,null,null,null,{"$f":"INDEX(D45:E47,MATCH(MAX(F45:F47),F45:F47,0),1)","v":"Stefan"}]
[null,null,null,{"$f":"K1","v":"Stefan"},null,{"$f":"SUM(K34)","v":0},null,null,null,null,{"$f":"INDEX(D45:E47,MATCH(MEDIAN(F45:F47),F45:F47,0),1)","v":"Stefan"}]
[null,null,null,{"$f":"R1","v":"Stefan"},null,{"$f":"SUM(S3)","v":0},null,null,null,null,{"$f":"INDEX(D45:E47,MATCH(MIN(F45:F47),F45:F47,0),1)","v":"Stefan"}]
[null,null,null,"MAX(B2:B7",null,{"$f":"MAX(F45:F47)","v":0}]

{"sheet":"Rd12","index":11,"n_rows":48,"n_cols":21,"rows_kept":48,"cut":false,"hidden":false,"merged":[[0,3,0,4],[0,10,0,11],[0,17,0,18],[7,4,7,5],[7,11,7,12],[7,18,7,19],[1,14,1,15],[8,4,9,5],[8,11,9,12],[8,18,9,19],[10,4,12,5],[10,11,12,12],[10,18,12,19],[44,3,44,4],[45,3,45,4],[46,3,46,4],[26,4,30,5],[26,11,30,12],[26,18,30,19],[31,4,32,5],[31,11,32,12],[31,18,32,19],[13,4,16,5],[13,11,16,12],[13,18,16,19],[19,4,25,5],[19,11,25,12],[19,18,25,19]]}
[null,null,null,{"$f":"'Rd11'!U3","v":"Stefan"},null,"Sp. 1",null,null,null,null,{"$f":"'Rd11'!U2","v":"Stefan"},null,"Sp. 2",null,null,null,null,{"$f":"'Rd11'!U1","v":"Stefan"},null,"Sp. 3",{"$f":"K45","v":"Stefan"}]
[null,null,null,"Punkte",501,"Start",null,null,null,null,"Punkte",501,"Start",null,null,null,null,"Punkte",501,"Start",{"$f":"K46","v":"Stefan"}]
[null,null,null,"Geworfen",{"$f":"SUM(D34)","v":0},"Punkte",null,null,null,null,"Geworfen",{"$f":"SUM(K34)","v":0},"Punkte",null,null,null,null,"Geworfen",{"$f":"SUM(R34)","v":0},"Punkte","Stefan"]
["RD 1",{"$f":"COUNT(D4)*1","v":0},{"$f":"COUNT(D4)*3","v":0},null,{"$f":"SUM(E2-E3)","v":501},"Rest",null,"RD 1",{"$f":"COUNT(K4)*1","v":0},{"$f":"COUNT(K4)*3","v":0},null,{"$f":"SUM(L2-L3)","v":501},"Rest",null,"RD 1",{"$f":"COUNT(R4)*1","v":0},{"$f":"COUNT(R4)*3","v":0},null,{"$f":"SUM(S2-S3)","v":501},"Rest"]
["RD 2",0,0,null,null,null,null,"RD 2",0,0,null,null,null,null,"RD 2",0,0]
["RD 3",0,0,null,"ø pro Spiel",{"$f":"SUM(E3)/B34","v":{"$error":"#DIV/0!"}},null,"RD 3",0,0,null,"ø pro Spiel",{"$f":"SUM(L3)/I34","v":{"$error":"#DIV/0!"}},null,"RD 3",0,0,null,"ø pro Spiel",{"$f":"SUM(S3)/P34","v":{"$error":"#DIV/0!"}}]
["RD 4",0,0,null,"ø pro Pfeil",{"$f":"SUM(E3)/C34","v":{"$error":"#DIV/0!"}},null,"RD 4",0,0,null,"ø pro Pfeil",{"$f":"SUM(L3)/J34","v":{"$error":"#DIV/0!"}},null,"RD 4",0,0,null,"ø pro Pfeil",{"$f":"SUM(S3)/Q34","v":{"$error":"#DIV/0!"}}]
["RD 5",0,0,null,"Average",null,null,"RD 5",0,0,null,"Average",null,null,"RD 5",0,0,null,"Average"]
["RD 6",0,0,null,{"$f":"SUM(F6)","v":{"$error":"#DIV/0!"}},null,null,"RD 6",0,0,null,{"$f":"SUM(M6)","v":{"$error":"#DIV/0!"}},null,null,"RD 6",0,0,null,{"$f":"SUM(T6)","v":{"$error":"#DIV/0!"}}]
["RD 7",0,0,null,null,null,null,"RD 7",0,0,null,null,null,null,"RD 7",0,0]
["RD 8",0,0,null,{"$f":"IF(F6<40,\"Nicht Gut\",\"\")","v":{"$error":"#DIV/0!"}},null,null,"RD 8",0,0,null,{"$f":"IF(M6<40,\"Nicht Gut\",\"\")","v":{"$error":"#DIV/0!"}},null,null,"RD 8",0,0,null,{"$f":"IF(T6<40,\"Nicht Gut\",\"\")","v":{"$error":"#DIV/0!"}}]
["RD 9",0,0,null,null,null,null,"RD 9",0,0,null,null,null,null,"RD 9",0,0]
["RD 10",0,0,null,null,null,null,"RD 10",0,0,null,null,null,null,"RD 10",0,0]
["RD 11",0,0,null,{"$f":"IF(F6>40,\"Gut\",\"\")","v":{"$error":"#DIV/0!"}},null,null,"RD 11",0,0,null,{"$f":"IF(M6>40,\"Gut\",\"\")","v":{"$error":"#DIV/0!"}},null,null,"RD 11",0,0,null,{"$f":"IF(T6>40,\"Gut\",\"\")","v":{"$error":"#DIV/0!"}}]
["RD 12",0,0,null,null,null,null,"RD 12",0,0,null,null,null,null,"RD 12",0,0]
["RD 13",0,0,null,null,null,null,"RD 13",0,0,null,null,null,null,"RD 13",0,0]
["RD 14",0,0,null,null,null,null,"RD 14",0,0,null,null,null,null,"RD 14",0,0]
["RD 15",0,0,null,{"$f":"D1","v":"Stefan"},{"$f":"E4","v":501},null,"RD 15",0,0,null,{"$f":"K1","v":"Stefan"},{"$f":"L4","v":501},null,"RD 15",0,0,null,{"$f":"R1","v":"Stefan"},{"$f":"S4","v":501}]
["RD 16",0,0,null,null,null,null,"RD 16",0,0,null,null,null,null,"RD 16",0,0]
["RD 17",0,0,null,{"$f":"IF(F6>50,\"Sehr Gut\",\"\")","v":{"$error":"#DIV/0!"}},null,null,"RD 17",0,0,null,{"$f":"IF(M6>50,\"Sehr Gut\",\"\")","v":{"$error":"#DIV/0!"}},null,null,"RD 17",0,0,null,{"$f":"IF(T6>50,\"Sehr Gut\",\"\")","v":{"$error":"#DIV/0!"}}]
["RD 18",0,0,null,null,null,null,"RD 18",0,0,null,null,null,null,"RD 18",0,0]
["RD 19",0,0,null,null,null,null,"RD 19",0,0,null,null,null,null,"RD 19",0,0]
["RD 20",0,0,null,null,null,null,"RD 20",0,0,null,null,null,null,"RD 20",0,0]
["RD 21",0,0,null,null,null,null,"RD 21",0,0,null,null,null,null,"RD 21",0,0]
["RD 22",0,0,null,null,null,null,"RD 22",0,0,null,null,null,null,"RD 22",0,0]
["RD 23",0,0,null,null,null,null,"RD 23",0,0,null,null,null,null,"RD 23",0,0]
["RD 24",0,0,null,null,null,null,"RD 24",0,0,null,null,null,null,"RD 24",0,0]
["RD 25",0,0,null,null,null,null,"RD 25",0,0,null,null,null,null,"RD 25",0,0]
["RD 26",0,0,null,null,null,null,"RD 26",0,0,null,null,null,null,"RD 26",0,0]
["RD 27",0,0,null,null,null,null,"RD 27",0,0,null,null,null,null,"RD 27",0,0]
["RD 28",0,0,null,null,null,null,"RD 28",0,0,null,null,null,null,"RD 28",0,0]
["RD 29",0,0,null,{"$f":"IF(E4=0,\"Sieg\",\"\")","v":""},null,null,"RD 29",0,0,null,{"$f":"IF(L4=0,\"Sieg\",\"\")","v":""},null,null,"RD 29",0,0,null,{"$f":"IF(S4=0,\"Sieg\",\"\")","v":""}]
["RD 30",0,0,null,null,null,null,"RD 30",0,0,null,null,null,null,"RD 30",0,0]
[null,{"$f":"SUM(B4:B33)","v":0},{"$f":"SUM(C4:C33)","v":0},{"$f":"SUM(D4:D33)","v":0},{"$f":"SUM(D4:D32)","v":0},null,null,null,{"$f":"SUM(I4:I33)","v":0},{"$f":"SUM(J4:J33)","v":0},{"$f":"SUM(K4:K33)","v":0},{"$f":"SUM(K4:K32)","v":0},null,null,null,{"$f":"SUM(P4:P33)","v":0},{"$f":"SUM(Q4:Q33)","v":0},{"$f":"SUM(R4:R33)","v":0},{"$f":"SUM(R4:R32)","v":0}]
[]
[]
[]
[]
[]
[]
[]
[]
[]
[]
[null,null,null,{"$f":"D1","v":"Stefan"},null,{"$f":"SUM(D34)","v":0},null,null,null,null,{"$f":"INDEX(D45:E47,MATCH(MAX(F45:F47),F45:F47,0),1)","v":"Stefan"}]
[null,null,null,{"$f":"K1","v":"Stefan"},null,{"$f":"SUM(K34)","v":0},null,null,null,null,{"$f":"INDEX(D45:E47,MATCH(MEDIAN(F45:F47),F45:F47,0),1)","v":"Stefan"}]
[null,null,null,{"$f":"R1","v":"Stefan"},null,{"$f":"SUM(S3)","v":0},null,null,null,null,{"$f":"INDEX(D45:E47,MATCH(MIN(F45:F47),F45:F47,0),1)","v":"Stefan"}]
[null,null,null,"MAX(B2:B7",null,{"$f":"MAX(F45:F47)","v":0}]

{"sheet":"Siegerliste","index":12,"n_rows":14,"n_cols":2,"rows_kept":14,"cut":false,"hidden":false,"merged":[]}
[null,"Sieger"]
[]
["Rd.1",{"$f":"'Rd1'!K45","v":"Thorsten"}]
["Rd.2",{"$f":"'Rd2'!K45","v":"Stefan"}]
["Rd.3",{"$f":"'Rd3'!K45","v":"Stefan"}]
["Rd.4",{"$f":"'Rd4'!K45","v":"Stefan"}]
["Rd.5",{"$f":"'Rd5'!K45","v":"Stefan"}]
["Rd.6",{"$f":"'Rd6'!K45","v":"Stefan"}]
["Rd.7",{"$f":"'Rd7'!K45","v":"Stefan"}]
["Rd.8",{"$f":"'Rd8'!K45","v":"Stefan"}]
["Rd.9",{"$f":"'Rd9'!K45","v":"Stefan"}]
["Rd.10",{"$f":"'Rd10'!K45","v":"Stefan"}]
["Rd.11",{"$f":"'Rd11'!K45","v":"Stefan"}]
["Rd.12",{"$f":"'Rd12'!K45","v":"Stefan"}]

{"sheet":"Tabelle1","index":13,"n_rows":48,"n_cols":5,"rows_kept":48,"cut":false,"hidden":false,"merged":[]}
[null,"Ralf Kl."]
["Anja","Volker"]
["Erich","Rene"]
["Siggi","Nicole"]
["Ralf M.","Frank"]
["Ralf Kl.","Rosi",null,null,"Ralf Kl."]
["Volker","Stefan",null,null,"Volker"]
["Rene","Micha",null,null,"Rene"]
["Nicole","Werner",null,null,"Nicole"]
["Frank","Gast",null,null,"Frank"]
["Gast","Vincent",null,null,"Rosi"]
["Anja/Erich","Anja",null,null,"Werner"]
["Anja/Siggi","Erich",null,null,"Gast"]
["Anja/Ralf M.","Siggi"]
["Anja/Ralf Kl.","Ralf M."]
["Anja/Volker","Dirk B."]
["Anja/Rene"]
["Anja/Gast"]
["Erich/Siggi"]
["Erich/Ralf M."]
["Erich/Ralf Kl."]
["Erich/Volker"]
["Erich/Rene"]
["Erich/Gast"]
["Siggi/Ralf M."]
["Siggi/Ralf Kl."]
["Siggi/Volker"]
["Siggi/Rene"]
["Siggi/Gast"]
["Ralf M./Ralf Kl."]
["Ralf M./Volker"]
["Ralf M./Rene"]
["Ralf M./Gast"]
["Ralf Kl./Volker"]
["Ralf Kl./Rene"]
["Ralf Kl./Gast"]
["Volker/Rene"]
["Rene/Gast"]
["Joker"]
["Anja/Nicole"]
["Anja/Frank"]
["Erich/Nicole"]
["Erich/Frank"]
["Siggi/Nicole"]
["Siggi/Frank"]
["Ralf M./Nicole"]
["Ralf M./Frank"]
["Nicole/Frank"]