{"text_format":"1","workbook":"xlsx","n_sheets":2,"sheets":["aktuelle Zahlen","Auswertung"],"not_rendered":{"charts":0,"images":1,"macros":1,"external_links":0,"defined_names":0,"comments":0,"pivot_tables":0},"unopened":[],"bounds":{"document_bytes":16777216,"sheet_cells":100000,"rows_first":2000,"rows_last":500,"rows_between":2000,"halvings":0,"cell_chars":16384,"cell_head_chars":4096},"cells_cut":0,"cells_raw":0,"read":"whole","date_system":"1900"}

{"sheet":"aktuelle Zahlen","index":0,"n_rows":154,"n_cols":10,"rows_kept":154,"cut":false,"hidden":false,"merged":[]}
["Mi","2025-05-14"]
[1,3]
[2,5]
[3,15]
[4,36]
[5,44]
[6,46]
[7,7]
[]
["Auswertung der Gewinnzahlen aus dem WEB"]
["Spieltag","Datum","Z1","Z2","Z3","Z4","Z5","Z6 ",null,"Zusatzzahl"]
["Mi","2024-01-03",36,14,32,49,28,25," ",4]
["Sa","2024-01-06",18,14,34,47,5,3," ",7]
["Mi","2024-01-10",37,3,7,24,21,49," ",9]
["Sa","2024-01-13",6,48,27,1,8,26," ",6]
["Mi","2024-01-17",13,44,6,40,30,9," ",6]
["Sa","2024-01-20",8,49,45,1,25,11," ",4]
["Mi","2024-01-24",35,29,9,10,39,19," ",1]
["Sa","2024-01-27",24,20,29,33,43,14," ",4]
["Mi","2024-01-31",29,24,40,11,43,28," ",7]
["Sa","2024-02-03",24,14,23,19,21,3," ",5]
["Mi","2024-02-07",1,8,31,15,19,26," ",0]
["Sa","2024-02-10",37,47,1,33,19,39," ",6]
["Mi","2024-02-14",34,48,17,35,46,43," ",4]
["Sa","2024-02-17",23,31,36,8,34,40," ",0]
["Mi","2024-02-21",33,7,8,23,30,40," ",3]
["Sa","2024-02-24",2,21,49,40,28,34," ",2]
["Mi","2024-02-28",4,28,22,1,37,26," ",3]
["Sa","2024-03-02",26,6,8,33,37,18," ",2]
["Mi","2024-03-06",17,23,40,8,42,11," ",3]
["Sa","2024-03-09",41,20,1,48,5,10," ",8]
["Mi","2024-03-13",10,11,29,39,31,18," ",5]
["Sa","2024-03-16",16,40,19,5,25,48," ",3]
["Mi","2024-03-20",40,9,7,45,24,16," ",8]
["Sa","2024-03-23",40,21,32,4,38,1," ",7]
["Mi","2024-03-27",41,32,44,20,2,13," ",2]
["Sa","2024-03-30",27,16,21,10,5,33," ",0]
["Mi","2024-04-03",35,29,31,36,2,3," ",9]
["Sa","2024-04-06",41,7,13,11,35,20," ",0]
["Mi","2024-04-10",7,49,13,8,43,47," ",2]
["Sa","2024-04-13",33,47,3,32,10,6," ",0]
["Mi","2024-04-17",37,34,16,47,40,9," ",2]
["Sa","2024-04-20",44,7,49,28,35,17," ",3]
["Mi","2024-04-24",15,19,25,29,13,12," ",7]
["Sa","2024-04-27",27,8,46,48,43,45," ",0]
["Mi","2024-05-01",41,36,31,37,26,6," ",1]
["Sa","2024-05-04",47,29,10,38,9,27," ",1]
["Mi","2024-05-08",31,3,40,23,30,27," ",8]
["Sa","2024-05-11",25,36,30,29,22,5," ",0]
["Mi","2024-05-15",31,28,44,46,10,9," ",9]
["Sa","2024-05-18",49,36,1,28,43,2," ",0]
["Mi","2024-05-22",8,15,10,9,47,38," ",4]
["Sa","2024-05-25",41,15,8,38,32,24," ",5]
["Mi","2024-05-29",3,44,5,11,12,28," ",6]
["Sa","2024-06-01",10,8,27,35,9,41," ",0]
["Mi","2024-06-05",16,26,10,33,19,11," ",5]
["Sa","2024-06-08",10,31,15,40,5,22," ",9]
["Mi","2024-06-12",11,10,46,5,9,22," ",2]
["Sa","2024-06-15",31,38,16,49,30,3," ",8]
["Mi","2024-06-19",4,1,30,43,32,12," ",4]
{"$rows_left_out":95}
{"sheet":"Auswertung","index":1,"n_rows":711,"n_cols":121,"rows_kept":711,"cut":false,"hidden":false,"merged":[[9,37,9,42],[8,37,8,42],[8,44,8,49],[8,51,8,56],[9,2,9,7],[9,44,9,49],[8,101,8,106],[8,108,8,113],[8,115,8,120],[8,58,8,64],[8,2,8,7],[8,10,8,32],[8,66,8,71],[8,73,8,78],[8,80,8,85],[8,87,8,92],[8,94,8,99],[9,115,9,120],[9,108,9,113],[9,101,9,106],[9,94,9,99],[9,87,9,92],[9,80,9,85],[9,73,9,78],[9,66,9,71],[9,58,9,64],[9,51,9,56],[7,51,7,64],[7,37,7,49],[7,80,7,92],[7,94,7,106],[7,108,7,120],[7,66,7,78]]}
[]
[null,{"$f":"'aktuelle Zahlen'!B1","v":"2025-05-14"},"aktuelle Lottozahlen"]
[]
[null,null,"kopieren auf aktuelle Seite",null,null,null,null,null,null,null,{"$f":"SUM(K6:K8)","v":2},{"$f":"SUM(L6:L8)","v":2},5,5,1,1,1,1,1,1,3,3,2,2,4,4,3,3,3,3,2,2,5]
[]
[null,null,"kopieren in Tabelle",null,null,null,null,null,null,4,{"$f":"COUNTIF(K$12:K$46,$J$6)","v":0},0,0,0,0,0,0,0,0,0,0,0,0,0,0,0,0,0,0,0,0,0,0]
[null,null,null,null,null,null,null,null,null,3,{"$f":"COUNTIF(K$12:K$46,$J$7)","v":1},1,0,0,0,0,0,0,0,0,1,1,0,0,0,0,1,1,1,1,0,0,1]
[null,null,null,null,null,null,null,null,null,2,{"$f":"COUNTIF(K$12:K$46,$J$8)","v":1},1,5,5,1,1,1,1,1,1,2,2,2,2,4,4,2,2,2,2,2,2,4,null,null,null,null,null,null,null,null,null,null,null,null,null,null,null,null,null,null,null,null,null,null,null,null,null,null,null,null,null,null,null,null,null,null,null,null,null,null,null,null,null,null,null,null,null,null,null,"Holger"]
[null,null,"Gewinnzahlen",null,null,null,null,null,null,null,"Gewinn / Tipp",null,null,null,null,null,null,null,null,null,null,null,null,null,null,null,null,null,null,null,null,null,null,null,null,"Superzahl",null,"Tipp",null,null,null,null,null,null,"Tipp",null,null,null,null,null,null,"Tipp",null,null,null,null,null,null,"Tipp",null,null,null,null,null,null,null,"Tipp",null,null,null,null,null,null,"Tipp",null,null,null,null,null,null,"Tipp",null,null,null,null,null,null,"Tipp",null,null,null,null,null,null,"Tipp",null,null,null,null,null,null,"Tipp",null,null,null,null,null,null,"Tipp",null,null,null,null,null,null,"Tipp"]
[null,"Datum",null,null,null,null,null,null,null,null,1,null,2,null,3,null,4,null,5,null,6,null,7,null,8,null,9,null,10,null,11,null,12,null,null,null,null,1,null,null,null,null,null,null,2,null,null,null,null,null,null,3,null,null,null,null,null,null,4,null,null,null,null,null,null,null,5,null,null,null,null,null,null,6,null,null,null,null,null,null,7,null,null,null,null,null,null,8,null,null,null,null,null,null,9,null,null,null,null,null,null,10,null,null,null,null,null,null,11,null,null,null,null,null,null,12]
[null,{"$f":"B2","v":"2025-05-14"},{"$f":"VLOOKUP($B11,'aktuelle Zahlen'!$B$12:$J$10000,COLUMN()-1,FALSE)","v":5},{"$f":"VLOOKUP($B11,'aktuelle Zahlen'!$B$12:$J$10000,COLUMN()-1,FALSE)","v":36},{"$f":"VLOOKUP($B11,'aktuelle Zahlen'!$B$12:$J$10000,COLUMN()-1,FALSE)","v":44},{"$f":"VLOOKUP($B11,'aktuelle Zahlen'!$B$12:$J$10000,COLUMN()-1,FALSE)","v":46},{"$f":"VLOOKUP($B11,'aktuelle Zahlen'!$B$12:$J$10000,COLUMN()-1,FALSE)","v":15},{"$f":"VLOOKUP($B11,'aktuelle Zahlen'!$B$12:$J$10000,COLUMN()-1,FALSE)","v":3},{"$f":"VLOOKUP($B11,'aktuelle Zahlen'!$B$12:$J$10000,COLUMN(),FALSE)","v":7},null,{"$f":"IF(L11>1,(IF($I$11=$AJ$11,L11 & \"Z\",L11)),\" \")","v":" "},{"$f":"SUM(COUNTIF($C$6:$H$11,AL11:AQ11))","v":1},{"$f":"IF(N11>1,(IF($I$11=$AJ$11,N11 & \"Z\",N11)),\" \")","v":" "},{"$f":"SUM(COUNTIF($C$6:$H$11,AS11:AX11))","v":0},{"$f":"IF(P11>1,(IF($I$11=$AU$11,P11 & \"Z\",P11)),\" \")","v":" "},{"$f":"SUM(COUNTIF($C$6:$H$11,AZ11:BE11))","v":0},{"$f":"IF(R11>1,(IF($I$11=$AU$11=1,R11 & \"Z\",R11)),\" \")","v":" "},{"$f":"SUM(COUNTIF($C$6:$H$11,BG11:BM11))","v":0},{"$f":"IF(T11>1,(IF($I$11=$AU$11=1,T11 & \"Z\",T11)),\" \")","v":" "},{"$f":"SUM(COUNTIF($C$6:$H$11,BO11:BT11))","v":0},{"$f":"IF(V11>1,(IF($I$11=$AU$11=1,V11 & \"Z\",V11)),\" \")","v":" "},{"$f":"SUM(COUNTIF($C$6:$H$11,BV11:CA11))","v":1},{"$f":"IF(X11>1,(IF($I$11=$AU$11=1,X11 & \"Z\",X11)),\" \")","v":" "},{"$f":"SUM(COUNTIF($C$6:$H$11,CC11:CH11))","v":1},{"$f":"IF(Z11>1,(IF($I$11=$AU$11=1,Z11 & \"Z\",Z11)),\" \")","v":" "},{"$f":"SUM(COUNTIF($C$6:$H$11,CJ11:CO11))","v":1},{"$f":"IF(AB11>1,(IF($I$11=$AU$11=1,AB11 & \"Z\",AB11)),\" \")","v":" "},{"$f":"SUM(COUNTIF($C$6:$H$11,CQ11:CV11))","v":0},{"$f":"IF(AD11>1,(IF($I$11=$AU$11=1,AD11 & \"Z\",AD11)),\" \")","v":" "},{"$f":"SUM(COUNTIF($C$6:$H$11,CX11:DC11))","v":0},{"$f":"IF(AF11>1,(IF($I$11=$AU$11=1,AF11 & \"Z\",AF11)),\" \")","v":" "},{"$f":"SUM(COUNTIF($C$6:$H$11,DE11:DJ11))","v":0},{"$f":"IF(AH11>1,(IF($I$11=$AU$11=1,AH11 & \"Z\",AH11)),\" \")","v":" "},{"$f":"SUM(COUNTIF($C$6:$H$11,DL11:DQ11))","v":1},null,2,null,5,10,18,23,29,38,null,1,11,14,16,26,41,null,2,17,26,28,38,49,null,4,8,12,19,29,38,42,null,8,12,19,29,38,42,null,4,19,23,26,46,48,null,4,38,39,41,43,46,null,2,3,6,10,47,48,null,8,9,17,18,31,47,null,2,11,29,33,35,43,null,2,11,17,32,37,49,null,11,16,30,32,33,44]
[]
[]
[]
["Spieltag","Datum","Z1","Z2","Z3","Z4","Z5","Z6 ","Z7"]
[{"$f":"'aktuelle Zahlen'!A154","v":"Mi"},{"$f":"'aktuelle Zahlen'!B154","v":"2025-05-14"},{"$f":"'aktuelle Zahlen'!C154","v":5},{"$f":"'aktuelle Zahlen'!D154","v":36},{"$f":"'aktuelle Zahlen'!E154","v":44},{"$f":"'aktuelle Zahlen'!F154","v":46},{"$f":"'aktuelle Zahlen'!G154","v":15},{"$f":"'aktuelle Zahlen'!H154","v":3},{"$f":"'aktuelle Zahlen'!J154","v":7},null," ",1," ",0," ",1," ",0," ",0,3,3," ",1," ",1," ",1," ",0,2,2," ",1]
[{"$f":"'aktuelle Zahlen'!A153","v":"Sa"},{"$f":"'aktuelle Zahlen'!B153","v":"2025-05-10"},{"$f":"'aktuelle Zahlen'!C153","v":46},{"$f":"'aktuelle Zahlen'!D153","v":34},{"$f":"'aktuelle Zahlen'!E153","v":23},{"$f":"'aktuelle Zahlen'!F153","v":17},{"$f":"'aktuelle Zahlen'!G153","v":32},{"$f":"'aktuelle Zahlen'!H153","v":48},{"$f":"'aktuelle Zahlen'!J153","v":2},null," ",0," ",0," ",1," ",0," ",0," ",1," ",0," ",1," ",0," ",0," ",1," ",1]
[{"$f":"'aktuelle Zahlen'!A152","v":"Mi"},{"$f":"'aktuelle Zahlen'!B152","v":"2025-05-07"},{"$f":"'aktuelle Zahlen'!C152","v":19},{"$f":"'aktuelle Zahlen'!D152","v":9},{"$f":"'aktuelle Zahlen'!E152","v":16},{"$f":"'aktuelle Zahlen'!F152","v":5},{"$f":"'aktuelle Zahlen'!G152","v":28},{"$f":"'aktuelle Zahlen'!H152","v":12},{"$f":"'aktuelle Zahlen'!J152","v":8},null," ",0,2,2," ",1," ",1," ",0,2,2,2,2," ",0," ",1," ",0," ",0," ",1]
[{"$f":"'aktuelle Zahlen'!A151","v":"Sa"},{"$f":"'aktuelle Zahlen'!B151","v":"2025-05-03"},{"$f":"'aktuelle Zahlen'!C151","v":37},{"$f":"'aktuelle Zahlen'!D151","v":48},{"$f":"'aktuelle Zahlen'!E151","v":25},{"$f":"'aktuelle Zahlen'!F151","v":20},{"$f":"'aktuelle Zahlen'!G151","v":28},{"$f":"'aktuelle Zahlen'!H151","v":44},{"$f":"'aktuelle Zahlen'!J151","v":9},null," ",0," ",1," ",0," ",1," ",1," ",0," ",1," ",1,2,2," ",0," ",1," ",0]
[{"$f":"'aktuelle Zahlen'!A150","v":"Mi"},{"$f":"'aktuelle Zahlen'!B150","v":"2025-04-30"},{"$f":"'aktuelle Zahlen'!C150","v":38},{"$f":"'aktuelle Zahlen'!D150","v":36},{"$f":"'aktuelle Zahlen'!E150","v":18},{"$f":"'aktuelle Zahlen'!F150","v":8},{"$f":"'aktuelle Zahlen'!G150","v":42},{"$f":"'aktuelle Zahlen'!H150","v":19},{"$f":"'aktuelle Zahlen'!J150","v":2},null,2,2," ",1," ",0," ",1," ",1," ",0," ",0," ",0," ",1," ",1," ",0," ",0]
[{"$f":"'aktuelle Zahlen'!A149","v":"Sa"},{"$f":"'aktuelle Zahlen'!B149","v":"2025-04-26"},{"$f":"'aktuelle Zahlen'!C149","v":44},{"$f":"'aktuelle Zahlen'!D149","v":26},{"$f":"'aktuelle Zahlen'!E149","v":9},{"$f":"'aktuelle Zahlen'!F149","v":13},{"$f":"'aktuelle Zahlen'!G149","v":4},{"$f":"'aktuelle Zahlen'!H149","v":41},{"$f":"'aktuelle Zahlen'!J149","v":1},null," ",1," ",1," ",0," ",1," ",1," ",0," ",1," ",1," ",0," ",1," ",0," ",0]
[{"$f":"'aktuelle Zahlen'!A148","v":"Mi"},{"$f":"'aktuelle Zahlen'!B148","v":"2025-04-23"},{"$f":"'aktuelle Zahlen'!C148","v":13},{"$f":"'aktuelle Zahlen'!D148","v":21},{"$f":"'aktuelle Zahlen'!E148","v":11},{"$f":"'aktuelle Zahlen'!F148","v":7},{"$f":"'aktuelle Zahlen'!G148","v":38},{"$f":"'aktuelle Zahlen'!H148","v":5},{"$f":"'aktuelle Zahlen'!J148","v":1},null," ",1," ",0," ",0," ",0," ",0," ",1,2,2," ",1,3,3," ",0," ",0," ",0]
[{"$f":"'aktuelle Zahlen'!A147","v":"Sa"},{"$f":"'aktuelle Zahlen'!B147","v":"2025-04-19"},{"$f":"'aktuelle Zahlen'!C147","v":31},{"$f":"'aktuelle Zahlen'!D147","v":37},{"$f":"'aktuelle Zahlen'!E147","v":20},{"$f":"'aktuelle Zahlen'!F147","v":12},{"$f":"'aktuelle Zahlen'!G147","v":47},{"$f":"'aktuelle Zahlen'!H147","v":41},{"$f":"'aktuelle Zahlen'!J147","v":7},null," ",0,2,2," ",1," ",0," ",0," ",0," ",1," ",0," ",0,2,2," ",1,2,2]
[{"$f":"'aktuelle Zahlen'!A146","v":"Mi"},{"$f":"'aktuelle Zahlen'!B146","v":"2025-04-16"},{"$f":"'aktuelle Zahlen'!C146","v":2},{"$f":"'aktuelle Zahlen'!D146","v":32},{"$f":"'aktuelle Zahlen'!E146","v":13},{"$f":"'aktuelle Zahlen'!F146","v":37},{"$f":"'aktuelle Zahlen'!G146","v":49},{"$f":"'aktuelle Zahlen'!H146","v":10},{"$f":"'aktuelle Zahlen'!J146","v":6},null," ",0," ",1," ",0," ",0," ",0," ",0," ",0,2,2," ",1,2,2," ",1,2,2]
[{"$f":"'aktuelle Zahlen'!A145","v":"Sa"},{"$f":"'aktuelle Zahlen'!B145","v":"2025-04-12"},{"$f":"'aktuelle Zahlen'!C145","v":29},{"$f":"'aktuelle Zahlen'!D145","v":20},{"$f":"'aktuelle Zahlen'!E145","v":15},{"$f":"'aktuelle Zahlen'!F145","v":36},{"$f":"'aktuelle Zahlen'!G145","v":14},{"$f":"'aktuelle Zahlen'!H145","v":18},{"$f":"'aktuelle Zahlen'!J145","v":5},null," ",0,2,2," ",1," ",0," ",0," ",1," ",1," ",0," ",0," ",0," ",0," ",1]
[{"$f":"'aktuelle Zahlen'!A144","v":"Mi"},{"$f":"'aktuelle Zahlen'!B144","v":"2025-04-09"},{"$f":"'aktuelle Zahlen'!C144","v":40},{"$f":"'aktuelle Zahlen'!D144","v":34},{"$f":"'aktuelle Zahlen'!E144","v":16},{"$f":"'aktuelle Zahlen'!F144","v":31},{"$f":"'aktuelle Zahlen'!G144","v":24},{"$f":"'aktuelle Zahlen'!H144","v":37},{"$f":"'aktuelle Zahlen'!J144","v":1},null," ",0,2,2," ",1," ",0," ",0," ",1," ",0," ",0," ",0," ",1," ",1,3,3]
[{"$f":"'aktuelle Zahlen'!A143","v":"Sa"},{"$f":"'aktuelle Zahlen'!B143","v":"2025-04-05"},{"$f":"'aktuelle Zahlen'!C143","v":12},{"$f":"'aktuelle Zahlen'!D143","v":41},{"$f":"'aktuelle Zahlen'!E143","v":10},{"$f":"'aktuelle Zahlen'!F143","v":40},{"$f":"'aktuelle Zahlen'!G143","v":35},{"$f":"'aktuelle Zahlen'!H143","v":21},{"$f":"'aktuelle Zahlen'!J143","v":9},null," ",0," ",1,2,2,2,2,2,2," ",1," ",0," ",1," ",1," ",0," ",0," ",0]
[{"$f":"'aktuelle Zahlen'!A142","v":"Mi"},{"$f":"'aktuelle Zahlen'!B142","v":"2025-04-02"},{"$f":"'aktuelle Zahlen'!C142","v":48},{"$f":"'aktuelle Zahlen'!D142","v":25},{"$f":"'aktuelle Zahlen'!E142","v":20},{"$f":"'aktuelle Zahlen'!F142","v":5},{"$f":"'aktuelle Zahlen'!G142","v":19},{"$f":"'aktuelle Zahlen'!H142","v":14},{"$f":"'aktuelle Zahlen'!J142","v":6},null,3,3," ",0," ",1," ",1," ",1,2,2," ",1,2,2," ",1,3,3," ",1," ",0]
[{"$f":"'aktuelle Zahlen'!A141","v":"Sa"},{"$f":"'aktuelle Zahlen'!B141","v":"2025-03-29"},{"$f":"'aktuelle Zahlen'!C141","v":31},{"$f":"'aktuelle Zahlen'!D141","v":18},{"$f":"'aktuelle Zahlen'!E141","v":46},{"$f":"'aktuelle Zahlen'!F141","v":47},{"$f":"'aktuelle Zahlen'!G141","v":39},{"$f":"'aktuelle Zahlen'!H141","v":25},{"$f":"'aktuelle Zahlen'!J141","v":6},null," ",0," ",1," ",1," ",0," ",0," ",0," ",0," ",1," ",1," ",0," ",1," ",1]
[{"$f":"'aktuelle Zahlen'!A140","v":"Mi"},{"$f":"'aktuelle Zahlen'!B140","v":"2025-03-26"},{"$f":"'aktuelle Zahlen'!C140","v":19},{"$f":"'aktuelle Zahlen'!D140","v":12},{"$f":"'aktuelle Zahlen'!E140","v":3},{"$f":"'aktuelle Zahlen'!F140","v":41},{"$f":"'aktuelle Zahlen'!G140","v":16},{"$f":"'aktuelle Zahlen'!H140","v":22},{"$f":"'aktuelle Zahlen'!J140","v":4},null," ",0," ",1," ",0," ",1," ",1," ",0," ",0," ",0,2,2," ",1," ",1," ",1]
[{"$f":"'aktuelle Zahlen'!A139","v":"Sa"},{"$f":"'aktuelle Zahlen'!B139","v":"2025-03-22"},{"$f":"'aktuelle Zahlen'!C139","v":30},{"$f":"'aktuelle Zahlen'!D139","v":41},{"$f":"'aktuelle Zahlen'!E139","v":11},{"$f":"'aktuelle Zahlen'!F139","v":20},{"$f":"'aktuelle Zahlen'!G139","v":35},{"$f":"'aktuelle Zahlen'!H139","v":28},{"$f":"'aktuelle Zahlen'!J139","v":3},null," ",1," ",1," ",1," ",0," ",0," ",1," ",0,2,2," ",0," ",1,2,2," ",1]
[{"$f":"'aktuelle Zahlen'!A138","v":"Mi"},{"$f":"'aktuelle Zahlen'!B138","v":"2025-03-19"},{"$f":"'aktuelle Zahlen'!C138","v":9},{"$f":"'aktuelle Zahlen'!D138","v":13},{"$f":"'aktuelle Zahlen'!E138","v":29},{"$f":"'aktuelle Zahlen'!F138","v":32},{"$f":"'aktuelle Zahlen'!G138","v":38},{"$f":"'aktuelle Zahlen'!H138","v":30},{"$f":"'aktuelle Zahlen'!J138","v":8},null," ",0,2,2," ",1," ",1," ",1," ",1," ",0," ",1," ",0," ",1," ",0,2,2]
[{"$f":"'aktuelle Zahlen'!A137","v":"Sa"},{"$f":"'aktuelle Zahlen'!B137","v":"2025-03-15"},{"$f":"'aktuelle Zahlen'!C137","v":11},{"$f":"'aktuelle Zahlen'!D137","v":35},{"$f":"'aktuelle Zahlen'!E137","v":6},{"$f":"'aktuelle Zahlen'!F137","v":36},{"$f":"'aktuelle Zahlen'!G137","v":30},{"$f":"'aktuelle Zahlen'!H137","v":47},{"$f":"'aktuelle Zahlen'!J137","v":0},null," ",1," ",1," ",1," ",0," ",0," ",1," ",0," ",1," ",0," ",1," ",0,2,2]
[{"$f":"'aktuelle Zahlen'!A136","v":"Mi"},{"$f":"'aktuelle Zahlen'!B136","v":"2025-03-12"},{"$f":"'aktuelle Zahlen'!C136","v":2},{"$f":"'aktuelle Zahlen'!D136","v":26},{"$f":"'aktuelle Zahlen'!E136","v":46},{"$f":"'aktuelle Zahlen'!F136","v":14},{"$f":"'aktuelle Zahlen'!G136","v":37},{"$f":"'aktuelle Zahlen'!H136","v":38},{"$f":"'aktuelle Zahlen'!J136","v":2},null," ",0," ",0," ",1," ",0," ",0," ",0," ",0,2,2," ",0," ",1," ",1," ",1]
[{"$f":"'aktuelle Zahlen'!A135","v":"Sa"},{"$f":"'aktuelle Zahlen'!B135","v":"2025-03-08"},{"$f":"'aktuelle Zahlen'!C135","v":41},{"$f":"'aktuelle Zahlen'!D135","v":25},{"$f":"'aktuelle Zahlen'!E135","v":26},{"$f":"'aktuelle Zahlen'!F135","v":44},{"$f":"'aktuelle Zahlen'!G135","v":13},{"$f":"'aktuelle Zahlen'!H135","v":27},{"$f":"'aktuelle Zahlen'!J135","v":5}]
[{"$f":"'aktuelle Zahlen'!A134","v":"Mi"},{"$f":"'aktuelle Zahlen'!B134","v":"2025-03-05"},{"$f":"'aktuelle Zahlen'!C134","v":46},{"$f":"'aktuelle Zahlen'!D134","v":22},{"$f":"'aktuelle Zahlen'!E134","v":45},{"$f":"'aktuelle Zahlen'!F134","v":26},{"$f":"'aktuelle Zahlen'!G134","v":4},{"$f":"'aktuelle Zahlen'!H134","v":29},{"$f":"'aktuelle Zahlen'!J134","v":7}]
[{"$f":"'aktuelle Zahlen'!A133","v":"Sa"},{"$f":"'aktuelle Zahlen'!B133","v":"2025-03-01"},{"$f":"'aktuelle Zahlen'!C133","v":25},{"$f":"'aktuelle Zahlen'!D133","v":36},{"$f":"'aktuelle Zahlen'!E133","v":26},{"$f":"'aktuelle Zahlen'!F133","v":11},{"$f":"'aktuelle Zahlen'!G133","v":44},{"$f":"'aktuelle Zahlen'!H133","v":30},{"$f":"'aktuelle Zahlen'!J133","v":8}]
[{"$f":"'aktuelle Zahlen'!A132","v":"Mi"},{"$f":"'aktuelle Zahlen'!B132","v":"2025-02-26"},{"$f":"'aktuelle Zahlen'!C132","v":12},{"$f":"'aktuelle Zahlen'!D132","v":45},{"$f":"'aktuelle Zahlen'!E132","v":24},{"$f":"'aktuelle Zahlen'!F132","v":29},{"$f":"'aktuelle Zahlen'!G132","v":22},{"$f":"'aktuelle Zahlen'!H132","v":17},{"$f":"'aktuelle Zahlen'!J132","v":7}]
[{"$f":"'aktuelle Zahlen'!A131","v":"Sa"},{"$f":"'aktuelle Zahlen'!B131","v":"2025-02-22"},{"$f":"'aktuelle Zahlen'!C131","v":34},{"$f":"'aktuelle Zahlen'!D131","v":28},{"$f":"'aktuelle Zahlen'!E131","v":26},{"$f":"'aktuelle Zahlen'!F131","v":6},{"$f":"'aktuelle Zahlen'!G131","v":8},{"$f":"'aktuelle Zahlen'!H131","v":12},{"$f":"'aktuelle Zahlen'!J131","v":0}]
[{"$f":"'aktuelle Zahlen'!A130","v":"Mi"},{"$f":"'aktuelle Zahlen'!B130","v":"2025-02-19"},{"$f":"'aktuelle Zahlen'!C130","v":8},{"$f":"'aktuelle Zahlen'!D130","v":4},{"$f":"'aktuelle Zahlen'!E130","v":28},{"$f":"'aktuelle Zahlen'!F130","v":44},{"$f":"'aktuelle Zahlen'!G130","v":25},{"$f":"'aktuelle Zahlen'!H130","v":10},{"$f":"'aktuelle Zahlen'!J130","v":3}]
[{"$f":"'aktuelle Zahlen'!A129","v":"Sa"},{"$f":"'aktuelle Zahlen'!B129","v":"2025-02-15"},{"$f":"'aktuelle Zahlen'!C129","v":18},{"$f":"'aktuelle Zahlen'!D129","v":23},{"$f":"'aktuelle Zahlen'!E129","v":43},{"$f":"'aktuelle Zahlen'!F129","v":29},{"$f":"'aktuelle Zahlen'!G129","v":48},{"$f":"'aktuelle Zahlen'!H129","v":2},{"$f":"'aktuelle Zahlen'!J129","v":7}]
[{"$f":"'aktuelle Zahlen'!A128","v":"Mi"},{"$f":"'aktuelle Zahlen'!B128","v":"2025-02-12"},{"$f":"'aktuelle Zahlen'!C128","v":5},{"$f":"'aktuelle Zahlen'!D128","v":12},{"$f":"'aktuelle Zahlen'!E128","v":43},{"$f":"'aktuelle Zahlen'!F128","v":39},{"$f":"'aktuelle Zahlen'!G128","v":47},{"$f":"'aktuelle Zahlen'!H128","v":30},{"$f":"'aktuelle Zahlen'!J128","v":5}]
[{"$f":"'aktuelle Zahlen'!A127","v":"Sa"},{"$f":"'aktuelle Zahlen'!B127","v":"2025-02-08"},{"$f":"'aktuelle Zahlen'!C127","v":49},{"$f":"'aktuelle Zahlen'!D127","v":20},{"$f":"'aktuelle Zahlen'!E127","v":13},{"$f":"'aktuelle Zahlen'!F127","v":47},{"$f":"'aktuelle Zahlen'!G127","v":27},{"$f":"'aktuelle Zahlen'!H127","v":16},{"$f":"'aktuelle Zahlen'!J127","v":2}]
[{"$f":"'aktuelle Zahlen'!A126","v":"Mi"},{"$f":"'aktuelle Zahlen'!B126","v":"2025-02-05"},{"$f":"'aktuelle Zahlen'!C126","v":15},{"$f":"'aktuelle Zahlen'!D126","v":9},{"$f":"'aktuelle Zahlen'!E126","v":18},{"$f":"'aktuelle Zahlen'!F126","v":30},{"$f":"'aktuelle Zahlen'!G126","v":14},{"$f":"'aktuelle Zahlen'!H126","v":1},{"$f":"'aktuelle Zahlen'!J126","v":8}]
[{"$f":"'aktuelle Zahlen'!A125","v":"Sa"},{"$f":"'aktuelle Zahlen'!B125","v":"2025-02-01"},{"$f":"'aktuelle Zahlen'!C125","v":11},{"$f":"'aktuelle Zahlen'!D125","v":9},{"$f":"'aktuelle Zahlen'!E125","v":22},{"$f":"'aktuelle Zahlen'!F125","v":27},{"$f":"'aktuelle Zahlen'!G125","v":25},{"$f":"'aktuelle Zahlen'!H125","v":8},{"$f":"'aktuelle Zahlen'!J125","v":8}]
[{"$f":"'aktuelle Zahlen'!A124","v":"Mi"},{"$f":"'aktuelle Zahlen'!B124","v":"2025-01-29"},{"$f":"'aktuelle Zahlen'!C124","v":41},{"$f":"'aktuelle Zahlen'!D124","v":48},{"$f":"'aktuelle Zahlen'!E124","v":25},{"$f":"'aktuelle Zahlen'!F124","v":35},{"$f":"'aktuelle Zahlen'!G124","v":7},{"$f":"'aktuelle Zahlen'!H124","v":16},{"$f":"'aktuelle Zahlen'!J124","v":2}]
[{"$f":"'aktuelle Zahlen'!A123","v":"Sa"},{"$f":"'aktuelle Zahlen'!B123","v":"2025-01-25"},{"$f":"'aktuelle Zahlen'!C123","v":48},{"$f":"'aktuelle Zahlen'!D123","v":49},{"$f":"'aktuelle Zahlen'!E123","v":25},{"$f":"'aktuelle Zahlen'!F123","v":10},{"$f":"'aktuelle Zahlen'!G123","v":11},{"$f":"'aktuelle Zahlen'!H123","v":36},{"$f":"'aktuelle Zahlen'!J123","v":2}]
[{"$f":"'aktuelle Zahlen'!A122","v":"Mi"},{"$f":"'aktuelle Zahlen'!B122","v":"2025-01-22"},{"$f":"'aktuelle Zahlen'!C122","v":34},{"$f":"'aktuelle Zahlen'!D122","v":35},{"$f":"'aktuelle Zahlen'!E122","v":41},{"$f":"'aktuelle Zahlen'!F122","v":40},{"$f":"'aktuelle Zahlen'!G122","v":31},{"$f":"'aktuelle Zahlen'!H122","v":9},{"$f":"'aktuelle Zahlen'!J122","v":4}]
[{"$f":"'aktuelle Zahlen'!A121","v":"Sa"},{"$f":"'aktuelle Zahlen'!B121","v":"2025-01-18"},{"$f":"'aktuelle Zahlen'!C121","v":20},{"$f":"'aktuelle Zahlen'!D121","v":3},{"$f":"'aktuelle Zahlen'!E121","v":12},{"$f":"'aktuelle Zahlen'!F121","v":26},{"$f":"'aktuelle Zahlen'!G121","v":33},{"$f":"'aktuelle Zahlen'!H121","v":16},{"$f":"'aktuelle Zahlen'!J121","v":3}]
[{"$f":"'aktuelle Zahlen'!A120","v":"Mi"},{"$f":"'aktuelle Zahlen'!B120","v":"2025-01-15"},{"$f":"'aktuelle Zahlen'!C120","v":38},{"$f":"'aktuelle Zahlen'!D120","v":13},{"$f":"'aktuelle Zahlen'!E120","v":41},{"$f":"'aktuelle Zahlen'!F120","v":1},{"$f":"'aktuelle Zahlen'!G120","v":30},{"$f":"'aktuelle Zahlen'!H120","v":36},{"$f":"'aktuelle Zahlen'!J120","v":6}]
[{"$f":"'aktuelle Zahlen'!A119","v":"Sa"},{"$f":"'aktuelle Zahlen'!B119","v":"2025-01-11"},{"$f":"'aktuelle Zahlen'!C119","v":27},{"$f":"'aktuelle Zahlen'!D119","v":30},{"$f":"'aktuelle Zahlen'!E119","v":10},{"$f":"'aktuelle Zahlen'!F119","v":26},{"$f":"'aktuelle Zahlen'!G119","v":22},{"$f":"'aktuelle Zahlen'!H119","v":33},{"$f":"'aktuelle Zahlen'!J119","v":8}]
[{"$f":"'aktuelle Zahlen'!A118","v":"Mi"},{"$f":"'aktuelle Zahlen'!B118","v":"2025-01-08"},{"$f":"'aktuelle Zahlen'!C118","v":45},{"$f":"'aktuelle Zahlen'!D118","v":49},{"$f":"'aktuelle Zahlen'!E118","v":27},{"$f":"'aktuelle Zahlen'!F118","v":30},{"$f":"'aktuelle Zahlen'!G118","v":28},{"$f":"'aktuelle Zahlen'!H118","v":9},{"$f":"'aktuelle Zahlen'!J118","v":6}]
[{"$f":"'aktuelle Zahlen'!A117","v":"Sa"},{"$f":"'aktuelle Zahlen'!B117","v":"2025-01-04"},{"$f":"'aktuelle Zahlen'!C117","v":6},{"$f":"'aktuelle Zahlen'!D117","v":24},{"$f":"'aktuelle Zahlen'!E117","v":36},{"$f":"'aktuelle Zahlen'!F117","v":2},{"$f":"'aktuelle Zahlen'!G117","v":30},{"$f":"'aktuelle Zahlen'!H117","v":45},{"$f":"'aktuelle Zahlen'!J117","v":2}]
[{"$f":"'aktuelle Zahlen'!A116","v":"Mi"},{"$f":"'aktuelle Zahlen'!B116","v":"2025-01-01"},{"$f":"'aktuelle Zahlen'!C116","v":18},{"$f":"'aktuelle Zahlen'!D116","v":15},{"$f":"'aktuelle Zahlen'!E116","v":3},{"$f":"'aktuelle Zahlen'!F116","v":26},{"$f":"'aktuelle Zahlen'!G116","v":33},{"$f":"'aktuelle Zahlen'!H116","v":7},{"$f":"'aktuelle Zahlen'!J116","v":2}]
[{"$f":"'aktuelle Zahlen'!A115","v":"Sa"},{"$f":"'aktuelle Zahlen'!B115","v":"2024-12-28"},{"$f":"'aktuelle Zahlen'!C115","v":18},{"$f":"'aktuelle Zahlen'!D115","v":7},{"$f":"'aktuelle Zahlen'!E115","v":40},{"$f":"'aktuelle Zahlen'!F115","v":28},{"$f":"'aktuelle Zahlen'!G115","v":13},{"$f":"'aktuelle Zahlen'!H115","v":44},{"$f":"'aktuelle Zahlen'!J115","v":5}]
[{"$f":"'aktuelle Zahlen'!A114","v":"Mi"},{"$f":"'aktuelle Zahlen'!B114","v":"2024-12-25"},{"$f":"'aktuelle Zahlen'!C114","v":24},{"$f":"'aktuelle Zahlen'!D114","v":44},{"$f":"'aktuelle Zahlen'!E114","v":5},{"$f":"'aktuelle Zahlen'!F114","v":48},{"$f":"'aktuelle Zahlen'!G114","v":9},{"$f":"'aktuelle Zahlen'!H114","v":7},{"$f":"'aktuelle Zahlen'!J114","v":0}]
[{"$f":"'aktuelle Zahlen'!A113","v":"Sa"},{"$f":"'aktuelle Zahlen'!B113","v":"2024-12-21"},{"$f":"'aktuelle Zahlen'!C113","v":44},{"$f":"'aktuelle Zahlen'!D113","v":3},{"$f":"'aktuelle Zahlen'!E113","v":8},{"$f":"'aktuelle Zahlen'!F113","v":39},{"$f":"'aktuelle Zahlen'!G113","v":6},{"$f":"'aktuelle Zahlen'!H113","v":34},{"$f":"'aktuelle Zahlen'!J113","v":5}]
[{"$f":"'aktuelle Zahlen'!A112","v":"Mi"},{"$f":"'aktuelle Zahlen'!B112","v":"2024-12-18"},{"$f":"'aktuelle Zahlen'!C112","v":6},{"$f":"'aktuelle Zahlen'!D112","v":42},{"$f":"'aktuelle Zahlen'!E112","v":2},{"$f":"'aktuelle Zahlen'!F112","v":30},{"$f":"'aktuelle Zahlen'!G112","v":37},{"$f":"'aktuelle Zahlen'!H112","v":22},{"$f":"'aktuelle Zahlen'!J112","v":6}]
[{"$f":"'aktuelle Zahlen'!A111","v":"Sa"},{"$f":"'aktuelle Zahlen'!B111","v":"2024-12-14"},{"$f":"'aktuelle Zahlen'!C111","v":9},{"$f":"'aktuelle Zahlen'!D111","v":44},{"$f":"'aktuelle Zahlen'!E111","v":1},{"$f":"'aktuelle Zahlen'!F111","v":14},{"$f":"'aktuelle Zahlen'!G111","v":27},{"$f":"'aktuelle Zahlen'!H111","v":4},{"$f":"'aktuelle Zahlen'!J111","v":3}]
[{"$f":"'aktuelle Zahlen'!A110","v":"Mi"},{"$f":"'aktuelle Zahlen'!B110","v":"2024-12-11"},{"$f":"'aktuelle Zahlen'!C110","v":30},{"$f":"'aktuelle Zahlen'!D110","v":49},{"$f":"'aktuelle Zahlen'!E110","v":34},{"$f":"'aktuelle Zahlen'!F110","v":15},{"$f":"'aktuelle Zahlen'!G110","v":14},{"$f":"'aktuelle Zahlen'!H110","v":35},{"$f":"'aktuelle Zahlen'!J110","v":5}]
{"$rows_left_out":651}