{"text_format":"1","workbook":"xlsx","n_sheets":14,"sheets":["Rd.1","Rd.2","Rd. 3","Rd. 4","Rd.5","Rd.6","Rd. 7","Rd. 8","Rd. 9","Rd. 10","Rd. 11","Rd. 12","Sieger","Tabelle1"],"not_rendered":{"charts":0,"images":1,"macros":1,"external_links":0,"defined_names":10,"comments":0,"pivot_tables":0},"unopened":[],"bounds":{"document_bytes":16777216,"sheet_cells":100000,"rows_first":2000,"rows_last":500,"rows_between":2000,"halvings":0,"cell_chars":16384,"cell_head_chars":4096},"cells_cut":0,"cells_raw":0,"read":"whole","date_system":"1900"}

{"sheet":"Rd.1","index":0,"n_rows":50,"n_cols":36,"rows_kept":50,"cut":false,"hidden":false,"merged":[[13,18,16,19],[13,25,16,26],[7,18,7,19],[7,25,7,26],[0,3,0,4],[0,10,0,11],[0,17,0,18],[0,24,0,25],[7,4,7,5],[8,18,9,19],[8,25,9,26],[10,25,12,26],[10,18,12,19],[7,11,7,12],[8,11,9,12],[13,4,16,5],[13,11,16,12],[20,4,25,5],[10,4,12,5],[10,11,12,12],[8,4,9,5],[20,11,25,12],[18,4,18,5],[18,11,18,12],[18,18,18,19],[18,25,18,26],[38,3,38,4],[26,4,30,5],[31,4,32,5],[20,18,25,19],[20,25,25,26],[26,18,30,19],[31,18,32,19],[26,25,30,26],[31,25,32,26],[31,11,32,12],[26,11,30,12]]}
[501,null,null,{"$f":"AE35","v":"Ralf M."},null,"Sp.1",null,null,null,null,{"$f":"AE36","v":"Anja"},null,"Sp.2",null,null,null,null,{"$f":"AE37","v":"Siggi"},null,"Sp.3",null,null,null,null,{"$f":"AE38","v":"Erich"},null,"Sp.4",null,null,null,{"$f":"INDEX($D$35:$D$38,MATCH(LARGE($F$35:$F$38,ROW(AE1)),$F$35:$F$38,0))","v":"Ralf M."},null,{"$f":"IF(AND((INT($E$2/100)-ROW())*111<$A$1,(INT($E$2/100)-ROW())*111>0),(INT($E$2/100)-ROW())*111,\"\")","v":444}]
[null,null,null,"Punkte",501,"Start",null,null,null,null,"Punkte",501,"Start",null,null,null,null,"Punkte",501,"Start",null,null,null,null,"Punkte",501,"Start",null,null,null,{"$f":"INDEX($D$35:$D$38,MATCH(LARGE($F$35:$F$38,ROW(AE2)),$F$35:$F$38,0))","v":"Ralf M."},null,{"$f":"IF(AND((INT($E$2/100)-ROW())*111<$A$1,(INT($E$2/100)-ROW())*111>0),(INT($E$2/100)-ROW())*111,\"\")","v":333}]
[null,null,null,"Geworfen",{"$f":"SUM(D34)","v":0},"Punkte",null,null,null,null,"Geworfen",{"$f":"SUM(K34)","v":0},"Punkte",null,null,null,null,"Geworfen",{"$f":"SUM(R34)","v":0},"Punkte",null,null,null,null,"Geworfen",{"$f":"SUM(Y34)","v":0},"Punkte",null,null,null,"Ralf M.",null,{"$f":"IF(AND((INT($E$2/100)-ROW())*111<$A$1,(INT($E$2/100)-ROW())*111>0),(INT($E$2/100)-ROW())*111,\"\")","v":222}]
["RD 1",{"$f":"COUNT(D4)*1","v":0},{"$f":"COUNT(D4)*3","v":0},null,{"$f":"SUM(E2-E3)","v":501},"Rest",null,"RD 1",{"$f":"COUNT(K4)*1","v":0},{"$f":"COUNT(K4)*3","v":0},null,{"$f":"SUM(L2-L3)","v":501},"Rest",null,"RD 1",{"$f":"COUNT(R4)*1","v":0},{"$f":"COUNT(R4)*3","v":0},null,{"$f":"SUM(S2-S3)","v":501},"Rest",null,"RD 1",{"$f":"COUNT(Y4)*1","v":0},{"$f":"COUNT(Y4)*3","v":0},null,{"$f":"SUM(Z2-Z3)","v":501},"Rest",null,null,null,"Ralf M.",null,111]
["RD 2",0,0,null,null,null,null,"RD 2",0,0,null,null,null,null,"RD 2",0,0,null,null,null,null,"RD 2",0,0]
["RD 3",0,0,null,"ø pro Spiel",{"$f":"SUM(E3)/B34","v":{"$error":"#DIV/0!"}},null,"RD 3",0,0,null,"ø pro Spiel",{"$f":"SUM(L3)/I34","v":{"$error":"#DIV/0!"}},null,"RD 3",0,0,null,"ø pro Spiel",{"$f":"SUM(S3)/P34","v":{"$error":"#DIV/0!"}},null,"RD 3",0,0,null,"ø pro Spiel",{"$f":"SUM(Z3)/W34","v":{"$error":"#DIV/0!"}}]
["RD 4",0,0,null,"ø pro Pfeil",{"$f":"SUM(E3)/C34","v":{"$error":"#DIV/0!"}},null,"RD 4",0,0,null,"ø pro Pfeil",{"$f":"SUM(L3)/J34","v":{"$error":"#DIV/0!"}},null,"RD 4",0,0,null,"ø pro Pfeil",{"$f":"SUM(S3)/Q34","v":{"$error":"#DIV/0!"}},null,"RD 4",0,0,null,"ø pro Pfeil",{"$f":"SUM(Z3)/X34","v":{"$error":"#DIV/0!"}}]
["RD 5",0,0,null,"Average",null,null,"RD 5",0,0,null,"Average",null,null,"RD 5",0,0,null,"Average",null,null,"RD 5",0,0,null,"Average"]
["RD 6",0,0,null,{"$f":"SUM(F6)","v":{"$error":"#DIV/0!"}},null,null,"RD 6",0,0,null,{"$f":"SUM(M6)","v":{"$error":"#DIV/0!"}},null,null,"RD 6",0,0,null,{"$f":"SUM(T6)","v":{"$error":"#DIV/0!"}},null,null,"RD 6",0,0,null,{"$f":"SUM(AA6)","v":{"$error":"#DIV/0!"}}]
["RD 7",0,0,null,null,null,null,"RD 7",0,0,null,null,null,null,"RD 7",0,0,null,null,null,null,"RD 7",0,0]
["RD 8",0,0,null,{"$f":"IF(F6<40,\"Nicht Gut\",\"\")","v":{"$error":"#DIV/0!"}},null,null,"RD 8",0,0,null,{"$f":"IF(M6<40,\"Nicht Gut\",\"\")","v":{"$error":"#DIV/0!"}},null,null,"RD 8",0,0,null,{"$f":"IF(T6<40,\"Nicht Gut\",\"\")","v":{"$error":"#DIV/0!"}},null,null,"RD 8",0,0,null,{"$f":"IF(AA6<40,\"Nicht Gut\",\"\")","v":{"$error":"#DIV/0!"}}]
["RD 9",0,0,null,null,null,null,"RD 9",0,0,null,null,null,null,"RD 9",0,0,null,null,null,null,"RD 9",0,0]
["RD 10",0,0,null,null,null,null,"RD 10",0,0,null,null,null,null,"RD 10",0,0,null,null,null,null,"RD 10",0,0]
["RD 11",0,0,null,{"$f":"IF(AND(F6>=40,F6<=50),\"GUT\",\"\")","v":{"$error":"#DIV/0!"}},null,null,"RD 11",0,0,null,{"$f":"IF(AND(M6>=40,M6<=50),\"GUT\",\"\")","v":{"$error":"#DIV/0!"}},null,null,"RD 11",0,0,null,{"$f":"IF(AND(T6>=40,T6<=50),\"GUT\",\"\")","v":{"$error":"#DIV/0!"}},null,null,"RD 11",0,0,null,{"$f":"IF(AND(AA6>=40,AA6<=50),\"GUT\",\"\")","v":{"$error":"#DIV/0!"}}]
["RD 12",0,0,null,null,null,null,"RD 12",0,0,null,null,null,null,"RD 12",0,0,null,null,null,null,"RD 12",0,0]
["RD 13",0,0,null,null,null,null,"RD 13",0,0,null,null,null,null,"RD 13",0,0,null,null,null,null,"RD 13",0,0]
["RD 14",0,0,null,null,null,null,"RD 14",0,0,null,null,null,null,"RD 14",0,0,null,null,null,null,"RD 14",0,0]
["RD 15",0,0,null,null,null,null,"RD 15",0,0,null,null,null,null,"RD 15",0,0,null,null,null,null,"RD 15",0,0]
["RD 16",0,0,null,{"$f":"D1","v":"Ralf M."},{"$f":"E4","v":501},null,"RD 16",0,0,null,{"$f":"K1","v":"Anja"},{"$f":"L4","v":501},null,"RD 16",0,0,null,{"$f":"R1","v":"Siggi"},{"$f":"S4","v":501},null,"RD 16",0,0,null,{"$f":"Y1","v":"Erich"},{"$f":"Z4","v":501}]
["RD 17",0,0,null,"Rest",{"$f":"E4","v":501},null,"RD 17",0,0,null,"Rest",{"$f":"L4","v":501},null,"RD 17",0,0,null,"Rest",{"$f":"S4","v":501},null,"RD 17",0,0,null,"Rest",{"$f":"Z4","v":501}]
["RD 18",0,0,null,{"$f":"IF(F6>50,\"Sehr Gut\",\"\")","v":{"$error":"#DIV/0!"}},null,null,"RD 18",0,0,null,{"$f":"IF(M6>50,\"Sehr Gut\",\"\")","v":{"$error":"#DIV/0!"}},null,null,"RD 18",0,0,null,{"$f":"IF(T6>50,\"Sehr Gut\",\"\")","v":{"$error":"#DIV/0!"}},null,null,"RD 18",0,0,null,{"$f":"IF(AA6>50,\"Sehr Gut\",\"\")","v":{"$error":"#DIV/0!"}}]
["RD 19",0,0,null,null,null,null,"RD 19",0,0,null,null,null,null,"RD 19",0,0,null,null,null,null,"RD 19",0,0]
["RD 20",0,0,null,null,null,null,"RD 20",0,0,null,null,null,null,"RD 20",0,0,null,null,null,null,"RD 20",0,0]
["RD 21",0,0,null,null,null,null,"RD 21",0,0,null,null,null,null,"RD 21",0,0,null,null,null,null,"RD 21",0,0]
["RD 22",0,0,null,null,null,null,"RD 22",0,0,null,null,null,null,"RD 22",0,0,null,null,null,null,"RD 22",0,0]
["RD 23",0,0,null,null,null,null,"RD 23",0,0,null,null,null,null,"RD 23",0,0,null,null,null,null,"RD 23",0,0]
["RD 24",0,0,null,null,null,null,"RD 24",0,0,null,null,null,null,"RD 24",0,0,null,null,null,null,"RD 24",0,0]
["RD 25",0,0,null,null,null,null,"RD 25",0,0,null,null,null,null,"RD 25",0,0,null,null,null,null,"RD 25",0,0]
["RD 26",0,0,null,null,null,null,"RD 26",0,0,null,null,null,null,"RD 26",0,0,null,null,null,null,"RD 26",0,0]
["RD 27",0,0,null,null,null,null,"RD 27",0,0,null,null,null,null,"RD 27",0,0,null,null,null,null,"RD 27",0,0]
["RD 28",0,0,null,null,null,null,"RD 28",0,0,null,null,null,null,"RD 28",0,0,null,null,null,null,"RD 28",0,0]
["RD 29",0,0,null,{"$f":"IF(E4=0,\"Sieg\",\"\")","v":""},null,null,"RD 29",0,0,null,{"$f":"IF(L4=0,\"Sieg\",\"\")","v":""},null,null,"RD 29",0,0,null,{"$f":"IF(S4=0,\"Sieg\",\"\")","v":""},null,null,"RD 29",0,0,null,{"$f":"IF(Z4=0,\"Sieg\",\"\")","v":""}]
["RD 30",0,0,null,null,null,null,"RD 30",0,0,null,null,null,null,"RD 30",0,0,null,null,null,null,"RD 30",0,0]
[null,{"$f":"SUM(B4:B33)","v":0},{"$f":"SUM(C4:C33)","v":0},{"$f":"SUM(D4:D33)","v":0},{"$f":"SUM(D4:D32)","v":0},null,null,null,{"$f":"SUM(I4:I33)","v":0},{"$f":"SUM(J4:J33)","v":0},{"$f":"SUM(K4:K33)","v":0},{"$f":"SUM(K4:K32)","v":0},null,null,null,{"$f":"SUM(P4:P33)","v":0},{"$f":"SUM(Q4:Q33)","v":0},{"$f":"SUM(R4:R33)","v":0},{"$f":"SUM(R4:R32)","v":0},null,null,null,{"$f":"SUM(W4:W33)","v":0},{"$f":"SUM(X4:X33)","v":0},{"$f":"SUM(Y4:Y33)","v":0},{"$f":"SUM(Y4:Y32)","v":0},null,null,null,null,null,null,{"$f":"RAND()","v":0.24945004712314123},null,null,"Vincent"]
[null,null,null,{"$f":"D1","v":"Ralf M."},null,{"$f":"SUM(E3)","v":0},null,null,null,null,{"$f":"INDEX(D35:D38,MATCH(LARGE(F35:F38,1),F35:F38,0))","v":"Ralf M."},null,null,null,null,null,null,null,null,null,null,null,null,null,null,null,null,null,null,null,"Ralf M.",null,{"$f":"RAND()","v":0.75528509184572235},null,null,"Anja"]
[null,null,null,{"$f":"K1","v":"Anja"},null,{"$f":"SUM(L3)","v":0},null,null,null,null,{"$f":"INDEX(D35:D38,MATCH(LARGE(F35:F38,2),F35:F38,0))","v":"Ralf M."},null,null,null,null,null,null,null,null,null,null,null,null,null,null,null,null,null,null,null,"Anja",null,{"$f":"RAND()","v":0.47584452013457446},null,null,"Erich"]
[null,null,null,{"$f":"R1","v":"Siggi"},null,{"$f":"SUM(S3)","v":0},null,null,null,null,{"$f":"INDEX(D35:D38,MATCH(LARGE(F35:F38,3),F35:F38,0))","v":"Ralf M."},null,null,null,null,null,null,null,null,null,null,null,null,null,null,null,null,null,null,null,"Siggi",null,{"$f":"RAND()","v":0.17908874610717274},null,null,"Siggi"]
[null,null,null,{"$f":"Y1","v":"Erich"},null,{"$f":"SUM(Z3)","v":0},null,null,null,null,{"$f":"INDEX(D35:D38,MATCH(LARGE(F35:F38,4),F35:F38,0))","v":"Ralf M."},null,null,null,null,null,null,null,null,null,null,null,null,null,null,null,null,null,null,null,"Erich",null,{"$f":"RAND()","v":0.91133245564809751},null,null,"Ralf M."]
[null,null,null,"MAX(B2:B7",null,{"$f":"SUM(F35:F38)","v":0},null,null,null,null,null,null,null,null,null,null,null,null,null,null,null,null,null,null,null,null,null,null,null,null,null,null,null,null,null,"Ralf Kl."]
[null,null,null,null,null,null,null,null,null,null,null,null,null,null,null,null,null,null,null,null,null,null,null,null,null,null,null,null,null,null,null,null,null,null,null,"Volker"]
[null,null,null,null,null,null,null,null,null,null,null,null,null,null,null,null,null,null,null,null,null,null,null,null,null,null,null,null,null,null,null,null,null,null,null,"Rene"]
[null,null,null,null,null,null,null,null,null,null,null,null,null,null,null,null,null,null,null,null,null,null,null,null,null,null,null,null,null,null,null,null,null,null,null,"Nicole"]
[null,null,null,null,null,null,null,null,null,null,null,null,null,null,null,null,null,null,null,null,null,null,null,null,null,null,null,null,null,null,null,null,null,null,null,"Frank"]
[null,null,null,null,null,null,null,null,null,null,null,null,null,null,null,null,null,null,null,null,null,null,null,null,null,null,null,null,null,null,null,null,null,null,null,"Rosi"]
[null,null,null,null,null,null,null,null,null,null,null,null,null,null,null,null,null,null,null,null,null,null,null,null,null,null,null,null,null,null,null,null,null,null,null,"Werner"]
[null,null,null,null,null,null,null,null,null,null,null,null,null,null,null,null,null,null,null,null,null,null,null,null,null,null,null,null,null,null,null,null,null,null,null,"Gast"]
[null,null,null,null,null,null,null,null,null,null,null,null,null,null,null,null,null,null,null,null,null,null,null,null,null,null,null,null,null,null,null,null,null,null,null,"Dirk B."]
[null,null,null,null,null,null,null,null,null,null,null,null,null,null,null,null,null,null,null,null,null,null,null,null,null,null,null,null,null,null,null,null,null,null,null,"Stefan"]
[null,null,null,null,null,null,null,null,null,null,null,null,null,null,null,null,null,null,null,null,null,null,null,null,null,null,null,null,null,null,null,null,null,null,null,"Micha"]
[null,null,null,null,null,null,null,null,null,null,null,null,null,null,null,null,null,null,null,null,null,null,null,null,null,null,null,null,null,null,null,null,null,null,null,"Thorsten"]

{"sheet":"Rd.2","index":1,"n_rows":39,"n_cols":31,"rows_kept":39,"cut":false,"hidden":false,"merged":[[0,24,0,25],[7,4,7,5],[7,11,7,12],[7,18,7,19],[7,25,7,26],[0,3,0,4],[0,10,0,11],[0,17,0,18],[31,25,32,26],[26,4,30,5],[26,11,30,12],[13,18,16,19],[26,25,30,26],[13,25,16,26],[20,4,25,5],[20,11,25,12],[20,18,25,19],[20,25,25,26],[13,4,16,5],[26,18,30,19],[13,11,16,12],[18,25,18,26],[8,25,9,26],[10,4,12,5],[10,11,12,12],[10,18,12,19],[10,25,12,26],[8,4,9,5],[38,3,38,4],[8,11,9,12],[8,18,9,19],[31,4,32,5],[31,11,32,12],[31,18,32,19],[18,4,18,5],[18,11,18,12],[18,18,18,19]]}
[null,null,null,{"$f":"'Rd.1'!AE4","v":"Ralf M."},null,"Sp.1",null,null,null,null,{"$f":"'Rd.1'!AE3","v":"Ralf M."},null,"Sp.2",null,null,null,null,{"$f":"'Rd.1'!AE2","v":"Ralf M."},null,"Sp.3",null,null,null,null,{"$f":"'Rd.1'!AE1","v":"Ralf M."},null,"Sp.4",null,null,null,{"$f":"INDEX($D$35:$D$38,MATCH(LARGE($F$35:$F$38,ROW(AE1)),$F$35:$F$38,0))","v":"Ralf M."}]
[null,null,null,"Punkte",501,"Start",null,null,null,null,"Punkte",501,"Start",null,null,null,null,"Punkte",501,"Start",null,null,null,null,"Punkte",501,"Start",null,null,null,{"$f":"INDEX($D$35:$D$38,MATCH(LARGE($F$35:$F$38,ROW(AE2)),$F$35:$F$38,0))","v":"Ralf M."}]
[null,null,null,"Geworfen",{"$f":"SUM(D34)","v":0},"Punkte",null,null,null,null,"Geworfen",{"$f":"SUM(K34)","v":0},"Punkte",null,null,null,null,"Geworfen",{"$f":"SUM(R34)","v":0},"Punkte",null,null,null,null,"Geworfen",{"$f":"SUM(Y34)","v":0},"Punkte",null,null,null,"Ralf M."]
["RD 1",{"$f":"COUNT(D4)*1","v":0},{"$f":"COUNT(D4)*3","v":0},null,{"$f":"SUM(E2-E3)","v":501},"Rest",null,"RD 1",{"$f":"COUNT(K4)*1","v":0},{"$f":"COUNT(K4)*3","v":0},null,{"$f":"SUM(L2-L3)","v":501},"Rest",null,"RD 1",{"$f":"COUNT(R4)*1","v":0},{"$f":"COUNT(R4)*3","v":0},null,{"$f":"SUM(S2-S3)","v":501},"Rest",null,"RD 1",{"$f":"COUNT(Y4)*1","v":0},{"$f":"COUNT(Y4)*3","v":0},null,{"$f":"SUM(Z2-Z3)","v":501},"Rest",null,null,null,"Ralf M."]
["RD 2",0,0,null,null,null,null,"RD 2",0,0,null,null,null,null,"RD 2",0,0,null,null,null,null,"RD 2",0,0]
["RD 3",0,0,null,"ø pro Spiel",{"$f":"SUM(E3)/B34","v":{"$error":"#DIV/0!"}},null,"RD 3",0,0,null,"ø pro Spiel",{"$f":"SUM(L3)/I34","v":{"$error":"#DIV/0!"}},null,"RD 3",0,0,null,"ø pro Spiel",{"$f":"SUM(S3)/P34","v":{"$error":"#DIV/0!"}},null,"RD 3",0,0,null,"ø pro Spiel",{"$f":"SUM(Z3)/W34","v":{"$error":"#DIV/0!"}}]
["RD 4",0,0,null,"ø pro Pfeil",{"$f":"SUM(E3)/C34","v":{"$error":"#DIV/0!"}},null,"RD 4",0,0,null,"ø pro Pfeil",{"$f":"SUM(L3)/J34","v":{"$error":"#DIV/0!"}},null,"RD 4",0,0,null,"ø pro Pfeil",{"$f":"SUM(S3)/Q34","v":{"$error":"#DIV/0!"}},null,"RD 4",0,0,null,"ø pro Pfeil",{"$f":"SUM(Z3)/X34","v":{"$error":"#DIV/0!"}}]
["RD 5",0,0,null,"Average",null,null,"RD 5",0,0,null,"Average",null,null,"RD 5",0,0,null,"Average",null,null,"RD 5",0,0,null,"Average"]
["RD 6",0,0,null,{"$f":"SUM(F6)","v":{"$error":"#DIV/0!"}},null,null,"RD 6",0,0,null,{"$f":"SUM(M6)","v":{"$error":"#DIV/0!"}},null,null,"RD 6",0,0,null,{"$f":"SUM(T6)","v":{"$error":"#DIV/0!"}},null,null,"RD 6",0,0,null,{"$f":"SUM(AA6)","v":{"$error":"#DIV/0!"}}]
["RD 7",0,0,null,null,null,null,"RD 7",0,0,null,null,null,null,"RD 7",0,0,null,null,null,null,"RD 7",0,0]
["RD 8",0,0,null,{"$f":"IF(F6<40,\"Nicht Gut\",\"\")","v":{"$error":"#DIV/0!"}},null,null,"RD 8",0,0,null,{"$f":"IF(M6<40,\"Nicht Gut\",\"\")","v":{"$error":"#DIV/0!"}},null,null,"RD 8",0,0,null,{"$f":"IF(T6<40,\"Nicht Gut\",\"\")","v":{"$error":"#DIV/0!"}},null,null,"RD 8",0,0,null,{"$f":"IF(AA6<40,\"Nicht Gut\",\"\")","v":{"$error":"#DIV/0!"}}]
["RD 9",0,0,null,null,null,null,"RD 9",0,0,null,null,null,null,"RD 9",0,0,null,null,null,null,"RD 9",0,0]
["RD 10",0,0,null,null,null,null,"RD 10",0,0,null,null,null,null,"RD 10",0,0,null,null,null,null,"RD 10",0,0]
["RD 11",0,0,null,{"$f":"IF(AND(F6>=40,F6<=50),\"GUT\",\"\")","v":{"$error":"#DIV/0!"}},null,null,"RD 11",0,0,null,{"$f":"IF(AND(M6>=40,M6<=50),\"GUT\",\"\")","v":{"$error":"#DIV/0!"}},null,null,"RD 11",0,0,null,{"$f":"IF(AND(T6>=40,T6<=50),\"GUT\",\"\")","v":{"$error":"#DIV/0!"}},null,null,"RD 11",0,0,null,{"$f":"IF(AND(AA6>=40,AA6<=50),\"GUT\",\"\")","v":{"$error":"#DIV/0!"}}]
["RD 12",0,0,null,null,null,null,"RD 12",0,0,null,null,null,null,"RD 12",0,0,null,null,null,null,"RD 12",0,0]
["RD 13",0,0,null,null,null,null,"RD 13",0,0,null,null,null,null,"RD 13",0,0,null,null,null,null,"RD 13",0,0]
["RD 14",0,0,null,null,null,null,"RD 14",0,0,null,null,null,null,"RD 14",0,0,null,null,null,null,"RD 14",0,0]
["RD 15",0,0,null,null,null,null,"RD 15",0,0,null,null,null,null,"RD 15",0,0,null,null,null,null,"RD 15",0,0]
["RD 16",0,0,null,{"$f":"D1","v":"Ralf M."},{"$f":"E4","v":501},null,"RD 16",0,0,null,{"$f":"K1","v":"Ralf M."},{"$f":"L4","v":501},null,"RD 16",0,0,null,{"$f":"R1","v":"Ralf M."},{"$f":"S4","v":501},null,"RD 16",0,0,null,{"$f":"Y1","v":"Ralf M."},{"$f":"Z4","v":501}]
["RD 17",0,0,null,"Rest",{"$f":"E4","v":501},null,"RD 17",0,0,null,"Rest",{"$f":"L4","v":501},null,"RD 17",0,0,null,"Rest",{"$f":"S4","v":501},null,"RD 17",0,0,null,"Rest",{"$f":"Z4","v":501}]
["RD 18",0,0,null,{"$f":"IF(F6>50,\"Sehr Gut\",\"\")","v":{"$error":"#DIV/0!"}},null,null,"RD 18",0,0,null,{"$f":"IF(M6>50,\"Sehr Gut\",\"\")","v":{"$error":"#DIV/0!"}},null,null,"RD 18",0,0,null,{"$f":"IF(T6>50,\"Sehr Gut\",\"\")","v":{"$error":"#DIV/0!"}},null,null,"RD 18",0,0,null,{"$f":"IF(AA6>50,\"Sehr Gut\",\"\")","v":{"$error":"#DIV/0!"}}]
["RD 19",0,0,null,null,null,null,"RD 19",0,0,null,null,null,null,"RD 19",0,0,null,null,null,null,"RD 19",0,0]
["RD 20",0,0,null,null,null,null,"RD 20",0,0,null,null,null,null,"RD 20",0,0,null,null,null,null,"RD 20",0,0]
["RD 21",0,0,null,null,null,null,"RD 21",0,0,null,null,null,null,"RD 21",0,0,null,null,null,null,"RD 21",0,0]
["RD 22",0,0,null,null,null,null,"RD 22",0,0,null,null,null,null,"RD 22",0,0,null,null,null,null,"RD 22",0,0]
["RD 23",0,0,null,null,null,null,"RD 23",0,0,null,null,null,null,"RD 23",0,0,null,null,null,null,"RD 23",0,0]
["RD 24",0,0,null,null,null,null,"RD 24",0,0,null,null,null,null,"RD 24",0,0,null,null,null,null,"RD 24",0,0]
["RD 25",0,0,null,null,null,null,"RD 25",0,0,null,null,null,null,"RD 25",0,0,null,null,null,null,"RD 25",0,0]
["RD 26",0,0,null,null,null,null,"RD 26",0,0,null,null,null,null,"RD 26",0,0,null,null,null,null,"RD 26",0,0]
["RD 27",0,0,null,null,null,null,"RD 27",0,0,null,null,null,null,"RD 27",0,0,null,null,null,null,"RD 27",0,0]
["RD 28",0,0,null,null,null,null,"RD 28",0,0,null,null,null,null,"RD 28",0,0,null,null,null,null,"RD 28",0,0]
["RD 29",0,0,null,{"$f":"IF(E4=0,\"Sieg\",\"\")","v":""},null,null,"RD 29",0,0,null,{"$f":"IF(L4=0,\"Sieg\",\"\")","v":""},null,null,"RD 29",0,0,null,{"$f":"IF(S4=0,\"Sieg\",\"\")","v":""},null,null,"RD 29",0,0,null,{"$f":"IF(Z4=0,\"Sieg\",\"\")","v":""}]
["RD 30",0,0,null,null,null,null,"RD 30",0,0,null,null,null,null,"RD 30",0,0,null,null,null,null,"RD 30",0,0]
[null,{"$f":"SUM(B4:B33)","v":0},{"$f":"SUM(C4:C33)","v":0},{"$f":"SUM(D4:D33)","v":0},{"$f":"SUM(D4:D32)","v":0},null,null,null,{"$f":"SUM(I4:I33)","v":0},{"$f":"SUM(J4:J33)","v":0},{"$f":"SUM(K4:K33)","v":0},{"$f":"SUM(K4:K32)","v":0},null,null,null,{"$f":"SUM(P4:P33)","v":0},{"$f":"SUM(Q4:Q33)","v":0},{"$f":"SUM(R4:R33)","v":0},{"$f":"SUM(R4:R32)","v":0},null,null,null,{"$f":"SUM(W4:W33)","v":0},{"$f":"SUM(X4:X33)","v":0},{"$f":"SUM(Y4:Y33)","v":0},{"$f":"SUM(Y4:Y32)","v":0}]
[null,null,null,{"$f":"D1","v":"Ralf M."},null,{"$f":"SUM(E3)","v":0},null,null,null,null,{"$f":"INDEX(D35:D38,MATCH(LARGE(F35:F38,1),F35:F38,0))","v":"Ralf M."}]
[null,null,null,{"$f":"K1","v":"Ralf M."},null,{"$f":"SUM(L3)","v":0},null,null,null,null,{"$f":"INDEX(D35:D38,MATCH(LARGE(F35:F38,2),F35:F38,0))","v":"Ralf M."}]
[null,null,null,{"$f":"R1","v":"Ralf M."},null,{"$f":"SUM(S3)","v":0},null,null,null,null,{"$f":"INDEX(D35:D38,MATCH(LARGE(F35:F38,3),F35:F38,0))","v":"Ralf M."},null,null,null,null,null,null,null,null,null,null,null,null,null,null,null,null,null,null,null,"Micha"]
[null,null,null,{"$f":"Y1","v":"Ralf M."},null,{"$f":"SUM(Z3)","v":0},null,null,null,null,{"$f":"INDEX(D35:D38,MATCH(LARGE(F35:F38,4),F35:F38,0))","v":"Ralf M."}]
[null,null,null,"MAX(B2:B7",null,{"$f":"SUM(F35:F38)","v":0}]

{"sheet":"Rd. 3","index":2,"n_rows":39,"n_cols":31,"rows_kept":39,"cut":false,"hidden":false,"merged":[[0,24,0,25],[7,4,7,5],[7,11,7,12],[7,18,7,19],[7,25,7,26],[0,3,0,4],[0,10,0,11],[0,17,0,18],[31,25,32,26],[26,4,30,5],[26,11,30,12],[13,18,16,19],[26,25,30,26],[13,25,16,26],[20,4,25,5],[20,11,25,12],[20,18,25,19],[20,25,25,26],[13,4,16,5],[26,18,30,19],[13,11,16,12],[18,25,18,26],[8,25,9,26],[10,4,12,5],[10,11,12,12],[10,18,12,19],[10,25,12,26],[8,4,9,5],[38,3,38,4],[8,11,9,12],[8,18,9,19],[31,4,32,5],[31,11,32,12],[31,18,32,19],[18,4,18,5],[18,11,18,12],[18,18,18,19]]}
[null,null,null,{"$f":"'Rd.2'!AE4","v":"Ralf M."},null,"Sp.1",null,null,null,null,{"$f":"'Rd.2'!AE3","v":"Ralf M."},null,"Sp.2",null,null,null,null,{"$f":"'Rd.2'!AE2","v":"Ralf M."},null,"Sp.3",null,null,null,null,{"$f":"'Rd.2'!AE1","v":"Ralf M."},null,"Sp.4",null,null,null,{"$f":"INDEX($D$35:$D$38,MATCH(LARGE($F$35:$F$38,ROW(AE1)),$F$35:$F$38,0))","v":"Ralf M."}]
[null,null,null,"Punkte",501,"Start",null,null,null,null,"Punkte",501,"Start",null,null,null,null,"Punkte",501,"Start",null,null,null,null,"Punkte",501,"Start",null,null,null,{"$f":"INDEX($D$35:$D$38,MATCH(LARGE($F$35:$F$38,ROW(AE2)),$F$35:$F$38,0))","v":"Ralf M."}]
[null,null,null,"Geworfen",{"$f":"SUM(D34)","v":0},"Punkte",null,null,null,null,"Geworfen",{"$f":"SUM(K34)","v":0},"Punkte",null,null,null,null,"Geworfen",{"$f":"SUM(R34)","v":0},"Punkte",null,null,null,null,"Geworfen",{"$f":"SUM(Y34)","v":0},"Punkte",null,null,null,"Ralf M."]
["RD 1",{"$f":"COUNT(D4)*1","v":0},{"$f":"COUNT(D4)*3","v":0},null,{"$f":"SUM(E2-E3)","v":501},"Rest",null,"RD 1",{"$f":"COUNT(K4)*1","v":0},{"$f":"COUNT(K4)*3","v":0},null,{"$f":"SUM(L2-L3)","v":501},"Rest",null,"RD 1",{"$f":"COUNT(R4)*1","v":0},{"$f":"COUNT(R4)*3","v":0},null,{"$f":"SUM(S2-S3)","v":501},"Rest",null,"RD 1",{"$f":"COUNT(Y4)*1","v":0},{"$f":"COUNT(Y4)*3","v":0},null,{"$f":"SUM(Z2-Z3)","v":501},"Rest",null,null,null,"Ralf M."]
["RD 2",0,0,null,null,null,null,"RD 2",0,0,null,null,null,null,"RD 2",0,0,null,null,null,null,"RD 2",0,0]
["RD 3",0,0,null,"ø pro Spiel",{"$f":"SUM(E3)/B34","v":{"$error":"#DIV/0!"}},null,"RD 3",0,0,null,"ø pro Spiel",{"$f":"SUM(L3)/I34","v":{"$error":"#DIV/0!"}},null,"RD 3",0,0,null,"ø pro Spiel",{"$f":"SUM(S3)/P34","v":{"$error":"#DIV/0!"}},null,"RD 3",0,0,null,"ø pro Spiel",{"$f":"SUM(Z3)/W34","v":{"$error":"#DIV/0!"}}]
["RD 4",0,0,null,"ø pro Pfeil",{"$f":"SUM(E3)/C34","v":{"$error":"#DIV/0!"}},null,"RD 4",0,0,null,"ø pro Pfeil",{"$f":"SUM(L3)/J34","v":{"$error":"#DIV/0!"}},null,"RD 4",0,0,null,"ø pro Pfeil",{"$f":"SUM(S3)/Q34","v":{"$error":"#DIV/0!"}},null,"RD 4",0,0,null,"ø pro Pfeil",{"$f":"SUM(Z3)/X34","v":{"$error":"#DIV/0!"}}]
["RD 5",0,0,null,"Average",null,null,"RD 5",0,0,null,"Average",null,null,"RD 5",0,0,null,"Average",null,null,"RD 5",0,0,null,"Average"]
["RD 6",0,0,null,{"$f":"SUM(F6)","v":{"$error":"#DIV/0!"}},null,null,"RD 6",0,0,null,{"$f":"SUM(M6)","v":{"$error":"#DIV/0!"}},null,null,"RD 6",0,0,null,{"$f":"SUM(T6)","v":{"$error":"#DIV/0!"}},null,null,"RD 6",0,0,null,{"$f":"SUM(AA6)","v":{"$error":"#DIV/0!"}}]
["RD 7",0,0,null,null,null,null,"RD 7",0,0,null,null,null,null,"RD 7",0,0,null,null,null,null,"RD 7",0,0]
["RD 8",0,0,null,{"$f":"IF(F6<40,\"Nicht Gut\",\"\")","v":{"$error":"#DIV/0!"}},null,null,"RD 8",0,0,null,{"$f":"IF(M6<40,\"Nicht Gut\",\"\")","v":{"$error":"#DIV/0!"}},null,null,"RD 8",0,0,null,{"$f":"IF(T6<40,\"Nicht Gut\",\"\")","v":{"$error":"#DIV/0!"}},null,null,"RD 8",0,0,null,{"$f":"IF(AA6<40,\"Nicht Gut\",\"\")","v":{"$error":"#DIV/0!"}}]
["RD 9",0,0,null,null,null,null,"RD 9",0,0,null,null,null,null,"RD 9",0,0,null,null,null,null,"RD 9",0,0]
["RD 10",0,0,null,null,null,null,"RD 10",0,0,null,null,null,null,"RD 10",0,0,null,null,null,null,"RD 10",0,0]
["RD 11",0,0,null,{"$f":"IF(AND(F6>=40,F6<=50),\"GUT\",\"\")","v":{"$error":"#DIV/0!"}},null,null,"RD 11",0,0,null,{"$f":"IF(AND(M6>=40,M6<=50),\"GUT\",\"\")","v":{"$error":"#DIV/0!"}},null,null,"RD 11",0,0,null,{"$f":"IF(AND(T6>=40,T6<=50),\"GUT\",\"\")","v":{"$error":"#DIV/0!"}},null,null,"RD 11",0,0,null,{"$f":"IF(AND(AA6>=40,AA6<=50),\"GUT\",\"\")","v":{"$error":"#DIV/0!"}}]
["RD 12",0,0,null,null,null,null,"RD 12",0,0,null,null,null,null,"RD 12",0,0,null,null,null,null,"RD 12",0,0]
["RD 13",0,0,null,null,null,null,"RD 13",0,0,null,null,null,null,"RD 13",0,0,null,null,null,null,"RD 13",0,0]
["RD 14",0,0,null,null,null,null,"RD 14",0,0,null,null,null,null,"RD 14",0,0,null,null,null,null,"RD 14",0,0]
["RD 15",0,0,null,null,null,null,"RD 15",0,0,null,null,null,null,"RD 15",0,0,null,null,null,null,"RD 15",0,0]
["RD 16",0,0,null,{"$f":"D1","v":"Ralf M."},{"$f":"E4","v":501},null,"RD 16",0,0,null,{"$f":"K1","v":"Ralf M."},{"$f":"L4","v":501},null,"RD 16",0,0,null,{"$f":"R1","v":"Ralf M."},{"$f":"S4","v":501},null,"RD 16",0,0,null,{"$f":"Y1","v":"Ralf M."},{"$f":"Z4","v":501}]
["RD 17",0,0,null,"Rest",{"$f":"E4","v":501},null,"RD 17",0,0,null,"Rest",{"$f":"L4","v":501},null,"RD 17",0,0,null,"Rest",{"$f":"S4","v":501},null,"RD 17",0,0,null,"Rest",{"$f":"Z4","v":501}]
["RD 18",0,0,null,{"$f":"IF(F6>50,\"Sehr Gut\",\"\")","v":{"$error":"#DIV/0!"}},null,null,"RD 18",0,0,null,{"$f":"IF(M6>50,\"Sehr Gut\",\"\")","v":{"$error":"#DIV/0!"}},null,null,"RD 18",0,0,null,{"$f":"IF(T6>50,\"Sehr Gut\",\"\")","v":{"$error":"#DIV/0!"}},null,null,"RD 18",0,0,null,{"$f":"IF(AA6>50,\"Sehr Gut\",\"\")","v":{"$error":"#DIV/0!"}}]
["RD 19",0,0,null,null,null,null,"RD 19",0,0,null,null,null,null,"RD 19",0,0,null,null,null,null,"RD 19",0,0]
["RD 20",0,0,null,null,null,null,"RD 20",0,0,null,null,null,null,"RD 20",0,0,null,null,null,null,"RD 20",0,0]
["RD 21",0,0,null,null,null,null,"RD 21",0,0,null,null,null,null,"RD 21",0,0,null,null,null,null,"RD 21",0,0]
["RD 22",0,0,null,null,null,null,"RD 22",0,0,null,null,null,null,"RD 22",0,0,null,null,null,null,"RD 22",0,0]
["RD 23",0,0,null,null,null,null,"RD 23",0,0,null,null,null,null,"RD 23",0,0,null,null,null,null,"RD 23",0,0]
["RD 24",0,0,null,null,null,null,"RD 24",0,0,null,null,null,null,"RD 24",0,0,null,null,null,null,"RD 24",0,0]
["RD 25",0,0,null,null,null,null,"RD 25",0,0,null,null,null,null,"RD 25",0,0,null,null,null,null,"RD 25",0,0]
["RD 26",0,0,null,null,null,null,"RD 26",0,0,null,null,null,null,"RD 26",0,0,null,null,null,null,"RD 26",0,0]
["RD 27",0,0,null,null,null,null,"RD 27",0,0,null,null,null,null,"RD 27",0,0,null,null,null,null,"RD 27",0,0]
["RD 28",0,0,null,null,null,null,"RD 28",0,0,null,null,null,null,"RD 28",0,0,null,null,null,null,"RD 28",0,0]
["RD 29",0,0,null,{"$f":"IF(E4=0,\"Sieg\",\"\")","v":""},null,null,"RD 29",0,0,null,{"$f":"IF(L4=0,\"Sieg\",\"\")","v":""},null,null,"RD 29",0,0,null,{"$f":"IF(S4=0,\"Sieg\",\"\")","v":""},null,null,"RD 29",0,0,null,{"$f":"IF(Z4=0,\"Sieg\",\"\")","v":""}]
["RD 30",0,0,null,null,null,null,"RD 30",0,0,null,null,null,null,"RD 30",0,0,null,null,null,null,"RD 30",0,0]
[null,{"$f":"SUM(B4:B33)","v":0},{"$f":"SUM(C4:C33)","v":0},{"$f":"SUM(D4:D33)","v":0},{"$f":"SUM(D4:D32)","v":0},null,null,null,{"$f":"SUM(I4:I33)","v":0},{"$f":"SUM(J4:J33)","v":0},{"$f":"SUM(K4:K33)","v":0},{"$f":"SUM(K4:K32)","v":0},null,null,null,{"$f":"SUM(P4:P33)","v":0},{"$f":"SUM(Q4:Q33)","v":0},{"$f":"SUM(R4:R33)","v":0},{"$f":"SUM(R4:R32)","v":0},null,null,null,{"$f":"SUM(W4:W33)","v":0},{"$f":"SUM(X4:X33)","v":0},{"$f":"SUM(Y4:Y33)","v":0},{"$f":"SUM(Y4:Y32)","v":0}]
[null,null,null,{"$f":"D1","v":"Ralf M."},null,{"$f":"SUM(E3)","v":0},null,null,null,null,{"$f":"INDEX(D35:D38,MATCH(LARGE(F35:F38,1),F35:F38,0))","v":"Ralf M."}]
[null,null,null,{"$f":"K1","v":"Ralf M."},null,{"$f":"SUM(L3)","v":0},null,null,null,null,{"$f":"INDEX(D35:D38,MATCH(LARGE(F35:F38,2),F35:F38,0))","v":"Ralf M."}]
[null,null,null,{"$f":"R1","v":"Ralf M."},null,{"$f":"SUM(S3)","v":0},null,null,null,null,{"$f":"INDEX(D35:D38,MATCH(LARGE(F35:F38,3),F35:F38,0))","v":"Ralf M."},null,null,null,null,null,null,null,null,null,null,null,null,null,null,null,null,null,null,null,"Micha"]
[null,null,null,{"$f":"Y1","v":"Ralf M."},null,{"$f":"SUM(Z3)","v":0},null,null,null,null,{"$f":"INDEX(D35:D38,MATCH(LARGE(F35:F38,4),F35:F38,0))","v":"Ralf M."}]
[null,null,null,"MAX(B2:B7",null,{"$f":"SUM(F35:F38)","v":0}]

{"sheet":"Rd. 4","index":3,"n_rows":39,"n_cols":31,"rows_kept":39,"cut":false,"hidden":false,"merged":[[0,24,0,25],[7,4,7,5],[7,11,7,12],[7,18,7,19],[7,25,7,26],[0,3,0,4],[0,10,0,11],[0,17,0,18],[31,25,32,26],[26,4,30,5],[26,11,30,12],[13,18,16,19],[26,25,30,26],[13,25,16,26],[20,4,25,5],[20,11,25,12],[20,18,25,19],[20,25,25,26],[13,4,16,5],[26,18,30,19],[13,11,16,12],[18,25,18,26],[8,25,9,26],[10,4,12,5],[10,11,12,12],[10,18,12,19],[10,25,12,26],[8,4,9,5],[38,3,38,4],[8,11,9,12],[8,18,9,19],[31,4,32,5],[31,11,32,12],[31,18,32,19],[18,4,18,5],[18,11,18,12],[18,18,18,19]]}
[null,null,null,{"$f":"'Rd. 3'!AE4","v":"Ralf M."},null,"Sp.1",null,null,null,null,{"$f":"'Rd. 3'!AE3","v":"Ralf M."},null,"Sp.2",null,null,null,null,{"$f":"'Rd. 3'!AE2","v":"Ralf M."},null,"Sp.3",null,null,null,null,{"$f":"'Rd. 3'!AE1","v":"Ralf M."},null,"Sp.4",null,null,null,{"$f":"INDEX($D$35:$D$38,MATCH(LARGE($F$35:$F$38,ROW(AE1)),$F$35:$F$38,0))","v":"Ralf M."}]
[null,null,null,"Punkte",501,"Start",null,null,null,null,"Punkte",501,"Start",null,null,null,null,"Punkte",501,"Start",null,null,null,null,"Punkte",501,"Start",null,null,null,{"$f":"INDEX($D$35:$D$38,MATCH(LARGE($F$35:$F$38,ROW(AE2)),$F$35:$F$38,0))","v":"Ralf M."}]
[null,null,null,"Geworfen",{"$f":"SUM(D34)","v":0},"Punkte",null,null,null,null,"Geworfen",{"$f":"SUM(K34)","v":0},"Punkte",null,null,null,null,"Geworfen",{"$f":"SUM(R34)","v":0},"Punkte",null,null,null,null,"Geworfen",{"$f":"SUM(Y34)","v":0},"Punkte",null,null,null,"Ralf M."]
["RD 1",{"$f":"COUNT(D4)*1","v":0},{"$f":"COUNT(D4)*3","v":0},null,{"$f":"SUM(E2-E3)","v":501},"Rest",null,"RD 1",{"$f":"COUNT(K4)*1","v":0},{"$f":"COUNT(K4)*3","v":0},null,{"$f":"SUM(L2-L3)","v":501},"Rest",null,"RD 1",{"$f":"COUNT(R4)*1","v":0},{"$f":"COUNT(R4)*3","v":0},null,{"$f":"SUM(S2-S3)","v":501},"Rest",null,"RD 1",{"$f":"COUNT(Y4)*1","v":0},{"$f":"COUNT(Y4)*3","v":0},null,{"$f":"SUM(Z2-Z3)","v":501},"Rest",null,null,null,"Ralf M."]
["RD 2",0,0,null,null,null,null,"RD 2",0,0,null,null,null,null,"RD 2",0,0,null,null,null,null,"RD 2",0,0]
["RD 3",0,0,null,"ø pro Spiel",{"$f":"SUM(E3)/B34","v":{"$error":"#DIV/0!"}},null,"RD 3",0,0,null,"ø pro Spiel",{"$f":"SUM(L3)/I34","v":{"$error":"#DIV/0!"}},null,"RD 3",0,0,null,"ø pro Spiel",{"$f":"SUM(S3)/P34","v":{"$error":"#DIV/0!"}},null,"RD 3",0,0,null,"ø pro Spiel",{"$f":"SUM(Z3)/W34","v":{"$error":"#DIV/0!"}}]
["RD 4",0,0,null,"ø pro Pfeil",{"$f":"SUM(E3)/C34","v":{"$error":"#DIV/0!"}},null,"RD 4",0,0,null,"ø pro Pfeil",{"$f":"SUM(L3)/J34","v":{"$error":"#DIV/0!"}},null,"RD 4",0,0,null,"ø pro Pfeil",{"$f":"SUM(S3)/Q34","v":{"$error":"#DIV/0!"}},null,"RD 4",0,0,null,"ø pro Pfeil",{"$f":"SUM(Z3)/X34","v":{"$error":"#DIV/0!"}}]
["RD 5",0,0,null,"Average",null,null,"RD 5",0,0,null,"Average",null,null,"RD 5",0,0,null,"Average",null,null,"RD 5",0,0,null,"Average"]
["RD 6",0,0,null,{"$f":"SUM(F6)","v":{"$error":"#DIV/0!"}},null,null,"RD 6",0,0,null,{"$f":"SUM(M6)","v":{"$error":"#DIV/0!"}},null,null,"RD 6",0,0,null,{"$f":"SUM(T6)","v":{"$error":"#DIV/0!"}},null,null,"RD 6",0,0,null,{"$f":"SUM(AA6)","v":{"$error":"#DIV/0!"}}]
["RD 7",0,0,null,null,null,null,"RD 7",0,0,null,null,null,null,"RD 7",0,0,null,null,null,null,"RD 7",0,0]
["RD 8",0,0,null,{"$f":"IF(F6<40,\"Nicht Gut\",\"\")","v":{"$error":"#DIV/0!"}},null,null,"RD 8",0,0,null,{"$f":"IF(M6<40,\"Nicht Gut\",\"\")","v":{"$error":"#DIV/0!"}},null,null,"RD 8",0,0,null,{"$f":"IF(T6<40,\"Nicht Gut\",\"\")","v":{"$error":"#DIV/0!"}},null,null,"RD 8",0,0,null,{"$f":"IF(AA6<40,\"Nicht Gut\",\"\")","v":{"$error":"#DIV/0!"}}]
["RD 9",0,0,null,null,null,null,"RD 9",0,0,null,null,null,null,"RD 9",0,0,null,null,null,null,"RD 9",0,0]
["RD 10",0,0,null,null,null,null,"RD 10",0,0,null,null,null,null,"RD 10",0,0,null,null,null,null,"RD 10",0,0]
["RD 11",0,0,null,{"$f":"IF(AND(F6>=40,F6<=50),\"GUT\",\"\")","v":{"$error":"#DIV/0!"}},null,null,"RD 11",0,0,null,{"$f":"IF(AND(M6>=40,M6<=50),\"GUT\",\"\")","v":{"$error":"#DIV/0!"}},null,null,"RD 11",0,0,null,{"$f":"IF(AND(T6>=40,T6<=50),\"GUT\",\"\")","v":{"$error":"#DIV/0!"}},null,null,"RD 11",0,0,null,{"$f":"IF(AND(AA6>=40,AA6<=50),\"GUT\",\"\")","v":{"$error":"#DIV/0!"}}]
["RD 12",0,0,null,null,null,null,"RD 12",0,0,null,null,null,null,"RD 12",0,0,null,null,null,null,"RD 12",0,0]
["RD 13",0,0,null,null,null,null,"RD 13",0,0,null,null,null,null,"RD 13",0,0,null,null,null,null,"RD 13",0,0]
["RD 14",0,0,null,null,null,null,"RD 14",0,0,null,null,null,null,"RD 14",0,0,null,null,null,null,"RD 14",0,0]
["RD 15",0,0,null,null,null,null,"RD 15",0,0,null,null,null,null,"RD 15",0,0,null,null,null,null,"RD 15",0,0]
["RD 16",0,0,null,{"$f":"D1","v":"Ralf M."},{"$f":"E4","v":501},null,"RD 16",0,0,null,{"$f":"K1","v":"Ralf M."},{"$f":"L4","v":501},null,"RD 16",0,0,null,{"$f":"R1","v":"Ralf M."},{"$f":"S4","v":501},null,"RD 16",0,0,null,{"$f":"Y1","v":"Ralf M."},{"$f":"Z4","v":501}]
["RD 17",0,0,null,"Rest",{"$f":"E4","v":501},null,"RD 17",0,0,null,"Rest",{"$f":"L4","v":501},null,"RD 17",0,0,null,"Rest",{"$f":"S4","v":501},null,"RD 17",0,0,null,"Rest",{"$f":"Z4","v":501}]
["RD 18",0,0,null,{"$f":"IF(F6>50,\"Sehr Gut\",\"\")","v":{"$error":"#DIV/0!"}},null,null,"RD 18",0,0,null,{"$f":"IF(M6>50,\"Sehr Gut\",\"\")","v":{"$error":"#DIV/0!"}},null,null,"RD 18",0,0,null,{"$f":"IF(T6>50,\"Sehr Gut\",\"\")","v":{"$error":"#DIV/0!"}},null,null,"RD 18",0,0,null,{"$f":"IF(AA6>50,\"Sehr Gut\",\"\")","v":{"$error":"#DIV/0!"}}]
["RD 19",0,0,null,null,null,null,"RD 19",0,0,null,null,null,null,"RD 19",0,0,null,null,null,null,"RD 19",0,0]
["RD 20",0,0,null,null,null,null,"RD 20",0,0,null,null,null,null,"RD 20",0,0,null,null,null,null,"RD 20",0,0]
["RD 21",0,0,null,null,null,null,"RD 21",0,0,null,null,null,null,"RD 21",0,0,null,null,null,null,"RD 21",0,0]
["RD 22",0,0,null,null,null,null,"RD 22",0,0,null,null,null,null,"RD 22",0,0,null,null,null,null,"RD 22",0,0]
["RD 23",0,0,null,null,null,null,"RD 23",0,0,null,null,null,null,"RD 23",0,0,null,null,null,null,"RD 23",0,0]
["RD 24",0,0,null,null,null,null,"RD 24",0,0,null,null,null,null,"RD 24",0,0,null,null,null,null,"RD 24",0,0]
["RD 25",0,0,null,null,null,null,"RD 25",0,0,null,null,null,null,"RD 25",0,0,null,null,null,null,"RD 25",0,0]
["RD 26",0,0,null,null,null,null,"RD 26",0,0,null,null,null,null,"RD 26",0,0,null,null,null,null,"RD 26",0,0]
["RD 27",0,0,null,null,null,null,"RD 27",0,0,null,null,null,null,"RD 27",0,0,null,null,null,null,"RD 27",0,0]
["RD 28",0,0,null,null,null,null,"RD 28",0,0,null,null,null,null,"RD 28",0,0,null,null,null,null,"RD 28",0,0]
["RD 29",0,0,null,{"$f":"IF(E4=0,\"Sieg\",\"\")","v":""},null,null,"RD 29",0,0,null,{"$f":"IF(L4=0,\"Sieg\",\"\")","v":""},null,null,"RD 29",0,0,null,{"$f":"IF(S4=0,\"Sieg\",\"\")","v":""},null,null,"RD 29",0,0,null,{"$f":"IF(Z4=0,\"Sieg\",\"\")","v":""}]
["RD 30",0,0,null,null,null,null,"RD 30",0,0,null,null,null,null,"RD 30",0,0,null,null,null,null,"RD 30",0,0]
[null,{"$f":"SUM(B4:B33)","v":0},{"$f":"SUM(C4:C33)","v":0},{"$f":"SUM(D4:D33)","v":0},{"$f":"SUM(D4:D32)","v":0},null,null,null,{"$f":"SUM(I4:I33)","v":0},{"$f":"SUM(J4:J33)","v":0},{"$f":"SUM(K4:K33)","v":0},{"$f":"SUM(K4:K32)","v":0},null,null,null,{"$f":"SUM(P4:P33)","v":0},{"$f":"SUM(Q4:Q33)","v":0},{"$f":"SUM(R4:R33)","v":0},{"$f":"SUM(R4:R32)","v":0},null,null,null,{"$f":"SUM(W4:W33)","v":0},{"$f":"SUM(X4:X33)","v":0},{"$f":"SUM(Y4:Y33)","v":0},{"$f":"SUM(Y4:Y32)","v":0}]
[null,null,null,{"$f":"D1","v":"Ralf M."},null,{"$f":"SUM(E3)","v":0},null,null,null,null,{"$f":"INDEX(D35:D38,MATCH(LARGE(F35:F38,1),F35:F38,0))","v":"Ralf M."}]
[null,null,null,{"$f":"K1","v":"Ralf M."},null,{"$f":"SUM(L3)","v":0},null,null,null,null,{"$f":"INDEX(D35:D38,MATCH(LARGE(F35:F38,2),F35:F38,0))","v":"Ralf M."}]
[null,null,null,{"$f":"R1","v":"Ralf M."},null,{"$f":"SUM(S3)","v":0},null,null,null,null,{"$f":"INDEX(D35:D38,MATCH(LARGE(F35:F38,3),F35:F38,0))","v":"Ralf M."},null,null,null,null,null,null,null,null,null,null,null,null,null,null,null,null,null,null,null,"Micha"]
[null,null,null,{"$f":"Y1","v":"Ralf M."},null,{"$f":"SUM(Z3)","v":0},null,null,null,null,{"$f":"INDEX(D35:D38,MATCH(LARGE(F35:F38,4),F35:F38,0))","v":"Ralf M."}]
[null,null,null,"MAX(B2:B7",null,{"$f":"SUM(F35:F38)","v":0}]

{"sheet":"Rd.5","index":4,"n_rows":39,"n_cols":31,"rows_kept":39,"cut":false,"hidden":false,"merged":[[0,24,0,25],[7,4,7,5],[7,11,7,12],[7,18,7,19],[7,25,7,26],[0,3,0,4],[0,10,0,11],[0,17,0,18],[31,25,32,26],[26,4,30,5],[26,11,30,12],[13,18,16,19],[26,25,30,26],[13,25,16,26],[20,4,25,5],[20,11,25,12],[20,18,25,19],[20,25,25,26],[13,4,16,5],[26,18,30,19],[13,11,16,12],[18,25,18,26],[8,25,9,26],[10,4,12,5],[10,11,12,12],[10,18,12,19],[10,25,12,26],[8,4,9,5],[38,3,38,4],[8,11,9,12],[8,18,9,19],[31,4,32,5],[31,11,32,12],[31,18,32,19],[18,4,18,5],[18,11,18,12],[18,18,18,19]]}
[null,null,null,{"$f":"'Rd. 4'!AE4","v":"Ralf M."},null,"Sp.1",null,null,null,null,{"$f":"'Rd. 4'!AE3","v":"Ralf M."},null,"Sp.2",null,null,null,null,{"$f":"'Rd. 4'!AE2","v":"Ralf M."},null,"Sp.3",null,null,null,null,{"$f":"'Rd. 4'!AE1","v":"Ralf M."},null,"Sp.4",null,null,null,{"$f":"INDEX($D$35:$D$38,MATCH(LARGE($F$35:$F$38,ROW(AE1)),$F$35:$F$38,0))","v":"Ralf M."}]
[null,null,null,"Punkte",501,"Start",null,null,null,null,"Punkte",501,"Start",null,null,null,null,"Punkte",501,"Start",null,null,null,null,"Punkte",501,"Start",null,null,null,{"$f":"INDEX($D$35:$D$38,MATCH(LARGE($F$35:$F$38,ROW(AE2)),$F$35:$F$38,0))","v":"Ralf M."}]
[null,null,null,"Geworfen",{"$f":"SUM(D34)","v":0},"Punkte",null,null,null,null,"Geworfen",{"$f":"SUM(K34)","v":0},"Punkte",null,null,null,null,"Geworfen",{"$f":"SUM(R34)","v":0},"Punkte",null,null,null,null,"Geworfen",{"$f":"SUM(Y34)","v":0},"Punkte",null,null,null,"Ralf M."]
["RD 1",{"$f":"COUNT(D4)*1","v":0},{"$f":"COUNT(D4)*3","v":0},null,{"$f":"SUM(E2-E3)","v":501},"Rest",null,"RD 1",{"$f":"COUNT(K4)*1","v":0},{"$f":"COUNT(K4)*3","v":0},null,{"$f":"SUM(L2-L3)","v":501},"Rest",null,"RD 1",{"$f":"COUNT(R4)*1","v":0},{"$f":"COUNT(R4)*3","v":0},null,{"$f":"SUM(S2-S3)","v":501},"Rest",null,"RD 1",{"$f":"COUNT(Y4)*1","v":0},{"$f":"COUNT(Y4)*3","v":0},null,{"$f":"SUM(Z2-Z3)","v":501},"Rest",null,null,null,"Ralf M."]
["RD 2",0,0,null,null,null,null,"RD 2",0,0,null,null,null,null,"RD 2",0,0,null,null,null,null,"RD 2",0,0]
["RD 3",0,0,null,"ø pro Spiel",{"$f":"SUM(E3)/B34","v":{"$error":"#DIV/0!"}},null,"RD 3",0,0,null,"ø pro Spiel",{"$f":"SUM(L3)/I34","v":{"$error":"#DIV/0!"}},null,"RD 3",0,0,null,"ø pro Spiel",{"$f":"SUM(S3)/P34","v":{"$error":"#DIV/0!"}},null,"RD 3",0,0,null,"ø pro Spiel",{"$f":"SUM(Z3)/W34","v":{"$error":"#DIV/0!"}}]
["RD 4",0,0,null,"ø pro Pfeil",{"$f":"SUM(E3)/C34","v":{"$error":"#DIV/0!"}},null,"RD 4",0,0,null,"ø pro Pfeil",{"$f":"SUM(L3)/J34","v":{"$error":"#DIV/0!"}},null,"RD 4",0,0,null,"ø pro Pfeil",{"$f":"SUM(S3)/Q34","v":{"$error":"#DIV/0!"}},null,"RD 4",0,0,null,"ø pro Pfeil",{"$f":"SUM(Z3)/X34","v":{"$error":"#DIV/0!"}}]
["RD 5",0,0,null,"Average",null,null,"RD 5",0,0,null,"Average",null,null,"RD 5",0,0,null,"Average",null,null,"RD 5",0,0,null,"Average"]
["RD 6",0,0,null,{"$f":"SUM(F6)","v":{"$error":"#DIV/0!"}},null,null,"RD 6",0,0,null,{"$f":"SUM(M6)","v":{"$error":"#DIV/0!"}},null,null,"RD 6",0,0,null,{"$f":"SUM(T6)","v":{"$error":"#DIV/0!"}},null,null,"RD 6",0,0,null,{"$f":"SUM(AA6)","v":{"$error":"#DIV/0!"}}]
["RD 7",0,0,null,null,null,null,"RD 7",0,0,null,null,null,null,"RD 7",0,0,null,null,null,null,"RD 7",0,0]
["RD 8",0,0,null,{"$f":"IF(F6<40,\"Nicht Gut\",\"\")","v":{"$error":"#DIV/0!"}},null,null,"RD 8",0,0,null,{"$f":"IF(M6<40,\"Nicht Gut\",\"\")","v":{"$error":"#DIV/0!"}},null,null,"RD 8",0,0,null,{"$f":"IF(T6<40,\"Nicht Gut\",\"\")","v":{"$error":"#DIV/0!"}},null,null,"RD 8",0,0,null,{"$f":"IF(AA6<40,\"Nicht Gut\",\"\")","v":{"$error":"#DIV/0!"}}]
["RD 9",0,0,null,null,null,null,"RD 9",0,0,null,null,null,null,"RD 9",0,0,null,null,null,null,"RD 9",0,0]
["RD 10",0,0,null,null,null,null,"RD 10",0,0,null,null,null,null,"RD 10",0,0,null,null,null,null,"RD 10",0,0]
["RD 11",0,0,null,{"$f":"IF(AND(F6>=40,F6<=50),\"GUT\",\"\")","v":{"$error":"#DIV/0!"}},null,null,"RD 11",0,0,null,{"$f":"IF(AND(M6>=40,M6<=50),\"GUT\",\"\")","v":{"$error":"#DIV/0!"}},null,null,"RD 11",0,0,null,{"$f":"IF(AND(T6>=40,T6<=50),\"GUT\",\"\")","v":{"$error":"#DIV/0!"}},null,null,"RD 11",0,0,null,{"$f":"IF(AND(AA6>=40,AA6<=50),\"GUT\",\"\")","v":{"$error":"#DIV/0!"}}]
["RD 12",0,0,null,null,null,null,"RD 12",0,0,null,null,null,null,"RD 12",0,0,null,null,null,null,"RD 12",0,0]
["RD 13",0,0,null,null,null,null,"RD 13",0,0,null,null,null,null,"RD 13",0,0,null,null,null,null,"RD 13",0,0]
["RD 14",0,0,null,null,null,null,"RD 14",0,0,null,null,null,null,"RD 14",0,0,null,null,null,null,"RD 14",0,0]
["RD 15",0,0,null,null,null,null,"RD 15",0,0,null,null,null,null,"RD 15",0,0,null,null,null,null,"RD 15",0,0]
["RD 16",0,0,null,{"$f":"D1","v":"Ralf M."},{"$f":"E4","v":501},null,"RD 16",0,0,null,{"$f":"K1","v":"Ralf M."},{"$f":"L4","v":501},null,"RD 16",0,0,null,{"$f":"R1","v":"Ralf M."},{"$f":"S4","v":501},null,"RD 16",0,0,null,{"$f":"Y1","v":"Ralf M."},{"$f":"Z4","v":501}]
["RD 17",0,0,null,"Rest",{"$f":"E4","v":501},null,"RD 17",0,0,null,"Rest",{"$f":"L4","v":501},null,"RD 17",0,0,null,"Rest",{"$f":"S4","v":501},null,"RD 17",0,0,null,"Rest",{"$f":"Z4","v":501}]
["RD 18",0,0,null,{"$f":"IF(F6>50,\"Sehr Gut\",\"\")","v":{"$error":"#DIV/0!"}},null,null,"RD 18",0,0,null,{"$f":"IF(M6>50,\"Sehr Gut\",\"\")","v":{"$error":"#DIV/0!"}},null,null,"RD 18",0,0,null,{"$f":"IF(T6>50,\"Sehr Gut\",\"\")","v":{"$error":"#DIV/0!"}},null,null,"RD 18",0,0,null,{"$f":"IF(AA6>50,\"Sehr Gut\",\"\")","v":{"$error":"#DIV/0!"}}]
["RD 19",0,0,null,null,null,null,"RD 19",0,0,null,null,null,null,"RD 19",0,0,null,null,null,null,"RD 19",0,0]
["RD 20",0,0,null,null,null,null,"RD 20",0,0,null,null,null,null,"RD 20",0,0,null,null,null,null,"RD 20",0,0]
["RD 21",0,0,null,null,null,null,"RD 21",0,0,null,null,null,null,"RD 21",0,0,null,null,null,null,"RD 21",0,0]
["RD 22",0,0,null,null,null,null,"RD 22",0,0,null,null,null,null,"RD 22",0,0,null,null,null,null,"RD 22",0,0]
["RD 23",0,0,null,null,null,null,"RD 23",0,0,null,null,null,null,"RD 23",0,0,null,null,null,null,"RD 23",0,0]
["RD 24",0,0,null,null,null,null,"RD 24",0,0,null,null,null,null,"RD 24",0,0,null,null,null,null,"RD 24",0,0]
["RD 25",0,0,null,null,null,null,"RD 25",0,0,null,null,null,null,"RD 25",0,0,null,null,null,null,"RD 25",0,0]
["RD 26",0,0,null,null,null,null,"RD 26",0,0,null,null,null,null,"RD 26",0,0,null,null,null,null,"RD 26",0,0]
["RD 27",0,0,null,null,null,null,"RD 27",0,0,null,null,null,null,"RD 27",0,0,null,null,null,null,"RD 27",0,0]
["RD 28",0,0,null,null,null,null,"RD 28",0,0,null,null,null,null,"RD 28",0,0,null,null,null,null,"RD 28",0,0]
["RD 29",0,0,null,{"$f":"IF(E4=0,\"Sieg\",\"\")","v":""},null,null,"RD 29",0,0,null,{"$f":"IF(L4=0,\"Sieg\",\"\")","v":""},null,null,"RD 29",0,0,null,{"$f":"IF(S4=0,\"Sieg\",\"\")","v":""},null,null,"RD 29",0,0,null,{"$f":"IF(Z4=0,\"Sieg\",\"\")","v":""}]
["RD 30",0,0,null,null,null,null,"RD 30",0,0,null,null,null,null,"RD 30",0,0,null,null,null,null,"RD 30",0,0]
[null,{"$f":"SUM(B4:B33)","v":0},{"$f":"SUM(C4:C33)","v":0},{"$f":"SUM(D4:D33)","v":0},{"$f":"SUM(D4:D32)","v":0},null,null,null,{"$f":"SUM(I4:I33)","v":0},{"$f":"SUM(J4:J33)","v":0},{"$f":"SUM(K4:K33)","v":0},{"$f":"SUM(K4:K32)","v":0},null,null,null,{"$f":"SUM(P4:P33)","v":0},{"$f":"SUM(Q4:Q33)","v":0},{"$f":"SUM(R4:R33)","v":0},{"$f":"SUM(R4:R32)","v":0},null,null,null,{"$f":"SUM(W4:W33)","v":0},{"$f":"SUM(X4:X33)","v":0},{"$f":"SUM(Y4:Y33)","v":0},{"$f":"SUM(Y4:Y32)","v":0}]
[null,null,null,{"$f":"D1","v":"Ralf M."},null,{"$f":"SUM(E3)","v":0},null,null,null,null,{"$f":"INDEX(D35:D38,MATCH(LARGE(F35:F38,1),F35:F38,0))","v":"Ralf M."}]
[null,null,null,{"$f":"K1","v":"Ralf M."},null,{"$f":"SUM(L3)","v":0},null,null,null,null,{"$f":"INDEX(D35:D38,MATCH(LARGE(F35:F38,2),F35:F38,0))","v":"Ralf M."}]
[null,null,null,{"$f":"R1","v":"Ralf M."},null,{"$f":"SUM(S3)","v":0},null,null,null,null,{"$f":"INDEX(D35:D38,MATCH(LARGE(F35:F38,3),F35:F38,0))","v":"Ralf M."},null,null,null,null,null,null,null,null,null,null,null,null,null,null,null,null,null,null,null,"Micha"]
[null,null,null,{"$f":"Y1","v":"Ralf M."},null,{"$f":"SUM(Z3)","v":0},null,null,null,null,{"$f":"INDEX(D35:D38,MATCH(LARGE(F35:F38,4),F35:F38,0))","v":"Ralf M."}]
[null,null,null,"MAX(B2:B7",null,{"$f":"SUM(F35:F38)","v":0}]

{"sheet":"Rd.6","index":5,"n_rows":39,"n_cols":31,"rows_kept":39,"cut":false,"hidden":false,"merged":[[0,24,0,25],[7,4,7,5],[7,11,7,12],[7,18,7,19],[7,25,7,26],[0,3,0,4],[0,10,0,11],[0,17,0,18],[31,25,32,26],[26,4,30,5],[26,11,30,12],[13,18,16,19],[26,25,30,26],[13,25,16,26],[20,4,25,5],[20,11,25,12],[20,18,25,19],[20,25,25,26],[13,4,16,5],[26,18,30,19],[13,11,16,12],[18,25,18,26],[8,25,9,26],[10,4,12,5],[10,11,12,12],[10,18,12,19],[10,25,12,26],[8,4,9,5],[38,3,38,4],[8,11,9,12],[8,18,9,19],[31,4,32,5],[31,11,32,12],[31,18,32,19],[18,4,18,5],[18,11,18,12],[18,18,18,19]]}
[null,null,null,{"$f":"'Rd.5'!AE4","v":"Ralf M."},null,"Sp.1",null,null,null,null,{"$f":"'Rd.5'!AE3","v":"Ralf M."},null,"Sp.2",null,null,null,null,{"$f":"'Rd.5'!AE2","v":"Ralf M."},null,"Sp.3",null,null,null,null,{"$f":"'Rd.5'!AE1","v":"Ralf M."},null,"Sp.4",null,null,null,{"$f":"INDEX($D$35:$D$38,MATCH(LARGE($F$35:$F$38,ROW(AE1)),$F$35:$F$38,0))","v":"Ralf M."}]
[null,null,null,"Punkte",501,"Start",null,null,null,null,"Punkte",501,"Start",null,null,null,null,"Punkte",501,"Start",null,null,null,null,"Punkte",501,"Start",null,null,null,{"$f":"INDEX($D$35:$D$38,MATCH(LARGE($F$35:$F$38,ROW(AE2)),$F$35:$F$38,0))","v":"Ralf M."}]
[null,null,null,"Geworfen",{"$f":"SUM(D34)","v":0},"Punkte",null,null,null,null,"Geworfen",{"$f":"SUM(K34)","v":0},"Punkte",null,null,null,null,"Geworfen",{"$f":"SUM(R34)","v":0},"Punkte",null,null,null,null,"Geworfen",{"$f":"SUM(Y34)","v":0},"Punkte",null,null,null,"Ralf M."]
["RD 1",{"$f":"COUNT(D4)*1","v":0},{"$f":"COUNT(D4)*3","v":0},null,{"$f":"SUM(E2-E3)","v":501},"Rest",null,"RD 1",{"$f":"COUNT(K4)*1","v":0},{"$f":"COUNT(K4)*3","v":0},null,{"$f":"SUM(L2-L3)","v":501},"Rest",null,"RD 1",{"$f":"COUNT(R4)*1","v":0},{"$f":"COUNT(R4)*3","v":0},null,{"$f":"SUM(S2-S3)","v":501},"Rest",null,"RD 1",{"$f":"COUNT(Y4)*1","v":0},{"$f":"COUNT(Y4)*3","v":0},null,{"$f":"SUM(Z2-Z3)","v":501},"Rest",null,null,null,"Ralf M."]
["RD 2",0,0,null,null,null,null,"RD 2",0,0,null,null,null,null,"RD 2",0,0,null,null,null,null,"RD 2",0,0]
["RD 3",0,0,null,"ø pro Spiel",{"$f":"SUM(E3)/B34","v":{"$error":"#DIV/0!"}},null,"RD 3",0,0,null,"ø pro Spiel",{"$f":"SUM(L3)/I34","v":{"$error":"#DIV/0!"}},null,"RD 3",0,0,null,"ø pro Spiel",{"$f":"SUM(S3)/P34","v":{"$error":"#DIV/0!"}},null,"RD 3",0,0,null,"ø pro Spiel",{"$f":"SUM(Z3)/W34","v":{"$error":"#DIV/0!"}}]
["RD 4",0,0,null,"ø pro Pfeil",{"$f":"SUM(E3)/C34","v":{"$error":"#DIV/0!"}},null,"RD 4",0,0,null,"ø pro Pfeil",{"$f":"SUM(L3)/J34","v":{"$error":"#DIV/0!"}},null,"RD 4",0,0,null,"ø pro Pfeil",{"$f":"SUM(S3)/Q34","v":{"$error":"#DIV/0!"}},null,"RD 4",0,0,null,"ø pro Pfeil",{"$f":"SUM(Z3)/X34","v":{"$error":"#DIV/0!"}}]
["RD 5",0,0,null,"Average",null,null,"RD 5",0,0,null,"Average",null,null,"RD 5",0,0,null,"Average",null,null,"RD 5",0,0,null,"Average"]
["RD 6",0,0,null,{"$f":"SUM(F6)","v":{"$error":"#DIV/0!"}},null,null,"RD 6",0,0,null,{"$f":"SUM(M6)","v":{"$error":"#DIV/0!"}},null,null,"RD 6",0,0,null,{"$f":"SUM(T6)","v":{"$error":"#DIV/0!"}},null,null,"RD 6",0,0,null,{"$f":"SUM(AA6)","v":{"$error":"#DIV/0!"}}]
["RD 7",0,0,null,null,null,null,"RD 7",0,0,null,null,null,null,"RD 7",0,0,null,null,null,null,"RD 7",0,0]
["RD 8",0,0,null,{"$f":"IF(F6<40,\"Nicht Gut\",\"\")","v":{"$error":"#DIV/0!"}},null,null,"RD 8",0,0,null,{"$f":"IF(M6<40,\"Nicht Gut\",\"\")","v":{"$error":"#DIV/0!"}},null,null,"RD 8",0,0,null,{"$f":"IF(T6<40,\"Nicht Gut\",\"\")","v":{"$error":"#DIV/0!"}},null,null,"RD 8",0,0,null,{"$f":"IF(AA6<40,\"Nicht Gut\",\"\")","v":{"$error":"#DIV/0!"}}]
["RD 9",0,0,null,null,null,null,"RD 9",0,0,null,null,null,null,"RD 9",0,0,null,null,null,null,"RD 9",0,0]
["RD 10",0,0,null,null,null,null,"RD 10",0,0,null,null,null,null,"RD 10",0,0,null,null,null,null,"RD 10",0,0]
["RD 11",0,0,null,{"$f":"IF(AND(F6>=40,F6<=50),\"GUT\",\"\")","v":{"$error":"#DIV/0!"}},null,null,"RD 11",0,0,null,{"$f":"IF(AND(M6>=40,M6<=50),\"GUT\",\"\")","v":{"$error":"#DIV/0!"}},null,null,"RD 11",0,0,null,{"$f":"IF(AND(T6>=40,T6<=50),\"GUT\",\"\")","v":{"$error":"#DIV/0!"}},null,null,"RD 11",0,0,null,{"$f":"IF(AND(AA6>=40,AA6<=50),\"GUT\",\"\")","v":{"$error":"#DIV/0!"}}]
["RD 12",0,0,null,null,null,null,"RD 12",0,0,null,null,null,null,"RD 12",0,0,null,null,null,null,"RD 12",0,0]
["RD 13",0,0,null,null,null,null,"RD 13",0,0,null,null,null,null,"RD 13",0,0,null,null,null,null,"RD 13",0,0]
["RD 14",0,0,null,null,null,null,"RD 14",0,0,null,null,null,null,"RD 14",0,0,null,null,null,null,"RD 14",0,0]
["RD 15",0,0,null,null,null,null,"RD 15",0,0,null,null,null,null,"RD 15",0,0,null,null,null,null,"RD 15",0,0]
["RD 16",0,0,null,{"$f":"D1","v":"Ralf M."},{"$f":"E4","v":501},null,"RD 16",0,0,null,{"$f":"K1","v":"Ralf M."},{"$f":"L4","v":501},null,"RD 16",0,0,null,{"$f":"R1","v":"Ralf M."},{"$f":"S4","v":501},null,"RD 16",0,0,null,{"$f":"Y1","v":"Ralf M."},{"$f":"Z4","v":501}]
["RD 17",0,0,null,"Rest",{"$f":"E4","v":501},null,"RD 17",0,0,null,"Rest",{"$f":"L4","v":501},null,"RD 17",0,0,null,"Rest",{"$f":"S4","v":501},null,"RD 17",0,0,null,"Rest",{"$f":"Z4","v":501}]
["RD 18",0,0,null,{"$f":"IF(F6>50,\"Sehr Gut\",\"\")","v":{"$error":"#DIV/0!"}},null,null,"RD 18",0,0,null,{"$f":"IF(M6>50,\"Sehr Gut\",\"\")","v":{"$error":"#DIV/0!"}},null,null,"RD 18",0,0,null,{"$f":"IF(T6>50,\"Sehr Gut\",\"\")","v":{"$error":"#DIV/0!"}},null,null,"RD 18",0,0,null,{"$f":"IF(AA6>50,\"Sehr Gut\",\"\")","v":{"$error":"#DIV/0!"}}]
["RD 19",0,0,null,null,null,null,"RD 19",0,0,null,null,null,null,"RD 19",0,0,null,null,null,null,"RD 19",0,0]
["RD 20",0,0,null,null,null,null,"RD 20",0,0,null,null,null,null,"RD 20",0,0,null,null,null,null,"RD 20",0,0]
["RD 21",0,0,null,null,null,null,"RD 21",0,0,null,null,null,null,"RD 21",0,0,null,null,null,null,"RD 21",0,0]
["RD 22",0,0,null,null,null,null,"RD 22",0,0,null,null,null,null,"RD 22",0,0,null,null,null,null,"RD 22",0,0]
["RD 23",0,0,null,null,null,null,"RD 23",0,0,null,null,null,null,"RD 23",0,0,null,null,null,null,"RD 23",0,0]
["RD 24",0,0,null,null,null,null,"RD 24",0,0,null,null,null,null,"RD 24",0,0,null,null,null,null,"RD 24",0,0]
["RD 25",0,0,null,null,null,null,"RD 25",0,0,null,null,null,null,"RD 25",0,0,null,null,null,null,"RD 25",0,0]
["RD 26",0,0,null,null,null,null,"RD 26",0,0,null,null,null,null,"RD 26",0,0,null,null,null,null,"RD 26",0,0]
["RD 27",0,0,null,null,null,null,"RD 27",0,0,null,null,null,null,"RD 27",0,0,null,null,null,null,"RD 27",0,0]
["RD 28",0,0,null,null,null,null,"RD 28",0,0,null,null,null,null,"RD 28",0,0,null,null,null,null,"RD 28",0,0]
["RD 29",0,0,null,{"$f":"IF(E4=0,\"Sieg\",\"\")","v":""},null,null,"RD 29",0,0,null,{"$f":"IF(L4=0,\"Sieg\",\"\")","v":""},null,null,"RD 29",0,0,null,{"$f":"IF(S4=0,\"Sieg\",\"\")","v":""},null,null,"RD 29",0,0,null,{"$f":"IF(Z4=0,\"Sieg\",\"\")","v":""}]
["RD 30",0,0,null,null,null,null,"RD 30",0,0,null,null,null,null,"RD 30",0,0,null,null,null,null,"RD 30",0,0]
[null,{"$f":"SUM(B4:B33)","v":0},{"$f":"SUM(C4:C33)","v":0},{"$f":"SUM(D4:D33)","v":0},{"$f":"SUM(D4:D32)","v":0},null,null,null,{"$f":"SUM(I4:I33)","v":0},{"$f":"SUM(J4:J33)","v":0},{"$f":"SUM(K4:K33)","v":0},{"$f":"SUM(K4:K32)","v":0},null,null,null,{"$f":"SUM(P4:P33)","v":0},{"$f":"SUM(Q4:Q33)","v":0},{"$f":"SUM(R4:R33)","v":0},{"$f":"SUM(R4:R32)","v":0},null,null,null,{"$f":"SUM(W4:W33)","v":0},{"$f":"SUM(X4:X33)","v":0},{"$f":"SUM(Y4:Y33)","v":0},{"$f":"SUM(Y4:Y32)","v":0}]
[null,null,null,{"$f":"D1","v":"Ralf M."},null,{"$f":"SUM(E3)","v":0},null,null,null,null,{"$f":"INDEX(D35:D38,MATCH(LARGE(F35:F38,1),F35:F38,0))","v":"Ralf M."}]
[null,null,null,{"$f":"K1","v":"Ralf M."},null,{"$f":"SUM(L3)","v":0},null,null,null,null,{"$f":"INDEX(D35:D38,MATCH(LARGE(F35:F38,2),F35:F38,0))","v":"Ralf M."}]
[null,null,null,{"$f":"R1","v":"Ralf M."},null,{"$f":"SUM(S3)","v":0},null,null,null,null,{"$f":"INDEX(D35:D38,MATCH(LARGE(F35:F38,3),F35:F38,0))","v":"Ralf M."},null,null,null,null,null,null,null,null,null,null,null,null,null,null,null,null,null,null,null,"Micha"]
[null,null,null,{"$f":"Y1","v":"Ralf M."},null,{"$f":"SUM(Z3)","v":0},null,null,null,null,{"$f":"INDEX(D35:D38,MATCH(LARGE(F35:F38,4),F35:F38,0))","v":"Ralf M."}]
[null,null,null,"MAX(B2:B7",null,{"$f":"SUM(F35:F38)","v":0}]

{"sheet":"Rd. 7","index":6,"n_rows":39,"n_cols":31,"rows_kept":39,"cut":false,"hidden":false,"merged":[[0,24,0,25],[7,4,7,5],[7,11,7,12],[7,18,7,19],[7,25,7,26],[0,3,0,4],[0,10,0,11],[0,17,0,18],[31,25,32,26],[26,4,30,5],[26,11,30,12],[13,18,16,19],[26,25,30,26],[13,25,16,26],[20,4,25,5],[20,11,25,12],[20,18,25,19],[20,25,25,26],[13,4,16,5],[26,18,30,19],[13,11,16,12],[18,25,18,26],[8,25,9,26],[10,4,12,5],[10,11,12,12],[10,18,12,19],[10,25,12,26],[8,4,9,5],[38,3,38,4],[8,11,9,12],[8,18,9,19],[31,4,32,5],[31,11,32,12],[31,18,32,19],[18,4,18,5],[18,11,18,12],[18,18,18,19]]}
[null,null,null,{"$f":"'Rd.6'!AE4","v":"Ralf M."},null,"Sp.1",null,null,null,null,{"$f":"'Rd.6'!AE3","v":"Ralf M."},null,"Sp.2",null,null,null,null,{"$f":"'Rd.6'!AE2","v":"Ralf M."},null,"Sp.3",null,null,null,null,{"$f":"'Rd.6'!AE1","v":"Ralf M."},null,"Sp.4",null,null,null,{"$f":"INDEX($D$35:$D$38,MATCH(LARGE($F$35:$F$38,ROW(AE1)),$F$35:$F$38,0))","v":"Ralf M."}]
[null,null,null,"Punkte",501,"Start",null,null,null,null,"Punkte",501,"Start",null,null,null,null,"Punkte",501,"Start",null,null,null,null,"Punkte",501,"Start",null,null,null,{"$f":"INDEX($D$35:$D$38,MATCH(LARGE($F$35:$F$38,ROW(AE2)),$F$35:$F$38,0))","v":"Ralf M."}]
[null,null,null,"Geworfen",{"$f":"SUM(D34)","v":0},"Punkte",null,null,null,null,"Geworfen",{"$f":"SUM(K34)","v":0},"Punkte",null,null,null,null,"Geworfen",{"$f":"SUM(R34)","v":0},"Punkte",null,null,null,null,"Geworfen",{"$f":"SUM(Y34)","v":0},"Punkte",null,null,null,"Ralf M."]
["RD 1",{"$f":"COUNT(D4)*1","v":0},{"$f":"COUNT(D4)*3","v":0},null,{"$f":"SUM(E2-E3)","v":501},"Rest",null,"RD 1",{"$f":"COUNT(K4)*1","v":0},{"$f":"COUNT(K4)*3","v":0},null,{"$f":"SUM(L2-L3)","v":501},"Rest",null,"RD 1",{"$f":"COUNT(R4)*1","v":0},{"$f":"COUNT(R4)*3","v":0},null,{"$f":"SUM(S2-S3)","v":501},"Rest",null,"RD 1",{"$f":"COUNT(Y4)*1","v":0},{"$f":"COUNT(Y4)*3","v":0},null,{"$f":"SUM(Z2-Z3)","v":501},"Rest",null,null,null,"Ralf M."]
["RD 2",0,0,null,null,null,null,"RD 2",0,0,null,null,null,null,"RD 2",0,0,null,null,null,null,"RD 2",0,0]
["RD 3",0,0,null,"ø pro Spiel",{"$f":"SUM(E3)/B34","v":{"$error":"#DIV/0!"}},null,"RD 3",0,0,null,"ø pro Spiel",{"$f":"SUM(L3)/I34","v":{"$error":"#DIV/0!"}},null,"RD 3",0,0,null,"ø pro Spiel",{"$f":"SUM(S3)/P34","v":{"$error":"#DIV/0!"}},null,"RD 3",0,0,null,"ø pro Spiel",{"$f":"SUM(Z3)/W34","v":{"$error":"#DIV/0!"}}]
["RD 4",0,0,null,"ø pro Pfeil",{"$f":"SUM(E3)/C34","v":{"$error":"#DIV/0!"}},null,"RD 4",0,0,null,"ø pro Pfeil",{"$f":"SUM(L3)/J34","v":{"$error":"#DIV/0!"}},null,"RD 4",0,0,null,"ø pro Pfeil",{"$f":"SUM(S3)/Q34","v":{"$error":"#DIV/0!"}},null,"RD 4",0,0,null,"ø pro Pfeil",{"$f":"SUM(Z3)/X34","v":{"$error":"#DIV/0!"}}]
["RD 5",0,0,null,"Average",null,null,"RD 5",0,0,null,"Average",null,null,"RD 5",0,0,null,"Average",null,null,"RD 5",0,0,null,"Average"]
["RD 6",0,0,null,{"$f":"SUM(F6)","v":{"$error":"#DIV/0!"}},null,null,"RD 6",0,0,null,{"$f":"SUM(M6)","v":{"$error":"#DIV/0!"}},null,null,"RD 6",0,0,null,{"$f":"SUM(T6)","v":{"$error":"#DIV/0!"}},null,null,"RD 6",0,0,null,{"$f":"SUM(AA6)","v":{"$error":"#DIV/0!"}}]
["RD 7",0,0,null,null,null,null,"RD 7",0,0,null,null,null,null,"RD 7",0,0,null,null,null,null,"RD 7",0,0]
["RD 8",0,0,null,{"$f":"IF(F6<40,\"Nicht Gut\",\"\")","v":{"$error":"#DIV/0!"}},null,null,"RD 8",0,0,null,{"$f":"IF(M6<40,\"Nicht Gut\",\"\")","v":{"$error":"#DIV/0!"}},null,null,"RD 8",0,0,null,{"$f":"IF(T6<40,\"Nicht Gut\",\"\")","v":{"$error":"#DIV/0!"}},null,null,"RD 8",0,0,null,{"$f":"IF(AA6<40,\"Nicht Gut\",\"\")","v":{"$error":"#DIV/0!"}}]
["RD 9",0,0,null,null,null,null,"RD 9",0,0,null,null,null,null,"RD 9",0,0,null,null,null,null,"RD 9",0,0]
["RD 10",0,0,null,null,null,null,"RD 10",0,0,null,null,null,null,"RD 10",0,0,null,null,null,null,"RD 10",0,0]
["RD 11",0,0,null,{"$f":"IF(AND(F6>=40,F6<=50),\"GUT\",\"\")","v":{"$error":"#DIV/0!"}},null,null,"RD 11",0,0,null,{"$f":"IF(AND(M6>=40,M6<=50),\"GUT\",\"\")","v":{"$error":"#DIV/0!"}},null,null,"RD 11",0,0,null,{"$f":"IF(AND(T6>=40,T6<=50),\"GUT\",\"\")","v":{"$error":"#DIV/0!"}},null,null,"RD 11",0,0,null,{"$f":"IF(AND(AA6>=40,AA6<=50),\"GUT\",\"\")","v":{"$error":"#DIV/0!"}}]
["RD 12",0,0,null,null,null,null,"RD 12",0,0,null,null,null,null,"RD 12",0,0,null,null,null,null,"RD 12",0,0]
["RD 13",0,0,null,null,null,null,"RD 13",0,0,null,null,null,null,"RD 13",0,0,null,null,null,null,"RD 13",0,0]
["RD 14",0,0,null,null,null,null,"RD 14",0,0,null,null,null,null,"RD 14",0,0,null,null,null,null,"RD 14",0,0]
["RD 15",0,0,null,null,null,null,"RD 15",0,0,null,null,null,null,"RD 15",0,0,null,null,null,null,"RD 15",0,0]
["RD 16",0,0,null,{"$f":"D1","v":"Ralf M."},{"$f":"E4","v":501},null,"RD 16",0,0,null,{"$f":"K1","v":"Ralf M."},{"$f":"L4","v":501},null,"RD 16",0,0,null,{"$f":"R1","v":"Ralf M."},{"$f":"S4","v":501},null,"RD 16",0,0,null,{"$f":"Y1","v":"Ralf M."},{"$f":"Z4","v":501}]
["RD 17",0,0,null,"Rest",{"$f":"E4","v":501},null,"RD 17",0,0,null,"Rest",{"$f":"L4","v":501},null,"RD 17",0,0,null,"Rest",{"$f":"S4","v":501},null,"RD 17",0,0,null,"Rest",{"$f":"Z4","v":501}]
["RD 18",0,0,null,{"$f":"IF(F6>50,\"Sehr Gut\",\"\")","v":{"$error":"#DIV/0!"}},null,null,"RD 18",0,0,null,{"$f":"IF(M6>50,\"Sehr Gut\",\"\")","v":{"$error":"#DIV/0!"}},null,null,"RD 18",0,0,null,{"$f":"IF(T6>50,\"Sehr Gut\",\"\")","v":{"$error":"#DIV/0!"}},null,null,"RD 18",0,0,null,{"$f":"IF(AA6>50,\"Sehr Gut\",\"\")","v":{"$error":"#DIV/0!"}}]
["RD 19",0,0,null,null,null,null,"RD 19",0,0,null,null,null,null,"RD 19",0,0,null,null,null,null,"RD 19",0,0]
["RD 20",0,0,null,null,null,null,"RD 20",0,0,null,null,null,null,"RD 20",0,0,null,null,null,null,"RD 20",0,0]
["RD 21",0,0,null,null,null,null,"RD 21",0,0,null,null,null,null,"RD 21",0,0,null,null,null,null,"RD 21",0,0]
["RD 22",0,0,null,null,null,null,"RD 22",0,0,null,null,null,null,"RD 22",0,0,null,null,null,null,"RD 22",0,0]
["RD 23",0,0,null,null,null,null,"RD 23",0,0,null,null,null,null,"RD 23",0,0,null,null,null,null,"RD 23",0,0]
["RD 24",0,0,null,null,null,null,"RD 24",0,0,null,null,null,null,"RD 24",0,0,null,null,null,null,"RD 24",0,0]
["RD 25",0,0,null,null,null,null,"RD 25",0,0,null,null,null,null,"RD 25",0,0,null,null,null,null,"RD 25",0,0]
["RD 26",0,0,null,null,null,null,"RD 26",0,0,null,null,null,null,"RD 26",0,0,null,null,null,null,"RD 26",0,0]
["RD 27",0,0,null,null,null,null,"RD 27",0,0,null,null,null,null,"RD 27",0,0,null,null,null,null,"RD 27",0,0]
["RD 28",0,0,null,null,null,null,"RD 28",0,0,null,null,null,null,"RD 28",0,0,null,null,null,null,"RD 28",0,0]
["RD 29",0,0,null,{"$f":"IF(E4=0,\"Sieg\",\"\")","v":""},null,null,"RD 29",0,0,null,{"$f":"IF(L4=0,\"Sieg\",\"\")","v":""},null,null,"RD 29",0,0,null,{"$f":"IF(S4=0,\"Sieg\",\"\")","v":""},null,null,"RD 29",0,0,null,{"$f":"IF(Z4=0,\"Sieg\",\"\")","v":""}]
["RD 30",0,0,null,null,null,null,"RD 30",0,0,null,null,null,null,"RD 30",0,0,null,null,null,null,"RD 30",0,0]
[null,{"$f":"SUM(B4:B33)","v":0},{"$f":"SUM(C4:C33)","v":0},{"$f":"SUM(D4:D33)","v":0},{"$f":"SUM(D4:D32)","v":0},null,null,null,{"$f":"SUM(I4:I33)","v":0},{"$f":"SUM(J4:J33)","v":0},{"$f":"SUM(K4:K33)","v":0},{"$f":"SUM(K4:K32)","v":0},null,null,null,{"$f":"SUM(P4:P33)","v":0},{"$f":"SUM(Q4:Q33)","v":0},{"$f":"SUM(R4:R33)","v":0},{"$f":"SUM(R4:R32)","v":0},null,null,null,{"$f":"SUM(W4:W33)","v":0},{"$f":"SUM(X4:X33)","v":0},{"$f":"SUM(Y4:Y33)","v":0},{"$f":"SUM(Y4:Y32)","v":0}]
[null,null,null,{"$f":"D1","v":"Ralf M."},null,{"$f":"SUM(E3)","v":0},null,null,null,null,{"$f":"INDEX(D35:D38,MATCH(LARGE(F35:F38,1),F35:F38,0))","v":"Ralf M."}]
[null,null,null,{"$f":"K1","v":"Ralf M."},null,{"$f":"SUM(L3)","v":0},null,null,null,null,{"$f":"INDEX(D35:D38,MATCH(LARGE(F35:F38,2),F35:F38,0))","v":"Ralf M."}]
[null,null,null,{"$f":"R1","v":"Ralf M."},null,{"$f":"SUM(S3)","v":0},null,null,null,null,{"$f":"INDEX(D35:D38,MATCH(LARGE(F35:F38,3),F35:F38,0))","v":"Ralf M."},null,null,null,null,null,null,null,null,null,null,null,null,null,null,null,null,null,null,null,"Micha"]
[null,null,null,{"$f":"Y1","v":"Ralf M."},null,{"$f":"SUM(Z3)","v":0},null,null,null,null,{"$f":"INDEX(D35:D38,MATCH(LARGE(F35:F38,4),F35:F38,0))","v":"Ralf M."}]
[null,null,null,"MAX(B2:B7",null,{"$f":"SUM(F35:F38)","v":0}]

{"sheet":"Rd. 8","index":7,"n_rows":39,"n_cols":31,"rows_kept":39,"cut":false,"hidden":false,"merged":[[0,24,0,25],[7,4,7,5],[7,11,7,12],[7,18,7,19],[7,25,7,26],[0,3,0,4],[0,10,0,11],[0,17,0,18],[31,25,32,26],[26,4,30,5],[26,11,30,12],[13,18,16,19],[26,25,30,26],[13,25,16,26],[20,4,25,5],[20,11,25,12],[20,18,25,19],[20,25,25,26],[13,4,16,5],[26,18,30,19],[13,11,16,12],[18,25,18,26],[8,25,9,26],[10,4,12,5],[10,11,12,12],[10,18,12,19],[10,25,12,26],[8,4,9,5],[38,3,38,4],[8,11,9,12],[8,18,9,19],[31,4,32,5],[31,11,32,12],[31,18,32,19],[18,4,18,5],[18,11,18,12],[18,18,18,19]]}
[null,null,null,{"$f":"'Rd. 7'!AE4","v":"Ralf M."},null,"Sp.1",null,null,null,null,{"$f":"'Rd. 7'!AE3","v":"Ralf M."},null,"Sp.2",null,null,null,null,{"$f":"'Rd. 7'!AE2","v":"Ralf M."},null,"Sp.3",null,null,null,null,{"$f":"'Rd. 7'!AE1","v":"Ralf M."},null,"Sp. 4",null,null,null,{"$f":"INDEX($D$35:$D$38,MATCH(LARGE($F$35:$F$38,ROW(AE1)),$F$35:$F$38,0))","v":"Ralf M."}]
[null,null,null,"Punkte",501,"Start",null,null,null,null,"Punkte",501,"Start",null,null,null,null,"Punkte",501,"Start",null,null,null,null,"Punkte",501,"Start",null,null,null,{"$f":"INDEX($D$35:$D$38,MATCH(LARGE($F$35:$F$38,ROW(AE2)),$F$35:$F$38,0))","v":"Ralf M."}]
[null,null,null,"Geworfen",{"$f":"SUM(D34)","v":0},"Punkte",null,null,null,null,"Geworfen",{"$f":"SUM(K34)","v":0},"Punkte",null,null,null,null,"Geworfen",{"$f":"SUM(R34)","v":0},"Punkte",null,null,null,null,"Geworfen",{"$f":"SUM(Y34)","v":0},"Punkte",null,null,null,"Ralf M."]
["RD 1",{"$f":"COUNT(D4)*1","v":0},{"$f":"COUNT(D4)*3","v":0},null,{"$f":"SUM(E2-E3)","v":501},"Rest",null,"RD 1",{"$f":"COUNT(K4)*1","v":0},{"$f":"COUNT(K4)*3","v":0},null,{"$f":"SUM(L2-L3)","v":501},"Rest",null,"RD 1",{"$f":"COUNT(R4)*1","v":0},{"$f":"COUNT(R4)*3","v":0},null,{"$f":"SUM(S2-S3)","v":501},"Rest",null,"RD 1",{"$f":"COUNT(Y4)*1","v":0},{"$f":"COUNT(Y4)*3","v":0},null,{"$f":"SUM(Z2-Z3)","v":501},"Rest",null,null,null,"Ralf M."]
["RD 2",0,0,null,null,null,null,"RD 2",0,0,null,null,null,null,"RD 2",0,0,null,null,null,null,"RD 2",0,0]
["RD 3",0,0,null,"ø pro Spiel",{"$f":"SUM(E3)/B34","v":{"$error":"#DIV/0!"}},null,"RD 3",0,0,null,"ø pro Spiel",{"$f":"SUM(L3)/I34","v":{"$error":"#DIV/0!"}},null,"RD 3",0,0,null,"ø pro Spiel",{"$f":"SUM(S3)/P34","v":{"$error":"#DIV/0!"}},null,"RD 3",0,0,null,"ø pro Spiel",{"$f":"SUM(Z3)/W34","v":{"$error":"#DIV/0!"}}]
["RD 4",0,0,null,"ø pro Pfeil",{"$f":"SUM(E3)/C34","v":{"$error":"#DIV/0!"}},null,"RD 4",0,0,null,"ø pro Pfeil",{"$f":"SUM(L3)/J34","v":{"$error":"#DIV/0!"}},null,"RD 4",0,0,null,"ø pro Pfeil",{"$f":"SUM(S3)/Q34","v":{"$error":"#DIV/0!"}},null,"RD 4",0,0,null,"ø pro Pfeil",{"$f":"SUM(Z3)/X34","v":{"$error":"#DIV/0!"}}]
["RD 5",0,0,null,"Average",null,null,"RD 5",0,0,null,"Average",null,null,"RD 5",0,0,null,"Average",null,null,"RD 5",0,0,null,"Average"]
["RD 6",0,0,null,{"$f":"SUM(F6)","v":{"$error":"#DIV/0!"}},null,null,"RD 6",0,0,null,{"$f":"SUM(M6)","v":{"$error":"#DIV/0!"}},null,null,"RD 6",0,0,null,{"$f":"SUM(T6)","v":{"$error":"#DIV/0!"}},null,null,"RD 6",0,0,null,{"$f":"SUM(AA6)","v":{"$error":"#DIV/0!"}}]
["RD 7",0,0,null,null,null,null,"RD 7",0,0,null,null,null,null,"RD 7",0,0,null,null,null,null,"RD 7",0,0]
["RD 8",0,0,null,{"$f":"IF(F6<40,\"Nicht Gut\",\"\")","v":{"$error":"#DIV/0!"}},null,null,"RD 8",0,0,null,{"$f":"IF(M6<40,\"Nicht Gut\",\"\")","v":{"$error":"#DIV/0!"}},null,null,"RD 8",0,0,null,{"$f":"IF(T6<40,\"Nicht Gut\",\"\")","v":{"$error":"#DIV/0!"}},null,null,"RD 8",0,0,null,{"$f":"IF(AA6<40,\"Nicht Gut\",\"\")","v":{"$error":"#DIV/0!"}}]
["RD 9",0,0,null,null,null,null,"RD 9",0,0,null,null,null,null,"RD 9",0,0,null,null,null,null,"RD 9",0,0]
["RD 10",0,0,null,null,null,null,"RD 10",0,0,null,null,null,null,"RD 10",0,0,null,null,null,null,"RD 10",0,0]
["RD 11",0,0,null,{"$f":"IF(AND(F6>=40,F6<=50),\"GUT\",\"\")","v":{"$error":"#DIV/0!"}},null,null,"RD 11",0,0,null,{"$f":"IF(AND(M6>=40,M6<=50),\"GUT\",\"\")","v":{"$error":"#DIV/0!"}},null,null,"RD 11",0,0,null,{"$f":"IF(AND(T6>=40,T6<=50),\"GUT\",\"\")","v":{"$error":"#DIV/0!"}},null,null,"RD 11",0,0,null,{"$f":"IF(AND(AA6>=40,AA6<=50),\"GUT\",\"\")","v":{"$error":"#DIV/0!"}}]
["RD 12",0,0,null,null,null,null,"RD 12",0,0,null,null,null,null,"RD 12",0,0,null,null,null,null,"RD 12",0,0]
["RD 13",0,0,null,null,null,null,"RD 13",0,0,null,null,null,null,"RD 13",0,0,null,null,null,null,"RD 13",0,0]
["RD 14",0,0,null,null,null,null,"RD 14",0,0,null,null,null,null,"RD 14",0,0,null,null,null,null,"RD 14",0,0]
["RD 15",0,0,null,null,null,null,"RD 15",0,0,null,null,null,null,"RD 15",0,0,null,null,null,null,"RD 15",0,0]
["RD 16",0,0,null,{"$f":"D1","v":"Ralf M."},{"$f":"E4","v":501},null,"RD 16",0,0,null,{"$f":"K1","v":"Ralf M."},{"$f":"L4","v":501},null,"RD 16",0,0,null,{"$f":"R1","v":"Ralf M."},{"$f":"S4","v":501},null,"RD 16",0,0,null,{"$f":"Y1","v":"Ralf M."},{"$f":"Z4","v":501}]
["RD 17",0,0,null,"Rest",{"$f":"E4","v":501},null,"RD 17",0,0,null,"Rest",{"$f":"L4","v":501},null,"RD 17",0,0,null,"Rest",{"$f":"S4","v":501},null,"RD 17",0,0,null,"Rest",{"$f":"Z4","v":501}]
["RD 18",0,0,null,{"$f":"IF(F6>50,\"Sehr Gut\",\"\")","v":{"$error":"#DIV/0!"}},null,null,"RD 18",0,0,null,{"$f":"IF(M6>50,\"Sehr Gut\",\"\")","v":{"$error":"#DIV/0!"}},null,null,"RD 18",0,0,null,{"$f":"IF(T6>50,\"Sehr Gut\",\"\")","v":{"$error":"#DIV/0!"}},null,null,"RD 18",0,0,null,{"$f":"IF(AA6>50,\"Sehr Gut\",\"\")","v":{"$error":"#DIV/0!"}}]
["RD 19",0,0,null,null,null,null,"RD 19",0,0,null,null,null,null,"RD 19",0,0,null,null,null,null,"RD 19",0,0]
["RD 20",0,0,null,null,null,null,"RD 20",0,0,null,null,null,null,"RD 20",0,0,null,null,null,null,"RD 20",0,0]
["RD 21",0,0,null,null,null,null,"RD 21",0,0,null,null,null,null,"RD 21",0,0,null,null,null,null,"RD 21",0,0]
["RD 22",0,0,null,null,null,null,"RD 22",0,0,null,null,null,null,"RD 22",0,0,null,null,null,null,"RD 22",0,0]
["RD 23",0,0,null,null,null,null,"RD 23",0,0,null,null,null,null,"RD 23",0,0,null,null,null,null,"RD 23",0,0]
["RD 24",0,0,null,null,null,null,"RD 24",0,0,null,null,null,null,"RD 24",0,0,null,null,null,null,"RD 24",0,0]
["RD 25",0,0,null,null,null,null,"RD 25",0,0,null,null,null,null,"RD 25",0,0,null,null,null,null,"RD 25",0,0]
["RD 26",0,0,null,null,null,null,"RD 26",0,0,null,null,null,null,"RD 26",0,0,null,null,null,null,"RD 26",0,0]
["RD 27",0,0,null,null,null,null,"RD 27",0,0,null,null,null,null,"RD 27",0,0,null,null,null,null,"RD 27",0,0]
["RD 28",0,0,null,null,null,null,"RD 28",0,0,null,null,null,null,"RD 28",0,0,null,null,null,null,"RD 28",0,0]
["RD 29",0,0,null,{"$f":"IF(E4=0,\"Sieg\",\"\")","v":""},null,null,"RD 29",0,0,null,{"$f":"IF(L4=0,\"Sieg\",\"\")","v":""},null,null,"RD 29",0,0,null,{"$f":"IF(S4=0,\"Sieg\",\"\")","v":""},null,null,"RD 29",0,0,null,{"$f":"IF(Z4=0,\"Sieg\",\"\")","v":""}]
["RD 30",0,0,null,null,null,null,"RD 30",0,0,null,null,null,null,"RD 30",0,0,null,null,null,null,"RD 30",0,0]
[null,{"$f":"SUM(B4:B33)","v":0},{"$f":"SUM(C4:C33)","v":0},{"$f":"SUM(D4:D33)","v":0},{"$f":"SUM(D4:D32)","v":0},null,null,null,{"$f":"SUM(I4:I33)","v":0},{"$f":"SUM(J4:J33)","v":0},{"$f":"SUM(K4:K33)","v":0},{"$f":"SUM(K4:K32)","v":0},null,null,null,{"$f":"SUM(P4:P33)","v":0},{"$f":"SUM(Q4:Q33)","v":0},{"$f":"SUM(R4:R33)","v":0},{"$f":"SUM(R4:R32)","v":0},null,null,null,{"$f":"SUM(W4:W33)","v":0},{"$f":"SUM(X4:X33)","v":0},{"$f":"SUM(Y4:Y33)","v":0},{"$f":"SUM(Y4:Y32)","v":0}]
[null,null,null,{"$f":"D1","v":"Ralf M."},null,{"$f":"SUM(E3)","v":0},null,null,null,null,{"$f":"INDEX(D35:D38,MATCH(LARGE(F35:F38,1),F35:F38,0))","v":"Ralf M."}]
[null,null,null,{"$f":"K1","v":"Ralf M."},null,{"$f":"SUM(L3)","v":0},null,null,null,null,{"$f":"INDEX(D35:D38,MATCH(LARGE(F35:F38,2),F35:F38,0))","v":"Ralf M."}]
[null,null,null,{"$f":"R1","v":"Ralf M."},null,{"$f":"SUM(S3)","v":0},null,null,null,null,{"$f":"INDEX(D35:D38,MATCH(LARGE(F35:F38,3),F35:F38,0))","v":"Ralf M."},null,null,null,null,null,null,null,null,null,null,null,null,null,null,null,null,null,null,null,"Micha"]
[null,null,null,{"$f":"Y1","v":"Ralf M."},null,{"$f":"SUM(Z3)","v":0},null,null,null,null,{"$f":"INDEX(D35:D38,MATCH(LARGE(F35:F38,4),F35:F38,0))","v":"Ralf M."}]
[null,null,null,"MAX(B2:B7",null,{"$f":"SUM(F35:F38)","v":0}]

{"sheet":"Rd. 9","index":8,"n_rows":39,"n_cols":31,"rows_kept":39,"cut":false,"hidden":false,"merged":[[0,24,0,25],[7,4,7,5],[7,11,7,12],[7,18,7,19],[7,25,7,26],[0,3,0,4],[0,10,0,11],[0,17,0,18],[31,25,32,26],[26,4,30,5],[26,11,30,12],[13,18,16,19],[26,25,30,26],[13,25,16,26],[20,4,25,5],[20,11,25,12],[20,18,25,19],[20,25,25,26],[13,4,16,5],[26,18,30,19],[13,11,16,12],[18,25,18,26],[8,25,9,26],[10,4,12,5],[10,11,12,12],[10,18,12,19],[10,25,12,26],[8,4,9,5],[38,3,38,4],[8,11,9,12],[8,18,9,19],[31,4,32,5],[31,11,32,12],[31,18,32,19],[18,4,18,5],[18,11,18,12],[18,18,18,19]]}
[null,null,null,{"$f":"'Rd. 8'!AE4","v":"Ralf M."},null,"Sp.1",null,null,null,null,{"$f":"'Rd. 8'!AE3","v":"Ralf M."},null,"Sp.2",null,null,null,null,{"$f":"'Rd. 8'!AE2","v":"Ralf M."},null,"Sp.3",null,null,null,null,{"$f":"'Rd. 8'!AE1","v":"Ralf M."},null,"Sp.4",null,null,null,{"$f":"INDEX($D$35:$D$38,MATCH(LARGE($F$35:$F$38,ROW(AE1)),$F$35:$F$38,0))","v":"Ralf M."}]
[null,null,null,"Punkte",501,"Start",null,null,null,null,"Punkte",501,"Start",null,null,null,null,"Punkte",501,"Start",null,null,null,null,"Punkte",501,"Start",null,null,null,{"$f":"INDEX($D$35:$D$38,MATCH(LARGE($F$35:$F$38,ROW(AE2)),$F$35:$F$38,0))","v":"Ralf M."}]
[null,null,null,"Geworfen",{"$f":"SUM(D34)","v":0},"Punkte",null,null,null,null,"Geworfen",{"$f":"SUM(K34)","v":0},"Punkte",null,null,null,null,"Geworfen",{"$f":"SUM(R34)","v":0},"Punkte",null,null,null,null,"Geworfen",{"$f":"SUM(Y34)","v":0},"Punkte",null,null,null,"Ralf M."]
["RD 1",{"$f":"COUNT(D4)*1","v":0},{"$f":"COUNT(D4)*3","v":0},null,{"$f":"SUM(E2-E3)","v":501},"Rest",null,"RD 1",{"$f":"COUNT(K4)*1","v":0},{"$f":"COUNT(K4)*3","v":0},null,{"$f":"SUM(L2-L3)","v":501},"Rest",null,"RD 1",{"$f":"COUNT(R4)*1","v":0},{"$f":"COUNT(R4)*3","v":0},null,{"$f":"SUM(S2-S3)","v":501},"Rest",null,"RD 1",{"$f":"COUNT(Y4)*1","v":0},{"$f":"COUNT(Y4)*3","v":0},null,{"$f":"SUM(Z2-Z3)","v":501},"Rest",null,null,null,"Ralf M."]
["RD 2",0,0,null,null,null,null,"RD 2",0,0,null,null,null,null,"RD 2",0,0,null,null,null,null,"RD 2",0,0]
["RD 3",0,0,null,"ø pro Spiel",{"$f":"SUM(E3)/B34","v":{"$error":"#DIV/0!"}},null,"RD 3",0,0,null,"ø pro Spiel",{"$f":"SUM(L3)/I34","v":{"$error":"#DIV/0!"}},null,"RD 3",0,0,null,"ø pro Spiel",{"$f":"SUM(S3)/P34","v":{"$error":"#DIV/0!"}},null,"RD 3",0,0,null,"ø pro Spiel",{"$f":"SUM(Z3)/W34","v":{"$error":"#DIV/0!"}}]
["RD 4",0,0,null,"ø pro Pfeil",{"$f":"SUM(E3)/C34","v":{"$error":"#DIV/0!"}},null,"RD 4",0,0,null,"ø pro Pfeil",{"$f":"SUM(L3)/J34","v":{"$error":"#DIV/0!"}},null,"RD 4",0,0,null,"ø pro Pfeil",{"$f":"SUM(S3)/Q34","v":{"$error":"#DIV/0!"}},null,"RD 4",0,0,null,"ø pro Pfeil",{"$f":"SUM(Z3)/X34","v":{"$error":"#DIV/0!"}}]
["RD 5",0,0,null,"Average",null,null,"RD 5",0,0,null,"Average",null,null,"RD 5",0,0,null,"Average",null,null,"RD 5",0,0,null,"Average"]
["RD 6",0,0,null,{"$f":"SUM(F6)","v":{"$error":"#DIV/0!"}},null,null,"RD 6",0,0,null,{"$f":"SUM(M6)","v":{"$error":"#DIV/0!"}},null,null,"RD 6",0,0,null,{"$f":"SUM(T6)","v":{"$error":"#DIV/0!"}},null,null,"RD 6",0,0,null,{"$f":"SUM(AA6)","v":{"$error":"#DIV/0!"}}]
["RD 7",0,0,null,null,null,null,"RD 7",0,0,null,null,null,null,"RD 7",0,0,null,null,null,null,"RD 7",0,0]
["RD 8",0,0,null,{"$f":"IF(F6<40,\"Nicht Gut\",\"\")","v":{"$error":"#DIV/0!"}},null,null,"RD 8",0,0,null,{"$f":"IF(M6<40,\"Nicht Gut\",\"\")","v":{"$error":"#DIV/0!"}},null,null,"RD 8",0,0,null,{"$f":"IF(T6<40,\"Nicht Gut\",\"\")","v":{"$error":"#DIV/0!"}},null,null,"RD 8",0,0,null,{"$f":"IF(AA6<40,\"Nicht Gut\",\"\")","v":{"$error":"#DIV/0!"}}]
["RD 9",0,0,null,null,null,null,"RD 9",0,0,null,null,null,null,"RD 9",0,0,null,null,null,null,"RD 9",0,0]
["RD 10",0,0,null,null,null,null,"RD 10",0,0,null,null,null,null,"RD 10",0,0,null,null,null,null,"RD 10",0,0]
["RD 11",0,0,null,{"$f":"IF(AND(F6>=40,F6<=50),\"GUT\",\"\")","v":{"$error":"#DIV/0!"}},null,null,"RD 11",0,0,null,{"$f":"IF(AND(M6>=40,M6<=50),\"GUT\",\"\")","v":{"$error":"#DIV/0!"}},null,null,"RD 11",0,0,null,{"$f":"IF(AND(T6>=40,T6<=50),\"GUT\",\"\")","v":{"$error":"#DIV/0!"}},null,null,"RD 11",0,0,null,{"$f":"IF(AND(AA6>=40,AA6<=50),\"GUT\",\"\")","v":{"$error":"#DIV/0!"}}]
["RD 12",0,0,null,null,null,null,"RD 12",0,0,null,null,null,null,"RD 12",0,0,null,null,null,null,"RD 12",0,0]
["RD 13",0,0,null,null,null,null,"RD 13",0,0,null,null,null,null,"RD 13",0,0,null,null,null,null,"RD 13",0,0]
["RD 14",0,0,null,null,null,null,"RD 14",0,0,null,null,null,null,"RD 14",0,0,null,null,null,null,"RD 14",0,0]
["RD 15",0,0,null,null,null,null,"RD 15",0,0,null,null,null,null,"RD 15",0,0,null,null,null,null,"RD 15",0,0]
["RD 16",0,0,null,{"$f":"D1","v":"Ralf M."},{"$f":"E4","v":501},null,"RD 16",0,0,null,{"$f":"K1","v":"Ralf M."},{"$f":"L4","v":501},null,"RD 16",0,0,null,{"$f":"R1","v":"Ralf M."},{"$f":"S4","v":501},null,"RD 16",0,0,null,{"$f":"Y1","v":"Ralf M."},{"$f":"Z4","v":501}]
["RD 17",0,0,null,"Rest",{"$f":"E4","v":501},null,"RD 17",0,0,null,"Rest",{"$f":"L4","v":501},null,"RD 17",0,0,null,"Rest",{"$f":"S4","v":501},null,"RD 17",0,0,null,"Rest",{"$f":"Z4","v":501}]
["RD 18",0,0,null,{"$f":"IF(F6>50,\"Sehr Gut\",\"\")","v":{"$error":"#DIV/0!"}},null,null,"RD 18",0,0,null,{"$f":"IF(M6>50,\"Sehr Gut\",\"\")","v":{"$error":"#DIV/0!"}},null,null,"RD 18",0,0,null,{"$f":"IF(T6>50,\"Sehr Gut\",\"\")","v":{"$error":"#DIV/0!"}},null,null,"RD 18",0,0,null,{"$f":"IF(AA6>50,\"Sehr Gut\",\"\")","v":{"$error":"#DIV/0!"}}]
["RD 19",0,0,null,null,null,null,"RD 19",0,0,null,null,null,null,"RD 19",0,0,null,null,null,null,"RD 19",0,0]
["RD 20",0,0,null,null,null,null,"RD 20",0,0,null,null,null,null,"RD 20",0,0,null,null,null,null,"RD 20",0,0]
["RD 21",0,0,null,null,null,null,"RD 21",0,0,null,null,null,null,"RD 21",0,0,null,null,null,null,"RD 21",0,0]
["RD 22",0,0,null,null,null,null,"RD 22",0,0,null,null,null,null,"RD 22",0,0,null,null,null,null,"RD 22",0,0]
["RD 23",0,0,null,null,null,null,"RD 23",0,0,null,null,null,null,"RD 23",0,0,null,null,null,null,"RD 23",0,0]
["RD 24",0,0,null,null,null,null,"RD 24",0,0,null,null,null,null,"RD 24",0,0,null,null,null,null,"RD 24",0,0]
["RD 25",0,0,null,null,null,null,"RD 25",0,0,null,null,null,null,"RD 25",0,0,null,null,null,null,"RD 25",0,0]
["RD 26",0,0,null,null,null,null,"RD 26",0,0,null,null,null,null,"RD 26",0,0,null,null,null,null,"RD 26",0,0]
["RD 27",0,0,null,null,null,null,"RD 27",0,0,null,null,null,null,"RD 27",0,0,null,null,null,null,"RD 27",0,0]
["RD 28",0,0,null,null,null,null,"RD 28",0,0,null,null,null,null,"RD 28",0,0,null,null,null,null,"RD 28",0,0]
["RD 29",0,0,null,{"$f":"IF(E4=0,\"Sieg\",\"\")","v":""},null,null,"RD 29",0,0,null,{"$f":"IF(L4=0,\"Sieg\",\"\")","v":""},null,null,"RD 29",0,0,null,{"$f":"IF(S4=0,\"Sieg\",\"\")","v":""},null,null,"RD 29",0,0,null,{"$f":"IF(Z4=0,\"Sieg\",\"\")","v":""}]
["RD 30",0,0,null,null,null,null,"RD 30",0,0,null,null,null,null,"RD 30",0,0,null,null,null,null,"RD 30",0,0]
[null,{"$f":"SUM(B4:B33)","v":0},{"$f":"SUM(C4:C33)","v":0},{"$f":"SUM(D4:D33)","v":0},{"$f":"SUM(D4:D32)","v":0},null,null,null,{"$f":"SUM(I4:I33)","v":0},{"$f":"SUM(J4:J33)","v":0},{"$f":"SUM(K4:K33)","v":0},{"$f":"SUM(K4:K32)","v":0},null,null,null,{"$f":"SUM(P4:P33)","v":0},{"$f":"SUM(Q4:Q33)","v":0},{"$f":"SUM(R4:R33)","v":0},{"$f":"SUM(R4:R32)","v":0},null,null,null,{"$f":"SUM(W4:W33)","v":0},{"$f":"SUM(X4:X33)","v":0},{"$f":"SUM(Y4:Y33)","v":0},{"$f":"SUM(Y4:Y32)","v":0}]
[null,null,null,{"$f":"D1","v":"Ralf M."},null,{"$f":"SUM(E3)","v":0},null,null,null,null,{"$f":"INDEX(D35:D38,MATCH(LARGE(F35:F38,1),F35:F38,0))","v":"Ralf M."}]
[null,null,null,{"$f":"K1","v":"Ralf M."},null,{"$f":"SUM(L3)","v":0},null,null,null,null,{"$f":"INDEX(D35:D38,MATCH(LARGE(F35:F38,2),F35:F38,0))","v":"Ralf M."}]
[null,null,null,{"$f":"R1","v":"Ralf M."},null,{"$f":"SUM(S3)","v":0},null,null,null,null,{"$f":"INDEX(D35:D38,MATCH(LARGE(F35:F38,3),F35:F38,0))","v":"Ralf M."},null,null,null,null,null,null,null,null,null,null,null,null,null,null,null,null,null,null,null,"Micha"]
[null,null,null,{"$f":"Y1","v":"Ralf M."},null,{"$f":"SUM(Z3)","v":0},null,null,null,null,{"$f":"INDEX(D35:D38,MATCH(LARGE(F35:F38,4),F35:F38,0))","v":"Ralf M."}]
[null,null,null,"MAX(B2:B7",null,{"$f":"SUM(F35:F38)","v":0}]

{"sheet":"Rd. 10","index":9,"n_rows":39,"n_cols":31,"rows_kept":39,"cut":false,"hidden":false,"merged":[[0,24,0,25],[7,4,7,5],[7,11,7,12],[7,18,7,19],[7,25,7,26],[0,3,0,4],[0,10,0,11],[0,17,0,18],[31,25,32,26],[26,4,30,5],[26,11,30,12],[13,18,16,19],[26,25,30,26],[13,25,16,26],[20,4,25,5],[20,11,25,12],[20,18,25,19],[20,25,25,26],[13,4,16,5],[26,18,30,19],[13,11,16,12],[18,25,18,26],[8,25,9,26],[10,4,12,5],[10,11,12,12],[10,18,12,19],[10,25,12,26],[8,4,9,5],[38,3,38,4],[8,11,9,12],[8,18,9,19],[31,4,32,5],[31,11,32,12],[31,18,32,19],[18,4,18,5],[18,11,18,12],[18,18,18,19]]}
[null,null,null,{"$f":"'Rd. 9'!AE4","v":"Ralf M."},null,"Sp.1",null,null,null,null,{"$f":"'Rd. 9'!AE3","v":"Ralf M."},null,"Sp.2",null,null,null,null,{"$f":"'Rd. 9'!AE2","v":"Ralf M."},null,"Sp.3",null,null,null,null,{"$f":"'Rd. 9'!AE1","v":"Ralf M."},null,"Sp.4",null,null,null,{"$f":"INDEX($D$35:$D$38,MATCH(LARGE($F$35:$F$38,ROW(AE1)),$F$35:$F$38,0))","v":"Ralf M."}]
[null,null,null,"Punkte",501,"Start",null,null,null,null,"Punkte",501,"Start",null,null,null,null,"Punkte",501,"Start",null,null,null,null,"Punkte",501,"Start",null,null,null,{"$f":"INDEX($D$35:$D$38,MATCH(LARGE($F$35:$F$38,ROW(AE2)),$F$35:$F$38,0))","v":"Ralf M."}]
[null,null,null,"Geworfen",{"$f":"SUM(D34)","v":0},"Punkte",null,null,null,null,"Geworfen",{"$f":"SUM(K34)","v":0},"Punkte",null,null,null,null,"Geworfen",{"$f":"SUM(R34)","v":0},"Punkte",null,null,null,null,"Geworfen",{"$f":"SUM(Y34)","v":0},"Punkte",null,null,null,"Ralf M."]
["RD 1",{"$f":"COUNT(D4)*1","v":0},{"$f":"COUNT(D4)*3","v":0},null,{"$f":"SUM(E2-E3)","v":501},"Rest",null,"RD 1",{"$f":"COUNT(K4)*1","v":0},{"$f":"COUNT(K4)*3","v":0},null,{"$f":"SUM(L2-L3)","v":501},"Rest",null,"RD 1",{"$f":"COUNT(R4)*1","v":0},{"$f":"COUNT(R4)*3","v":0},null,{"$f":"SUM(S2-S3)","v":501},"Rest",null,"RD 1",{"$f":"COUNT(Y4)*1","v":0},{"$f":"COUNT(Y4)*3","v":0},null,{"$f":"SUM(Z2-Z3)","v":501},"Rest",null,null,null,"Ralf M."]
["RD 2",0,0,null,null,null,null,"RD 2",0,0,null,null,null,null,"RD 2",0,0,null,null,null,null,"RD 2",0,0]
["RD 3",0,0,null,"ø pro Spiel",{"$f":"SUM(E3)/B34","v":{"$error":"#DIV/0!"}},null,"RD 3",0,0,null,"ø pro Spiel",{"$f":"SUM(L3)/I34","v":{"$error":"#DIV/0!"}},null,"RD 3",0,0,null,"ø pro Spiel",{"$f":"SUM(S3)/P34","v":{"$error":"#DIV/0!"}},null,"RD 3",0,0,null,"ø pro Spiel",{"$f":"SUM(Z3)/W34","v":{"$error":"#DIV/0!"}}]
["RD 4",0,0,null,"ø pro Pfeil",{"$f":"SUM(E3)/C34","v":{"$error":"#DIV/0!"}},null,"RD 4",0,0,null,"ø pro Pfeil",{"$f":"SUM(L3)/J34","v":{"$error":"#DIV/0!"}},null,"RD 4",0,0,null,"ø pro Pfeil",{"$f":"SUM(S3)/Q34","v":{"$error":"#DIV/0!"}},null,"RD 4",0,0,null,"ø pro Pfeil",{"$f":"SUM(Z3)/X34","v":{"$error":"#DIV/0!"}}]
["RD 5",0,0,null,"Average",null,null,"RD 5",0,0,null,"Average",null,null,"RD 5",0,0,null,"Average",null,null,"RD 5",0,0,null,"Average"]
["RD 6",0,0,null,{"$f":"SUM(F6)","v":{"$error":"#DIV/0!"}},null,null,"RD 6",0,0,null,{"$f":"SUM(M6)","v":{"$error":"#DIV/0!"}},null,null,"RD 6",0,0,null,{"$f":"SUM(T6)","v":{"$error":"#DIV/0!"}},null,null,"RD 6",0,0,null,{"$f":"SUM(AA6)","v":{"$error":"#DIV/0!"}}]
["RD 7",0,0,null,null,null,null,"RD 7",0,0,null,null,null,null,"RD 7",0,0,null,null,null,null,"RD 7",0,0]
["RD 8",0,0,null,{"$f":"IF(F6<40,\"Nicht Gut\",\"\")","v":{"$error":"#DIV/0!"}},null,null,"RD 8",0,0,null,{"$f":"IF(M6<40,\"Nicht Gut\",\"\")","v":{"$error":"#DIV/0!"}},null,null,"RD 8",0,0,null,{"$f":"IF(T6<40,\"Nicht Gut\",\"\")","v":{"$error":"#DIV/0!"}},null,null,"RD 8",0,0,null,{"$f":"IF(AA6<40,\"Nicht Gut\",\"\")","v":{"$error":"#DIV/0!"}}]
["RD 9",0,0,null,null,null,null,"RD 9",0,0,null,null,null,null,"RD 9",0,0,null,null,null,null,"RD 9",0,0]
["RD 10",0,0,null,null,null,null,"RD 10",0,0,null,null,null,null,"RD 10",0,0,null,null,null,null,"RD 10",0,0]
["RD 11",0,0,null,{"$f":"IF(AND(F6>=40,F6<=50),\"GUT\",\"\")","v":{"$error":"#DIV/0!"}},null,null,"RD 11",0,0,null,{"$f":"IF(AND(M6>=40,M6<=50),\"GUT\",\"\")","v":{"$error":"#DIV/0!"}},null,null,"RD 11",0,0,null,{"$f":"IF(AND(T6>=40,T6<=50),\"GUT\",\"\")","v":{"$error":"#DIV/0!"}},null,null,"RD 11",0,0,null,{"$f":"IF(AND(AA6>=40,AA6<=50),\"GUT\",\"\")","v":{"$error":"#DIV/0!"}}]
["RD 12",0,0,null,null,null,null,"RD 12",0,0,null,null,null,null,"RD 12",0,0,null,null,null,null,"RD 12",0,0]
["RD 13",0,0,null,null,null,null,"RD 13",0,0,null,null,null,null,"RD 13",0,0,null,null,null,null,"RD 13",0,0]
["RD 14",0,0,null,null,null,null,"RD 14",0,0,null,null,null,null,"RD 14",0,0,null,null,null,null,"RD 14",0,0]
["RD 15",0,0,null,null,null,null,"RD 15",0,0,null,null,null,null,"RD 15",0,0,null,null,null,null,"RD 15",0,0]
["RD 16",0,0,null,{"$f":"D1","v":"Ralf M."},{"$f":"E4","v":501},null,"RD 16",0,0,null,{"$f":"K1","v":"Ralf M."},{"$f":"L4","v":501},null,"RD 16",0,0,null,{"$f":"R1","v":"Ralf M."},{"$f":"S4","v":501},null,"RD 16",0,0,null,{"$f":"Y1","v":"Ralf M."},{"$f":"Z4","v":501}]
["RD 17",0,0,null,"Rest",{"$f":"E4","v":501},null,"RD 17",0,0,null,"Rest",{"$f":"L4","v":501},null,"RD 17",0,0,null,"Rest",{"$f":"S4","v":501},null,"RD 17",0,0,null,"Rest",{"$f":"Z4","v":501}]
["RD 18",0,0,null,{"$f":"IF(F6>50,\"Sehr Gut\",\"\")","v":{"$error":"#DIV/0!"}},null,null,"RD 18",0,0,null,{"$f":"IF(M6>50,\"Sehr Gut\",\"\")","v":{"$error":"#DIV/0!"}},null,null,"RD 18",0,0,null,{"$f":"IF(T6>50,\"Sehr Gut\",\"\")","v":{"$error":"#DIV/0!"}},null,null,"RD 18",0,0,null,{"$f":"IF(AA6>50,\"Sehr Gut\",\"\")","v":{"$error":"#DIV/0!"}}]
["RD 19",0,0,null,null,null,null,"RD 19",0,0,null,null,null,null,"RD 19",0,0,null,null,null,null,"RD 19",0,0]
["RD 20",0,0,null,null,null,null,"RD 20",0,0,null,null,null,null,"RD 20",0,0,null,null,null,null,"RD 20",0,0]
["RD 21",0,0,null,null,null,null,"RD 21",0,0,null,null,null,null,"RD 21",0,0,null,null,null,null,"RD 21",0,0]
["RD 22",0,0,null,null,null,null,"RD 22",0,0,null,null,null,null,"RD 22",0,0,null,null,null,null,"RD 22",0,0]
["RD 23",0,0,null,null,null,null,"RD 23",0,0,null,null,null,null,"RD 23",0,0,null,null,null,null,"RD 23",0,0]
["RD 24",0,0,null,null,null,null,"RD 24",0,0,null,null,null,null,"RD 24",0,0,null,null,null,null,"RD 24",0,0]
["RD 25",0,0,null,null,null,null,"RD 25",0,0,null,null,null,null,"RD 25",0,0,null,null,null,null,"RD 25",0,0]
["RD 26",0,0,null,null,null,null,"RD 26",0,0,null,null,null,null,"RD 26",0,0,null,null,null,null,"RD 26",0,0]
["RD 27",0,0,null,null,null,null,"RD 27",0,0,null,null,null,null,"RD 27",0,0,null,null,null,null,"RD 27",0,0]
["RD 28",0,0,null,null,null,null,"RD 28",0,0,null,null,null,null,"RD 28",0,0,null,null,null,null,"RD 28",0,0]
["RD 29",0,0,null,{"$f":"IF(E4=0,\"Sieg\",\"\")","v":""},null,null,"RD 29",0,0,null,{"$f":"IF(L4=0,\"Sieg\",\"\")","v":""},null,null,"RD 29",0,0,null,{"$f":"IF(S4=0,\"Sieg\",\"\")","v":""},null,null,"RD 29",0,0,null,{"$f":"IF(Z4=0,\"Sieg\",\"\")","v":""}]
["RD 30",0,0,null,null,null,null,"RD 30",0,0,null,null,null,null,"RD 30",0,0,null,null,null,null,"RD 30",0,0]
[null,{"$f":"SUM(B4:B33)","v":0},{"$f":"SUM(C4:C33)","v":0},{"$f":"SUM(D4:D33)","v":0},{"$f":"SUM(D4:D32)","v":0},null,null,null,{"$f":"SUM(I4:I33)","v":0},{"$f":"SUM(J4:J33)","v":0},{"$f":"SUM(K4:K33)","v":0},{"$f":"SUM(K4:K32)","v":0},null,null,null,{"$f":"SUM(P4:P33)","v":0},{"$f":"SUM(Q4:Q33)","v":0},{"$f":"SUM(R4:R33)","v":0},{"$f":"SUM(R4:R32)","v":0},null,null,null,{"$f":"SUM(W4:W33)","v":0},{"$f":"SUM(X4:X33)","v":0},{"$f":"SUM(Y4:Y33)","v":0},{"$f":"SUM(Y4:Y32)","v":0}]
[null,null,null,{"$f":"D1","v":"Ralf M."},null,{"$f":"SUM(E3)","v":0},null,null,null,null,{"$f":"INDEX(D35:D38,MATCH(LARGE(F35:F38,1),F35:F38,0))","v":"Ralf M."}]
[null,null,null,{"$f":"K1","v":"Ralf M."},null,{"$f":"SUM(L3)","v":0},null,null,null,null,{"$f":"INDEX(D35:D38,MATCH(LARGE(F35:F38,2),F35:F38,0))","v":"Ralf M."}]
[null,null,null,{"$f":"R1","v":"Ralf M."},null,{"$f":"SUM(S3)","v":0},null,null,null,null,{"$f":"INDEX(D35:D38,MATCH(LARGE(F35:F38,3),F35:F38,0))","v":"Ralf M."},null,null,null,null,null,null,null,null,null,null,null,null,null,null,null,null,null,null,null,"Micha"]
[null,null,null,{"$f":"Y1","v":"Ralf M."},null,{"$f":"SUM(Z3)","v":0},null,null,null,null,{"$f":"INDEX(D35:D38,MATCH(LARGE(F35:F38,4),F35:F38,0))","v":"Ralf M."}]
[null,null,null,"MAX(B2:B7",null,{"$f":"SUM(F35:F38)","v":0}]

{"sheet":"Rd. 11","index":10,"n_rows":39,"n_cols":31,"rows_kept":39,"cut":false,"hidden":false,"merged":[[0,24,0,25],[7,4,7,5],[7,11,7,12],[7,18,7,19],[7,25,7,26],[0,3,0,4],[0,10,0,11],[0,17,0,18],[31,25,32,26],[26,4,30,5],[26,11,30,12],[13,18,16,19],[26,25,30,26],[13,25,16,26],[20,4,25,5],[20,11,25,12],[20,18,25,19],[20,25,25,26],[13,4,16,5],[26,18,30,19],[13,11,16,12],[18,25,18,26],[8,25,9,26],[10,4,12,5],[10,11,12,12],[10,18,12,19],[10,25,12,26],[8,4,9,5],[38,3,38,4],[8,11,9,12],[8,18,9,19],[31,4,32,5],[31,11,32,12],[31,18,32,19],[18,4,18,5],[18,11,18,12],[18,18,18,19]]}
[null,null,null,{"$f":"'Rd. 10'!AE4","v":"Ralf M."},null,"Sp.1",null,null,null,null,{"$f":"'Rd. 10'!AE3","v":"Ralf M."},null,"Sp.2",null,null,null,null,{"$f":"'Rd. 10'!AE2","v":"Ralf M."},null,"Sp.3",null,null,null,null,{"$f":"'Rd. 10'!AE1","v":"Ralf M."},null,"Sp.4",null,null,null,{"$f":"INDEX($D$35:$D$38,MATCH(LARGE($F$35:$F$38,ROW(AE1)),$F$35:$F$38,0))","v":"Ralf M."}]
[null,null,null,"Punkte",501,"Start",null,null,null,null,"Punkte",501,"Start",null,null,null,null,"Punkte",501,"Start",null,null,null,null,"Punkte",501,"Start",null,null,null,{"$f":"INDEX($D$35:$D$38,MATCH(LARGE($F$35:$F$38,ROW(AE2)),$F$35:$F$38,0))","v":"Ralf M."}]
[null,null,null,"Geworfen",{"$f":"SUM(D34)","v":0},"Punkte",null,null,null,null,"Geworfen",{"$f":"SUM(K34)","v":0},"Punkte",null,null,null,null,"Geworfen",{"$f":"SUM(R34)","v":0},"Punkte",null,null,null,null,"Geworfen",{"$f":"SUM(Y34)","v":0},"Punkte",null,null,null,"Ralf M."]
["RD 1",{"$f":"COUNT(D4)*1","v":0},{"$f":"COUNT(D4)*3","v":0},null,{"$f":"SUM(E2-E3)","v":501},"Rest",null,"RD 1",{"$f":"COUNT(K4)*1","v":0},{"$f":"COUNT(K4)*3","v":0},null,{"$f":"SUM(L2-L3)","v":501},"Rest",null,"RD 1",{"$f":"COUNT(R4)*1","v":0},{"$f":"COUNT(R4)*3","v":0},null,{"$f":"SUM(S2-S3)","v":501},"Rest",null,"RD 1",{"$f":"COUNT(Y4)*1","v":0},{"$f":"COUNT(Y4)*3","v":0},null,{"$f":"SUM(Z2-Z3)","v":501},"Rest",null,null,null,"Ralf M."]
["RD 2",0,0,null,null,null,null,"RD 2",0,0,null,null,null,null,"RD 2",0,0,null,null,null,null,"RD 2",0,0]
["RD 3",0,0,null,"ø pro Spiel",{"$f":"SUM(E3)/B34","v":{"$error":"#DIV/0!"}},null,"RD 3",0,0,null,"ø pro Spiel",{"$f":"SUM(L3)/I34","v":{"$error":"#DIV/0!"}},null,"RD 3",0,0,null,"ø pro Spiel",{"$f":"SUM(S3)/P34","v":{"$error":"#DIV/0!"}},null,"RD 3",0,0,null,"ø pro Spiel",{"$f":"SUM(Z3)/W34","v":{"$error":"#DIV/0!"}}]
["RD 4",0,0,null,"ø pro Pfeil",{"$f":"SUM(E3)/C34","v":{"$error":"#DIV/0!"}},null,"RD 4",0,0,null,"ø pro Pfeil",{"$f":"SUM(L3)/J34","v":{"$error":"#DIV/0!"}},null,"RD 4",0,0,null,"ø pro Pfeil",{"$f":"SUM(S3)/Q34","v":{"$error":"#DIV/0!"}},null,"RD 4",0,0,null,"ø pro Pfeil",{"$f":"SUM(Z3)/X34","v":{"$error":"#DIV/0!"}}]
["RD 5",0,0,null,"Average",null,null,"RD 5",0,0,null,"Average",null,null,"RD 5",0,0,null,"Average",null,null,"RD 5",0,0,null,"Average"]
["RD 6",0,0,null,{"$f":"SUM(F6)","v":{"$error":"#DIV/0!"}},null,null,"RD 6",0,0,null,{"$f":"SUM(M6)","v":{"$error":"#DIV/0!"}},null,null,"RD 6",0,0,null,{"$f":"SUM(T6)","v":{"$error":"#DIV/0!"}},null,null,"RD 6",0,0,null,{"$f":"SUM(AA6)","v":{"$error":"#DIV/0!"}}]
["RD 7",0,0,null,null,null,null,"RD 7",0,0,null,null,null,null,"RD 7",0,0,null,null,null,null,"RD 7",0,0]
["RD 8",0,0,null,{"$f":"IF(F6<40,\"Nicht Gut\",\"\")","v":{"$error":"#DIV/0!"}},null,null,"RD 8",0,0,null,{"$f":"IF(M6<40,\"Nicht Gut\",\"\")","v":{"$error":"#DIV/0!"}},null,null,"RD 8",0,0,null,{"$f":"IF(T6<40,\"Nicht Gut\",\"\")","v":{"$error":"#DIV/0!"}},null,null,"RD 8",0,0,null,{"$f":"IF(AA6<40,\"Nicht Gut\",\"\")","v":{"$error":"#DIV/0!"}}]
["RD 9",0,0,null,null,null,null,"RD 9",0,0,null,null,null,null,"RD 9",0,0,null,null,null,null,"RD 9",0,0]
["RD 10",0,0,null,null,null,null,"RD 10",0,0,null,null,null,null,"RD 10",0,0,null,null,null,null,"RD 10",0,0]
["RD 11",0,0,null,{"$f":"IF(AND(F6>=40,F6<=50),\"GUT\",\"\")","v":{"$error":"#DIV/0!"}},null,null,"RD 11",0,0,null,{"$f":"IF(AND(M6>=40,M6<=50),\"GUT\",\"\")","v":{"$error":"#DIV/0!"}},null,null,"RD 11",0,0,null,{"$f":"IF(AND(T6>=40,T6<=50),\"GUT\",\"\")","v":{"$error":"#DIV/0!"}},null,null,"RD 11",0,0,null,{"$f":"IF(AND(AA6>=40,AA6<=50),\"GUT\",\"\")","v":{"$error":"#DIV/0!"}}]
["RD 12",0,0,null,null,null,null,"RD 12",0,0,null,null,null,null,"RD 12",0,0,null,null,null,null,"RD 12",0,0]
["RD 13",0,0,null,null,null,null,"RD 13",0,0,null,null,null,null,"RD 13",0,0,null,null,null,null,"RD 13",0,0]
["RD 14",0,0,null,null,null,null,"RD 14",0,0,null,null,null,null,"RD 14",0,0,null,null,null,null,"RD 14",0,0]
["RD 15",0,0,null,null,null,null,"RD 15",0,0,null,null,null,null,"RD 15",0,0,null,null,null,null,"RD 15",0,0]
["RD 16",0,0,null,{"$f":"D1","v":"Ralf M."},{"$f":"E4","v":501},null,"RD 16",0,0,null,{"$f":"K1","v":"Ralf M."},{"$f":"L4","v":501},null,"RD 16",0,0,null,{"$f":"R1","v":"Ralf M."},{"$f":"S4","v":501},null,"RD 16",0,0,null,{"$f":"Y1","v":"Ralf M."},{"$f":"Z4","v":501}]
["RD 17",0,0,null,"Rest",{"$f":"E4","v":501},null,"RD 17",0,0,null,"Rest",{"$f":"L4","v":501},null,"RD 17",0,0,null,"Rest",{"$f":"S4","v":501},null,"RD 17",0,0,null,"Rest",{"$f":"Z4","v":501}]
["RD 18",0,0,null,{"$f":"IF(F6>50,\"Sehr Gut\",\"\")","v":{"$error":"#DIV/0!"}},null,null,"RD 18",0,0,null,{"$f":"IF(M6>50,\"Sehr Gut\",\"\")","v":{"$error":"#DIV/0!"}},null,null,"RD 18",0,0,null,{"$f":"IF(T6>50,\"Sehr Gut\",\"\")","v":{"$error":"#DIV/0!"}},null,null,"RD 18",0,0,null,{"$f":"IF(AA6>50,\"Sehr Gut\",\"\")","v":{"$error":"#DIV/0!"}}]
["RD 19",0,0,null,null,null,null,"RD 19",0,0,null,null,null,null,"RD 19",0,0,null,null,null,null,"RD 19",0,0]
["RD 20",0,0,null,null,null,null,"RD 20",0,0,null,null,null,null,"RD 20",0,0,null,null,null,null,"RD 20",0,0]
["RD 21",0,0,null,null,null,null,"RD 21",0,0,null,null,null,null,"RD 21",0,0,null,null,null,null,"RD 21",0,0]
["RD 22",0,0,null,null,null,null,"RD 22",0,0,null,null,null,null,"RD 22",0,0,null,null,null,null,"RD 22",0,0]
["RD 23",0,0,null,null,null,null,"RD 23",0,0,null,null,null,null,"RD 23",0,0,null,null,null,null,"RD 23",0,0]
["RD 24",0,0,null,null,null,null,"RD 24",0,0,null,null,null,null,"RD 24",0,0,null,null,null,null,"RD 24",0,0]
["RD 25",0,0,null,null,null,null,"RD 25",0,0,null,null,null,null,"RD 25",0,0,null,null,null,null,"RD 25",0,0]
["RD 26",0,0,null,null,null,null,"RD 26",0,0,null,null,null,null,"RD 26",0,0,null,null,null,null,"RD 26",0,0]
["RD 27",0,0,null,null,null,null,"RD 27",0,0,null,null,null,null,"RD 27",0,0,null,null,null,null,"RD 27",0,0]
["RD 28",0,0,null,null,null,null,"RD 28",0,0,null,null,null,null,"RD 28",0,0,null,null,null,null,"RD 28",0,0]
["RD 29",0,0,null,{"$f":"IF(E4=0,\"Sieg\",\"\")","v":""},null,null,"RD 29",0,0,null,{"$f":"IF(L4=0,\"Sieg\",\"\")","v":""},null,null,"RD 29",0,0,null,{"$f":"IF(S4=0,\"Sieg\",\"\")","v":""},null,null,"RD 29",0,0,null,{"$f":"IF(Z4=0,\"Sieg\",\"\")","v":""}]
["RD 30",0,0,null,null,null,null,"RD 30",0,0,null,null,null,null,"RD 30",0,0,null,null,null,null,"RD 30",0,0]
[null,{"$f":"SUM(B4:B33)","v":0},{"$f":"SUM(C4:C33)","v":0},{"$f":"SUM(D4:D33)","v":0},{"$f":"SUM(D4:D32)","v":0},null,null,null,{"$f":"SUM(I4:I33)","v":0},{"$f":"SUM(J4:J33)","v":0},{"$f":"SUM(K4:K33)","v":0},{"$f":"SUM(K4:K32)","v":0},null,null,null,{"$f":"SUM(P4:P33)","v":0},{"$f":"SUM(Q4:Q33)","v":0},{"$f":"SUM(R4:R33)","v":0},{"$f":"SUM(R4:R32)","v":0},null,null,null,{"$f":"SUM(W4:W33)","v":0},{"$f":"SUM(X4:X33)","v":0},{"$f":"SUM(Y4:Y33)","v":0},{"$f":"SUM(Y4:Y32)","v":0}]
[null,null,null,{"$f":"D1","v":"Ralf M."},null,{"$f":"SUM(E3)","v":0},null,null,null,null,{"$f":"INDEX(D35:D38,MATCH(LARGE(F35:F38,1),F35:F38,0))","v":"Ralf M."}]
[null,null,null,{"$f":"K1","v":"Ralf M."},null,{"$f":"SUM(L3)","v":0},null,null,null,null,{"$f":"INDEX(D35:D38,MATCH(LARGE(F35:F38,2),F35:F38,0))","v":"Ralf M."}]
[null,null,null,{"$f":"R1","v":"Ralf M."},null,{"$f":"SUM(S3)","v":0},null,null,null,null,{"$f":"INDEX(D35:D38,MATCH(LARGE(F35:F38,3),F35:F38,0))","v":"Ralf M."},null,null,null,null,null,null,null,null,null,null,null,null,null,null,null,null,null,null,null,"Micha"]
[null,null,null,{"$f":"Y1","v":"Ralf M."},null,{"$f":"SUM(Z3)","v":0},null,null,null,null,{"$f":"INDEX(D35:D38,MATCH(LARGE(F35:F38,4),F35:F38,0))","v":"Ralf M."}]
[null,null,null,"MAX(B2:B7",null,{"$f":"SUM(F35:F38)","v":0}]

{"sheet":"Rd. 12","index":11,"n_rows":39,"n_cols":31,"rows_kept":39,"cut":false,"hidden":false,"merged":[[0,24,0,25],[7,4,7,5],[7,11,7,12],[7,18,7,19],[7,25,7,26],[0,3,0,4],[0,10,0,11],[0,17,0,18],[31,25,32,26],[26,4,30,5],[26,11,30,12],[13,18,16,19],[26,25,30,26],[13,25,16,26],[20,4,25,5],[20,11,25,12],[20,18,25,19],[20,25,25,26],[13,4,16,5],[26,18,30,19],[13,11,16,12],[18,25,18,26],[8,25,9,26],[10,4,12,5],[10,11,12,12],[10,18,12,19],[10,25,12,26],[8,4,9,5],[38,3,38,4],[8,11,9,12],[8,18,9,19],[31,4,32,5],[31,11,32,12],[31,18,32,19],[18,4,18,5],[18,11,18,12],[18,18,18,19]]}
[null,null,null,{"$f":"'Rd. 11'!AE4","v":"Ralf M."},null,"Sp.1",null,null,null,null,{"$f":"'Rd. 11'!AE3","v":"Ralf M."},null,"Sp.2",null,null,null,null,{"$f":"'Rd. 11'!AE2","v":"Ralf M."},null,"Sp.3",null,null,null,null,{"$f":"'Rd. 11'!AE1","v":"Ralf M."},null,"Sp.4",null,null,null,{"$f":"INDEX($D$35:$D$38,MATCH(LARGE($F$35:$F$38,ROW(AE1)),$F$35:$F$38,0))","v":"Ralf M."}]
[null,null,null,"Punkte",501,"Start",null,null,null,null,"Punkte",501,"Start",null,null,null,null,"Punkte",501,"Start",null,null,null,null,"Punkte",501,"Start",null,null,null,{"$f":"INDEX($D$35:$D$38,MATCH(LARGE($F$35:$F$38,ROW(AE2)),$F$35:$F$38,0))","v":"Ralf M."}]
[null,null,null,"Geworfen",{"$f":"SUM(D34)","v":0},"Punkte",null,null,null,null,"Geworfen",{"$f":"SUM(K34)","v":0},"Punkte",null,null,null,null,"Geworfen",{"$f":"SUM(R34)","v":0},"Punkte",null,null,null,null,"Geworfen",{"$f":"SUM(Y34)","v":0},"Punkte",null,null,null,"Ralf M."]
["RD 1",{"$f":"COUNT(D4)*1","v":0},{"$f":"COUNT(D4)*3","v":0},null,{"$f":"SUM(E2-E3)","v":501},"Rest",null,"RD 1",{"$f":"COUNT(K4)*1","v":0},{"$f":"COUNT(K4)*3","v":0},null,{"$f":"SUM(L2-L3)","v":501},"Rest",null,"RD 1",{"$f":"COUNT(R4)*1","v":0},{"$f":"COUNT(R4)*3","v":0},null,{"$f":"SUM(S2-S3)","v":501},"Rest",null,"RD 1",{"$f":"COUNT(Y4)*1","v":0},{"$f":"COUNT(Y4)*3","v":0},null,{"$f":"SUM(Z2-Z3)","v":501},"Rest",null,null,null,"Ralf M."]
["RD 2",0,0,null,null,null,null,"RD 2",0,0,null,null,null,null,"RD 2",0,0,null,null,null,null,"RD 2",0,0]
["RD 3",0,0,null,"ø pro Spiel",{"$f":"SUM(E3)/B34","v":{"$error":"#DIV/0!"}},null,"RD 3",0,0,null,"ø pro Spiel",{"$f":"SUM(L3)/I34","v":{"$error":"#DIV/0!"}},null,"RD 3",0,0,null,"ø pro Spiel",{"$f":"SUM(S3)/P34","v":{"$error":"#DIV/0!"}},null,"RD 3",0,0,null,"ø pro Spiel",{"$f":"SUM(Z3)/W34","v":{"$error":"#DIV/0!"}}]
["RD 4",0,0,null,"ø pro Pfeil",{"$f":"SUM(E3)/C34","v":{"$error":"#DIV/0!"}},null,"RD 4",0,0,null,"ø pro Pfeil",{"$f":"SUM(L3)/J34","v":{"$error":"#DIV/0!"}},null,"RD 4",0,0,null,"ø pro Pfeil",{"$f":"SUM(S3)/Q34","v":{"$error":"#DIV/0!"}},null,"RD 4",0,0,null,"ø pro Pfeil",{"$f":"SUM(Z3)/X34","v":{"$error":"#DIV/0!"}}]
["RD 5",0,0,null,"Average",null,null,"RD 5",0,0,null,"Average",null,null,"RD 5",0,0,null,"Average",null,null,"RD 5",0,0,null,"Average"]
["RD 6",0,0,null,{"$f":"SUM(F6)","v":{"$error":"#DIV/0!"}},null,null,"RD 6",0,0,null,{"$f":"SUM(M6)","v":{"$error":"#DIV/0!"}},null,null,"RD 6",0,0,null,{"$f":"SUM(T6)","v":{"$error":"#DIV/0!"}},null,null,"RD 6",0,0,null,{"$f":"SUM(AA6)","v":{"$error":"#DIV/0!"}}]
["RD 7",0,0,null,null,null,null,"RD 7",0,0,null,null,null,null,"RD 7",0,0,null,null,null,null,"RD 7",0,0]
["RD 8",0,0,null,{"$f":"IF(F6<40,\"Nicht Gut\",\"\")","v":{"$error":"#DIV/0!"}},null,null,"RD 8",0,0,null,{"$f":"IF(M6<40,\"Nicht Gut\",\"\")","v":{"$error":"#DIV/0!"}},null,null,"RD 8",0,0,null,{"$f":"IF(T6<40,\"Nicht Gut\",\"\")","v":{"$error":"#DIV/0!"}},null,null,"RD 8",0,0,null,{"$f":"IF(AA6<40,\"Nicht Gut\",\"\")","v":{"$error":"#DIV/0!"}}]
["RD 9",0,0,null,null,null,null,"RD 9",0,0,null,null,null,null,"RD 9",0,0,null,null,null,null,"RD 9",0,0]
["RD 10",0,0,null,null,null,null,"RD 10",0,0,null,null,null,null,"RD 10",0,0,null,null,null,null,"RD 10",0,0]
["RD 11",0,0,null,{"$f":"IF(AND(F6>=40,F6<=50),\"GUT\",\"\")","v":{"$error":"#DIV/0!"}},null,null,"RD 11",0,0,null,{"$f":"IF(AND(M6>=40,M6<=50),\"GUT\",\"\")","v":{"$error":"#DIV/0!"}},null,null,"RD 11",0,0,null,{"$f":"IF(AND(T6>=40,T6<=50),\"GUT\",\"\")","v":{"$error":"#DIV/0!"}},null,null,"RD 11",0,0,null,{"$f":"IF(AND(AA6>=40,AA6<=50),\"GUT\",\"\")","v":{"$error":"#DIV/0!"}}]
["RD 12",0,0,null,null,null,null,"RD 12",0,0,null,null,null,null,"RD 12",0,0,null,null,null,null,"RD 12",0,0]
["RD 13",0,0,null,null,null,null,"RD 13",0,0,null,null,null,null,"RD 13",0,0,null,null,null,null,"RD 13",0,0]
["RD 14",0,0,null,null,null,null,"RD 14",0,0,null,null,null,null,"RD 14",0,0,null,null,null,null,"RD 14",0,0]
["RD 15",0,0,null,null,null,null,"RD 15",0,0,null,null,null,null,"RD 15",0,0,null,null,null,null,"RD 15",0,0]
["RD 16",0,0,null,{"$f":"D1","v":"Ralf M."},{"$f":"E4","v":501},null,"RD 16",0,0,null,{"$f":"K1","v":"Ralf M."},{"$f":"L4","v":501},null,"RD 16",0,0,null,{"$f":"R1","v":"Ralf M."},{"$f":"S4","v":501},null,"RD 16",0,0,null,{"$f":"Y1","v":"Ralf M."},{"$f":"Z4","v":501}]
["RD 17",0,0,null,"Rest",{"$f":"E4","v":501},null,"RD 17",0,0,null,"Rest",{"$f":"L4","v":501},null,"RD 17",0,0,null,"Rest",{"$f":"S4","v":501},null,"RD 17",0,0,null,"Rest",{"$f":"Z4","v":501}]
["RD 18",0,0,null,{"$f":"IF(F6>50,\"Sehr Gut\",\"\")","v":{"$error":"#DIV/0!"}},null,null,"RD 18",0,0,null,{"$f":"IF(M6>50,\"Sehr Gut\",\"\")","v":{"$error":"#DIV/0!"}},null,null,"RD 18",0,0,null,{"$f":"IF(T6>50,\"Sehr Gut\",\"\")","v":{"$error":"#DIV/0!"}},null,null,"RD 18",0,0,null,{"$f":"IF(AA6>50,\"Sehr Gut\",\"\")","v":{"$error":"#DIV/0!"}}]
["RD 19",0,0,null,null,null,null,"RD 19",0,0,null,null,null,null,"RD 19",0,0,null,null,null,null,"RD 19",0,0]
["RD 20",0,0,null,null,null,null,"RD 20",0,0,null,null,null,null,"RD 20",0,0,null,null,null,null,"RD 20",0,0]
["RD 21",0,0,null,null,null,null,"RD 21",0,0,null,null,null,null,"RD 21",0,0,null,null,null,null,"RD 21",0,0]
["RD 22",0,0,null,null,null,null,"RD 22",0,0,null,null,null,null,"RD 22",0,0,null,null,null,null,"RD 22",0,0]
["RD 23",0,0,null,null,null,null,"RD 23",0,0,null,null,null,null,"RD 23",0,0,null,null,null,null,"RD 23",0,0]
["RD 24",0,0,null,null,null,null,"RD 24",0,0,null,null,null,null,"RD 24",0,0,null,null,null,null,"RD 24",0,0]
["RD 25",0,0,null,null,null,null,"RD 25",0,0,null,null,null,null,"RD 25",0,0,null,null,null,null,"RD 25",0,0]
["RD 26",0,0,null,null,null,null,"RD 26",0,0,null,null,null,null,"RD 26",0,0,null,null,null,null,"RD 26",0,0]
["RD 27",0,0,null,null,null,null,"RD 27",0,0,null,null,null,null,"RD 27",0,0,null,null,null,null,"RD 27",0,0]
["RD 28",0,0,null,null,null,null,"RD 28",0,0,null,null,null,null,"RD 28",0,0,null,null,null,null,"RD 28",0,0]
["RD 29",0,0,null,{"$f":"IF(E4=0,\"Sieg\",\"\")","v":""},null,null,"RD 29",0,0,null,{"$f":"IF(L4=0,\"Sieg\",\"\")","v":""},null,null,"RD 29",0,0,null,{"$f":"IF(S4=0,\"Sieg\",\"\")","v":""},null,null,"RD 29",0,0,null,{"$f":"IF(Z4=0,\"Sieg\",\"\")","v":""}]
["RD 30",0,0,null,null,null,null,"RD 30",0,0,null,null,null,null,"RD 30",0,0,null,null,null,null,"RD 30",0,0]
[null,{"$f":"SUM(B4:B33)","v":0},{"$f":"SUM(C4:C33)","v":0},{"$f":"SUM(D4:D33)","v":0},{"$f":"SUM(D4:D32)","v":0},null,null,null,{"$f":"SUM(I4:I33)","v":0},{"$f":"SUM(J4:J33)","v":0},{"$f":"SUM(K4:K33)","v":0},{"$f":"SUM(K4:K32)","v":0},null,null,null,{"$f":"SUM(P4:P33)","v":0},{"$f":"SUM(Q4:Q33)","v":0},{"$f":"SUM(R4:R33)","v":0},{"$f":"SUM(R4:R32)","v":0},null,null,null,{"$f":"SUM(W4:W33)","v":0},{"$f":"SUM(X4:X33)","v":0},{"$f":"SUM(Y4:Y33)","v":0},{"$f":"SUM(Y4:Y32)","v":0}]
[null,null,null,{"$f":"D1","v":"Ralf M."},null,{"$f":"SUM(E3)","v":0},null,null,null,null,{"$f":"INDEX(D35:D38,MATCH(LARGE(F35:F38,1),F35:F38,0))","v":"Ralf M."}]
[null,null,null,{"$f":"K1","v":"Ralf M."},null,{"$f":"SUM(L3)","v":0},null,null,null,null,{"$f":"INDEX(D35:D38,MATCH(LARGE(F35:F38,2),F35:F38,0))","v":"Ralf M."}]
[null,null,null,{"$f":"R1","v":"Ralf M."},null,{"$f":"SUM(S3)","v":0},null,null,null,null,{"$f":"INDEX(D35:D38,MATCH(LARGE(F35:F38,3),F35:F38,0))","v":"Ralf M."},null,null,null,null,null,null,null,null,null,null,null,null,null,null,null,null,null,null,null,"Micha"]
[null,null,null,{"$f":"Y1","v":"Ralf M."},null,{"$f":"SUM(Z3)","v":0},null,null,null,null,{"$f":"INDEX(D35:D38,MATCH(LARGE(F35:F38,4),F35:F38,0))","v":"Ralf M."}]
[null,null,null,"MAX(B2:B7",null,{"$f":"SUM(F35:F38)","v":0}]

{"sheet":"Sieger","index":12,"n_rows":13,"n_cols":5,"rows_kept":13,"cut":false,"hidden":false,"merged":[[6,4,6,7],[0,4,0,7],[12,1,12,2],[0,1,0,2],[7,1,7,2],[8,1,8,2],[9,1,9,2],[10,1,10,2],[11,1,11,2],[1,1,1,2],[2,1,2,2],[3,1,3,2],[4,1,4,2],[5,1,5,2],[6,1,6,2]]}
[null,"Sieger"]
["Rd.1",{"$f":"'Rd.1'!K35","v":"Ralf M."}]
["Rd.2",{"$f":"'Rd.2'!K35","v":"Ralf M."}]
["Rd.3",{"$f":"'Rd. 3'!K35","v":"Ralf M."}]
["Rd.4",{"$f":"'Rd. 4'!K35","v":"Ralf M."}]
["Rd.5",{"$f":"'Rd.5'!K35","v":"Ralf M."}]
["Rd.6",{"$f":"'Rd.6'!K35","v":"Ralf M."},null,null,"Alles Leeren"]
["Rd.7",{"$f":"'Rd. 7'!K35","v":"Ralf M."}]
["Rd.8",{"$f":"'Rd. 8'!K35","v":"Ralf M."}]
["Rd.9",{"$f":"'Rd. 9'!K35","v":"Ralf M."}]
["Rd.10",{"$f":"'Rd. 10'!K35","v":"Ralf M."}]
["Rd.11",{"$f":"'Rd. 11'!K35","v":"Ralf M."}]
["Rd.12",{"$f":"'Rd. 12'!K35","v":"Ralf M."}]

{"sheet":"Tabelle1","index":13,"n_rows":47,"n_cols":4,"rows_kept":47,"cut":false,"hidden":false,"merged":[]}
["Anja/Erich","Ralf Kl.","Ralf Kl."]
["Anja/Siggi","Volker","Volker",2]
["Anja/Ralf M.","Rene","Rene",2]
["Anja/Ralf Kl.","Nicole","Nicole",3]
["Anja/Volker","Frank","Frank",3]
["Anja/Rene","Rosi","Rosi",4]
["Anja/Nicole","Werner","Werner",4]
["Anja/Frank","Gast","Gast"]
["Anja/Gast","Joker","Joker"]
["Joker","Anja","Anja"]
["Erich/Siggi","Vincent","Vincent"]
["Erich/Ralf M.","Erich","Erich"]
["Erich/Ralf Kl.","Siggi","Siggi"]
["Erich/Volker","Ralf M.","Ralf M."]
["Erich/Rene","Dirk B."]
["Erich/Nicole"]
["Erich/Frank"]
["Erich/Gast"]
["Siggi/Ralf M."]
["Siggi/Ralf Kl."]
["Siggi/Volker"]
["Siggi/Rene"]
["Siggi/Nicole"]
["Siggi/Frank"]
["Siggi/Gast"]
["Ralf M./Ralf Kl."]
["Ralf M./Volker"]
["Ralf M./Rene"]
["Ralf M./Nicole"]
["Ralf M./Frank"]
["Ralf M./Gast"]
["Ralf Kl./Volker"]
["Ralf Kl./Rene"]
["Ralf Kl./Nicole"]
["Ralf Kl./Frank"]
["Ralf Kl./Gast"]
["Volker/Rene"]
["Volker/Nicole"]
["Volker/Frank"]
["Volker/Gast"]
["Rene/Nicole"]
["Rene/Frank"]
["Rene/Gast"]
["Nicole/Frank"]
["Nicole/Gast"]
["Frank/Gast"]
["Joker"]