{"text_format":"1","workbook":"xlsx","n_sheets":3,"sheets":["Stand","Liste1+5","Auswertung"],"not_rendered":{"charts":0,"images":0,"macros":1,"external_links":0,"defined_names":1,"comments":0,"pivot_tables":0},"unopened":[],"bounds":{"document_bytes":16777216,"sheet_cells":100000,"rows_first":2000,"rows_last":500,"rows_between":2000,"halvings":0,"cell_chars":16384,"cell_head_chars":4096},"cells_cut":0,"cells_raw":0,"read":"whole","date_system":"1900"}

{"sheet":"Stand","index":0,"n_rows":30,"n_cols":45,"rows_kept":30,"cut":false,"hidden":false,"merged":[]}
["Name","Vorname","Geburtsdatum","Abteilung","xxx","G 46 MS",null,null,"G46MS","G 24 Haut",null,null,"G24Haut","G 37 BAP",null,null,"G37BAP","G 42 Infektionsschutz",null,null,"G42Infektionsschutz","G 40 KRM Stoffe",null,null,"G40KRMStoffe","G25 Fahr_Steuer_Überwachung",null,null,"G25Fahr_Steuer_Überwachung","G 20 Lärm",null,null,"G20Lärm","G 1_1 Silikogener Staub",null,null,"G1_1SilikogenerStaub","G 26_1 Atemschutz FFP 2_3",null,null,"G26_1AtemschutzFFP2_3","G 30 Hitze",null,null,"G30Hitze"]
[null,null,null,null,null,null,"erster","letzter","nächster",null,"erster","letzter","nächster",null,"erster","letzter","nächster",null,"erster","letzter","nächster",null,"erster","letzter","nächster",null,"erster","letzter","nächster",null,"erster","letzter","nächster",null,"erster","letzter","nächster",null,"erster","letzter","nächster",null,"erster","letzter","nächster"]
["Muster","Heike",null,"Innere 1",null,{"$f":"VLOOKUP(D3,'Liste1+5'!C:M,2,FALSE)","v":"-"},null,null,{"$f":"IF(OR(F3=\"A\",F3=\"P\"),IF(H3=\"\",IF(G3=\"\",0,G3+365),H3+1096),0)","v":"00:00:00"},{"$f":"IFERROR(LOOKUP($D3,'Liste1+5'!$C$2:$C$3,'Liste1+5'!$E$2:$E$3),\"\")","v":"P"},"2023-08-17","2024-09-24",{"$f":"IF(OR(J3=\"A\",J3=\"P\"),IF(L3=\"\",IF(K3=\"\",0,K3+365),L3+1096),0)","v":"2027-09-25"},{"$f":"IFERROR(LOOKUP($D3,'Liste1+5'!$C$2:$C$3,'Liste1+5'!$F$2:$F$3),\"\")","v":"A"},null,"2024-09-24",{"$f":"IF(OR(N3=\"A\",N3=\"P\"),IF(P3=\"\",IF(O3=\"\",0,O3+365),P3+1096),0)","v":"2027-09-25"},{"$f":"IFERROR(LOOKUP($D3,'Liste1+5'!$C$2:$C$3,'Liste1+5'!$G$2:$G$3),\"\")","v":"P"},null,"2021-09-24",{"$f":"IF(OR(R3=\"A\",R3=\"P\"),IF(T3=\"\",IF(S3=\"\",0,S3+365),T3+1096),0)","v":"2024-09-24"},{"$f":"IFERROR(LOOKUP($D3,'Liste1+5'!$C$2:$C$3,'Liste1+5'!$H$2:$H$3),\"\")","v":"-"},null,null,{"$f":"IF(OR(V3=\"A\",V3=\"P\"),IF(X3=\"\",IF(W3=\"\",0,W3+365),X3+1096),0)","v":"00:00:00"},{"$f":"IFERROR(LOOKUP($D3,'Liste1+5'!$C$2:$C$3,'Liste1+5'!$I$2:$I$3),\"\")","v":0},null,null,{"$f":"IF(OR(Z3=\"A\",Z3=\"P\"),IF(AB3=\"\",IF(AA3=\"\",0,AA3+365),AB3+1096),0)","v":"00:00:00"},{"$f":"IFERROR(LOOKUP($D3,'Liste1+5'!$C$2:$C$3,'Liste1+5'!$J$2:$J$3),\"\")","v":0},null,null,{"$f":"IF(OR(AD3=\"A\",AD3=\"P\"),IF(AF3=\"\",IF(AE3=\"\",0,AE3+365),AF3+1096),0)","v":"00:00:00"},{"$f":"IFERROR(LOOKUP($D3,'Liste1+5'!$C$2:$C$3,'Liste1+5'!$K$2:$K$3),\"\")","v":0},null,null,{"$f":"IF(OR(AH3=\"A\",AH3=\"P\"),IF(AJ3=\"\",IF(AI3=\"\",0,AI3+365),AJ3+1096),0)","v":"00:00:00"},{"$f":"IFERROR(LOOKUP($D3,'Liste1+5'!$C$2:$C$3,'Liste1+5'!$L$2:$L$3),\"\")","v":0},null,null,{"$f":"IF(OR(AL33=\"A\",AL3=\"P\"),IF(AN3=\"\",IF(AM3=\"\",0,AM3+365),AN3+1096),0)","v":"00:00:00"},{"$f":"IFERROR(LOOKUP($D3,'Liste1+5'!$C$2:$C$3,'Liste1+5'!$M$2:$M$3),\"\")","v":0},null,null,{"$f":"IF(OR(AP3=\"A\",AP3=\"P\"),IF(AR3=\"\",IF(AQ3=\"\",0,AQ3+365),AR3+1096),0)","v":"00:00:00"}]
["Mustermann","Max",null,"Gynäkologie",null,{"$f":"VLOOKUP(D4,'Liste1+5'!C:M,2,FALSE)","v":"A"},"2024-03-22","2025-05-14","2028-05-14",{"$f":"IFERROR(LOOKUP($D4,'Liste1+5'!$C$2:$C$3,'Liste1+5'!$E$2:$E$3),\"\")","v":"P"},"2024-04-25",null,"2025-04-25",{"$f":"IFERROR(LOOKUP($D4,'Liste1+5'!$C$2:$C$3,'Liste1+5'!$F$2:$F$3),\"\")","v":"A"},"2024-03-22",null,"2025-03-22",{"$f":"IFERROR(LOOKUP($D4,'Liste1+5'!$C$2:$C$3,'Liste1+5'!$G$2:$G$3),\"\")","v":"P"},null,null,"00:00:00",{"$f":"IFERROR(LOOKUP($D4,'Liste1+5'!$C$2:$C$3,'Liste1+5'!$H$2:$H$3),\"\")","v":"P"},"2024-03-22","2025-05-28","2028-05-28",{"$f":"IFERROR(LOOKUP($D4,'Liste1+5'!$C$2:$C$3,'Liste1+5'!$I$2:$I$3),\"\")","v":0},null,null,"00:00:00",{"$f":"IFERROR(LOOKUP($D4,'Liste1+5'!$C$2:$C$3,'Liste1+5'!$J$2:$J$3),\"\")","v":0},null,null,"00:00:00",{"$f":"IFERROR(LOOKUP($D4,'Liste1+5'!$C$2:$C$3,'Liste1+5'!$K$2:$K$3),\"\")","v":0},null,null,"00:00:00",{"$f":"IFERROR(LOOKUP($D4,'Liste1+5'!$C$2:$C$3,'Liste1+5'!$L$2:$L$3),\"\")","v":0},null,null,"00:00:00",{"$f":"IFERROR(LOOKUP($D4,'Liste1+5'!$C$2:$C$3,'Liste1+5'!$M$2:$M$3),\"\")","v":0},null,null,"00:00:00"]
["Test","Thomas",null,"Innere 1",null,{"$f":"VLOOKUP(D5,'Liste1+5'!C:M,2,FALSE)","v":"-"},null,null,"00:00:00",{"$f":"IFERROR(LOOKUP($D5,'Liste1+5'!$C$2:$C$3,'Liste1+5'!$E$2:$E$3),\"\")","v":"P"},"2019-04-17","2020-07-28","2023-07-29",{"$f":"IFERROR(LOOKUP($D5,'Liste1+5'!$C$2:$C$3,'Liste1+5'!$F$2:$F$3),\"\")","v":"A"},"2019-04-22","2023-06-25","2026-06-25",{"$f":"IFERROR(LOOKUP($D5,'Liste1+5'!$C$2:$C$3,'Liste1+5'!$G$2:$G$3),\"\")","v":"P"},"2019-04-22","2024-10-25","2027-10-26",{"$f":"IFERROR(LOOKUP($D5,'Liste1+5'!$C$2:$C$3,'Liste1+5'!$H$2:$H$3),\"\")","v":"-"},null,null,"00:00:00",{"$f":"IFERROR(LOOKUP($D5,'Liste1+5'!$C$2:$C$3,'Liste1+5'!$I$2:$I$3),\"\")","v":0},null,null,"00:00:00",{"$f":"IFERROR(LOOKUP($D5,'Liste1+5'!$C$2:$C$3,'Liste1+5'!$J$2:$J$3),\"\")","v":0},null,null,"00:00:00",{"$f":"IFERROR(LOOKUP($D5,'Liste1+5'!$C$2:$C$3,'Liste1+5'!$K$2:$K$3),\"\")","v":0},null,null,"00:00:00",{"$f":"IFERROR(LOOKUP($D5,'Liste1+5'!$C$2:$C$3,'Liste1+5'!$L$2:$L$3),\"\")","v":0},null,null,"00:00:00",{"$f":"IFERROR(LOOKUP($D5,'Liste1+5'!$C$2:$C$3,'Liste1+5'!$M$2:$M$3),\"\")","v":0},null,null,"00:00:00"]
[]
[]
[]
[]
[]
[]
[]
[]
[]
[]
[]
[]
[]
[]
[]
[]
[]
[]
[]
[null,null,null,null,null,null,null,null,null,null,null,null,null,null,null,null,null,null,null,null,null,null,null,null,null,null,null,null,null,{"$f":"IFERROR(LOOKUP($D25,'Liste1+5'!#REF!,'Liste1+5'!#REF!),\"\")","v":""},null,null,null,{"$f":"IFERROR(LOOKUP($D25,'Liste1+5'!#REF!,'Liste1+5'!#REF!),\"\")","v":""},null,null,null,{"$f":"IFERROR(LOOKUP($D25,'Liste1+5'!#REF!,'Liste1+5'!#REF!),\"\")","v":""},null,null,null,{"$f":"IFERROR(LOOKUP($D25,'Liste1+5'!#REF!,'Liste1+5'!#REF!),\"\")","v":""}]
[null,null,null,null,null,null,null,null,null,null,null,null,null,null,null,null,null,null,null,null,null,null,null,null,null,null,null,null,null,{"$f":"IFERROR(LOOKUP($D26,'Liste1+5'!#REF!,'Liste1+5'!#REF!),\"\")","v":""},null,null,null,{"$f":"IFERROR(LOOKUP($D26,'Liste1+5'!#REF!,'Liste1+5'!#REF!),\"\")","v":""},null,null,null,{"$f":"IFERROR(LOOKUP($D26,'Liste1+5'!#REF!,'Liste1+5'!#REF!),\"\")","v":""},null,null,null,{"$f":"IFERROR(LOOKUP($D26,'Liste1+5'!#REF!,'Liste1+5'!#REF!),\"\")","v":""}]
[null,null,null,null,null,null,null,null,null,null,null,null,null,null,null,null,null,null,null,null,null,null,null,null,null,null,null,null,null,{"$f":"IFERROR(LOOKUP($D27,'Liste1+5'!#REF!,'Liste1+5'!#REF!),\"\")","v":""},null,null,null,{"$f":"IFERROR(LOOKUP($D27,'Liste1+5'!#REF!,'Liste1+5'!#REF!),\"\")","v":""},null,null,null,{"$f":"IFERROR(LOOKUP($D27,'Liste1+5'!#REF!,'Liste1+5'!#REF!),\"\")","v":""},null,null,null,{"$f":"IFERROR(LOOKUP($D27,'Liste1+5'!#REF!,'Liste1+5'!#REF!),\"\")","v":""}]
[null,null,null,null,null,null,null,null,null,null,null,null,null,null,null,null,null,null,null,null,null,null,null,null,null,null,null,null,null,{"$f":"IFERROR(LOOKUP($D28,'Liste1+5'!#REF!,'Liste1+5'!#REF!),\"\")","v":""},null,null,null,{"$f":"IFERROR(LOOKUP($D28,'Liste1+5'!#REF!,'Liste1+5'!#REF!),\"\")","v":""},null,null,null,{"$f":"IFERROR(LOOKUP($D28,'Liste1+5'!#REF!,'Liste1+5'!#REF!),\"\")","v":""},null,null,null,{"$f":"IFERROR(LOOKUP($D28,'Liste1+5'!#REF!,'Liste1+5'!#REF!),\"\")","v":""}]
[null,null,null,null,null,null,null,null,null,null,null,null,null,null,null,null,null,null,null,null,null,null,null,null,null,null,null,null,null,{"$f":"IFERROR(LOOKUP($D29,'Liste1+5'!#REF!,'Liste1+5'!#REF!),\"\")","v":""},null,null,null,{"$f":"IFERROR(LOOKUP($D29,'Liste1+5'!#REF!,'Liste1+5'!#REF!),\"\")","v":""},null,null,null,{"$f":"IFERROR(LOOKUP($D29,'Liste1+5'!#REF!,'Liste1+5'!#REF!),\"\")","v":""},null,null,null,{"$f":"IFERROR(LOOKUP($D29,'Liste1+5'!#REF!,'Liste1+5'!#REF!),\"\")","v":""}]
[null,null,null,null,null,null,null,null,null,null,null,null,null,null,null,null,null,null,null,null,null,null,null,null,null,null,null,null,null,{"$f":"IFERROR(LOOKUP($D30,'Liste1+5'!#REF!,'Liste1+5'!#REF!),\"\")","v":""},null,null,null,{"$f":"IFERROR(LOOKUP($D30,'Liste1+5'!#REF!,'Liste1+5'!#REF!),\"\")","v":""},null,null,null,{"$f":"IFERROR(LOOKUP($D30,'Liste1+5'!#REF!,'Liste1+5'!#REF!),\"\")","v":""},null,null,null,{"$f":"IFERROR(LOOKUP($D30,'Liste1+5'!#REF!,'Liste1+5'!#REF!),\"\")","v":""}]

{"sheet":"Liste1+5","index":1,"n_rows":3,"n_cols":29,"rows_kept":3,"cut":false,"hidden":false,"merged":[]}
["Name","Vorname","Abteilung","G 46\nMS","G 24 \nHaut","G 37 \nBAP","G 42 Infektions-schutz","G 40 \nKMR Stoffe","G25 (Stufe 2)\nFahr- Steuer- Überwachung","G 20 \nLärm","G1.1 \nSilikogener Staub","G26.1 \nAtemschutz \nFFP 2-3","G30 \nHitze",null,null,null,null,null,null,null,null,null,null,null,null,null,null,null,"x"]
[null,null,"Gynäkologie","A","P","A","P","P"]
[null,null,"Innere 1","-","P","A","P","-"]

{"sheet":"Auswertung","index":2,"n_rows":25,"n_cols":4,"rows_kept":25,"cut":false,"hidden":false,"merged":[]}
["Name","Vorname","Abteilung","nächster Termin"]
[]
["G46MS"]
[]
["G24Haut"]
["Mustermann","Max","Gynäkologie","2025-04-25"]
["Test","Thomas","Innere 1","2023-07-29"]
[]
["G37BAP"]
["Mustermann","Max","Gynäkologie","2025-03-22"]
[]
["G42Infektionsschutz"]
["Muster","Heike","Innere 1","2024-09-24"]
[]
["G40KRMStoffe"]
[]
["G25Fahr_Steuer_Überwachung"]
[]
["G20Lärm"]
[]
["G1_1SilikogenerStaub"]
[]
["G26_1AtemschutzFFP2_3"]
[]
["G30Hitze"]