{"text_format":"1","workbook":"xlsx","n_sheets":4,"sheets":["starter","final","einzel","mannschaft"],"not_rendered":{"charts":0,"images":0,"macros":1,"external_links":0,"defined_names":3,"comments":1,"pivot_tables":0},"unopened":[],"bounds":{"document_bytes":16777216,"sheet_cells":100000,"rows_first":2000,"rows_last":500,"rows_between":2000,"halvings":0,"cell_chars":16384,"cell_head_chars":4096},"cells_cut":0,"cells_raw":0,"read":"whole","date_system":"1900"}

{"sheet":"starter","index":0,"n_rows":42,"n_cols":8,"rows_kept":42,"cut":false,"hidden":false,"merged":[[0,3,0,4],[0,1,0,2],[0,6,0,7]]}
[null,"Teilnehmer - Vorergebnis",null,null,null,null,"Mannschaften (zugelost)"]
["Nr.","Name","Vorname ","m/w","Ringe","mit","Name","Vorname"]
[{"$f":"IF(B3=\"\",\"\",1)","v":1},"Traut","Oswald","m",419.2,"↔","Ewen","Luca"]
[{"$f":"IF(B4=\"\",\"\",A3+1)","v":2},"Bechtel","Marina","w",416,"↔","Zimmer","Jennifer"]
[3,"Traut","Annemarie","w",415.3,"↔","Görgen","Elfriede"]
[4,"Reis ","Paul","m",414.4,"↔","Lorse","Philipp"]
[5,"Stoffel","Anton","m",414,"↔","Greber","Michael"]
[6,"König","Herbert","m",413.6,"↔","Konz","Patrick"]
[7,"Boujong","Annalena","w",412.8,"↔","Reis","Mechthild"]
[8,"Feit","Ulrike","w",412.6,"↔","Grauer","Fabian"]
[9,"Bechtel","Karl Heinz","m",412.2,"↔","Barthelme","Friedrich"]
[10,"König","Marlene","w",411.7,"↔","Barzen","Kevin"]
[11,"Feit","Udo","m",411.4,"↔","Mayer","Wolfgang"]
[12,"Hansen","Alfred","m",409.8,"↔","Stark","Arnold"]
[13,"Staadt","Brunhilde","w",403.1,"↔","Kaurisch","Erwin"]
[14,"Mayer","Wolfgang","m",399.9,"↔"]
[15,"Ewen","Luca","m",399.3,"↔"]
[16,"Stark","Arnold","m",397.3,"↔"]
[17,"Reis ","Mechthild","w",395.3,"↔"]
[18,"Konz","Anne ","w",393.4,"↔"]
[19,"Görgen","Elfriede","w",388.9,"↔"]
[20,"Greber","Michael","m",385.9,"↔"]
[21,"Grauer","Fabian","m",383.7]
[22,"Zimmer","Jennifer","w",381]
[23,"Barzen","Kevin","m",373.2]
[24,"Lorse","Philipp","m",363.9]
[25,"Kaurisch","Erwin","m",324.60000000000002]
[26,"Barthelme","Friedrich","m",318.7]
[27,"Konz","Patrick ","m",317.60000000000002]
[""]
[""]
[""]
[""]
[""]
[""]
[""]
[""]
[""]
[""]
[""]
[""]
[""]

{"sheet":"final","index":1,"n_rows":42,"n_cols":17,"rows_kept":42,"cut":false,"hidden":false,"merged":[[0,13,0,16]]}
[null,"Finalschießen"]
["Nr.","Name","m/w","w","m","1. FS","2.FS","3.FS","4.FS","5.FS","Z-Stand","6.FS","7.FS","8.FS","9.FS","10.FS","Gesamt"]
[{"$f":"starter!A3","v":1},{"$f":"CONCATENATE(starter!B3,\"   \",starter!C3)","v":"Traut   Oswald"},{"$f":"IF(starter!D3=\"\",\"\",starter!D3)","v":"m"},{"$f":"IF(C3=\"w\",C3,\"\")","v":""},{"$f":"IF(C3=\"w\",\"\",C3)","v":"m"},10.9,10.9,10.9,10.9,10.9,{"$f":"IF(AND(F3=\"\",G3=\"\",H3=\"\",I3=\"\",J3=\"\"),\"\",SUM(F3:J3))","v":54.5},10.9,10.9,10.9,10.9,10.9,{"$f":"IF(AND(L3=\"\",M3=\"\",N3=\"\",O3=\"\",P3=\"\"),\"\",SUM(K3:P3))","v":109.00000000000003}]
[{"$f":"starter!A4","v":2},{"$f":"CONCATENATE(starter!B4,\"   \",starter!C4)","v":"Bechtel   Marina"},{"$f":"IF(starter!D4=\"\",\"\",starter!D4)","v":"w"},"w","",10,10,10,10,10,50,10,10,10,10,10,100]
[{"$f":"starter!A5","v":3},{"$f":"CONCATENATE(starter!B5,\"   \",starter!C5)","v":"Traut   Annemarie"},{"$f":"IF(starter!D5=\"\",\"\",starter!D5)","v":"w"},"w","",9.9,9.9,9.9,9.9,9.9,49.5,9.9,9.9,9.9,9.9,9.9,99.000000000000014]
[{"$f":"starter!A6","v":4},{"$f":"CONCATENATE(starter!B6,\"   \",starter!C6)","v":"Reis    Paul"},{"$f":"IF(starter!D6=\"\",\"\",starter!D6)","v":"m"},"","m",9.6,9.6,9.6,9.6,9.6,48,9.6,9.6,9.6,9.6,9.6,95.999999999999986]
[{"$f":"starter!A7","v":5},{"$f":"CONCATENATE(starter!B7,\"   \",starter!C7)","v":"Stoffel   Anton"},{"$f":"IF(starter!D7=\"\",\"\",starter!D7)","v":"m"},"","m",9.4,9.4,9.4,9.4,9.4,47,9.4,9.4,9.4,9.4,9.4,94.000000000000014]
[{"$f":"starter!A8","v":6},{"$f":"CONCATENATE(starter!B9,\"   \",starter!C9)","v":"Boujong   Annalena"},{"$f":"IF(starter!D9=\"\",\"\",starter!D9)","v":"w"},"w","",8.9,8.9,8.9,8.9,8.9,44.5,8.9,8.9,8.9,8.9,8.9,89.000000000000014]
[{"$f":"starter!A9","v":7},{"$f":"CONCATENATE(starter!B8,\"   \",starter!C8)","v":"König   Herbert"},{"$f":"IF(starter!D8=\"\",\"\",starter!D8)","v":"m"},"","m",8.9,8.9,8.9,8.9,8.9,44.5,8.9,8.9,8.9,8.9,8.9,89.000000000000014]
[{"$f":"starter!A10","v":8},{"$f":"CONCATENATE(starter!B10,\"   \",starter!C10)","v":"Feit   Ulrike"},{"$f":"IF(starter!D10=\"\",\"\",starter!D10)","v":"w"},"w","",8.6,8.6,8.6,8.6,8.6,43,8.6,8.6,8.6,8.6,8.6,85.999999999999986]
[{"$f":"starter!A11","v":9},{"$f":"CONCATENATE(starter!B11,\"   \",starter!C11)","v":"Bechtel   Karl Heinz"},{"$f":"IF(starter!D11=\"\",\"\",starter!D11)","v":"m"},"","m",8.9,9.9,8.4,7.9,6.9,42,8.9,8.5,8.4,8.6,8.4,84.8]
[{"$f":"starter!A12","v":10},{"$f":"CONCATENATE(starter!B12,\"   \",starter!C12)","v":"König   Marlene"},{"$f":"IF(starter!D12=\"\",\"\",starter!D12)","v":"w"},"w","",7.8,7.8,7.8,7.8,7.8,39,7.8,7.8,7.8,7.8,7.8,77.999999999999986]
[{"$f":"starter!A13","v":11},{"$f":"CONCATENATE(starter!B13,\"   \",starter!C13)","v":"Feit   Udo"},{"$f":"IF(starter!D13=\"\",\"\",starter!D13)","v":"m"},"","m",7.6,7.6,7.6,7.6,7.6,38,7.6,7.6,7.6,7.6,7.6,76]
[{"$f":"starter!A14","v":12},{"$f":"CONCATENATE(starter!B14,\"   \",starter!C14)","v":"Hansen   Alfred"},{"$f":"IF(starter!D14=\"\",\"\",starter!D14)","v":"m"},"","m",7.3,7.3,7.3,7.3,7.3,36.5,7.3,7.3,7.3,7.3,7.3,72.999999999999986]
[{"$f":"starter!A15","v":13},{"$f":"CONCATENATE(starter!B15,\"   \",starter!C15)","v":"Staadt   Brunhilde"},{"$f":"IF(starter!D15=\"\",\"\",starter!D15)","v":"w"},"w","",7,7,7,7,7,35,7,7,7,7,7,70]
[{"$f":"starter!A16","v":14},{"$f":"CONCATENATE(starter!B16,\"   \",starter!C16)","v":"Mayer   Wolfgang"},{"$f":"IF(starter!D16=\"\",\"\",starter!D16)","v":"m"},"","m",6.9,6.9,6.9,6.9,6.9,34.5,6.9,6.9,6.9,6.9,6.9,69]
[{"$f":"starter!A17","v":15},{"$f":"CONCATENATE(starter!B17,\"   \",starter!C17)","v":"Ewen   Luca"},{"$f":"IF(starter!D17=\"\",\"\",starter!D17)","v":"m"},"","m",6.8,6.8,6.8,6.8,6.8,34,6.8,6.8,6.8,6.8,6.8,67.999999999999986]
[{"$f":"starter!A18","v":16},{"$f":"CONCATENATE(starter!B18,\"   \",starter!C18)","v":"Stark   Arnold"},{"$f":"IF(starter!D18=\"\",\"\",starter!D18)","v":"m"},"","m",6.7,6.7,6.7,6.7,6.7,33.5,6.7,6.7,6.7,6.7,6.7,67.000000000000014]
[{"$f":"starter!A19","v":17},{"$f":"CONCATENATE(starter!B19,\"   \",starter!C19)","v":"Reis    Mechthild"},{"$f":"IF(starter!D19=\"\",\"\",starter!D19)","v":"w"},"w","",6,6,6,6,6,30,6,6,6,6,6,60]
[{"$f":"starter!A20","v":18},{"$f":"CONCATENATE(starter!B20,\"   \",starter!C20)","v":"Konz   Anne "},{"$f":"IF(starter!D20=\"\",\"\",starter!D20)","v":"w"},"w","",5,5,5,5,5,25,5,5,5,5,5,50]
[{"$f":"starter!A21","v":19},{"$f":"CONCATENATE(starter!B21,\"   \",starter!C21)","v":"Görgen   Elfriede"},{"$f":"IF(starter!D21=\"\",\"\",starter!D21)","v":"w"},"w","",4.8,4.8,4.8,4.8,4.8,24,4.8,4.8,4.8,4.8,4.8,47.999999999999993]
[{"$f":"starter!A22","v":20},{"$f":"CONCATENATE(starter!B22,\"   \",starter!C22)","v":"Greber   Michael"},{"$f":"IF(starter!D22=\"\",\"\",starter!D22)","v":"m"},"","m",4.5999999999999996,4.5999999999999996,4.5999999999999996,4.5999999999999996,4.5999999999999996,23,4.5999999999999996,4.5999999999999996,4.5999999999999996,4.5999999999999996,4.5999999999999996,46.000000000000007]
[{"$f":"starter!A23","v":21},{"$f":"CONCATENATE(starter!B23,\"   \",starter!C23)","v":"Grauer   Fabian"},{"$f":"IF(starter!D23=\"\",\"\",starter!D23)","v":"m"},"","m",4.5,4.5,4.5,4.5,4.5,22.5,4.5,4.5,4.5,4.5,4.5,45]
[{"$f":"starter!A24","v":22},{"$f":"CONCATENATE(starter!B24,\"   \",starter!C24)","v":"Zimmer   Jennifer"},{"$f":"IF(starter!D24=\"\",\"\",starter!D24)","v":"w"},"w","",4,4,4,4,4,20,4,4,4,4,4,40]
[{"$f":"starter!A25","v":23},{"$f":"CONCATENATE(starter!B25,\"   \",starter!C25)","v":"Barzen   Kevin"},{"$f":"IF(starter!D25=\"\",\"\",starter!D25)","v":"m"},"","m",3.9,3.9,3.9,3.9,3.9,19.5,3.9,3.9,3.9,3.9,3.9,38.999999999999993]
[{"$f":"starter!A26","v":24},{"$f":"CONCATENATE(starter!B26,\"   \",starter!C26)","v":"Lorse   Philipp"},{"$f":"IF(starter!D26=\"\",\"\",starter!D26)","v":"m"},"","m",3.5,3.5,3.5,3.5,3.5,17.5,3.5,3.5,3.5,3.5,3.5,35]
[{"$f":"starter!A27","v":25},{"$f":"CONCATENATE(starter!B27,\"   \",starter!C27)","v":"Kaurisch   Erwin"},{"$f":"IF(starter!D27=\"\",\"\",starter!D27)","v":"m"},"","m",3,3,3,3,3,15,3,3,3,3,3,30]
[{"$f":"starter!A28","v":26},{"$f":"CONCATENATE(starter!B28,\"   \",starter!C28)","v":"Barthelme   Friedrich"},{"$f":"IF(starter!D28=\"\",\"\",starter!D28)","v":"m"},"","m",2,2,2,2,2,10,2,2,2,2,2,20]
[{"$f":"starter!A29","v":27},{"$f":"CONCATENATE(starter!B29,\"   \",starter!C29)","v":"Konz   Patrick "},{"$f":"IF(starter!D29=\"\",\"\",starter!D29)","v":"m"},"","m",1,1,1,1,1,5,1,1,1,1,1,10]
[{"$f":"starter!A30","v":""},{"$f":"CONCATENATE(starter!B30,\"   \",starter!C30)","v":"   "},{"$f":"IF(starter!D30=\"\",\"\",starter!D30)","v":""}]
[{"$f":"starter!A31","v":""},{"$f":"CONCATENATE(starter!B31,\"   \",starter!C31)","v":"   "},{"$f":"IF(starter!D31=\"\",\"\",starter!D31)","v":""}]
[{"$f":"starter!A32","v":""},{"$f":"CONCATENATE(starter!B32,\"   \",starter!C32)","v":"   "},{"$f":"IF(starter!D32=\"\",\"\",starter!D32)","v":""}]
[{"$f":"starter!A33","v":""},{"$f":"CONCATENATE(starter!B33,\"   \",starter!C33)","v":"   "},{"$f":"IF(starter!D33=\"\",\"\",starter!D33)","v":""}]
[{"$f":"starter!A34","v":""},{"$f":"CONCATENATE(starter!B34,\"   \",starter!C34)","v":"   "},{"$f":"IF(starter!D34=\"\",\"\",starter!D34)","v":""}]
[{"$f":"starter!A35","v":""},{"$f":"CONCATENATE(starter!B35,\"   \",starter!C35)","v":"   "},{"$f":"IF(starter!D35=\"\",\"\",starter!D35)","v":""}]
[{"$f":"starter!A36","v":""},{"$f":"CONCATENATE(starter!B36,\"   \",starter!C36)","v":"   "},{"$f":"IF(starter!D36=\"\",\"\",starter!D36)","v":""}]
[{"$f":"starter!A37","v":""},{"$f":"CONCATENATE(starter!B37,\"   \",starter!C37)","v":"   "},{"$f":"IF(starter!D37=\"\",\"\",starter!D37)","v":""}]
[{"$f":"starter!A38","v":""},{"$f":"CONCATENATE(starter!B38,\"   \",starter!C38)","v":"   "},{"$f":"IF(starter!D38=\"\",\"\",starter!D38)","v":""}]
[{"$f":"starter!A39","v":""},{"$f":"CONCATENATE(starter!B39,\"   \",starter!C39)","v":"   "},{"$f":"IF(starter!D39=\"\",\"\",starter!D39)","v":""}]
[{"$f":"starter!A40","v":""},{"$f":"CONCATENATE(starter!B40,\"   \",starter!C40)","v":"   "},{"$f":"IF(starter!D40=\"\",\"\",starter!D40)","v":""}]
[{"$f":"starter!A41","v":""},{"$f":"CONCATENATE(starter!B41,\"   \",starter!C41)","v":"   "},{"$f":"IF(starter!D41=\"\",\"\",starter!D41)","v":""}]
[{"$f":"starter!A42","v":""},{"$f":"CONCATENATE(starter!B42,\"   \",starter!C42)","v":"   "},{"$f":"IF(starter!D42=\"\",\"\",starter!D42)","v":""}]

{"sheet":"einzel","index":2,"n_rows":22,"n_cols":9,"rows_kept":22,"cut":false,"hidden":false,"merged":[]}
[null,"Einzelwertung - Damen (w)",null,null,null,null,"Einzelwertung - Herren (m)"]
["Platz","Name",null,"Ergebnis",null,"Platz","Name",null,"Ergebnis"]
[1,"Bechtel   Marina",null,100,null,1,"Traut   Oswald",null,109.00000000000003]
[2,"Traut   Annemarie",null,99.000000000000014,null,2,"Reis    Paul",null,95.999999999999986]
[3,"Boujong   Annalena",null,89.000000000000014,null,3,"Stoffel   Anton",null,94.000000000000014]
[4,"Feit   Ulrike",null,85.999999999999986,null,4,"König   Herbert",null,89.000000000000014]
[5,"König   Marlene",null,77.999999999999986,null,5,"Bechtel   Karl Heinz",null,84.8]
[6,"Staadt   Brunhilde",null,70,null,6,"Feit   Udo",null,76]
[7,"Reis    Mechthild",null,60,null,7,"Hansen   Alfred",null,72.999999999999986]
[8,"Konz   Anne ",null,50,null,8,"Mayer   Wolfgang",null,69]
[9,"Görgen   Elfriede",null,47.999999999999993,null,9,"Ewen   Luca",null,67.999999999999986]
[10,"Zimmer   Jennifer",null,40,null,10,"Stark   Arnold",null,67.000000000000014]
[11,null,null,null,null,11,"Greber   Michael",null,46.000000000000007]
[12,null,null,null,null,12,"Grauer   Fabian",null,45]
[13,null,null,null,null,13,"Barzen   Kevin",null,38.999999999999993]
[14,null,null,null,null,14,"Lorse   Philipp",null,35]
[15,null,null,null,null,15,"Kaurisch   Erwin",null,30]
[16,null,null,null,null,16,"Barthelme   Friedrich",null,20]
[17,null,null,null,null,17,"Konz   Patrick ",null,10]
[18,null,null,null,null,18]
[19,null,null,null,null,19]
[20,null,null,null,null,20]

{"sheet":"mannschaft","index":3,"n_rows":22,"n_cols":6,"rows_kept":22,"cut":false,"hidden":false,"merged":[]}
[null,"Mannschaftswertung"]
["Platz","Name (gesetzt)","Ringe","Name (zugelost)","Ringe","Gesamt"]
[1,"Traut   Oswald",109.00000000000003,"Ewen   Luca",67.999999999999986,177]
[2,"Bechtel   Marina",100,"Zimmer   Jennifer",40,140]
[3,"Traut   Annemarie",99.000000000000014,"Görgen   Elfriede",47.999999999999993,147]
[4,"Reis    Paul",95.999999999999986,"Lorse   Philipp",35,131]
[5,"Stoffel   Anton",94.000000000000014,"Greber   Michael",46.000000000000007,140.00000000000003]
[6,"König   Herbert",89.000000000000014,"Konz   Patrick",{"$error":"#N/A"},{"$error":"#N/A"}]
[7,"Boujong   Annalena",89.000000000000014,"Reis   Mechthild",{"$error":"#N/A"},{"$error":"#N/A"}]
[8,"Feit   Ulrike",85.999999999999986,"Grauer   Fabian",45,131]
[9,"Bechtel   Karl Heinz",84.8,"Barthelme   Friedrich",20,104.8]
[10,"König   Marlene",77.999999999999986,"Barzen   Kevin",38.999999999999993,116.99999999999997]
[11,"Feit   Udo",76,"Mayer   Wolfgang",69,145]
[12,"Hansen   Alfred",72.999999999999986,"Stark   Arnold",67.000000000000014,140]
[13,"Staadt   Brunhilde",70,"Kaurisch   Erwin",30,100]
[14]
[15]
[16]
[17]
[18]
[19]
[20]