{"text_format":"1","workbook":"xlsx","n_sheets":15,"sheets":["Rd1","Rd2","Rd3","Rd4","Rd5","Rd6","Rd7","Rd8","Rd9","Rd10","Rd11","Rd12","Siegerliste","Tabelle2","Tabelle1"],"not_rendered":{"charts":0,"images":1,"macros":1,"external_links":2,"defined_names":11,"comments":0,"pivot_tables":0},"unopened":[],"bounds":{"document_bytes":16777216,"sheet_cells":100000,"rows_first":2000,"rows_last":500,"rows_between":2000,"halvings":0,"cell_chars":16384,"cell_head_chars":4096},"cells_cut":0,"cells_raw":0,"read":"whole","date_system":"1900"}

{"sheet":"Rd1","index":0,"n_rows":63,"n_cols":25,"rows_kept":63,"cut":false,"hidden":false,"merged":[[51,3,51,4],[54,3,54,4],[55,3,55,4],[56,3,56,4],[44,10,44,11],[45,10,45,11],[46,10,46,11],[49,5,49,6],[50,3,50,4],[56,10,56,11],[55,10,55,11],[54,10,54,11],[51,10,51,11],[50,10,50,11],[50,5,50,6],[51,5,51,6],[21,4,25,5],[21,11,25,12],[21,18,25,19],[31,4,32,5],[31,11,32,12],[31,18,32,19],[26,4,30,5],[26,11,30,12],[26,18,30,19],[10,4,12,5],[10,11,12,12],[10,18,12,19],[13,18,17,19],[13,4,17,5],[13,11,17,12],[7,4,7,5],[7,11,7,12],[7,18,7,19],[8,4,9,5],[8,11,9,12],[8,18,9,19],[47,12,47,13],[43,3,43,4],[43,5,43,6],[48,3,48,4],[48,5,48,6],[49,10,49,11],[44,3,44,4],[45,3,45,4],[46,3,46,4],[47,5,47,6],[49,3,49,4],[44,5,44,6],[45,5,45,6],[46,5,46,6]]}
[null,null,null,{"$f":"Tabelle2!G11","v":"Anja"},{"$f":"Tabelle2!H11","v":"Vincent"},"Sp. 1",null,null,null,null,{"$f":"Tabelle2!G12","v":"Erich"},{"$f":"Tabelle2!H12","v":"Siggi"},"Sp. 2",null,null,null,null,{"$f":"Tabelle2!G13","v":"Ralfie"},{"$f":"Tabelle2!H13","v":"Frank"},"Sp. 3",{"$f":"J45","v":"Anja"},{"$f":"R45","v":"Vincent"}]
[null,null,null,"Punkte",501,"Start",null,null,null,null,"Punkte",501,"Start",null,null,null,null,"Punkte",501,"Start",{"$f":"J50","v":"Anja"},{"$f":"R50","v":"Vincent"}]
[null,null,null,"Geworfen",{"$f":"SUM(D34)","v":0},"Punkte",null,null,null,null,"Geworfen",{"$f":"SUM(K34)","v":0},"Punkte",null,null,null,null,"Geworfen",{"$f":"SUM(R34)","v":0},"Punkte",{"$f":"J55","v":"Anja"},{"$f":"R55","v":"Vincent"}]
["RD 1",{"$f":"COUNT(D4)*1","v":0},{"$f":"COUNT(D4)*3","v":0},null,{"$f":"SUM(E2-E3)","v":501},"Rest",null,"RD 1",{"$f":"COUNT(K4)*1","v":0},{"$f":"COUNT(K4)*3","v":0},null,{"$f":"SUM(L2-L3)","v":501},"Rest",null,"RD 1",{"$f":"COUNT(R4)*1","v":0},{"$f":"COUNT(R4)*3","v":0},null,{"$f":"SUM(S2-S3)","v":501},"Rest"]
["RD 2",{"$f":"COUNT(D5)*1","v":0},{"$f":"COUNT(D5)*3","v":0},null,null,null,null,"RD 2",0,0,null,null,null,null,"RD 2",0,0]
["RD 3",0,0,null,"ø pro Spiel",{"$f":"SUM(E3)/B34","v":{"$error":"#DIV/0!"}},null,"RD 3",0,0,null,"ø pro Spiel",{"$f":"SUM(L3)/I34","v":{"$error":"#DIV/0!"}},null,"RD 3",0,0,null,"ø pro Spiel",{"$f":"SUM(S3)/P34","v":{"$error":"#DIV/0!"}}]
["RD 4",0,0,null,"ø pro Pfeil",{"$f":"SUM(E3)/C34","v":{"$error":"#DIV/0!"}},null,"RD 4",0,0,null,"ø pro Pfeil",{"$f":"SUM(L3)/J34","v":{"$error":"#DIV/0!"}},null,"RD 4",0,0,null,"ø pro Pfeil",{"$f":"SUM(S3)/Q34","v":{"$error":"#DIV/0!"}}]
["RD 5",0,0,null,"Average",null,null,"RD 5",0,0,null,"Average",null,null,"RD 5",0,0,null,"Average"]
["RD 6",0,0,null,{"$f":"SUM(F6)","v":{"$error":"#DIV/0!"}},null,null,"RD 6",0,0,null,{"$f":"SUM(M6)","v":{"$error":"#DIV/0!"}},null,null,"RD 6",0,0,null,{"$f":"SUM(T6)","v":{"$error":"#DIV/0!"}}]
["RD 7",0,0,null,null,null,null,"RD 7",0,0,null,null,null,null,"RD 7",0,0]
["RD 8",0,0,null,"Nicht Gut",null,null,"RD 8",0,0,null,"Nicht Gut",null,null,"RD 8",0,0,null,"Nicht Gut"]
["RD 9",0,0,null,null,null,null,"RD 9",0,0,null,null,null,null,"RD 9",0,0]
["RD 10",0,0,null,null,null,null,"RD 10",0,0,null,null,null,null,"RD 10",0,0]
["RD 11",0,0,null,"Gut",null,null,"RD 11",0,0,null,"Gut",null,null,"RD 11",0,0,null,"Gut"]
["RD 12",0,0,null,null,null,null,"RD 12",0,0,null,null,null,null,"RD 12",0,0]
["RD 13",0,0,null,null,null,null,"RD 13",0,0,null,null,null,null,"RD 13",0,0]
["RD 14",0,0,null,null,null,null,"RD 14",0,0,null,null,null,null,"RD 14",0,0]
["RD 15",0,0,null,null,null,null,"RD 15",0,0,null,null,null,null,"RD 15",0,0]
["RD 16",0,0,null,{"$f":"D1","v":"Anja"},{"$f":"E1","v":"Vincent"},null,"RD 16",0,0,null,{"$f":"K1","v":"Erich"},{"$f":"L1","v":"Siggi"},null,"RD 16",0,0,null,{"$f":"R1","v":"Ralfie"},{"$f":"S1","v":"Frank"}]
["RD 17",0,0,null,{"$f":"SUM(D4,D6,D8,D10,D12,D14,D16,D18,D20,D22,D24,D26,D28,D30,D32)","v":0},{"$f":"SUM(D5,D7,D9,D11,D13,D15,D17,D19,D21,D23,D25,D27,D29,D31,D33)","v":0},null,"RD 17",0,0,null,{"$f":"SUM(K4,K6,K8,K10,K12,K14,K16,K18,K20,K22,K24,K26,K28,K30,K32)","v":0},{"$f":"SUM(K5,K7,K9,K11,K13,K15,K17,K19,K21,K23,K25,K27,K29,K31,K33)","v":0},null,"RD 17",0,0,null,{"$f":"SUM(R4,R6,R8,R10,R12,R14,R16,R18,R20,R22,R24,R26,R28,R30,R32)","v":0},{"$f":"SUM(R5,R7,R9,R11,R13,R15,R17,R19,R21,R23,R25,R27,R29,R31,R33)","v":0}]
["RD 18",0,0,null,"Rest:",{"$f":"E4","v":501},null,"RD 18",0,0,null,"Rest:",{"$f":"L4","v":501},null,"RD 18",0,0,null,"Rest:",{"$f":"S4","v":501}]
["RD 19",0,0,null,"Sehr  Gut",null,null,"RD 19",0,0,null,"Sehr  Gut",null,null,"RD 19",0,0,null,"Sehr  Gut"]
["RD 20",0,0,null,null,null,null,"RD 20",0,0,null,null,null,null,"RD 20",0,0]
["RD 21",0,0,null,null,null,null,"RD 21",0,0,null,null,null,null,"RD 21",0,0]
["RD 22",0,0,null,null,null,null,"RD 22",0,0,null,null,null,null,"RD 22",0,0]
["RD 23",0,0,null,null,null,null,"RD 23",0,0,null,null,null,null,"RD 23",0,0]
["RD 24",0,0,null,null,null,null,"RD 24",0,0,null,null,null,null,"RD 24",0,0]
["RD 25",0,0,null,null,null,null,"RD 25",0,0,null,null,null,null,"RD 25",0,0]
["RD 26",0,0,null,null,null,null,"RD 26",0,0,null,null,null,null,"RD 26",0,0]
["RD 27",0,0,null,null,null,null,"RD 27",0,0,null,null,null,null,"RD 27",0,0]
["RD 28",0,0,null,null,null,null,"RD 28",0,0,null,null,null,null,"RD 28",0,0]
["RD 29",0,0,null,{"$f":"IF(E4=0,\"Sieg\",\"\")","v":""},null,null,"RD 29",0,0,null,{"$f":"IF(L4=0,\"Sieg\",\"\")","v":""},null,null,"RD 29",0,0,null,{"$f":"IF(S4=0,\"Sieg\",\"\")","v":""}]
["RD 30",0,0,null,null,null,null,"RD 30",0,0,null,null,null,null,"RD 30",0,0]
[null,{"$f":"SUM(B4:B33)","v":0},{"$f":"SUM(C4:C33)","v":0},{"$f":"SUM(D4:D33)","v":0},{"$f":"SUM(D5:D32)","v":0},null,null,null,{"$f":"SUM(I4:I33)","v":0},{"$f":"SUM(J4:J33)","v":0},{"$f":"SUM(K4:K33)","v":0},{"$f":"SUM(K4:K32)","v":0},null,null,null,{"$f":"SUM(P4:P33)","v":0},{"$f":"SUM(Q4:Q33)","v":0},{"$f":"SUM(R4:R33)","v":0},{"$f":"SUM(R4:R32)","v":0}]
[]
[null,"RD 5",null,null,null,null,null,null,null,null,null,null,null,null,null,null,null,null,null,null,null,null,null,null,"Ralf Kl."]
["RD 1","RD 4",null,null,null,null,null,null,null,null,null,null,null,null,null,null,null,null,null,null,null,null,{"$f":"RAND()","v":0.22587799131362218},null,"Volker"]
["RD 2","RD 3",null,null,null,null,null,null,null,null,null,null,null,null,null,null,null,null,null,null,null,"Anja",{"$f":"RAND()","v":0.30721593871129327},null,"Rene"]
[null,null,null,null,null,null,null,null,null,null,null,null,null,null,null,null,null,null,null,null,null,"Vincent",0.64088117328965954,null,"Nicole"]
[null,null,null,null,null,null,null,null,null,null,null,null,null,null,null,null,null,null,null,null,null,"Erich",0.36710478239033628,null,"Frank"]
[null,null,null,null,null,null,null,null,null,null,null,null,null,null,null,null,null,null,null,null,null,"Siggi",0.94786711693901171,null,"Rosi"]
[null,null,null,null,null,null,null,null,null,null,null,null,null,null,null,null,null,null,null,null,null,"Ralfie",0.33018755555757129,null,"Werner"]
[null,null,null,null,null,null,null,null,null,null,null,null,null,null,null,null,null,null,null,null,null,"Frank",0.79585703098883798,null,"Thorsten"]
[null,null,null,null,null,null,null,null,null,null,null,null,null,null,null,null,null,null,null,null,null,null,null,null,"Stefan"]
[null,null,null,{"$f":"D1","v":"Anja"},null,{"$f":"D34","v":0},null,{"$f":"INDEX(D45:E47,MATCH(MAX(F45:F47),F45:F47,0),1)","v":"Anja"},null,{"$f":"INDEX(D45:E47,MATCH(MAX(F45:F47),F45:F47,0),1)","v":"Anja"},{"$f":"E1","v":"Vincent"},null,{"$f":"SUM(D34)","v":0},null,null,null,null,{"$f":"INDEX(K45:L47,MATCH(MAX(M45:M47),M45:M47,0),1)","v":"Vincent"},null,null,null,null,null,null,"Micha"]
[null,null,null,{"$f":"K1","v":"Erich"},null,{"$f":"SUM(K34)","v":0},null,null,null,null,{"$f":"L1","v":"Siggi"},null,{"$f":"SUM(K34)","v":0},null,null,null,null,null,null,null,null,null,null,null,"Joker"]
[null,null,null,{"$f":"R1","v":"Ralfie"},null,{"$f":"SUM(S34)","v":0},null,null,null,null,{"$f":"S1","v":"Frank"},null,{"$f":"SUM(S3)","v":0},null,null,null,null,null,null,null,null,null,null,null,"Anja"]
[null,null,null,"MAX(B2:B7",null,null,null,null,null,null,"MAX(B2:B7",null,null,null,null,null,null,null,null,null,null,null,null,null,"Vincent"]
[null,null,null,null,null,null,null,null,null,null,null,null,null,null,null,null,null,null,null,null,null,null,null,null,"Erich"]
[null,null,null,{"$f":"D1","v":"Anja"},null,{"$f":"D34","v":0},null,{"$f":"INDEX(D45:E47,MATCH(MEDIAN(F45:F47),F45:F47,0),1)","v":"Anja"},null,{"$f":"INDEX(D45:E47,MATCH(MEDIAN(F45:F47),F45:F47,0),1)","v":"Anja"},{"$f":"E1","v":"Vincent"},null,{"$f":"SUM(D34)","v":0},null,null,null,null,{"$f":"INDEX(K50:L52,MATCH(MEDIAN(M50:M52),M50:M52,0),1)","v":"Vincent"},null,null,null,null,null,null,"Siggi"]
[null,null,null,{"$f":"K1","v":"Erich"},null,{"$f":"SUM(K34)","v":0},null,null,null,null,{"$f":"L1","v":"Siggi"},null,{"$f":"SUM(K34)","v":0},null,null,null,null,null,null,null,null,null,null,null,"Rally"]
[null,null,null,{"$f":"R1","v":"Ralfie"},null,{"$f":"SUM(S34)","v":0},null,null,null,null,{"$f":"S1","v":"Frank"},null,{"$f":"SUM(S34)","v":0},null,null,null,null,null,null,null,null,null,null,null,"Dirk B."]
[null,null,null,"MAX(B2:B7",null,{"$f":"MAX(F50:F52)","v":0},null,null,null,null,"MAX(B2:B7",null,{"$f":"MAX(M50:M52)","v":0}]
[]
[null,null,null,{"$f":"D1","v":"Anja"},null,{"$f":"D34","v":0},null,{"$f":"INDEX(D55:E57,MATCH(MIN(F55:F57),F55:F57,0),1)","v":"Anja"},null,{"$f":"INDEX(D55:E57,MATCH(MIN(F55:F57),F55:F57,0),1)","v":"Anja"},{"$f":"E1","v":"Vincent"},null,{"$f":"SUM(D34)","v":0},null,null,null,null,{"$f":"INDEX(K55:L57,MATCH(MIN(M55:M57),M55:M57,0),1)","v":"Vincent"}]
[null,null,null,{"$f":"K1","v":"Erich"},null,{"$f":"SUM(K34)","v":0},null,null,null,null,{"$f":"L1","v":"Siggi"},null,{"$f":"SUM(K34)","v":0}]
[null,null,null,{"$f":"R1","v":"Ralfie"},null,{"$f":"SUM(S34)","v":0},null,null,null,null,{"$f":"S1","v":"Frank"},null,{"$f":"SUM(S34)","v":0},null,null,null,null,null,null,"1.Paar","2.Paar","3.Paar","4.Paar","5.Paar","6.Paar"]
[null,null,null,null,null,null,{"$f":"SUM(F57)","v":0},null,null,null,null,null,null,{"$f":"SUM(M57)","v":0},null,null,null,null,null,{"$f":"V38","v":"Anja"},{"$f":"V39","v":"Vincent"},{"$f":"V40","v":"Erich"},{"$f":"V41","v":"Siggi"},{"$f":"V42","v":"Ralfie"},{"$f":"V43","v":"Frank"}]
[null,null,null,null,null,null,null,null,null,null,null,null,null,null,null,null,null,null,null,"Vincent",{"$f":"V40","v":"Erich"},{"$f":"V41","v":"Siggi"},{"$f":"V42","v":"Ralfie"},{"$f":"V43","v":"Frank"},{"$f":"V38","v":"Anja"}]
[null,null,null,null,null,null,null,null,null,null,null,null,null,null,null,null,null,null,null,"Erich",{"$f":"V41","v":"Siggi"},{"$f":"V42","v":"Ralfie"},{"$f":"V43","v":"Frank"},{"$f":"V38","v":"Anja"},{"$f":"V39","v":"Vincent"}]
[null,null,null,null,null,null,null,null,null,null,null,null,null,null,null,null,null,null,null,"Siggi",{"$f":"V42","v":"Ralfie"},{"$f":"V43","v":"Frank"},{"$f":"V38","v":"Anja"},{"$f":"V39","v":"Vincent"},{"$f":"V40","v":"Erich"}]
[null,null,null,null,null,null,null,null,null,{"$f":"SUM(F50:G52)/3","v":0},null,null,null,null,null,null,null,null,null,"Ralfie",{"$f":"V43","v":"Frank"},{"$f":"V38","v":"Anja"},{"$f":"V39","v":"Vincent"},{"$f":"V40","v":"Erich"},{"$f":"V41","v":"Siggi"}]
[null,null,null,null,null,null,null,null,null,null,null,null,null,null,null,null,null,null,null,"Frank",{"$f":"V38","v":"Anja"},{"$f":"V39","v":"Vincent"},{"$f":"V40","v":"Erich"},{"$f":"V41","v":"Siggi"},{"$f":"V42","v":"Ralfie"}]

{"sheet":"Rd2","index":1,"n_rows":62,"n_cols":25,"rows_kept":62,"cut":false,"hidden":false,"merged":[[46,3,46,4],[46,5,46,6],[26,18,30,19],[31,4,32,5],[31,11,32,12],[31,18,32,19],[43,3,43,4],[43,5,43,6],[44,5,44,6],[44,3,44,4],[45,3,45,4],[26,4,30,5],[26,11,30,12],[10,4,12,5],[10,11,12,12],[10,18,12,19],[13,4,17,5],[13,11,17,12],[13,18,17,19],[21,4,25,5],[21,11,25,12],[21,18,25,19],[7,4,7,5],[7,11,7,12],[7,18,7,19],[8,4,9,5],[8,11,9,12],[8,18,9,19],[47,5,47,6],[47,12,47,13],[48,3,48,4],[48,5,48,6],[49,3,49,4],[49,5,49,6],[49,10,49,11],[47,3,47,4],[56,3,56,4],[56,10,56,11],[50,3,50,4],[50,5,50,6],[50,10,50,11],[51,3,51,4],[51,5,51,6],[51,10,51,11],[52,3,52,4],[53,3,53,4],[54,3,54,4],[54,10,54,11],[55,3,55,4],[55,10,55,11]]}
[null,null,null,{"$f":"'Rd1'!R55","v":"Vincent"},{"$f":"'Rd1'!J55","v":"Anja"},"Sp. 1",null,null,null,null,{"$f":"'Rd1'!R50","v":"Vincent"},{"$f":"'Rd1'!J50","v":"Anja"},"Sp. 2",null,null,null,null,{"$f":"'Rd1'!R45","v":"Vincent"},{"$f":"'Rd1'!J45","v":"Anja"},"Sp. 3",null,{"$f":"J45","v":"Vincent"},{"$f":"R45","v":"Anja"}]
[null,null,null,"Punkte",501,"Start",null,null,null,null,"Punkte",501,"Start",null,null,null,null,"Punkte",501,"Start",null,{"$f":"J50","v":"Vincent"},{"$f":"R50","v":"Anja"}]
[null,null,null,"Geworfen",{"$f":"SUM(D34)","v":0},"Punkte",null,null,null,null,"Geworfen",{"$f":"SUM(K34)","v":0},"Punkte",null,null,null,null,"Geworfen",{"$f":"SUM(R34)","v":0},"Punkte",null,{"$f":"J55","v":"Vincent"},{"$f":"R55","v":"Anja"}]
["RD 1",{"$f":"COUNT(D4)*1","v":0},{"$f":"COUNT(D4)*3","v":0},null,{"$f":"SUM(E2-E3)","v":501},"Rest",null,"RD 1",{"$f":"COUNT(K4)*1","v":0},{"$f":"COUNT(K4)*3","v":0},null,{"$f":"SUM(L2-L3)","v":501},"Rest",null,"RD 1",{"$f":"COUNT(R4)*1","v":0},{"$f":"COUNT(R4)*3","v":0},null,{"$f":"SUM(S2-S3)","v":501},"Rest"]
["RD 2",{"$f":"COUNT(D5)*1","v":0},{"$f":"COUNT(D5)*3","v":0},null,null,null,null,"RD 2",0,0,null,null,null,null,"RD 2",0,0]
["RD 3",0,0,null,"ø pro Spiel",{"$f":"SUM(E3)/B34","v":{"$error":"#DIV/0!"}},null,"RD 3",0,0,null,"ø pro Spiel",{"$f":"SUM(L3)/I34","v":{"$error":"#DIV/0!"}},null,"RD 3",0,0,null,"ø pro Spiel",{"$f":"SUM(S3)/P34","v":{"$error":"#DIV/0!"}}]
["RD 4",0,0,null,"ø pro Pfeil",{"$f":"SUM(E3)/C34","v":{"$error":"#DIV/0!"}},null,"RD 4",0,0,null,"ø pro Pfeil",{"$f":"SUM(L3)/J34","v":{"$error":"#DIV/0!"}},null,"RD 4",0,0,null,"ø pro Pfeil",{"$f":"SUM(S3)/Q34","v":{"$error":"#DIV/0!"}}]
["RD 5",0,0,null,"Average",null,null,"RD 5",0,0,null,"Average",null,null,"RD 5",0,0,null,"Average"]
["RD 6",0,0,null,{"$f":"SUM(F6)","v":{"$error":"#DIV/0!"}},null,null,"RD 6",0,0,null,{"$f":"SUM(M6)","v":{"$error":"#DIV/0!"}},null,null,"RD 6",0,0,null,{"$f":"SUM(T6)","v":{"$error":"#DIV/0!"}}]
["RD 7",0,0,null,null,null,null,"RD 7",0,0,null,null,null,null,"RD 7",0,0]
["RD 8",0,0,null,"Nicht Gut",null,null,"RD 8",0,0,null,"Nicht Gut",null,null,"RD 8",0,0,null,"Nicht Gut"]
["RD 9",0,0,null,null,null,null,"RD 9",0,0,null,null,null,null,"RD 9",0,0]
["RD 10",0,0,null,null,null,null,"RD 10",0,0,null,null,null,null,"RD 10",0,0]
["RD 11",0,0,null,"Gut",null,null,"RD 11",0,0,null,"Gut",null,null,"RD 11",0,0,null,"Gut"]
["RD 12",0,0,null,null,null,null,"RD 12",0,0,null,null,null,null,"RD 12",0,0]
["RD 13",0,0,null,null,null,null,"RD 13",0,0,null,null,null,null,"RD 13",0,0]
["RD 14",0,0,null,null,null,null,"RD 14",0,0,null,null,null,null,"RD 14",0,0,null,null,null,null,null,null,null,"Ralf Kl."]
["RD 15",0,0,null,null,null,null,"RD 15",0,0,null,null,null,null,"RD 15",0,0,null,null,null,null,null,null,null,"Volker"]
["RD 16",0,0,null,{"$f":"D1","v":"Vincent"},{"$f":"E1","v":"Anja"},null,"RD 16",0,0,null,{"$f":"K1","v":"Vincent"},{"$f":"L1","v":"Anja"},null,"RD 16",0,0,null,{"$f":"R1","v":"Vincent"},{"$f":"S1","v":"Anja"},null,null,null,null,"Rene"]
["RD 17",0,0,null,{"$f":"SUM(D4,D6,D8,D10,D12,D14,D16,D18,D20,D22,D24,D26,D28,D30,D32)","v":0},{"$f":"SUM(D5,D7,D9,D11,D13,D15,D17,D19,D21,D23,D25,D27,D29,D31,D33)","v":0},null,"RD 17",0,0,null,{"$f":"SUM(K4,K6,K8,K10,K12,K14,K16,K18,K20,K22,K24,K26,K28,K30,K32)","v":0},{"$f":"SUM(K5,K7,K9,K11,K13,K15,K17,K19,K21,K23,K25,K27,K29,K31,K33)","v":0},null,"RD 17",0,0,null,{"$f":"SUM(R4,R6,R8,R10,R12,R14,R16,R18,R20,R22,R24,R26,R28,R30,R32)","v":0},{"$f":"SUM(R5,R7,R9,R11,R13,R15,R17,R19,R21,R23,R25,R27,R29,R31,R33)","v":0},null,null,null,null,"Nicole"]
["RD 18",0,0,null,"Rest:",{"$f":"E4","v":501},null,"RD 18",0,0,null,"Rest:",{"$f":"L4","v":501},null,"RD 18",0,0,null,"Rest:",{"$f":"S4","v":501},null,"Micha",null,null,"Frank"]
["RD 19",0,0,null,"Sehr  Gut",null,null,"RD 19",0,0,null,"Sehr  Gut",null,null,"RD 19",0,0,null,"Sehr  Gut",null,null,null,null,null,"Rosi"]
["RD 20",0,0,null,null,null,null,"RD 20",0,0,null,null,null,null,"RD 20",0,0,null,null,null,null,null,null,null,"Werner"]
["RD 21",0,0,null,null,null,null,"RD 21",0,0,null,null,null,null,"RD 21",0,0,null,null,null,null,"Stefan",null,null,"Gast"]
["RD 22",0,0,null,null,null,null,"RD 22",0,0,null,null,null,null,"RD 22",0,0,null,null,null,null,null,null,null,"Stefan"]
["RD 23",0,0,null,null,null,null,"RD 23",0,0,null,null,null,null,"RD 23",0,0,null,null,null,null,null,null,null,"Micha"]
["RD 24",0,0,null,null,null,null,"RD 24",0,0,null,null,null,null,"RD 24",0,0,null,null,null,null,null,null,null,"Joker"]
["RD 25",0,0,null,null,null,null,"RD 25",0,0,null,null,null,null,"RD 25",0,0,null,null,null,null,null,null,null,"Anja"]
["RD 26",0,0,null,null,null,null,"RD 26",0,0,null,null,null,null,"RD 26",0,0,null,null,null,null,null,null,null,"Vincent"]
["RD 27",0,0,null,null,null,null,"RD 27",0,0,null,null,null,null,"RD 27",0,0,null,null,null,null,null,null,null,"Erich"]
["RD 28",0,0,null,null,null,null,"RD 28",0,0,null,null,null,null,"RD 28",0,0,null,null,null,null,null,null,null,"Siggi"]
["RD 29",0,0,null,{"$f":"IF(E4=0,\"Sieg\",\"\")","v":""},null,null,"RD 29",0,0,null,{"$f":"IF(L4=0,\"Sieg\",\"\")","v":""},null,null,"RD 29",0,0,null,{"$f":"IF(S4=0,\"Sieg\",\"\")","v":""},null,null,null,null,null,"Ralf M."]
["RD 30",0,0,null,null,null,null,"RD 30",0,0,null,null,null,null,"RD 30",0,0,null,null,null,null,null,null,null,"Dirk B."]
[null,{"$f":"SUM(B4:B33)","v":0},{"$f":"SUM(C4:C33)","v":0},{"$f":"SUM(D4:D33)","v":0},{"$f":"SUM(D5:D32)","v":0},null,null,null,{"$f":"SUM(I4:I33)","v":0},{"$f":"SUM(J4:J33)","v":0},{"$f":"SUM(K4:K33)","v":0},{"$f":"SUM(K4:K32)","v":0},null,null,null,{"$f":"SUM(P4:P33)","v":0},{"$f":"SUM(Q4:Q33)","v":0},{"$f":"SUM(R4:R33)","v":0},{"$f":"SUM(R4:R32)","v":0}]
[]
[]
[]
[]
[]
[]
[]
[]
[]
[]
[null,null,null,{"$f":"D1","v":"Vincent"},null,{"$f":"D34","v":0},null,null,null,{"$f":"INDEX(D45:E47,MATCH(MAX(F45:F47),F45:F47,0),1)","v":"Vincent"},{"$f":"E1","v":"Anja"},null,{"$f":"SUM(D34)","v":0},null,null,null,null,{"$f":"INDEX(K45:L47,MATCH(MAX(M45:M47),M45:M47,0),1)","v":"Anja"}]
[null,null,null,{"$f":"K1","v":"Vincent"},null,{"$f":"SUM(K34)","v":0},null,null,null,null,{"$f":"L1","v":"Anja"},null,{"$f":"SUM(K34)","v":0}]
[null,null,null,{"$f":"R1","v":"Vincent"},null,{"$f":"SUM(S34)","v":0},null,null,null,null,{"$f":"S1","v":"Anja"},null,{"$f":"SUM(S3)","v":0}]
[null,null,null,"MAX(B2:B7",null,null,null,null,null,null,"MAX(B2:B7"]
[]
[null,null,null,{"$f":"D1","v":"Vincent"},null,{"$f":"D34","v":0},null,null,null,{"$f":"INDEX(D45:E47,MATCH(MEDIAN(F45:F47),F45:F47,0),1)","v":"Vincent"},{"$f":"E1","v":"Anja"},null,{"$f":"SUM(D34)","v":0},null,null,null,null,{"$f":"INDEX(K50:L52,MATCH(MEDIAN(M50:M52),M50:M52,0),1)","v":"Anja"}]
[null,null,null,{"$f":"K1","v":"Vincent"},null,{"$f":"SUM(K34)","v":0},null,null,null,null,{"$f":"L1","v":"Anja"},null,{"$f":"SUM(K34)","v":0}]
[null,null,null,{"$f":"R1","v":"Vincent"},null,{"$f":"SUM(S34)","v":0},null,null,null,null,{"$f":"S1","v":"Anja"},null,{"$f":"SUM(S34)","v":0}]
[null,null,null,"MAX(B2:B7",null,{"$f":"MAX(F50:F52)","v":0},null,null,null,null,"MAX(B2:B7",null,{"$f":"MAX(M50:M52)","v":0}]
[]
[null,null,null,{"$f":"D1","v":"Vincent"},null,{"$f":"D34","v":0},null,null,null,{"$f":"INDEX(D55:E57,MATCH(MIN(F55:F57),F55:F57,0),1)","v":"Vincent"},{"$f":"E1","v":"Anja"},null,{"$f":"SUM(D34)","v":0},null,null,null,null,{"$f":"INDEX(K55:L57,MATCH(MIN(M55:M57),M55:M57,0),1)","v":"Anja"}]
[null,null,null,{"$f":"K1","v":"Vincent"},null,{"$f":"SUM(K34)","v":0},null,null,null,null,{"$f":"L1","v":"Anja"},null,{"$f":"SUM(K34)","v":0}]
[null,null,null,{"$f":"R1","v":"Vincent"},null,{"$f":"SUM(S34)","v":0},null,null,null,null,{"$f":"S1","v":"Anja"},null,{"$f":"SUM(S34)","v":0}]
[null,null,null,null,null,null,{"$f":"SUM(F57)","v":0},null,null,null,null,null,null,{"$f":"SUM(M57)","v":0}]
[]
[]
[]
[null,null,null,null,null,null,null,null,null,{"$f":"SUM(F50:G52)/3","v":0}]

{"sheet":"Rd3","index":2,"n_rows":62,"n_cols":25,"rows_kept":62,"cut":false,"hidden":false,"merged":[[26,18,30,19],[31,4,32,5],[31,11,32,12],[31,18,32,19],[43,3,43,4],[43,5,43,6],[26,11,30,12],[26,4,30,5],[21,18,25,19],[7,4,7,5],[7,11,7,12],[7,18,7,19],[8,4,9,5],[8,11,9,12],[8,18,9,19],[10,4,12,5],[10,11,12,12],[10,18,12,19],[13,4,17,5],[13,11,17,12],[13,18,17,19],[21,4,25,5],[21,11,25,12],[56,3,56,4],[56,10,56,11],[50,3,50,4],[50,5,50,6],[50,10,50,11],[51,3,51,4],[51,5,51,6],[51,10,51,11],[54,3,54,4],[54,10,54,11],[55,3,55,4],[55,10,55,11],[46,3,46,4],[46,5,46,6],[44,5,44,6],[44,3,44,4],[45,3,45,4],[47,12,47,13],[48,3,48,4],[48,5,48,6],[49,3,49,4],[49,5,49,6],[49,10,49,11],[47,5,47,6]]}
[null,null,null,{"$f":"Tabelle2!G14","v":"Anja"},{"$f":"Tabelle2!H14","v":"Erich"},"Sp. 1",null,null,null,null,{"$f":"Tabelle2!G15","v":"Ralfie"},{"$f":"Tabelle2!H15","v":"Vincent"},"Sp. 2",null,null,null,null,{"$f":"Tabelle2!G16","v":"Frank"},{"$f":"Tabelle2!H16","v":"Siggi"},"Sp. 3",null,{"$f":"J45","v":"Anja"},{"$f":"R45","v":"Erich"}]
[null,null,null,"Punkte",501,"Start",null,null,null,null,"Punkte",501,"Start",null,null,null,null,"Punkte",501,"Start",null,{"$f":"J50","v":"Anja"},{"$f":"R50","v":"Erich"}]
[null,null,null,"Geworfen",{"$f":"SUM(D34)","v":0},"Punkte",null,null,null,null,"Geworfen",{"$f":"SUM(K34)","v":0},"Punkte",null,null,null,null,"Geworfen",{"$f":"SUM(R34)","v":0},"Punkte",null,{"$f":"J55","v":"Anja"},{"$f":"R55","v":"Erich"}]
["RD 1",{"$f":"COUNT(D4)*1","v":0},{"$f":"COUNT(D4)*3","v":0},null,{"$f":"SUM(E2-E3)","v":501},"Rest",null,"RD 1",{"$f":"COUNT(K4)*1","v":0},{"$f":"COUNT(K4)*3","v":0},null,{"$f":"SUM(L2-L3)","v":501},"Rest",null,"RD 1",{"$f":"COUNT(R4)*1","v":0},{"$f":"COUNT(R4)*3","v":0},null,{"$f":"SUM(S2-S3)","v":501},"Rest"]
["RD 2",{"$f":"COUNT(D5)*1","v":0},{"$f":"COUNT(D5)*3","v":0},null,null,null,null,"RD 2",0,0,null,null,null,null,"RD 2",0,0]
["RD 3",0,0,null,"ø pro Spiel",{"$f":"SUM(E3)/B34","v":{"$error":"#DIV/0!"}},null,"RD 3",0,0,null,"ø pro Spiel",{"$f":"SUM(L3)/I34","v":{"$error":"#DIV/0!"}},null,"RD 3",0,0,null,"ø pro Spiel",{"$f":"SUM(S3)/P34","v":{"$error":"#DIV/0!"}}]
["RD 4",0,0,null,"ø pro Pfeil",{"$f":"SUM(E3)/C34","v":{"$error":"#DIV/0!"}},null,"RD 4",0,0,null,"ø pro Pfeil",{"$f":"SUM(L3)/J34","v":{"$error":"#DIV/0!"}},null,"RD 4",0,0,null,"ø pro Pfeil",{"$f":"SUM(S3)/Q34","v":{"$error":"#DIV/0!"}}]
["RD 5",0,0,null,"Average",null,null,"RD 5",0,0,null,"Average",null,null,"RD 5",0,0,null,"Average"]
["RD 6",0,0,null,{"$f":"SUM(F6)","v":{"$error":"#DIV/0!"}},null,null,"RD 6",0,0,null,{"$f":"SUM(M6)","v":{"$error":"#DIV/0!"}},null,null,"RD 6",0,0,null,{"$f":"SUM(T6)","v":{"$error":"#DIV/0!"}}]
["RD 7",0,0,null,null,null,null,"RD 7",0,0,null,null,null,null,"RD 7",0,0]
["RD 8",0,0,null,"Nicht Gut",null,null,"RD 8",0,0,null,"Nicht Gut",null,null,"RD 8",0,0,null,"Nicht Gut"]
["RD 9",0,0,null,null,null,null,"RD 9",0,0,null,null,null,null,"RD 9",0,0]
["RD 10",0,0,null,null,null,null,"RD 10",0,0,null,null,null,null,"RD 10",0,0]
["RD 11",0,0,null,"Gut",null,null,"RD 11",0,0,null,"Gut",null,null,"RD 11",0,0,null,"Gut"]
["RD 12",0,0,null,null,null,null,"RD 12",0,0,null,null,null,null,"RD 12",0,0]
["RD 13",0,0,null,null,null,null,"RD 13",0,0,null,null,null,null,"RD 13",0,0]
["RD 14",0,0,null,null,null,null,"RD 14",0,0,null,null,null,null,"RD 14",0,0,null,null,null,null,null,null,null,"Ralf Kl."]
["RD 15",0,0,null,null,null,null,"RD 15",0,0,null,null,null,null,"RD 15",0,0,null,null,null,null,null,null,null,"Volker"]
["RD 16",0,0,null,{"$f":"D1","v":"Anja"},{"$f":"E1","v":"Erich"},null,"RD 16",0,0,null,{"$f":"K1","v":"Ralfie"},{"$f":"L1","v":"Vincent"},null,"RD 16",0,0,null,{"$f":"R1","v":"Frank"},{"$f":"S1","v":"Siggi"},null,null,null,null,"Rene"]
["RD 17",0,0,null,{"$f":"SUM(D4,D6,D8,D10,D12,D14,D16,D18,D20,D22,D24,D26,D28,D30,D32)","v":0},{"$f":"SUM(D5,D7,D9,D11,D13,D15,D17,D19,D21,D23,D25,D27,D29,D31,D33)","v":0},null,"RD 17",0,0,null,{"$f":"SUM(K4,K6,K8,K10,K12,K14,K16,K18,K20,K22,K24,K26,K28,K30,K32)","v":0},{"$f":"SUM(K5,K7,K9,K11,K13,K15,K17,K19,K21,K23,K25,K27,K29,K31,K33)","v":0},null,"RD 17",0,0,null,{"$f":"SUM(R4,R6,R8,R10,R12,R14,R16,R18,R20,R22,R24,R26,R28,R30,R32)","v":0},{"$f":"SUM(R5,R7,R9,R11,R13,R15,R17,R19,R21,R23,R25,R27,R29,R31,R33)","v":0},null,null,null,null,"Nicole"]
["RD 18",0,0,null,"Rest:",{"$f":"E4","v":501},null,"RD 18",0,0,null,"Rest:",{"$f":"L4","v":501},null,"RD 18",0,0,null,"Rest:",{"$f":"S4","v":501},null,"Micha",null,null,"Frank"]
["RD 19",0,0,null,"Sehr  Gut",null,null,"RD 19",0,0,null,"Sehr  Gut",null,null,"RD 19",0,0,null,"Sehr  Gut",null,null,null,null,null,"Rosi"]
["RD 20",0,0,null,null,null,null,"RD 20",0,0,null,null,null,null,"RD 20",0,0,null,null,null,null,null,null,null,"Werner"]
["RD 21",0,0,null,null,null,null,"RD 21",0,0,null,null,null,null,"RD 21",0,0,null,null,null,null,"Stefan",null,null,"Gast"]
["RD 22",0,0,null,null,null,null,"RD 22",0,0,null,null,null,null,"RD 22",0,0,null,null,null,null,null,null,null,"Stefan"]
["RD 23",0,0,null,null,null,null,"RD 23",0,0,null,null,null,null,"RD 23",0,0,null,null,null,null,null,null,null,"Micha"]
["RD 24",0,0,null,null,null,null,"RD 24",0,0,null,null,null,null,"RD 24",0,0,null,null,null,null,null,null,null,"Joker"]
["RD 25",0,0,null,null,null,null,"RD 25",0,0,null,null,null,null,"RD 25",0,0,null,null,null,null,null,null,null,"Anja"]
["RD 26",0,0,null,null,null,null,"RD 26",0,0,null,null,null,null,"RD 26",0,0,null,null,null,null,null,null,null,"Vincent"]
["RD 27",0,0,null,null,null,null,"RD 27",0,0,null,null,null,null,"RD 27",0,0,null,null,null,null,null,null,null,"Erich"]
["RD 28",0,0,null,null,null,null,"RD 28",0,0,null,null,null,null,"RD 28",0,0,null,null,null,null,null,null,null,"Siggi"]
["RD 29",0,0,null,{"$f":"IF(E4=0,\"Sieg\",\"\")","v":""},null,null,"RD 29",0,0,null,{"$f":"IF(L4=0,\"Sieg\",\"\")","v":""},null,null,"RD 29",0,0,null,{"$f":"IF(S4=0,\"Sieg\",\"\")","v":""},null,null,null,null,null,"Ralf M."]
["RD 30",0,0,null,null,null,null,"RD 30",0,0,null,null,null,null,"RD 30",0,0,null,null,null,null,null,null,null,"Dirk B."]
[null,{"$f":"SUM(B4:B33)","v":0},{"$f":"SUM(C4:C33)","v":0},{"$f":"SUM(D4:D33)","v":0},{"$f":"SUM(D5:D32)","v":0},null,null,null,{"$f":"SUM(I4:I33)","v":0},{"$f":"SUM(J4:J33)","v":0},{"$f":"SUM(K4:K33)","v":0},{"$f":"SUM(K4:K32)","v":0},null,null,null,{"$f":"SUM(P4:P33)","v":0},{"$f":"SUM(Q4:Q33)","v":0},{"$f":"SUM(R4:R33)","v":0},{"$f":"SUM(R4:R32)","v":0}]
[]
[]
[]
[]
[]
[]
[]
[]
[]
[]
[null,null,null,{"$f":"D1","v":"Anja"},null,{"$f":"D34","v":0},null,null,null,{"$f":"INDEX(D45:E47,MATCH(MAX(F45:F47),F45:F47,0),1)","v":"Anja"},{"$f":"E1","v":"Erich"},null,{"$f":"SUM(D34)","v":0},null,null,null,null,{"$f":"INDEX(K45:L47,MATCH(MAX(M45:M47),M45:M47,0),1)","v":"Erich"}]
[null,null,null,{"$f":"K1","v":"Ralfie"},null,{"$f":"SUM(K34)","v":0},null,null,null,null,{"$f":"L1","v":"Vincent"},null,{"$f":"SUM(K34)","v":0}]
[null,null,null,{"$f":"R1","v":"Frank"},null,{"$f":"SUM(S34)","v":0},null,null,null,null,{"$f":"S1","v":"Siggi"},null,{"$f":"SUM(S3)","v":0}]
[null,null,null,"MAX(B2:B7",null,null,null,null,null,null,"MAX(B2:B7"]
[]
[null,null,null,{"$f":"D1","v":"Anja"},null,{"$f":"D34","v":0},null,null,null,{"$f":"INDEX(D45:E47,MATCH(MEDIAN(F45:F47),F45:F47,0),1)","v":"Anja"},{"$f":"E1","v":"Erich"},null,{"$f":"SUM(D34)","v":0},null,null,null,null,{"$f":"INDEX(K50:L52,MATCH(MEDIAN(M50:M52),M50:M52,0),1)","v":"Erich"}]
[null,null,null,{"$f":"K1","v":"Ralfie"},null,{"$f":"SUM(K34)","v":0},null,null,null,null,{"$f":"L1","v":"Vincent"},null,{"$f":"SUM(K34)","v":0}]
[null,null,null,{"$f":"R1","v":"Frank"},null,{"$f":"SUM(S34)","v":0},null,null,null,null,{"$f":"S1","v":"Siggi"},null,{"$f":"SUM(S34)","v":0}]
[null,null,null,"MAX(B2:B7",null,{"$f":"MAX(F50:F52)","v":0},null,null,null,null,"MAX(B2:B7",null,{"$f":"MAX(M50:M52)","v":0}]
[]
[null,null,null,{"$f":"D1","v":"Anja"},null,{"$f":"D34","v":0},null,null,null,{"$f":"INDEX(D55:E57,MATCH(MIN(F55:F57),F55:F57,0),1)","v":"Anja"},{"$f":"E1","v":"Erich"},null,{"$f":"SUM(D34)","v":0},null,null,null,null,{"$f":"INDEX(K55:L57,MATCH(MIN(M55:M57),M55:M57,0),1)","v":"Erich"}]
[null,null,null,{"$f":"K1","v":"Ralfie"},null,{"$f":"SUM(K34)","v":0},null,null,null,null,{"$f":"L1","v":"Vincent"},null,{"$f":"SUM(K34)","v":0}]
[null,null,null,{"$f":"R1","v":"Frank"},null,{"$f":"SUM(S34)","v":0},null,null,null,null,{"$f":"S1","v":"Siggi"},null,{"$f":"SUM(S34)","v":0}]
[null,null,null,null,null,null,{"$f":"SUM(F57)","v":0},null,null,null,null,null,null,{"$f":"SUM(M57)","v":0}]
[]
[]
[]
[null,null,null,null,null,null,null,null,null,{"$f":"SUM(F50:G52)/3","v":0}]

{"sheet":"Rd4","index":3,"n_rows":62,"n_cols":25,"rows_kept":62,"cut":false,"hidden":false,"merged":[[26,18,30,19],[31,4,32,5],[31,11,32,12],[31,18,32,19],[43,3,43,4],[43,5,43,6],[26,11,30,12],[26,4,30,5],[21,18,25,19],[7,4,7,5],[7,11,7,12],[7,18,7,19],[8,4,9,5],[8,11,9,12],[8,18,9,19],[10,4,12,5],[10,11,12,12],[10,18,12,19],[13,4,17,5],[13,11,17,12],[13,18,17,19],[21,4,25,5],[21,11,25,12],[56,3,56,4],[56,10,56,11],[50,3,50,4],[50,5,50,6],[50,10,50,11],[51,3,51,4],[51,5,51,6],[51,10,51,11],[54,3,54,4],[54,10,54,11],[55,3,55,4],[55,10,55,11],[46,3,46,4],[46,5,46,6],[44,5,44,6],[44,3,44,4],[45,3,45,4],[47,12,47,13],[48,3,48,4],[48,5,48,6],[49,3,49,4],[49,5,49,6],[49,10,49,11],[47,5,47,6]]}
[null,null,null,{"$f":"'Rd3'!R55","v":"Erich"},{"$f":"'Rd3'!J55","v":"Anja"},"Sp. 1",null,null,null,null,{"$f":"'Rd3'!R50","v":"Erich"},{"$f":"'Rd3'!J50","v":"Anja"},"Sp. 2",null,null,null,null,{"$f":"'Rd3'!R45","v":"Erich"},{"$f":"'Rd3'!J45","v":"Anja"},"Sp. 3",null,{"$f":"J45","v":"Erich"},{"$f":"R45","v":"Anja"}]
[null,null,null,"Punkte",501,"Start",null,null,null,null,"Punkte",501,"Start",null,null,null,null,"Punkte",501,"Start",null,{"$f":"J50","v":"Erich"},{"$f":"R50","v":"Anja"}]
[null,null,null,"Geworfen",{"$f":"SUM(D34)","v":0},"Punkte",null,null,null,null,"Geworfen",{"$f":"SUM(K34)","v":0},"Punkte",null,null,null,null,"Geworfen",{"$f":"SUM(R34)","v":0},"Punkte",null,{"$f":"J55","v":"Erich"},{"$f":"R55","v":"Anja"}]
["RD 1",{"$f":"COUNT(D4)*1","v":0},{"$f":"COUNT(D4)*3","v":0},null,{"$f":"SUM(E2-E3)","v":501},"Rest",null,"RD 1",{"$f":"COUNT(K4)*1","v":0},{"$f":"COUNT(K4)*3","v":0},null,{"$f":"SUM(L2-L3)","v":501},"Rest",null,"RD 1",{"$f":"COUNT(R4)*1","v":0},{"$f":"COUNT(R4)*3","v":0},null,{"$f":"SUM(S2-S3)","v":501},"Rest"]
["RD 2",{"$f":"COUNT(D5)*1","v":0},{"$f":"COUNT(D5)*3","v":0},null,null,null,null,"RD 2",0,0,null,null,null,null,"RD 2",0,0]
["RD 3",0,0,null,"ø pro Spiel",{"$f":"SUM(E3)/B34","v":{"$error":"#DIV/0!"}},null,"RD 3",0,0,null,"ø pro Spiel",{"$f":"SUM(L3)/I34","v":{"$error":"#DIV/0!"}},null,"RD 3",0,0,null,"ø pro Spiel",{"$f":"SUM(S3)/P34","v":{"$error":"#DIV/0!"}}]
["RD 4",0,0,null,"ø pro Pfeil",{"$f":"SUM(E3)/C34","v":{"$error":"#DIV/0!"}},null,"RD 4",0,0,null,"ø pro Pfeil",{"$f":"SUM(L3)/J34","v":{"$error":"#DIV/0!"}},null,"RD 4",0,0,null,"ø pro Pfeil",{"$f":"SUM(S3)/Q34","v":{"$error":"#DIV/0!"}}]
["RD 5",0,0,null,"Average",null,null,"RD 5",0,0,null,"Average",null,null,"RD 5",0,0,null,"Average"]
["RD 6",0,0,null,{"$f":"SUM(F6)","v":{"$error":"#DIV/0!"}},null,null,"RD 6",0,0,null,{"$f":"SUM(M6)","v":{"$error":"#DIV/0!"}},null,null,"RD 6",0,0,null,{"$f":"SUM(T6)","v":{"$error":"#DIV/0!"}}]
["RD 7",0,0,null,null,null,null,"RD 7",0,0,null,null,null,null,"RD 7",0,0]
["RD 8",0,0,null,"Nicht Gut",null,null,"RD 8",0,0,null,"Nicht Gut",null,null,"RD 8",0,0,null,"Nicht Gut"]
["RD 9",0,0,null,null,null,null,"RD 9",0,0,null,null,null,null,"RD 9",0,0]
["RD 10",0,0,null,null,null,null,"RD 10",0,0,null,null,null,null,"RD 10",0,0]
["RD 11",0,0,null,"Gut",null,null,"RD 11",0,0,null,"Gut",null,null,"RD 11",0,0,null,"Gut"]
["RD 12",0,0,null,null,null,null,"RD 12",0,0,null,null,null,null,"RD 12",0,0]
["RD 13",0,0,null,null,null,null,"RD 13",0,0,null,null,null,null,"RD 13",0,0]
["RD 14",0,0,null,null,null,null,"RD 14",0,0,null,null,null,null,"RD 14",0,0,null,null,null,null,null,null,null,"Ralf Kl."]
["RD 15",0,0,null,null,null,null,"RD 15",0,0,null,null,null,null,"RD 15",0,0,null,null,null,null,null,null,null,"Volker"]
["RD 16",0,0,null,{"$f":"D1","v":"Erich"},{"$f":"E1","v":"Anja"},null,"RD 16",0,0,null,{"$f":"K1","v":"Erich"},{"$f":"L1","v":"Anja"},null,"RD 16",0,0,null,{"$f":"R1","v":"Erich"},{"$f":"S1","v":"Anja"},null,null,null,null,"Rene"]
["RD 17",0,0,null,{"$f":"SUM(D4,D6,D8,D10,D12,D14,D16,D18,D20,D22,D24,D26,D28,D30,D32)","v":0},{"$f":"SUM(D5,D7,D9,D11,D13,D15,D17,D19,D21,D23,D25,D27,D29,D31,D33)","v":0},null,"RD 17",0,0,null,{"$f":"SUM(K4,K6,K8,K10,K12,K14,K16,K18,K20,K22,K24,K26,K28,K30,K32)","v":0},{"$f":"SUM(K5,K7,K9,K11,K13,K15,K17,K19,K21,K23,K25,K27,K29,K31,K33)","v":0},null,"RD 17",0,0,null,{"$f":"SUM(R4,R6,R8,R10,R12,R14,R16,R18,R20,R22,R24,R26,R28,R30,R32)","v":0},{"$f":"SUM(R5,R7,R9,R11,R13,R15,R17,R19,R21,R23,R25,R27,R29,R31,R33)","v":0},null,null,null,null,"Nicole"]
["RD 18",0,0,null,"Rest:",{"$f":"E4","v":501},null,"RD 18",0,0,null,"Rest:",{"$f":"L4","v":501},null,"RD 18",0,0,null,"Rest:",{"$f":"S4","v":501},null,"Micha",null,null,"Frank"]
["RD 19",0,0,null,"Sehr  Gut",null,null,"RD 19",0,0,null,"Sehr  Gut",null,null,"RD 19",0,0,null,"Sehr  Gut",null,null,null,null,null,"Rosi"]
["RD 20",0,0,null,null,null,null,"RD 20",0,0,null,null,null,null,"RD 20",0,0,null,null,null,null,null,null,null,"Werner"]
["RD 21",0,0,null,null,null,null,"RD 21",0,0,null,null,null,null,"RD 21",0,0,null,null,null,null,"Stefan",null,null,"Gast"]
["RD 22",0,0,null,null,null,null,"RD 22",0,0,null,null,null,null,"RD 22",0,0,null,null,null,null,null,null,null,"Stefan"]
["RD 23",0,0,null,null,null,null,"RD 23",0,0,null,null,null,null,"RD 23",0,0,null,null,null,null,null,null,null,"Micha"]
["RD 24",0,0,null,null,null,null,"RD 24",0,0,null,null,null,null,"RD 24",0,0,null,null,null,null,null,null,null,"Joker"]
["RD 25",0,0,null,null,null,null,"RD 25",0,0,null,null,null,null,"RD 25",0,0,null,null,null,null,null,null,null,"Anja"]
["RD 26",0,0,null,null,null,null,"RD 26",0,0,null,null,null,null,"RD 26",0,0,null,null,null,null,null,null,null,"Vincent"]
["RD 27",0,0,null,null,null,null,"RD 27",0,0,null,null,null,null,"RD 27",0,0,null,null,null,null,null,null,null,"Erich"]
["RD 28",0,0,null,null,null,null,"RD 28",0,0,null,null,null,null,"RD 28",0,0,null,null,null,null,null,null,null,"Siggi"]
["RD 29",0,0,null,{"$f":"IF(E4=0,\"Sieg\",\"\")","v":""},null,null,"RD 29",0,0,null,{"$f":"IF(L4=0,\"Sieg\",\"\")","v":""},null,null,"RD 29",0,0,null,{"$f":"IF(S4=0,\"Sieg\",\"\")","v":""},null,null,null,null,null,"Ralf M."]
["RD 30",0,0,null,null,null,null,"RD 30",0,0,null,null,null,null,"RD 30",0,0,null,null,null,null,null,null,null,"Dirk B."]
[null,{"$f":"SUM(B4:B33)","v":0},{"$f":"SUM(C4:C33)","v":0},{"$f":"SUM(D4:D33)","v":0},{"$f":"SUM(D5:D32)","v":0},null,null,null,{"$f":"SUM(I4:I33)","v":0},{"$f":"SUM(J4:J33)","v":0},{"$f":"SUM(K4:K33)","v":0},{"$f":"SUM(K4:K32)","v":0},null,null,null,{"$f":"SUM(P4:P33)","v":0},{"$f":"SUM(Q4:Q33)","v":0},{"$f":"SUM(R4:R33)","v":0},{"$f":"SUM(R4:R32)","v":0}]
[]
[]
[]
[]
[]
[]
[]
[]
[]
[]
[null,null,null,{"$f":"D1","v":"Erich"},null,{"$f":"D34","v":0},null,null,null,{"$f":"INDEX(D45:E47,MATCH(MAX(F45:F47),F45:F47,0),1)","v":"Erich"},{"$f":"E1","v":"Anja"},null,{"$f":"SUM(D34)","v":0},null,null,null,null,{"$f":"INDEX(K45:L47,MATCH(MAX(M45:M47),M45:M47,0),1)","v":"Anja"}]
[null,null,null,{"$f":"K1","v":"Erich"},null,{"$f":"SUM(K34)","v":0},null,null,null,null,{"$f":"L1","v":"Anja"},null,{"$f":"SUM(K34)","v":0}]
[null,null,null,{"$f":"R1","v":"Erich"},null,{"$f":"SUM(S34)","v":0},null,null,null,null,{"$f":"S1","v":"Anja"},null,{"$f":"SUM(S3)","v":0}]
[null,null,null,"MAX(B2:B7",null,null,null,null,null,null,"MAX(B2:B7"]
[]
[null,null,null,{"$f":"D1","v":"Erich"},null,{"$f":"D34","v":0},null,null,null,{"$f":"INDEX(D45:E47,MATCH(MEDIAN(F45:F47),F45:F47,0),1)","v":"Erich"},{"$f":"E1","v":"Anja"},null,{"$f":"SUM(D34)","v":0},null,null,null,null,{"$f":"INDEX(K50:L52,MATCH(MEDIAN(M50:M52),M50:M52,0),1)","v":"Anja"}]
[null,null,null,{"$f":"K1","v":"Erich"},null,{"$f":"SUM(K34)","v":0},null,null,null,null,{"$f":"L1","v":"Anja"},null,{"$f":"SUM(K34)","v":0}]
[null,null,null,{"$f":"R1","v":"Erich"},null,{"$f":"SUM(S34)","v":0},null,null,null,null,{"$f":"S1","v":"Anja"},null,{"$f":"SUM(S34)","v":0}]
[null,null,null,"MAX(B2:B7",null,{"$f":"MAX(F50:F52)","v":0},null,null,null,null,"MAX(B2:B7",null,{"$f":"MAX(M50:M52)","v":0}]
[]
[null,null,null,{"$f":"D1","v":"Erich"},null,{"$f":"D34","v":0},null,null,null,{"$f":"INDEX(D55:E57,MATCH(MIN(F55:F57),F55:F57,0),1)","v":"Erich"},{"$f":"E1","v":"Anja"},null,{"$f":"SUM(D34)","v":0},null,null,null,null,{"$f":"INDEX(K55:L57,MATCH(MIN(M55:M57),M55:M57,0),1)","v":"Anja"}]
[null,null,null,{"$f":"K1","v":"Erich"},null,{"$f":"SUM(K34)","v":0},null,null,null,null,{"$f":"L1","v":"Anja"},null,{"$f":"SUM(K34)","v":0}]
[null,null,null,{"$f":"R1","v":"Erich"},null,{"$f":"SUM(S34)","v":0},null,null,null,null,{"$f":"S1","v":"Anja"},null,{"$f":"SUM(S34)","v":0}]
[null,null,null,null,null,null,{"$f":"SUM(F57)","v":0},null,null,null,null,null,null,{"$f":"SUM(M57)","v":0}]
[]
[]
[]
[null,null,null,null,null,null,null,null,null,{"$f":"SUM(F50:G52)/3","v":0}]

{"sheet":"Rd5","index":4,"n_rows":62,"n_cols":25,"rows_kept":62,"cut":false,"hidden":false,"merged":[[26,18,30,19],[31,4,32,5],[31,11,32,12],[31,18,32,19],[43,3,43,4],[43,5,43,6],[26,11,30,12],[26,4,30,5],[21,18,25,19],[7,4,7,5],[7,11,7,12],[7,18,7,19],[8,4,9,5],[8,11,9,12],[8,18,9,19],[10,4,12,5],[10,11,12,12],[10,18,12,19],[13,4,17,5],[13,11,17,12],[13,18,17,19],[21,4,25,5],[21,11,25,12],[56,3,56,4],[56,10,56,11],[50,3,50,4],[50,5,50,6],[50,10,50,11],[51,3,51,4],[51,5,51,6],[51,10,51,11],[54,3,54,4],[54,10,54,11],[55,3,55,4],[55,10,55,11],[46,3,46,4],[46,5,46,6],[44,5,44,6],[44,3,44,4],[45,3,45,4],[47,12,47,13],[48,3,48,4],[48,5,48,6],[49,3,49,4],[49,5,49,6],[49,10,49,11],[47,5,47,6]]}
[null,null,null,{"$f":"Tabelle2!G17","v":"Erich"},{"$f":"Tabelle2!H17","v":"Vincent"},"Sp. 1",null,null,null,null,{"$f":"Tabelle2!G18","v":"Anja"},{"$f":"Tabelle2!H18","v":"Frank"},"Sp. 2",null,null,null,null,{"$f":"Tabelle2!G19","v":"Ralfie"},{"$f":"Tabelle2!H19","v":"Siggi"},"Sp. 3",null,{"$f":"J45","v":"Erich"},{"$f":"R45","v":"Vincent"}]
[null,null,null,"Punkte",501,"Start",null,null,null,null,"Punkte",501,"Start",null,null,null,null,"Punkte",501,"Start",null,{"$f":"J50","v":"Erich"},{"$f":"R50","v":"Vincent"}]
[null,null,null,"Geworfen",{"$f":"SUM(D34)","v":0},"Punkte",null,null,null,null,"Geworfen",{"$f":"SUM(K34)","v":0},"Punkte",null,null,null,null,"Geworfen",{"$f":"SUM(R34)","v":0},"Punkte",null,{"$f":"J55","v":"Erich"},{"$f":"R55","v":"Vincent"}]
["RD 1",{"$f":"COUNT(D4)*1","v":0},{"$f":"COUNT(D4)*3","v":0},null,{"$f":"SUM(E2-E3)","v":501},"Rest",null,"RD 1",{"$f":"COUNT(K4)*1","v":0},{"$f":"COUNT(K4)*3","v":0},null,{"$f":"SUM(L2-L3)","v":501},"Rest",null,"RD 1",{"$f":"COUNT(R4)*1","v":0},{"$f":"COUNT(R4)*3","v":0},null,{"$f":"SUM(S2-S3)","v":501},"Rest"]
["RD 2",{"$f":"COUNT(D5)*1","v":0},{"$f":"COUNT(D5)*3","v":0},null,null,null,null,"RD 2",0,0,null,null,null,null,"RD 2",0,0]
["RD 3",0,0,null,"ø pro Spiel",{"$f":"SUM(E3)/B34","v":{"$error":"#DIV/0!"}},null,"RD 3",0,0,null,"ø pro Spiel",{"$f":"SUM(L3)/I34","v":{"$error":"#DIV/0!"}},null,"RD 3",0,0,null,"ø pro Spiel",{"$f":"SUM(S3)/P34","v":{"$error":"#DIV/0!"}}]
["RD 4",0,0,null,"ø pro Pfeil",{"$f":"SUM(E3)/C34","v":{"$error":"#DIV/0!"}},null,"RD 4",0,0,null,"ø pro Pfeil",{"$f":"SUM(L3)/J34","v":{"$error":"#DIV/0!"}},null,"RD 4",0,0,null,"ø pro Pfeil",{"$f":"SUM(S3)/Q34","v":{"$error":"#DIV/0!"}}]
["RD 5",0,0,null,"Average",null,null,"RD 5",0,0,null,"Average",null,null,"RD 5",0,0,null,"Average"]
["RD 6",0,0,null,{"$f":"SUM(F6)","v":{"$error":"#DIV/0!"}},null,null,"RD 6",0,0,null,{"$f":"SUM(M6)","v":{"$error":"#DIV/0!"}},null,null,"RD 6",0,0,null,{"$f":"SUM(T6)","v":{"$error":"#DIV/0!"}}]
["RD 7",0,0,null,null,null,null,"RD 7",0,0,null,null,null,null,"RD 7",0,0]
["RD 8",0,0,null,"Nicht Gut",null,null,"RD 8",0,0,null,"Nicht Gut",null,null,"RD 8",0,0,null,"Nicht Gut"]
["RD 9",0,0,null,null,null,null,"RD 9",0,0,null,null,null,null,"RD 9",0,0]
["RD 10",0,0,null,null,null,null,"RD 10",0,0,null,null,null,null,"RD 10",0,0]
["RD 11",0,0,null,"Gut",null,null,"RD 11",0,0,null,"Gut",null,null,"RD 11",0,0,null,"Gut"]
["RD 12",0,0,null,null,null,null,"RD 12",0,0,null,null,null,null,"RD 12",0,0]
["RD 13",0,0,null,null,null,null,"RD 13",0,0,null,null,null,null,"RD 13",0,0]
["RD 14",0,0,null,null,null,null,"RD 14",0,0,null,null,null,null,"RD 14",0,0,null,null,null,null,null,null,null,"Ralf Kl."]
["RD 15",0,0,null,null,null,null,"RD 15",0,0,null,null,null,null,"RD 15",0,0,null,null,null,null,null,null,null,"Volker"]
["RD 16",0,0,null,{"$f":"D1","v":"Erich"},{"$f":"E1","v":"Vincent"},null,"RD 16",0,0,null,{"$f":"K1","v":"Anja"},{"$f":"L1","v":"Frank"},null,"RD 16",0,0,null,{"$f":"R1","v":"Ralfie"},{"$f":"S1","v":"Siggi"},null,null,null,null,"Rene"]
["RD 17",0,0,null,{"$f":"SUM(D4,D6,D8,D10,D12,D14,D16,D18,D20,D22,D24,D26,D28,D30,D32)","v":0},{"$f":"SUM(D5,D7,D9,D11,D13,D15,D17,D19,D21,D23,D25,D27,D29,D31,D33)","v":0},null,"RD 17",0,0,null,{"$f":"SUM(K4,K6,K8,K10,K12,K14,K16,K18,K20,K22,K24,K26,K28,K30,K32)","v":0},{"$f":"SUM(K5,K7,K9,K11,K13,K15,K17,K19,K21,K23,K25,K27,K29,K31,K33)","v":0},null,"RD 17",0,0,null,{"$f":"SUM(R4,R6,R8,R10,R12,R14,R16,R18,R20,R22,R24,R26,R28,R30,R32)","v":0},{"$f":"SUM(R5,R7,R9,R11,R13,R15,R17,R19,R21,R23,R25,R27,R29,R31,R33)","v":0},null,null,null,null,"Nicole"]
["RD 18",0,0,null,"Rest:",{"$f":"E4","v":501},null,"RD 18",0,0,null,"Rest:",{"$f":"L4","v":501},null,"RD 18",0,0,null,"Rest:",{"$f":"S4","v":501},null,"Micha",null,null,"Frank"]
["RD 19",0,0,null,"Sehr  Gut",null,null,"RD 19",0,0,null,"Sehr  Gut",null,null,"RD 19",0,0,null,"Sehr  Gut",null,null,null,null,null,"Rosi"]
["RD 20",0,0,null,null,null,null,"RD 20",0,0,null,null,null,null,"RD 20",0,0,null,null,null,null,null,null,null,"Werner"]
["RD 21",0,0,null,null,null,null,"RD 21",0,0,null,null,null,null,"RD 21",0,0,null,null,null,null,"Stefan",null,null,"Gast"]
["RD 22",0,0,null,null,null,null,"RD 22",0,0,null,null,null,null,"RD 22",0,0,null,null,null,null,null,null,null,"Stefan"]
["RD 23",0,0,null,null,null,null,"RD 23",0,0,null,null,null,null,"RD 23",0,0,null,null,null,null,null,null,null,"Micha"]
["RD 24",0,0,null,null,null,null,"RD 24",0,0,null,null,null,null,"RD 24",0,0,null,null,null,null,null,null,null,"Joker"]
["RD 25",0,0,null,null,null,null,"RD 25",0,0,null,null,null,null,"RD 25",0,0,null,null,null,null,null,null,null,"Anja"]
["RD 26",0,0,null,null,null,null,"RD 26",0,0,null,null,null,null,"RD 26",0,0,null,null,null,null,null,null,null,"Vincent"]
["RD 27",0,0,null,null,null,null,"RD 27",0,0,null,null,null,null,"RD 27",0,0,null,null,null,null,null,null,null,"Erich"]
["RD 28",0,0,null,null,null,null,"RD 28",0,0,null,null,null,null,"RD 28",0,0,null,null,null,null,null,null,null,"Siggi"]
["RD 29",0,0,null,{"$f":"IF(E4=0,\"Sieg\",\"\")","v":""},null,null,"RD 29",0,0,null,{"$f":"IF(L4=0,\"Sieg\",\"\")","v":""},null,null,"RD 29",0,0,null,{"$f":"IF(S4=0,\"Sieg\",\"\")","v":""},null,null,null,null,null,"Ralf M."]
["RD 30",0,0,null,null,null,null,"RD 30",0,0,null,null,null,null,"RD 30",0,0,null,null,null,null,null,null,null,"Dirk B."]
[null,{"$f":"SUM(B4:B33)","v":0},{"$f":"SUM(C4:C33)","v":0},{"$f":"SUM(D4:D33)","v":0},{"$f":"SUM(D5:D32)","v":0},null,null,null,{"$f":"SUM(I4:I33)","v":0},{"$f":"SUM(J4:J33)","v":0},{"$f":"SUM(K4:K33)","v":0},{"$f":"SUM(K4:K32)","v":0},null,null,null,{"$f":"SUM(P4:P33)","v":0},{"$f":"SUM(Q4:Q33)","v":0},{"$f":"SUM(R4:R33)","v":0},{"$f":"SUM(R4:R32)","v":0}]
[]
[]
[]
[]
[]
[]
[]
[]
[]
[]
[null,null,null,{"$f":"D1","v":"Erich"},null,{"$f":"D34","v":0},null,null,null,{"$f":"INDEX(D45:E47,MATCH(MAX(F45:F47),F45:F47,0),1)","v":"Erich"},{"$f":"E1","v":"Vincent"},null,{"$f":"SUM(D34)","v":0},null,null,null,null,{"$f":"INDEX(K45:L47,MATCH(MAX(M45:M47),M45:M47,0),1)","v":"Vincent"}]
[null,null,null,{"$f":"K1","v":"Anja"},null,{"$f":"SUM(K34)","v":0},null,null,null,null,{"$f":"L1","v":"Frank"},null,{"$f":"SUM(K34)","v":0}]
[null,null,null,{"$f":"R1","v":"Ralfie"},null,{"$f":"SUM(S34)","v":0},null,null,null,null,{"$f":"S1","v":"Siggi"},null,{"$f":"SUM(S3)","v":0}]
[null,null,null,"MAX(B2:B7",null,null,null,null,null,null,"MAX(B2:B7"]
[]
[null,null,null,{"$f":"D1","v":"Erich"},null,{"$f":"D34","v":0},null,null,null,{"$f":"INDEX(D45:E47,MATCH(MEDIAN(F45:F47),F45:F47,0),1)","v":"Erich"},{"$f":"E1","v":"Vincent"},null,{"$f":"SUM(D34)","v":0},null,null,null,null,{"$f":"INDEX(K50:L52,MATCH(MEDIAN(M50:M52),M50:M52,0),1)","v":"Vincent"}]
[null,null,null,{"$f":"K1","v":"Anja"},null,{"$f":"SUM(K34)","v":0},null,null,null,null,{"$f":"L1","v":"Frank"},null,{"$f":"SUM(K34)","v":0}]
[null,null,null,{"$f":"R1","v":"Ralfie"},null,{"$f":"SUM(S34)","v":0},null,null,null,null,{"$f":"S1","v":"Siggi"},null,{"$f":"SUM(S34)","v":0}]
[null,null,null,"MAX(B2:B7",null,{"$f":"MAX(F50:F52)","v":0},null,null,null,null,"MAX(B2:B7",null,{"$f":"MAX(M50:M52)","v":0}]
[]
[null,null,null,{"$f":"D1","v":"Erich"},null,{"$f":"D34","v":0},null,null,null,{"$f":"INDEX(D55:E57,MATCH(MIN(F55:F57),F55:F57,0),1)","v":"Erich"},{"$f":"E1","v":"Vincent"},null,{"$f":"SUM(D34)","v":0},null,null,null,null,{"$f":"INDEX(K55:L57,MATCH(MIN(M55:M57),M55:M57,0),1)","v":"Vincent"}]
[null,null,null,{"$f":"K1","v":"Anja"},null,{"$f":"SUM(K34)","v":0},null,null,null,null,{"$f":"L1","v":"Frank"},null,{"$f":"SUM(K34)","v":0}]
[null,null,null,{"$f":"R1","v":"Ralfie"},null,{"$f":"SUM(S34)","v":0},null,null,null,null,{"$f":"S1","v":"Siggi"},null,{"$f":"SUM(S34)","v":0}]
[null,null,null,null,null,null,{"$f":"SUM(F57)","v":0},null,null,null,null,null,null,{"$f":"SUM(M57)","v":0}]
[]
[]
[]
[null,null,null,null,null,null,null,null,null,{"$f":"SUM(F50:G52)/3","v":0}]

{"sheet":"Rd6","index":5,"n_rows":62,"n_cols":25,"rows_kept":62,"cut":false,"hidden":false,"merged":[[31,18,32,19],[44,3,44,4],[10,18,12,19],[13,4,17,5],[13,11,17,12],[13,18,17,19],[26,4,30,5],[21,18,25,19],[26,18,30,19],[10,4,12,5],[10,11,12,12],[45,3,45,4],[46,3,46,4],[31,4,32,5],[31,11,32,12],[26,11,30,12],[21,4,25,5],[21,11,25,12],[46,5,46,6],[43,3,43,4],[43,5,43,6],[44,5,44,6],[7,4,7,5],[7,11,7,12],[7,18,7,19],[8,4,9,5],[8,11,9,12],[8,18,9,19],[56,3,56,4],[56,10,56,11],[50,3,50,4],[50,5,50,6],[50,10,50,11],[51,3,51,4],[51,5,51,6],[51,10,51,11],[54,3,54,4],[54,10,54,11],[55,3,55,4],[55,10,55,11],[47,12,47,13],[48,3,48,4],[48,5,48,6],[49,3,49,4],[49,5,49,6],[49,10,49,11],[47,5,47,6]]}
[null,null,null,{"$f":"'Rd5'!R55","v":"Vincent"},{"$f":"'Rd5'!J55","v":"Erich"},"Sp. 1",null,null,null,null,{"$f":"'Rd5'!R50","v":"Vincent"},{"$f":"'Rd5'!J50","v":"Erich"},"Sp. 2",null,null,null,null,{"$f":"'Rd5'!R45","v":"Vincent"},{"$f":"'Rd5'!J45","v":"Erich"},"Sp. 3",null,{"$f":"J45","v":"Vincent"},{"$f":"R45","v":"Erich"}]
[null,null,null,"Punkte",501,"Start",null,null,null,null,"Punkte",501,"Start",null,null,null,null,"Punkte",501,"Start",null,{"$f":"J50","v":"Vincent"},{"$f":"R50","v":"Erich"}]
[null,null,null,"Geworfen",{"$f":"SUM(D34)","v":0},"Punkte",null,null,null,null,"Geworfen",{"$f":"SUM(K34)","v":0},"Punkte",null,null,null,null,"Geworfen",{"$f":"SUM(R34)","v":0},"Punkte",null,{"$f":"J55","v":"Vincent"},{"$f":"R55","v":"Erich"}]
["RD 1",{"$f":"COUNT(D4)*1","v":0},{"$f":"COUNT(D4)*3","v":0},null,{"$f":"SUM(E2-E3)","v":501},"Rest",null,"RD 1",{"$f":"COUNT(K4)*1","v":0},{"$f":"COUNT(K4)*3","v":0},null,{"$f":"SUM(L2-L3)","v":501},"Rest",null,"RD 1",{"$f":"COUNT(R4)*1","v":0},{"$f":"COUNT(R4)*3","v":0},null,{"$f":"SUM(S2-S3)","v":501},"Rest"]
["RD 2",{"$f":"COUNT(D5)*1","v":0},{"$f":"COUNT(D5)*3","v":0},null,null,null,null,"RD 2",0,0,null,null,null,null,"RD 2",0,0]
["RD 3",0,0,null,"ø pro Spiel",{"$f":"SUM(E3)/B34","v":{"$error":"#DIV/0!"}},null,"RD 3",0,0,null,"ø pro Spiel",{"$f":"SUM(L3)/I34","v":{"$error":"#DIV/0!"}},null,"RD 3",0,0,null,"ø pro Spiel",{"$f":"SUM(S3)/P34","v":{"$error":"#DIV/0!"}}]
["RD 4",0,0,null,"ø pro Pfeil",{"$f":"SUM(E3)/C34","v":{"$error":"#DIV/0!"}},null,"RD 4",0,0,null,"ø pro Pfeil",{"$f":"SUM(L3)/J34","v":{"$error":"#DIV/0!"}},null,"RD 4",0,0,null,"ø pro Pfeil",{"$f":"SUM(S3)/Q34","v":{"$error":"#DIV/0!"}}]
["RD 5",0,0,null,"Average",null,null,"RD 5",0,0,null,"Average",null,null,"RD 5",0,0,null,"Average"]
["RD 6",0,0,null,{"$f":"SUM(F6)","v":{"$error":"#DIV/0!"}},null,null,"RD 6",0,0,null,{"$f":"SUM(M6)","v":{"$error":"#DIV/0!"}},null,null,"RD 6",0,0,null,{"$f":"SUM(T6)","v":{"$error":"#DIV/0!"}}]
["RD 7",0,0,null,null,null,null,"RD 7",0,0,null,null,null,null,"RD 7",0,0]
["RD 8",0,0,null,"Nicht Gut",null,null,"RD 8",0,0,null,"Nicht Gut",null,null,"RD 8",0,0,null,"Nicht Gut"]
["RD 9",0,0,null,null,null,null,"RD 9",0,0,null,null,null,null,"RD 9",0,0]
["RD 10",0,0,null,null,null,null,"RD 10",0,0,null,null,null,null,"RD 10",0,0]
["RD 11",0,0,null,"Gut",null,null,"RD 11",0,0,null,"Gut",null,null,"RD 11",0,0,null,"Gut"]
["RD 12",0,0,null,null,null,null,"RD 12",0,0,null,null,null,null,"RD 12",0,0]
["RD 13",0,0,null,null,null,null,"RD 13",0,0,null,null,null,null,"RD 13",0,0]
["RD 14",0,0,null,null,null,null,"RD 14",0,0,null,null,null,null,"RD 14",0,0,null,null,null,null,null,null,null,"Ralf Kl."]
["RD 15",0,0,null,null,null,null,"RD 15",0,0,null,null,null,null,"RD 15",0,0,null,null,null,null,null,null,null,"Volker"]
["RD 16",0,0,null,{"$f":"D1","v":"Vincent"},{"$f":"E1","v":"Erich"},null,"RD 16",0,0,null,{"$f":"K1","v":"Vincent"},{"$f":"L1","v":"Erich"},null,"RD 16",0,0,null,{"$f":"R1","v":"Vincent"},{"$f":"S1","v":"Erich"},null,null,null,null,"Rene"]
["RD 17",0,0,null,{"$f":"SUM(D4,D6,D8,D10,D12,D14,D16,D18,D20,D22,D24,D26,D28,D30,D32)","v":0},{"$f":"SUM(D5,D7,D9,D11,D13,D15,D17,D19,D21,D23,D25,D27,D29,D31,D33)","v":0},null,"RD 17",0,0,null,{"$f":"SUM(K4,K6,K8,K10,K12,K14,K16,K18,K20,K22,K24,K26,K28,K30,K32)","v":0},{"$f":"SUM(K5,K7,K9,K11,K13,K15,K17,K19,K21,K23,K25,K27,K29,K31,K33)","v":0},null,"RD 17",0,0,null,{"$f":"SUM(R4,R6,R8,R10,R12,R14,R16,R18,R20,R22,R24,R26,R28,R30,R32)","v":0},{"$f":"SUM(R5,R7,R9,R11,R13,R15,R17,R19,R21,R23,R25,R27,R29,R31,R33)","v":0},null,null,null,null,"Nicole"]
["RD 18",0,0,null,"Rest:",{"$f":"E4","v":501},null,"RD 18",0,0,null,"Rest:",{"$f":"L4","v":501},null,"RD 18",0,0,null,"Rest:",{"$f":"S4","v":501},null,"Micha",null,null,"Frank"]
["RD 19",0,0,null,"Sehr  Gut",null,null,"RD 19",0,0,null,"Sehr  Gut",null,null,"RD 19",0,0,null,"Sehr  Gut",null,null,null,null,null,"Rosi"]
["RD 20",0,0,null,null,null,null,"RD 20",0,0,null,null,null,null,"RD 20",0,0,null,null,null,null,null,null,null,"Werner"]
["RD 21",0,0,null,null,null,null,"RD 21",0,0,null,null,null,null,"RD 21",0,0,null,null,null,null,"Stefan",null,null,"Gast"]
["RD 22",0,0,null,null,null,null,"RD 22",0,0,null,null,null,null,"RD 22",0,0,null,null,null,null,null,null,null,"Stefan"]
["RD 23",0,0,null,null,null,null,"RD 23",0,0,null,null,null,null,"RD 23",0,0,null,null,null,null,null,null,null,"Micha"]
["RD 24",0,0,null,null,null,null,"RD 24",0,0,null,null,null,null,"RD 24",0,0,null,null,null,null,null,null,null,"Joker"]
["RD 25",0,0,null,null,null,null,"RD 25",0,0,null,null,null,null,"RD 25",0,0,null,null,null,null,null,null,null,"Anja"]
["RD 26",0,0,null,null,null,null,"RD 26",0,0,null,null,null,null,"RD 26",0,0,null,null,null,null,null,null,null,"Vincent"]
["RD 27",0,0,null,null,null,null,"RD 27",0,0,null,null,null,null,"RD 27",0,0,null,null,null,null,null,null,null,"Erich"]
["RD 28",0,0,null,null,null,null,"RD 28",0,0,null,null,null,null,"RD 28",0,0,null,null,null,null,null,null,null,"Siggi"]
["RD 29",0,0,null,{"$f":"IF(E4=0,\"Sieg\",\"\")","v":""},null,null,"RD 29",0,0,null,{"$f":"IF(L4=0,\"Sieg\",\"\")","v":""},null,null,"RD 29",0,0,null,{"$f":"IF(S4=0,\"Sieg\",\"\")","v":""},null,null,null,null,null,"Ralf M."]
["RD 30",0,0,null,null,null,null,"RD 30",0,0,null,null,null,null,"RD 30",0,0,null,null,null,null,null,null,null,"Dirk B."]
[null,{"$f":"SUM(B4:B33)","v":0},{"$f":"SUM(C4:C33)","v":0},{"$f":"SUM(D4:D33)","v":0},{"$f":"SUM(D5:D32)","v":0},null,null,null,{"$f":"SUM(I4:I33)","v":0},{"$f":"SUM(J4:J33)","v":0},{"$f":"SUM(K4:K33)","v":0},{"$f":"SUM(K4:K32)","v":0},null,null,null,{"$f":"SUM(P4:P33)","v":0},{"$f":"SUM(Q4:Q33)","v":0},{"$f":"SUM(R4:R33)","v":0},{"$f":"SUM(R4:R32)","v":0}]
[]
[]
[]
[]
[]
[]
[]
[]
[]
[]
[null,null,null,{"$f":"D1","v":"Vincent"},null,{"$f":"D34","v":0},null,null,null,{"$f":"INDEX(D45:E47,MATCH(MAX(F45:F47),F45:F47,0),1)","v":"Vincent"},{"$f":"E1","v":"Erich"},null,{"$f":"SUM(D34)","v":0},null,null,null,null,{"$f":"INDEX(K45:L47,MATCH(MAX(M45:M47),M45:M47,0),1)","v":"Erich"}]
[null,null,null,{"$f":"K1","v":"Vincent"},null,{"$f":"SUM(K34)","v":0},null,null,null,null,{"$f":"L1","v":"Erich"},null,{"$f":"SUM(K34)","v":0}]
[null,null,null,{"$f":"R1","v":"Vincent"},null,{"$f":"SUM(S34)","v":0},null,null,null,null,{"$f":"S1","v":"Erich"},null,{"$f":"SUM(S3)","v":0}]
[null,null,null,"MAX(B2:B7",null,null,null,null,null,null,"MAX(B2:B7"]
[]
[null,null,null,{"$f":"D1","v":"Vincent"},null,{"$f":"D34","v":0},null,null,null,{"$f":"INDEX(D45:E47,MATCH(MEDIAN(F45:F47),F45:F47,0),1)","v":"Vincent"},{"$f":"E1","v":"Erich"},null,{"$f":"SUM(D34)","v":0},null,null,null,null,{"$f":"INDEX(K50:L52,MATCH(MEDIAN(M50:M52),M50:M52,0),1)","v":"Erich"}]
[null,null,null,{"$f":"K1","v":"Vincent"},null,{"$f":"SUM(K34)","v":0},null,null,null,null,{"$f":"L1","v":"Erich"},null,{"$f":"SUM(K34)","v":0}]
[null,null,null,{"$f":"R1","v":"Vincent"},null,{"$f":"SUM(S34)","v":0},null,null,null,null,{"$f":"S1","v":"Erich"},null,{"$f":"SUM(S34)","v":0}]
[null,null,null,"MAX(B2:B7",null,{"$f":"MAX(F50:F52)","v":0},null,null,null,null,"MAX(B2:B7",null,{"$f":"MAX(M50:M52)","v":0}]
[]
[null,null,null,{"$f":"D1","v":"Vincent"},null,{"$f":"D34","v":0},null,null,null,{"$f":"INDEX(D55:E57,MATCH(MIN(F55:F57),F55:F57,0),1)","v":"Vincent"},{"$f":"E1","v":"Erich"},null,{"$f":"SUM(D34)","v":0},null,null,null,null,{"$f":"INDEX(K55:L57,MATCH(MIN(M55:M57),M55:M57,0),1)","v":"Erich"}]
[null,null,null,{"$f":"K1","v":"Vincent"},null,{"$f":"SUM(K34)","v":0},null,null,null,null,{"$f":"L1","v":"Erich"},null,{"$f":"SUM(K34)","v":0}]
[null,null,null,{"$f":"R1","v":"Vincent"},null,{"$f":"SUM(S34)","v":0},null,null,null,null,{"$f":"S1","v":"Erich"},null,{"$f":"SUM(S34)","v":0}]
[null,null,null,null,null,null,{"$f":"SUM(F57)","v":0},null,null,null,null,null,null,{"$f":"SUM(M57)","v":0}]
[]
[]
[]
[null,null,null,null,null,null,null,null,null,{"$f":"SUM(F50:G52)/3","v":0}]

{"sheet":"Rd7","index":6,"n_rows":62,"n_cols":25,"rows_kept":62,"cut":false,"hidden":false,"merged":[[26,18,30,19],[31,4,32,5],[31,11,32,12],[31,18,32,19],[43,3,43,4],[43,5,43,6],[26,11,30,12],[26,4,30,5],[21,18,25,19],[7,4,7,5],[7,11,7,12],[7,18,7,19],[8,4,9,5],[8,11,9,12],[8,18,9,19],[10,4,12,5],[10,11,12,12],[10,18,12,19],[13,4,17,5],[13,11,17,12],[13,18,17,19],[21,4,25,5],[21,11,25,12],[56,3,56,4],[56,10,56,11],[50,3,50,4],[50,5,50,6],[50,10,50,11],[51,3,51,4],[51,5,51,6],[51,10,51,11],[54,3,54,4],[54,10,54,11],[55,3,55,4],[55,10,55,11],[46,3,46,4],[46,5,46,6],[44,5,44,6],[44,3,44,4],[45,3,45,4],[47,12,47,13],[48,3,48,4],[48,5,48,6],[49,3,49,4],[49,5,49,6],[49,10,49,11],[47,5,47,6]]}
[null,null,null,{"$f":"Tabelle2!G20","v":"Erich"},{"$f":"Tabelle2!H20","v":"Frank"},"Sp. 1",null,null,null,null,{"$f":"Tabelle2!G21","v":"Siggi"},{"$f":"Tabelle2!H21","v":"Vincent"},"Sp. 2",null,null,null,null,{"$f":"Tabelle2!G22","v":"Anja"},{"$f":"Tabelle2!H22","v":"Ralfie"},"Sp. 3",null,{"$f":"J45","v":"Erich"},{"$f":"R45","v":"Frank"}]
[null,null,null,"Punkte",501,"Start",null,null,null,null,"Punkte",501,"Start",null,null,null,null,"Punkte",501,"Start",null,{"$f":"J50","v":"Erich"},{"$f":"R50","v":"Frank"}]
[null,null,null,"Geworfen",{"$f":"SUM(D34)","v":0},"Punkte",null,null,null,null,"Geworfen",{"$f":"SUM(K34)","v":0},"Punkte",null,null,null,null,"Geworfen",{"$f":"SUM(R34)","v":0},"Punkte",null,{"$f":"J55","v":"Erich"},{"$f":"R55","v":"Frank"}]
["RD 1",{"$f":"COUNT(D4)*1","v":0},{"$f":"COUNT(D4)*3","v":0},null,{"$f":"SUM(E2-E3)","v":501},"Rest",null,"RD 1",{"$f":"COUNT(K4)*1","v":0},{"$f":"COUNT(K4)*3","v":0},null,{"$f":"SUM(L2-L3)","v":501},"Rest",null,"RD 1",{"$f":"COUNT(R4)*1","v":0},{"$f":"COUNT(R4)*3","v":0},null,{"$f":"SUM(S2-S3)","v":501},"Rest"]
["RD 2",{"$f":"COUNT(D5)*1","v":0},{"$f":"COUNT(D5)*3","v":0},null,null,null,null,"RD 2",0,0,null,null,null,null,"RD 2",0,0]
["RD 3",0,0,null,"ø pro Spiel",{"$f":"SUM(E3)/B34","v":{"$error":"#DIV/0!"}},null,"RD 3",0,0,null,"ø pro Spiel",{"$f":"SUM(L3)/I34","v":{"$error":"#DIV/0!"}},null,"RD 3",0,0,null,"ø pro Spiel",{"$f":"SUM(S3)/P34","v":{"$error":"#DIV/0!"}}]
["RD 4",0,0,null,"ø pro Pfeil",{"$f":"SUM(E3)/C34","v":{"$error":"#DIV/0!"}},null,"RD 4",0,0,null,"ø pro Pfeil",{"$f":"SUM(L3)/J34","v":{"$error":"#DIV/0!"}},null,"RD 4",0,0,null,"ø pro Pfeil",{"$f":"SUM(S3)/Q34","v":{"$error":"#DIV/0!"}}]
["RD 5",0,0,null,"Average",null,null,"RD 5",0,0,null,"Average",null,null,"RD 5",0,0,null,"Average"]
["RD 6",0,0,null,{"$f":"SUM(F6)","v":{"$error":"#DIV/0!"}},null,null,"RD 6",0,0,null,{"$f":"SUM(M6)","v":{"$error":"#DIV/0!"}},null,null,"RD 6",0,0,null,{"$f":"SUM(T6)","v":{"$error":"#DIV/0!"}}]
["RD 7",0,0,null,null,null,null,"RD 7",0,0,null,null,null,null,"RD 7",0,0]
["RD 8",0,0,null,"Nicht Gut",null,null,"RD 8",0,0,null,"Nicht Gut",null,null,"RD 8",0,0,null,"Nicht Gut"]
["RD 9",0,0,null,null,null,null,"RD 9",0,0,null,null,null,null,"RD 9",0,0]
["RD 10",0,0,null,null,null,null,"RD 10",0,0,null,null,null,null,"RD 10",0,0]
["RD 11",0,0,null,"Gut",null,null,"RD 11",0,0,null,"Gut",null,null,"RD 11",0,0,null,"Gut"]
["RD 12",0,0,null,null,null,null,"RD 12",0,0,null,null,null,null,"RD 12",0,0]
["RD 13",0,0,null,null,null,null,"RD 13",0,0,null,null,null,null,"RD 13",0,0]
["RD 14",0,0,null,null,null,null,"RD 14",0,0,null,null,null,null,"RD 14",0,0,null,null,null,null,null,null,null,"Ralf Kl."]
["RD 15",0,0,null,null,null,null,"RD 15",0,0,null,null,null,null,"RD 15",0,0,null,null,null,null,null,null,null,"Volker"]
["RD 16",0,0,null,{"$f":"D1","v":"Erich"},{"$f":"E1","v":"Frank"},null,"RD 16",0,0,null,{"$f":"K1","v":"Siggi"},{"$f":"L1","v":"Vincent"},null,"RD 16",0,0,null,{"$f":"R1","v":"Anja"},{"$f":"S1","v":"Ralfie"},null,null,null,null,"Rene"]
["RD 17",0,0,null,{"$f":"SUM(D4,D6,D8,D10,D12,D14,D16,D18,D20,D22,D24,D26,D28,D30,D32)","v":0},{"$f":"SUM(D5,D7,D9,D11,D13,D15,D17,D19,D21,D23,D25,D27,D29,D31,D33)","v":0},null,"RD 17",0,0,null,{"$f":"SUM(K4,K6,K8,K10,K12,K14,K16,K18,K20,K22,K24,K26,K28,K30,K32)","v":0},{"$f":"SUM(K5,K7,K9,K11,K13,K15,K17,K19,K21,K23,K25,K27,K29,K31,K33)","v":0},null,"RD 17",0,0,null,{"$f":"SUM(R4,R6,R8,R10,R12,R14,R16,R18,R20,R22,R24,R26,R28,R30,R32)","v":0},{"$f":"SUM(R5,R7,R9,R11,R13,R15,R17,R19,R21,R23,R25,R27,R29,R31,R33)","v":0},null,null,null,null,"Nicole"]
["RD 18",0,0,null,"Rest:",{"$f":"E4","v":501},null,"RD 18",0,0,null,"Rest:",{"$f":"L4","v":501},null,"RD 18",0,0,null,"Rest:",{"$f":"S4","v":501},null,"Micha",null,null,"Frank"]
["RD 19",0,0,null,"Sehr  Gut",null,null,"RD 19",0,0,null,"Sehr  Gut",null,null,"RD 19",0,0,null,"Sehr  Gut",null,null,null,null,null,"Rosi"]
["RD 20",0,0,null,null,null,null,"RD 20",0,0,null,null,null,null,"RD 20",0,0,null,null,null,null,null,null,null,"Werner"]
["RD 21",0,0,null,null,null,null,"RD 21",0,0,null,null,null,null,"RD 21",0,0,null,null,null,null,"Stefan",null,null,"Gast"]
["RD 22",0,0,null,null,null,null,"RD 22",0,0,null,null,null,null,"RD 22",0,0,null,null,null,null,null,null,null,"Stefan"]
["RD 23",0,0,null,null,null,null,"RD 23",0,0,null,null,null,null,"RD 23",0,0,null,null,null,null,null,null,null,"Micha"]
["RD 24",0,0,null,null,null,null,"RD 24",0,0,null,null,null,null,"RD 24",0,0,null,null,null,null,null,null,null,"Joker"]
["RD 25",0,0,null,null,null,null,"RD 25",0,0,null,null,null,null,"RD 25",0,0,null,null,null,null,null,null,null,"Anja"]
["RD 26",0,0,null,null,null,null,"RD 26",0,0,null,null,null,null,"RD 26",0,0,null,null,null,null,null,null,null,"Vincent"]
["RD 27",0,0,null,null,null,null,"RD 27",0,0,null,null,null,null,"RD 27",0,0,null,null,null,null,null,null,null,"Erich"]
["RD 28",0,0,null,null,null,null,"RD 28",0,0,null,null,null,null,"RD 28",0,0,null,null,null,null,null,null,null,"Siggi"]
["RD 29",0,0,null,{"$f":"IF(E4=0,\"Sieg\",\"\")","v":""},null,null,"RD 29",0,0,null,{"$f":"IF(L4=0,\"Sieg\",\"\")","v":""},null,null,"RD 29",0,0,null,{"$f":"IF(S4=0,\"Sieg\",\"\")","v":""},null,null,null,null,null,"Ralf M."]
["RD 30",0,0,null,null,null,null,"RD 30",0,0,null,null,null,null,"RD 30",0,0,null,null,null,null,null,null,null,"Dirk B."]
[null,{"$f":"SUM(B4:B33)","v":0},{"$f":"SUM(C4:C33)","v":0},{"$f":"SUM(D4:D33)","v":0},{"$f":"SUM(D5:D32)","v":0},null,null,null,{"$f":"SUM(I4:I33)","v":0},{"$f":"SUM(J4:J33)","v":0},{"$f":"SUM(K4:K33)","v":0},{"$f":"SUM(K4:K32)","v":0},null,null,null,{"$f":"SUM(P4:P33)","v":0},{"$f":"SUM(Q4:Q33)","v":0},{"$f":"SUM(R4:R33)","v":0},{"$f":"SUM(R4:R32)","v":0}]
[]
[]
[]
[]
[]
[]
[]
[]
[]
[]
[null,null,null,{"$f":"D1","v":"Erich"},null,{"$f":"D34","v":0},null,null,null,{"$f":"INDEX(D45:E47,MATCH(MAX(F45:F47),F45:F47,0),1)","v":"Erich"},{"$f":"E1","v":"Frank"},null,{"$f":"SUM(D34)","v":0},null,null,null,null,{"$f":"INDEX(K45:L47,MATCH(MAX(M45:M47),M45:M47,0),1)","v":"Frank"}]
[null,null,null,{"$f":"K1","v":"Siggi"},null,{"$f":"SUM(K34)","v":0},null,null,null,null,{"$f":"L1","v":"Vincent"},null,{"$f":"SUM(K34)","v":0}]
[null,null,null,{"$f":"R1","v":"Anja"},null,{"$f":"SUM(S34)","v":0},null,null,null,null,{"$f":"S1","v":"Ralfie"},null,{"$f":"SUM(S3)","v":0}]
[null,null,null,"MAX(B2:B7",null,null,null,null,null,null,"MAX(B2:B7"]
[]
[null,null,null,{"$f":"D1","v":"Erich"},null,{"$f":"D34","v":0},null,null,null,{"$f":"INDEX(D45:E47,MATCH(MEDIAN(F45:F47),F45:F47,0),1)","v":"Erich"},{"$f":"E1","v":"Frank"},null,{"$f":"SUM(D34)","v":0},null,null,null,null,{"$f":"INDEX(K50:L52,MATCH(MEDIAN(M50:M52),M50:M52,0),1)","v":"Frank"}]
[null,null,null,{"$f":"K1","v":"Siggi"},null,{"$f":"SUM(K34)","v":0},null,null,null,null,{"$f":"L1","v":"Vincent"},null,{"$f":"SUM(K34)","v":0}]
[null,null,null,{"$f":"R1","v":"Anja"},null,{"$f":"SUM(S34)","v":0},null,null,null,null,{"$f":"S1","v":"Ralfie"},null,{"$f":"SUM(S34)","v":0}]
[null,null,null,"MAX(B2:B7",null,{"$f":"MAX(F50:F52)","v":0},null,null,null,null,"MAX(B2:B7",null,{"$f":"MAX(M50:M52)","v":0}]
[]
[null,null,null,{"$f":"D1","v":"Erich"},null,{"$f":"D34","v":0},null,null,null,{"$f":"INDEX(D55:E57,MATCH(MIN(F55:F57),F55:F57,0),1)","v":"Erich"},{"$f":"E1","v":"Frank"},null,{"$f":"SUM(D34)","v":0},null,null,null,null,{"$f":"INDEX(K55:L57,MATCH(MIN(M55:M57),M55:M57,0),1)","v":"Frank"}]
[null,null,null,{"$f":"K1","v":"Siggi"},null,{"$f":"SUM(K34)","v":0},null,null,null,null,{"$f":"L1","v":"Vincent"},null,{"$f":"SUM(K34)","v":0}]
[null,null,null,{"$f":"R1","v":"Anja"},null,{"$f":"SUM(S34)","v":0},null,null,null,null,{"$f":"S1","v":"Ralfie"},null,{"$f":"SUM(S34)","v":0}]
[null,null,null,null,null,null,{"$f":"SUM(F57)","v":0},null,null,null,null,null,null,{"$f":"SUM(M57)","v":0}]
[]
[]
[]
[null,null,null,null,null,null,null,null,null,{"$f":"SUM(F50:G52)/3","v":0}]

{"sheet":"Rd8","index":7,"n_rows":62,"n_cols":25,"rows_kept":62,"cut":false,"hidden":false,"merged":[[26,18,30,19],[31,4,32,5],[31,11,32,12],[31,18,32,19],[43,3,43,4],[43,5,43,6],[26,11,30,12],[26,4,30,5],[21,18,25,19],[7,4,7,5],[7,11,7,12],[7,18,7,19],[8,4,9,5],[8,11,9,12],[8,18,9,19],[10,4,12,5],[10,11,12,12],[10,18,12,19],[13,4,17,5],[13,11,17,12],[13,18,17,19],[21,4,25,5],[21,11,25,12],[56,3,56,4],[56,10,56,11],[50,3,50,4],[50,5,50,6],[50,10,50,11],[51,3,51,4],[51,5,51,6],[51,10,51,11],[54,3,54,4],[54,10,54,11],[55,3,55,4],[55,10,55,11],[46,3,46,4],[46,5,46,6],[44,5,44,6],[44,3,44,4],[45,3,45,4],[47,12,47,13],[48,3,48,4],[48,5,48,6],[49,3,49,4],[49,5,49,6],[49,10,49,11],[47,5,47,6]]}
[null,null,null,{"$f":"'Rd7'!R55","v":"Frank"},{"$f":"'Rd7'!J55","v":"Erich"},"Sp. 1",null,null,null,null,{"$f":"'Rd7'!R50","v":"Frank"},{"$f":"'Rd7'!J50","v":"Erich"},"Sp. 2",null,null,null,null,{"$f":"'Rd7'!R45","v":"Frank"},{"$f":"'Rd7'!J45","v":"Erich"},"Sp. 3",null,{"$f":"J45","v":"Frank"},{"$f":"R45","v":"Erich"}]
[null,null,null,"Punkte",501,"Start",null,null,null,null,"Punkte",501,"Start",null,null,null,null,"Punkte",501,"Start",null,{"$f":"J50","v":"Frank"},{"$f":"R50","v":"Erich"}]
[null,null,null,"Geworfen",{"$f":"SUM(D34)","v":0},"Punkte",null,null,null,null,"Geworfen",{"$f":"SUM(K34)","v":0},"Punkte",null,null,null,null,"Geworfen",{"$f":"SUM(R34)","v":0},"Punkte",null,{"$f":"J55","v":"Frank"},{"$f":"R55","v":"Erich"}]
["RD 1",{"$f":"COUNT(D4)*1","v":0},{"$f":"COUNT(D4)*3","v":0},null,{"$f":"SUM(E2-E3)","v":501},"Rest",null,"RD 1",{"$f":"COUNT(K4)*1","v":0},{"$f":"COUNT(K4)*3","v":0},null,{"$f":"SUM(L2-L3)","v":501},"Rest",null,"RD 1",{"$f":"COUNT(R4)*1","v":0},{"$f":"COUNT(R4)*3","v":0},null,{"$f":"SUM(S2-S3)","v":501},"Rest"]
["RD 2",{"$f":"COUNT(D5)*1","v":0},{"$f":"COUNT(D5)*3","v":0},null,null,null,null,"RD 2",0,0,null,null,null,null,"RD 2",0,0]
["RD 3",0,0,null,"ø pro Spiel",{"$f":"SUM(E3)/B34","v":{"$error":"#DIV/0!"}},null,"RD 3",0,0,null,"ø pro Spiel",{"$f":"SUM(L3)/I34","v":{"$error":"#DIV/0!"}},null,"RD 3",0,0,null,"ø pro Spiel",{"$f":"SUM(S3)/P34","v":{"$error":"#DIV/0!"}}]
["RD 4",0,0,null,"ø pro Pfeil",{"$f":"SUM(E3)/C34","v":{"$error":"#DIV/0!"}},null,"RD 4",0,0,null,"ø pro Pfeil",{"$f":"SUM(L3)/J34","v":{"$error":"#DIV/0!"}},null,"RD 4",0,0,null,"ø pro Pfeil",{"$f":"SUM(S3)/Q34","v":{"$error":"#DIV/0!"}}]
["RD 5",0,0,null,"Average",null,null,"RD 5",0,0,null,"Average",null,null,"RD 5",0,0,null,"Average"]
["RD 6",0,0,null,{"$f":"SUM(F6)","v":{"$error":"#DIV/0!"}},null,null,"RD 6",0,0,null,{"$f":"SUM(M6)","v":{"$error":"#DIV/0!"}},null,null,"RD 6",0,0,null,{"$f":"SUM(T6)","v":{"$error":"#DIV/0!"}}]
["RD 7",0,0,null,null,null,null,"RD 7",0,0,null,null,null,null,"RD 7",0,0]
["RD 8",0,0,null,"Nicht Gut",null,null,"RD 8",0,0,null,"Nicht Gut",null,null,"RD 8",0,0,null,"Nicht Gut"]
["RD 9",0,0,null,null,null,null,"RD 9",0,0,null,null,null,null,"RD 9",0,0]
["RD 10",0,0,null,null,null,null,"RD 10",0,0,null,null,null,null,"RD 10",0,0]
["RD 11",0,0,null,"Gut",null,null,"RD 11",0,0,null,"Gut",null,null,"RD 11",0,0,null,"Gut"]
["RD 12",0,0,null,null,null,null,"RD 12",0,0,null,null,null,null,"RD 12",0,0]
["RD 13",0,0,null,null,null,null,"RD 13",0,0,null,null,null,null,"RD 13",0,0]
["RD 14",0,0,null,null,null,null,"RD 14",0,0,null,null,null,null,"RD 14",0,0,null,null,null,null,null,null,null,"Ralf Kl."]
["RD 15",0,0,null,null,null,null,"RD 15",0,0,null,null,null,null,"RD 15",0,0,null,null,null,null,null,null,null,"Volker"]
["RD 16",0,0,null,{"$f":"D1","v":"Frank"},{"$f":"E1","v":"Erich"},null,"RD 16",0,0,null,{"$f":"K1","v":"Frank"},{"$f":"L1","v":"Erich"},null,"RD 16",0,0,null,{"$f":"R1","v":"Frank"},{"$f":"S1","v":"Erich"},null,null,null,null,"Rene"]
["RD 17",0,0,null,{"$f":"SUM(D4,D6,D8,D10,D12,D14,D16,D18,D20,D22,D24,D26,D28,D30,D32)","v":0},{"$f":"SUM(D5,D7,D9,D11,D13,D15,D17,D19,D21,D23,D25,D27,D29,D31,D33)","v":0},null,"RD 17",0,0,null,{"$f":"SUM(K4,K6,K8,K10,K12,K14,K16,K18,K20,K22,K24,K26,K28,K30,K32)","v":0},{"$f":"SUM(K5,K7,K9,K11,K13,K15,K17,K19,K21,K23,K25,K27,K29,K31,K33)","v":0},null,"RD 17",0,0,null,{"$f":"SUM(R4,R6,R8,R10,R12,R14,R16,R18,R20,R22,R24,R26,R28,R30,R32)","v":0},{"$f":"SUM(R5,R7,R9,R11,R13,R15,R17,R19,R21,R23,R25,R27,R29,R31,R33)","v":0},null,null,null,null,"Nicole"]
["RD 18",0,0,null,"Rest:",{"$f":"E4","v":501},null,"RD 18",0,0,null,"Rest:",{"$f":"L4","v":501},null,"RD 18",0,0,null,"Rest:",{"$f":"S4","v":501},null,"Micha",null,null,"Frank"]
["RD 19",0,0,null,"Sehr  Gut",null,null,"RD 19",0,0,null,"Sehr  Gut",null,null,"RD 19",0,0,null,"Sehr  Gut",null,null,null,null,null,"Rosi"]
["RD 20",0,0,null,null,null,null,"RD 20",0,0,null,null,null,null,"RD 20",0,0,null,null,null,null,null,null,null,"Werner"]
["RD 21",0,0,null,null,null,null,"RD 21",0,0,null,null,null,null,"RD 21",0,0,null,null,null,null,"Stefan",null,null,"Gast"]
["RD 22",0,0,null,null,null,null,"RD 22",0,0,null,null,null,null,"RD 22",0,0,null,null,null,null,null,null,null,"Stefan"]
["RD 23",0,0,null,null,null,null,"RD 23",0,0,null,null,null,null,"RD 23",0,0,null,null,null,null,null,null,null,"Micha"]
["RD 24",0,0,null,null,null,null,"RD 24",0,0,null,null,null,null,"RD 24",0,0,null,null,null,null,null,null,null,"Joker"]
["RD 25",0,0,null,null,null,null,"RD 25",0,0,null,null,null,null,"RD 25",0,0,null,null,null,null,null,null,null,"Anja"]
["RD 26",0,0,null,null,null,null,"RD 26",0,0,null,null,null,null,"RD 26",0,0,null,null,null,null,null,null,null,"Vincent"]
["RD 27",0,0,null,null,null,null,"RD 27",0,0,null,null,null,null,"RD 27",0,0,null,null,null,null,null,null,null,"Erich"]
["RD 28",0,0,null,null,null,null,"RD 28",0,0,null,null,null,null,"RD 28",0,0,null,null,null,null,null,null,null,"Siggi"]
["RD 29",0,0,null,{"$f":"IF(E4=0,\"Sieg\",\"\")","v":""},null,null,"RD 29",0,0,null,{"$f":"IF(L4=0,\"Sieg\",\"\")","v":""},null,null,"RD 29",0,0,null,{"$f":"IF(S4=0,\"Sieg\",\"\")","v":""},null,null,null,null,null,"Ralf M."]
["RD 30",0,0,null,null,null,null,"RD 30",0,0,null,null,null,null,"RD 30",0,0,null,null,null,null,null,null,null,"Dirk B."]
[null,{"$f":"SUM(B4:B33)","v":0},{"$f":"SUM(C4:C33)","v":0},{"$f":"SUM(D4:D33)","v":0},{"$f":"SUM(D5:D32)","v":0},null,null,null,{"$f":"SUM(I4:I33)","v":0},{"$f":"SUM(J4:J33)","v":0},{"$f":"SUM(K4:K33)","v":0},{"$f":"SUM(K4:K32)","v":0},null,null,null,{"$f":"SUM(P4:P33)","v":0},{"$f":"SUM(Q4:Q33)","v":0},{"$f":"SUM(R4:R33)","v":0},{"$f":"SUM(R4:R32)","v":0}]
[]
[]
[]
[]
[]
[]
[]
[]
[]
[]
[null,null,null,{"$f":"D1","v":"Frank"},null,{"$f":"D34","v":0},null,null,null,{"$f":"INDEX(D45:E47,MATCH(MAX(F45:F47),F45:F47,0),1)","v":"Frank"},{"$f":"E1","v":"Erich"},null,{"$f":"SUM(D34)","v":0},null,null,null,null,{"$f":"INDEX(K45:L47,MATCH(MAX(M45:M47),M45:M47,0),1)","v":"Erich"}]
[null,null,null,{"$f":"K1","v":"Frank"},null,{"$f":"SUM(K34)","v":0},null,null,null,null,{"$f":"L1","v":"Erich"},null,{"$f":"SUM(K34)","v":0}]
[null,null,null,{"$f":"R1","v":"Frank"},null,{"$f":"SUM(S34)","v":0},null,null,null,null,{"$f":"S1","v":"Erich"},null,{"$f":"SUM(S3)","v":0}]
[null,null,null,"MAX(B2:B7",null,null,null,null,null,null,"MAX(B2:B7"]
[]
[null,null,null,{"$f":"D1","v":"Frank"},null,{"$f":"D34","v":0},null,null,null,{"$f":"INDEX(D45:E47,MATCH(MEDIAN(F45:F47),F45:F47,0),1)","v":"Frank"},{"$f":"E1","v":"Erich"},null,{"$f":"SUM(D34)","v":0},null,null,null,null,{"$f":"INDEX(K50:L52,MATCH(MEDIAN(M50:M52),M50:M52,0),1)","v":"Erich"}]
[null,null,null,{"$f":"K1","v":"Frank"},null,{"$f":"SUM(K34)","v":0},null,null,null,null,{"$f":"L1","v":"Erich"},null,{"$f":"SUM(K34)","v":0}]
[null,null,null,{"$f":"R1","v":"Frank"},null,{"$f":"SUM(S34)","v":0},null,null,null,null,{"$f":"S1","v":"Erich"},null,{"$f":"SUM(S34)","v":0}]
[null,null,null,"MAX(B2:B7",null,{"$f":"MAX(F50:F52)","v":0},null,null,null,null,"MAX(B2:B7",null,{"$f":"MAX(M50:M52)","v":0}]
[]
[null,null,null,{"$f":"D1","v":"Frank"},null,{"$f":"D34","v":0},null,null,null,{"$f":"INDEX(D55:E57,MATCH(MIN(F55:F57),F55:F57,0),1)","v":"Frank"},{"$f":"E1","v":"Erich"},null,{"$f":"SUM(D34)","v":0},null,null,null,null,{"$f":"INDEX(K55:L57,MATCH(MIN(M55:M57),M55:M57,0),1)","v":"Erich"}]
[null,null,null,{"$f":"K1","v":"Frank"},null,{"$f":"SUM(K34)","v":0},null,null,null,null,{"$f":"L1","v":"Erich"},null,{"$f":"SUM(K34)","v":0}]
[null,null,null,{"$f":"R1","v":"Frank"},null,{"$f":"SUM(S34)","v":0},null,null,null,null,{"$f":"S1","v":"Erich"},null,{"$f":"SUM(S34)","v":0}]
[null,null,null,null,null,null,{"$f":"SUM(F57)","v":0},null,null,null,null,null,null,{"$f":"SUM(M57)","v":0}]
[]
[]
[]
[null,null,null,null,null,null,null,null,null,{"$f":"SUM(F50:G52)/3","v":0}]

{"sheet":"Rd9","index":8,"n_rows":62,"n_cols":25,"rows_kept":62,"cut":false,"hidden":false,"merged":[[26,18,30,19],[31,4,32,5],[31,11,32,12],[31,18,32,19],[43,3,43,4],[43,5,43,6],[26,11,30,12],[26,4,30,5],[21,18,25,19],[7,4,7,5],[7,11,7,12],[7,18,7,19],[8,4,9,5],[8,11,9,12],[8,18,9,19],[10,4,12,5],[10,11,12,12],[10,18,12,19],[13,4,17,5],[13,11,17,12],[13,18,17,19],[21,4,25,5],[21,11,25,12],[56,3,56,4],[56,10,56,11],[50,3,50,4],[50,5,50,6],[50,10,50,11],[51,3,51,4],[51,5,51,6],[51,10,51,11],[54,3,54,4],[54,10,54,11],[55,3,55,4],[55,10,55,11],[46,3,46,4],[46,5,46,6],[44,5,44,6],[44,3,44,4],[45,3,45,4],[47,12,47,13],[48,3,48,4],[48,5,48,6],[49,3,49,4],[49,5,49,6],[49,10,49,11],[47,5,47,6]]}
[null,null,null,{"$f":"Tabelle2!G23","v":"Frank"},{"$f":"Tabelle2!H23","v":"Vincent"},"Sp. 1",null,null,null,null,{"$f":"Tabelle2!G24","v":"Erich"},{"$f":"Tabelle2!H24","v":"Ralfie"},"Sp. 2",null,null,null,null,{"$f":"Tabelle2!G25","v":"Anja"},{"$f":"Tabelle2!H25","v":"Siggi"},"Sp. 3",null,{"$f":"J45","v":"Frank"},{"$f":"R45","v":"Vincent"}]
[null,null,null,"Punkte",501,"Start",null,null,null,null,"Punkte",501,"Start",null,null,null,null,"Punkte",501,"Start",null,{"$f":"J50","v":"Frank"},{"$f":"R50","v":"Vincent"}]
[null,null,null,"Geworfen",{"$f":"SUM(D34)","v":0},"Punkte",null,null,null,null,"Geworfen",{"$f":"SUM(K34)","v":0},"Punkte",null,null,null,null,"Geworfen",{"$f":"SUM(R34)","v":0},"Punkte",null,{"$f":"J55","v":"Frank"},{"$f":"R55","v":"Vincent"}]
["RD 1",{"$f":"COUNT(D4)*1","v":0},{"$f":"COUNT(D4)*3","v":0},null,{"$f":"SUM(E2-E3)","v":501},"Rest",null,"RD 1",{"$f":"COUNT(K4)*1","v":0},{"$f":"COUNT(K4)*3","v":0},null,{"$f":"SUM(L2-L3)","v":501},"Rest",null,"RD 1",{"$f":"COUNT(R4)*1","v":0},{"$f":"COUNT(R4)*3","v":0},null,{"$f":"SUM(S2-S3)","v":501},"Rest"]
["RD 2",{"$f":"COUNT(D5)*1","v":0},{"$f":"COUNT(D5)*3","v":0},null,null,null,null,"RD 2",0,0,null,null,null,null,"RD 2",0,0]
["RD 3",0,0,null,"ø pro Spiel",{"$f":"SUM(E3)/B34","v":{"$error":"#DIV/0!"}},null,"RD 3",0,0,null,"ø pro Spiel",{"$f":"SUM(L3)/I34","v":{"$error":"#DIV/0!"}},null,"RD 3",0,0,null,"ø pro Spiel",{"$f":"SUM(S3)/P34","v":{"$error":"#DIV/0!"}}]
["RD 4",0,0,null,"ø pro Pfeil",{"$f":"SUM(E3)/C34","v":{"$error":"#DIV/0!"}},null,"RD 4",0,0,null,"ø pro Pfeil",{"$f":"SUM(L3)/J34","v":{"$error":"#DIV/0!"}},null,"RD 4",0,0,null,"ø pro Pfeil",{"$f":"SUM(S3)/Q34","v":{"$error":"#DIV/0!"}}]
["RD 5",0,0,null,"Average",null,null,"RD 5",0,0,null,"Average",null,null,"RD 5",0,0,null,"Average"]
["RD 6",0,0,null,{"$f":"SUM(F6)","v":{"$error":"#DIV/0!"}},null,null,"RD 6",0,0,null,{"$f":"SUM(M6)","v":{"$error":"#DIV/0!"}},null,null,"RD 6",0,0,null,{"$f":"SUM(T6)","v":{"$error":"#DIV/0!"}}]
["RD 7",0,0,null,null,null,null,"RD 7",0,0,null,null,null,null,"RD 7",0,0]
["RD 8",0,0,null,"Nicht Gut",null,null,"RD 8",0,0,null,"Nicht Gut",null,null,"RD 8",0,0,null,"Nicht Gut"]
["RD 9",0,0,null,null,null,null,"RD 9",0,0,null,null,null,null,"RD 9",0,0]
["RD 10",0,0,null,null,null,null,"RD 10",0,0,null,null,null,null,"RD 10",0,0]
["RD 11",0,0,null,"Gut",null,null,"RD 11",0,0,null,"Gut",null,null,"RD 11",0,0,null,"Gut"]
["RD 12",0,0,null,null,null,null,"RD 12",0,0,null,null,null,null,"RD 12",0,0]
["RD 13",0,0,null,null,null,null,"RD 13",0,0,null,null,null,null,"RD 13",0,0]
["RD 14",0,0,null,null,null,null,"RD 14",0,0,null,null,null,null,"RD 14",0,0,null,null,null,null,null,null,null,"Ralf Kl."]
["RD 15",0,0,null,null,null,null,"RD 15",0,0,null,null,null,null,"RD 15",0,0,null,null,null,null,null,null,null,"Volker"]
["RD 16",0,0,null,{"$f":"D1","v":"Frank"},{"$f":"E1","v":"Vincent"},null,"RD 16",0,0,null,{"$f":"K1","v":"Erich"},{"$f":"L1","v":"Ralfie"},null,"RD 16",0,0,null,{"$f":"R1","v":"Anja"},{"$f":"S1","v":"Siggi"},null,null,null,null,"Rene"]
["RD 17",0,0,null,{"$f":"SUM(D4,D6,D8,D10,D12,D14,D16,D18,D20,D22,D24,D26,D28,D30,D32)","v":0},{"$f":"SUM(D5,D7,D9,D11,D13,D15,D17,D19,D21,D23,D25,D27,D29,D31,D33)","v":0},null,"RD 17",0,0,null,{"$f":"SUM(K4,K6,K8,K10,K12,K14,K16,K18,K20,K22,K24,K26,K28,K30,K32)","v":0},{"$f":"SUM(K5,K7,K9,K11,K13,K15,K17,K19,K21,K23,K25,K27,K29,K31,K33)","v":0},null,"RD 17",0,0,null,{"$f":"SUM(R4,R6,R8,R10,R12,R14,R16,R18,R20,R22,R24,R26,R28,R30,R32)","v":0},{"$f":"SUM(R5,R7,R9,R11,R13,R15,R17,R19,R21,R23,R25,R27,R29,R31,R33)","v":0},null,null,null,null,"Nicole"]
["RD 18",0,0,null,"Rest:",{"$f":"E4","v":501},null,"RD 18",0,0,null,"Rest:",{"$f":"L4","v":501},null,"RD 18",0,0,null,"Rest:",{"$f":"S4","v":501},null,"Micha",null,null,"Frank"]
["RD 19",0,0,null,"Sehr  Gut",null,null,"RD 19",0,0,null,"Sehr  Gut",null,null,"RD 19",0,0,null,"Sehr  Gut",null,null,null,null,null,"Rosi"]
["RD 20",0,0,null,null,null,null,"RD 20",0,0,null,null,null,null,"RD 20",0,0,null,null,null,null,null,null,null,"Werner"]
["RD 21",0,0,null,null,null,null,"RD 21",0,0,null,null,null,null,"RD 21",0,0,null,null,null,null,"Stefan",null,null,"Gast"]
["RD 22",0,0,null,null,null,null,"RD 22",0,0,null,null,null,null,"RD 22",0,0,null,null,null,null,null,null,null,"Stefan"]
["RD 23",0,0,null,null,null,null,"RD 23",0,0,null,null,null,null,"RD 23",0,0,null,null,null,null,null,null,null,"Micha"]
["RD 24",0,0,null,null,null,null,"RD 24",0,0,null,null,null,null,"RD 24",0,0,null,null,null,null,null,null,null,"Joker"]
["RD 25",0,0,null,null,null,null,"RD 25",0,0,null,null,null,null,"RD 25",0,0,null,null,null,null,null,null,null,"Anja"]
["RD 26",0,0,null,null,null,null,"RD 26",0,0,null,null,null,null,"RD 26",0,0,null,null,null,null,null,null,null,"Vincent"]
["RD 27",0,0,null,null,null,null,"RD 27",0,0,null,null,null,null,"RD 27",0,0,null,null,null,null,null,null,null,"Erich"]
["RD 28",0,0,null,null,null,null,"RD 28",0,0,null,null,null,null,"RD 28",0,0,null,null,null,null,null,null,null,"Siggi"]
["RD 29",0,0,null,{"$f":"IF(E4=0,\"Sieg\",\"\")","v":""},null,null,"RD 29",0,0,null,{"$f":"IF(L4=0,\"Sieg\",\"\")","v":""},null,null,"RD 29",0,0,null,{"$f":"IF(S4=0,\"Sieg\",\"\")","v":""},null,null,null,null,null,"Ralf M."]
["RD 30",0,0,null,null,null,null,"RD 30",0,0,null,null,null,null,"RD 30",0,0,null,null,null,null,null,null,null,"Dirk B."]
[null,{"$f":"SUM(B4:B33)","v":0},{"$f":"SUM(C4:C33)","v":0},{"$f":"SUM(D4:D33)","v":0},{"$f":"SUM(D5:D32)","v":0},null,null,null,{"$f":"SUM(I4:I33)","v":0},{"$f":"SUM(J4:J33)","v":0},{"$f":"SUM(K4:K33)","v":0},{"$f":"SUM(K4:K32)","v":0},null,null,null,{"$f":"SUM(P4:P33)","v":0},{"$f":"SUM(Q4:Q33)","v":0},{"$f":"SUM(R4:R33)","v":0},{"$f":"SUM(R4:R32)","v":0}]
[]
[]
[]
[]
[]
[]
[]
[]
[]
[]
[null,null,null,{"$f":"D1","v":"Frank"},null,{"$f":"D34","v":0},null,null,null,{"$f":"INDEX(D45:E47,MATCH(MAX(F45:F47),F45:F47,0),1)","v":"Frank"},{"$f":"E1","v":"Vincent"},null,{"$f":"SUM(D34)","v":0},null,null,null,null,{"$f":"INDEX(K45:L47,MATCH(MAX(M45:M47),M45:M47,0),1)","v":"Vincent"}]
[null,null,null,{"$f":"K1","v":"Erich"},null,{"$f":"SUM(K34)","v":0},null,null,null,null,{"$f":"L1","v":"Ralfie"},null,{"$f":"SUM(K34)","v":0}]
[null,null,null,{"$f":"R1","v":"Anja"},null,{"$f":"SUM(S34)","v":0},null,null,null,null,{"$f":"S1","v":"Siggi"},null,{"$f":"SUM(S3)","v":0}]
[null,null,null,"MAX(B2:B7",null,null,null,null,null,null,"MAX(B2:B7"]
[]
[null,null,null,{"$f":"D1","v":"Frank"},null,{"$f":"D34","v":0},null,null,null,{"$f":"INDEX(D45:E47,MATCH(MEDIAN(F45:F47),F45:F47,0),1)","v":"Frank"},{"$f":"E1","v":"Vincent"},null,{"$f":"SUM(D34)","v":0},null,null,null,null,{"$f":"INDEX(K50:L52,MATCH(MEDIAN(M50:M52),M50:M52,0),1)","v":"Vincent"}]
[null,null,null,{"$f":"K1","v":"Erich"},null,{"$f":"SUM(K34)","v":0},null,null,null,null,{"$f":"L1","v":"Ralfie"},null,{"$f":"SUM(K34)","v":0}]
[null,null,null,{"$f":"R1","v":"Anja"},null,{"$f":"SUM(S34)","v":0},null,null,null,null,{"$f":"S1","v":"Siggi"},null,{"$f":"SUM(S34)","v":0}]
[null,null,null,"MAX(B2:B7",null,{"$f":"MAX(F50:F52)","v":0},null,null,null,null,"MAX(B2:B7",null,{"$f":"MAX(M50:M52)","v":0}]
[]
[null,null,null,{"$f":"D1","v":"Frank"},null,{"$f":"D34","v":0},null,null,null,{"$f":"INDEX(D55:E57,MATCH(MIN(F55:F57),F55:F57,0),1)","v":"Frank"},{"$f":"E1","v":"Vincent"},null,{"$f":"SUM(D34)","v":0},null,null,null,null,{"$f":"INDEX(K55:L57,MATCH(MIN(M55:M57),M55:M57,0),1)","v":"Vincent"}]
[null,null,null,{"$f":"K1","v":"Erich"},null,{"$f":"SUM(K34)","v":0},null,null,null,null,{"$f":"L1","v":"Ralfie"},null,{"$f":"SUM(K34)","v":0}]
[null,null,null,{"$f":"R1","v":"Anja"},null,{"$f":"SUM(S34)","v":0},null,null,null,null,{"$f":"S1","v":"Siggi"},null,{"$f":"SUM(S34)","v":0}]
[null,null,null,null,null,null,{"$f":"SUM(F57)","v":0},null,null,null,null,null,null,{"$f":"SUM(M57)","v":0}]
[]
[]
[]
[null,null,null,null,null,null,null,null,null,{"$f":"SUM(F50:G52)/3","v":0}]

{"sheet":"Rd10","index":9,"n_rows":62,"n_cols":25,"rows_kept":62,"cut":false,"hidden":false,"merged":[[26,18,30,19],[31,4,32,5],[31,11,32,12],[31,18,32,19],[43,3,43,4],[43,5,43,6],[26,11,30,12],[26,4,30,5],[21,18,25,19],[7,4,7,5],[7,11,7,12],[7,18,7,19],[8,4,9,5],[8,11,9,12],[8,18,9,19],[10,4,12,5],[10,11,12,12],[10,18,12,19],[13,4,17,5],[13,11,17,12],[13,18,17,19],[21,4,25,5],[21,11,25,12],[56,3,56,4],[56,10,56,11],[50,3,50,4],[50,5,50,6],[50,10,50,11],[51,3,51,4],[51,5,51,6],[51,10,51,11],[54,3,54,4],[54,10,54,11],[55,3,55,4],[55,10,55,11],[46,3,46,4],[46,5,46,6],[44,5,44,6],[44,3,44,4],[45,3,45,4],[47,12,47,13],[48,3,48,4],[48,5,48,6],[49,3,49,4],[49,5,49,6],[49,10,49,11],[47,5,47,6]]}
[null,null,null,{"$f":"'Rd9'!R55","v":"Vincent"},{"$f":"'Rd9'!J55","v":"Frank"},"Sp. 1",null,null,null,null,{"$f":"'Rd9'!R50","v":"Vincent"},{"$f":"'Rd9'!J50","v":"Frank"},"Sp. 2",null,null,null,null,{"$f":"'Rd9'!R45","v":"Vincent"},{"$f":"'Rd9'!J45","v":"Frank"},"Sp. 3",null,{"$f":"J45","v":"Vincent"},{"$f":"R45","v":"Frank"}]
[null,null,null,"Punkte",501,"Start",null,null,null,null,"Punkte",501,"Start",null,null,null,null,"Punkte",501,"Start",null,{"$f":"J50","v":"Vincent"},{"$f":"R50","v":"Frank"}]
[null,null,null,"Geworfen",{"$f":"SUM(D34)","v":0},"Punkte",null,null,null,null,"Geworfen",{"$f":"SUM(K34)","v":0},"Punkte",null,null,null,null,"Geworfen",{"$f":"SUM(R34)","v":0},"Punkte",null,{"$f":"J55","v":"Vincent"},{"$f":"R55","v":"Frank"}]
["RD 1",{"$f":"COUNT(D4)*1","v":0},{"$f":"COUNT(D4)*3","v":0},null,{"$f":"SUM(E2-E3)","v":501},"Rest",null,"RD 1",{"$f":"COUNT(K4)*1","v":0},{"$f":"COUNT(K4)*3","v":0},null,{"$f":"SUM(L2-L3)","v":501},"Rest",null,"RD 1",{"$f":"COUNT(R4)*1","v":0},{"$f":"COUNT(R4)*3","v":0},null,{"$f":"SUM(S2-S3)","v":501},"Rest"]
["RD 2",{"$f":"COUNT(D5)*1","v":0},{"$f":"COUNT(D5)*3","v":0},null,null,null,null,"RD 2",0,0,null,null,null,null,"RD 2",0,0]
["RD 3",0,0,null,"ø pro Spiel",{"$f":"SUM(E3)/B34","v":{"$error":"#DIV/0!"}},null,"RD 3",0,0,null,"ø pro Spiel",{"$f":"SUM(L3)/I34","v":{"$error":"#DIV/0!"}},null,"RD 3",0,0,null,"ø pro Spiel",{"$f":"SUM(S3)/P34","v":{"$error":"#DIV/0!"}}]
["RD 4",0,0,null,"ø pro Pfeil",{"$f":"SUM(E3)/C34","v":{"$error":"#DIV/0!"}},null,"RD 4",0,0,null,"ø pro Pfeil",{"$f":"SUM(L3)/J34","v":{"$error":"#DIV/0!"}},null,"RD 4",0,0,null,"ø pro Pfeil",{"$f":"SUM(S3)/Q34","v":{"$error":"#DIV/0!"}}]
["RD 5",0,0,null,"Average",null,null,"RD 5",0,0,null,"Average",null,null,"RD 5",0,0,null,"Average"]
["RD 6",0,0,null,{"$f":"SUM(F6)","v":{"$error":"#DIV/0!"}},null,null,"RD 6",0,0,null,{"$f":"SUM(M6)","v":{"$error":"#DIV/0!"}},null,null,"RD 6",0,0,null,{"$f":"SUM(T6)","v":{"$error":"#DIV/0!"}}]
["RD 7",0,0,null,null,null,null,"RD 7",0,0,null,null,null,null,"RD 7",0,0]
["RD 8",0,0,null,"Nicht Gut",null,null,"RD 8",0,0,null,"Nicht Gut",null,null,"RD 8",0,0,null,"Nicht Gut"]
["RD 9",0,0,null,null,null,null,"RD 9",0,0,null,null,null,null,"RD 9",0,0]
["RD 10",0,0,null,null,null,null,"RD 10",0,0,null,null,null,null,"RD 10",0,0]
["RD 11",0,0,null,"Gut",null,null,"RD 11",0,0,null,"Gut",null,null,"RD 11",0,0,null,"Gut"]
["RD 12",0,0,null,null,null,null,"RD 12",0,0,null,null,null,null,"RD 12",0,0]
["RD 13",0,0,null,null,null,null,"RD 13",0,0,null,null,null,null,"RD 13",0,0]
["RD 14",0,0,null,null,null,null,"RD 14",0,0,null,null,null,null,"RD 14",0,0,null,null,null,null,null,null,null,"Ralf Kl."]
["RD 15",0,0,null,null,null,null,"RD 15",0,0,null,null,null,null,"RD 15",0,0,null,null,null,null,null,null,null,"Volker"]
["RD 16",0,0,null,{"$f":"D1","v":"Vincent"},{"$f":"E1","v":"Frank"},null,"RD 16",0,0,null,{"$f":"K1","v":"Vincent"},{"$f":"L1","v":"Frank"},null,"RD 16",0,0,null,{"$f":"R1","v":"Vincent"},{"$f":"S1","v":"Frank"},null,null,null,null,"Rene"]
["RD 17",0,0,null,{"$f":"SUM(D4,D6,D8,D10,D12,D14,D16,D18,D20,D22,D24,D26,D28,D30,D32)","v":0},{"$f":"SUM(D5,D7,D9,D11,D13,D15,D17,D19,D21,D23,D25,D27,D29,D31,D33)","v":0},null,"RD 17",0,0,null,{"$f":"SUM(K4,K6,K8,K10,K12,K14,K16,K18,K20,K22,K24,K26,K28,K30,K32)","v":0},{"$f":"SUM(K5,K7,K9,K11,K13,K15,K17,K19,K21,K23,K25,K27,K29,K31,K33)","v":0},null,"RD 17",0,0,null,{"$f":"SUM(R4,R6,R8,R10,R12,R14,R16,R18,R20,R22,R24,R26,R28,R30,R32)","v":0},{"$f":"SUM(R5,R7,R9,R11,R13,R15,R17,R19,R21,R23,R25,R27,R29,R31,R33)","v":0},null,null,null,null,"Nicole"]
["RD 18",0,0,null,"Rest:",{"$f":"E4","v":501},null,"RD 18",0,0,null,"Rest:",{"$f":"L4","v":501},null,"RD 18",0,0,null,"Rest:",{"$f":"S4","v":501},null,"Micha",null,null,"Frank"]
["RD 19",0,0,null,"Sehr  Gut",null,null,"RD 19",0,0,null,"Sehr  Gut",null,null,"RD 19",0,0,null,"Sehr  Gut",null,null,null,null,null,"Rosi"]
["RD 20",0,0,null,null,null,null,"RD 20",0,0,null,null,null,null,"RD 20",0,0,null,null,null,null,null,null,null,"Werner"]
["RD 21",0,0,null,null,null,null,"RD 21",0,0,null,null,null,null,"RD 21",0,0,null,null,null,null,"Stefan",null,null,"Gast"]
["RD 22",0,0,null,null,null,null,"RD 22",0,0,null,null,null,null,"RD 22",0,0,null,null,null,null,null,null,null,"Stefan"]
["RD 23",0,0,null,null,null,null,"RD 23",0,0,null,null,null,null,"RD 23",0,0,null,null,null,null,null,null,null,"Micha"]
["RD 24",0,0,null,null,null,null,"RD 24",0,0,null,null,null,null,"RD 24",0,0,null,null,null,null,null,null,null,"Joker"]
["RD 25",0,0,null,null,null,null,"RD 25",0,0,null,null,null,null,"RD 25",0,0,null,null,null,null,null,null,null,"Anja"]
["RD 26",0,0,null,null,null,null,"RD 26",0,0,null,null,null,null,"RD 26",0,0,null,null,null,null,null,null,null,"Vincent"]
["RD 27",0,0,null,null,null,null,"RD 27",0,0,null,null,null,null,"RD 27",0,0,null,null,null,null,null,null,null,"Erich"]
["RD 28",0,0,null,null,null,null,"RD 28",0,0,null,null,null,null,"RD 28",0,0,null,null,null,null,null,null,null,"Siggi"]
["RD 29",0,0,null,{"$f":"IF(E4=0,\"Sieg\",\"\")","v":""},null,null,"RD 29",0,0,null,{"$f":"IF(L4=0,\"Sieg\",\"\")","v":""},null,null,"RD 29",0,0,null,{"$f":"IF(S4=0,\"Sieg\",\"\")","v":""},null,null,null,null,null,"Ralf M."]
["RD 30",0,0,null,null,null,null,"RD 30",0,0,null,null,null,null,"RD 30",0,0,null,null,null,null,null,null,null,"Dirk B."]
[null,{"$f":"SUM(B4:B33)","v":0},{"$f":"SUM(C4:C33)","v":0},{"$f":"SUM(D4:D33)","v":0},{"$f":"SUM(D5:D32)","v":0},null,null,null,{"$f":"SUM(I4:I33)","v":0},{"$f":"SUM(J4:J33)","v":0},{"$f":"SUM(K4:K33)","v":0},{"$f":"SUM(K4:K32)","v":0},null,null,null,{"$f":"SUM(P4:P33)","v":0},{"$f":"SUM(Q4:Q33)","v":0},{"$f":"SUM(R4:R33)","v":0},{"$f":"SUM(R4:R32)","v":0}]
[]
[]
[]
[]
[]
[]
[]
[]
[]
[]
[null,null,null,{"$f":"D1","v":"Vincent"},null,{"$f":"D34","v":0},null,null,null,{"$f":"INDEX(D45:E47,MATCH(MAX(F45:F47),F45:F47,0),1)","v":"Vincent"},{"$f":"E1","v":"Frank"},null,{"$f":"SUM(D34)","v":0},null,null,null,null,{"$f":"INDEX(K45:L47,MATCH(MAX(M45:M47),M45:M47,0),1)","v":"Frank"}]
[null,null,null,{"$f":"K1","v":"Vincent"},null,{"$f":"SUM(K34)","v":0},null,null,null,null,{"$f":"L1","v":"Frank"},null,{"$f":"SUM(K34)","v":0}]
[null,null,null,{"$f":"R1","v":"Vincent"},null,{"$f":"SUM(S34)","v":0},null,null,null,null,{"$f":"S1","v":"Frank"},null,{"$f":"SUM(S3)","v":0}]
[null,null,null,"MAX(B2:B7",null,null,null,null,null,null,"MAX(B2:B7"]
[]
[null,null,null,{"$f":"D1","v":"Vincent"},null,{"$f":"D34","v":0},null,null,null,{"$f":"INDEX(D45:E47,MATCH(MEDIAN(F45:F47),F45:F47,0),1)","v":"Vincent"},{"$f":"E1","v":"Frank"},null,{"$f":"SUM(D34)","v":0},null,null,null,null,{"$f":"INDEX(K50:L52,MATCH(MEDIAN(M50:M52),M50:M52,0),1)","v":"Frank"}]
[null,null,null,{"$f":"K1","v":"Vincent"},null,{"$f":"SUM(K34)","v":0},null,null,null,null,{"$f":"L1","v":"Frank"},null,{"$f":"SUM(K34)","v":0}]
[null,null,null,{"$f":"R1","v":"Vincent"},null,{"$f":"SUM(S34)","v":0},null,null,null,null,{"$f":"S1","v":"Frank"},null,{"$f":"SUM(S34)","v":0}]
[null,null,null,"MAX(B2:B7",null,{"$f":"MAX(F50:F52)","v":0},null,null,null,null,"MAX(B2:B7",null,{"$f":"MAX(M50:M52)","v":0}]
[]
[null,null,null,{"$f":"D1","v":"Vincent"},null,{"$f":"D34","v":0},null,null,null,{"$f":"INDEX(D55:E57,MATCH(MIN(F55:F57),F55:F57,0),1)","v":"Vincent"},{"$f":"E1","v":"Frank"},null,{"$f":"SUM(D34)","v":0},null,null,null,null,{"$f":"INDEX(K55:L57,MATCH(MIN(M55:M57),M55:M57,0),1)","v":"Frank"}]
[null,null,null,{"$f":"K1","v":"Vincent"},null,{"$f":"SUM(K34)","v":0},null,null,null,null,{"$f":"L1","v":"Frank"},null,{"$f":"SUM(K34)","v":0}]
[null,null,null,{"$f":"R1","v":"Vincent"},null,{"$f":"SUM(S34)","v":0},null,null,null,null,{"$f":"S1","v":"Frank"},null,{"$f":"SUM(S34)","v":0}]
[null,null,null,null,null,null,{"$f":"SUM(F57)","v":0},null,null,null,null,null,null,{"$f":"SUM(M57)","v":0}]
[]
[]
[]
[null,null,null,null,null,null,null,null,null,{"$f":"SUM(F50:G52)/3","v":0}]

{"sheet":"Rd11","index":10,"n_rows":62,"n_cols":25,"rows_kept":62,"cut":false,"hidden":false,"merged":[[26,18,30,19],[31,4,32,5],[31,11,32,12],[31,18,32,19],[43,3,43,4],[43,5,43,6],[26,11,30,12],[26,4,30,5],[21,18,25,19],[7,4,7,5],[7,11,7,12],[7,18,7,19],[8,4,9,5],[8,11,9,12],[8,18,9,19],[10,4,12,5],[10,11,12,12],[10,18,12,19],[13,4,17,5],[13,11,17,12],[13,18,17,19],[21,4,25,5],[21,11,25,12],[56,3,56,4],[56,10,56,11],[50,3,50,4],[50,5,50,6],[50,10,50,11],[51,3,51,4],[51,5,51,6],[51,10,51,11],[54,3,54,4],[54,10,54,11],[55,3,55,4],[55,10,55,11],[46,3,46,4],[46,5,46,6],[44,5,44,6],[44,3,44,4],[45,3,45,4],[47,12,47,13],[48,3,48,4],[48,5,48,6],[49,3,49,4],[49,5,49,6],[49,10,49,11],[47,5,47,6]]}
[null,null,null,{"$f":"'Rd1'!Y58","v":"Frank"},{"$f":"'Rd1'!Y59","v":"Anja"},"Sp. 1",null,null,null,null,{"$f":"'Rd1'!Y60","v":"Vincent"},{"$f":"'Rd1'!Y61","v":"Erich"},"Sp. 2",null,null,null,null,{"$f":"'Rd1'!Y62","v":"Siggi"},{"$f":"'Rd1'!Y63","v":"Ralfie"},"Sp. 3",null,{"$f":"J45","v":"Frank"},{"$f":"R45","v":"Anja"}]
[null,null,null,"Punkte",501,"Start",null,null,null,null,"Punkte",501,"Start",null,null,null,null,"Punkte",501,"Start",null,{"$f":"J50","v":"Frank"},{"$f":"R50","v":"Anja"}]
[null,null,null,"Geworfen",{"$f":"SUM(D34)","v":0},"Punkte",null,null,null,null,"Geworfen",{"$f":"SUM(K34)","v":0},"Punkte",null,null,null,null,"Geworfen",{"$f":"SUM(R34)","v":0},"Punkte",null,{"$f":"J55","v":"Frank"},{"$f":"R55","v":"Anja"}]
["RD 1",{"$f":"COUNT(D4)*1","v":0},{"$f":"COUNT(D4)*3","v":0},null,{"$f":"SUM(E2-E3)","v":501},"Rest",null,"RD 1",{"$f":"COUNT(K4)*1","v":0},{"$f":"COUNT(K4)*3","v":0},null,{"$f":"SUM(L2-L3)","v":501},"Rest",null,"RD 1",{"$f":"COUNT(R4)*1","v":0},{"$f":"COUNT(R4)*3","v":0},null,{"$f":"SUM(S2-S3)","v":501},"Rest"]
["RD 2",{"$f":"COUNT(D5)*1","v":0},{"$f":"COUNT(D5)*3","v":0},null,null,null,null,"RD 2",0,0,null,null,null,null,"RD 2",0,0]
["RD 3",0,0,null,"ø pro Spiel",{"$f":"SUM(E3)/B34","v":{"$error":"#DIV/0!"}},null,"RD 3",0,0,null,"ø pro Spiel",{"$f":"SUM(L3)/I34","v":{"$error":"#DIV/0!"}},null,"RD 3",0,0,null,"ø pro Spiel",{"$f":"SUM(S3)/P34","v":{"$error":"#DIV/0!"}}]
["RD 4",0,0,null,"ø pro Pfeil",{"$f":"SUM(E3)/C34","v":{"$error":"#DIV/0!"}},null,"RD 4",0,0,null,"ø pro Pfeil",{"$f":"SUM(L3)/J34","v":{"$error":"#DIV/0!"}},null,"RD 4",0,0,null,"ø pro Pfeil",{"$f":"SUM(S3)/Q34","v":{"$error":"#DIV/0!"}}]
["RD 5",0,0,null,"Average",null,null,"RD 5",0,0,null,"Average",null,null,"RD 5",0,0,null,"Average"]
["RD 6",0,0,null,{"$f":"SUM(F6)","v":{"$error":"#DIV/0!"}},null,null,"RD 6",0,0,null,{"$f":"SUM(M6)","v":{"$error":"#DIV/0!"}},null,null,"RD 6",0,0,null,{"$f":"SUM(T6)","v":{"$error":"#DIV/0!"}}]
["RD 7",0,0,null,null,null,null,"RD 7",0,0,null,null,null,null,"RD 7",0,0]
["RD 8",0,0,null,"Nicht Gut",null,null,"RD 8",0,0,null,"Nicht Gut",null,null,"RD 8",0,0,null,"Nicht Gut"]
["RD 9",0,0,null,null,null,null,"RD 9",0,0,null,null,null,null,"RD 9",0,0]
["RD 10",0,0,null,null,null,null,"RD 10",0,0,null,null,null,null,"RD 10",0,0]
["RD 11",0,0,null,"Gut",null,null,"RD 11",0,0,null,"Gut",null,null,"RD 11",0,0,null,"Gut"]
["RD 12",0,0,null,null,null,null,"RD 12",0,0,null,null,null,null,"RD 12",0,0]
["RD 13",0,0,null,null,null,null,"RD 13",0,0,null,null,null,null,"RD 13",0,0]
["RD 14",0,0,null,null,null,null,"RD 14",0,0,null,null,null,null,"RD 14",0,0,null,null,null,null,null,null,null,"Ralf Kl."]
["RD 15",0,0,null,null,null,null,"RD 15",0,0,null,null,null,null,"RD 15",0,0,null,null,null,null,null,null,null,"Volker"]
["RD 16",0,0,null,{"$f":"D1","v":"Frank"},{"$f":"E1","v":"Anja"},null,"RD 16",0,0,null,{"$f":"K1","v":"Vincent"},{"$f":"L1","v":"Erich"},null,"RD 16",0,0,null,{"$f":"R1","v":"Siggi"},{"$f":"S1","v":"Ralfie"},null,null,null,null,"Rene"]
["RD 17",0,0,null,{"$f":"SUM(D4,D6,D8,D10,D12,D14,D16,D18,D20,D22,D24,D26,D28,D30,D32)","v":0},{"$f":"SUM(D5,D7,D9,D11,D13,D15,D17,D19,D21,D23,D25,D27,D29,D31,D33)","v":0},null,"RD 17",0,0,null,{"$f":"SUM(K4,K6,K8,K10,K12,K14,K16,K18,K20,K22,K24,K26,K28,K30,K32)","v":0},{"$f":"SUM(K5,K7,K9,K11,K13,K15,K17,K19,K21,K23,K25,K27,K29,K31,K33)","v":0},null,"RD 17",0,0,null,{"$f":"SUM(R4,R6,R8,R10,R12,R14,R16,R18,R20,R22,R24,R26,R28,R30,R32)","v":0},{"$f":"SUM(R5,R7,R9,R11,R13,R15,R17,R19,R21,R23,R25,R27,R29,R31,R33)","v":0},null,null,null,null,"Nicole"]
["RD 18",0,0,null,"Rest:",{"$f":"E4","v":501},null,"RD 18",0,0,null,"Rest:",{"$f":"L4","v":501},null,"RD 18",0,0,null,"Rest:",{"$f":"S4","v":501},null,"Micha",null,null,"Frank"]
["RD 19",0,0,null,"Sehr  Gut",null,null,"RD 19",0,0,null,"Sehr  Gut",null,null,"RD 19",0,0,null,"Sehr  Gut",null,null,null,null,null,"Rosi"]
["RD 20",0,0,null,null,null,null,"RD 20",0,0,null,null,null,null,"RD 20",0,0,null,null,null,null,null,null,null,"Werner"]
["RD 21",0,0,null,null,null,null,"RD 21",0,0,null,null,null,null,"RD 21",0,0,null,null,null,null,"Stefan",null,null,"Gast"]
["RD 22",0,0,null,null,null,null,"RD 22",0,0,null,null,null,null,"RD 22",0,0,null,null,null,null,null,null,null,"Stefan"]
["RD 23",0,0,null,null,null,null,"RD 23",0,0,null,null,null,null,"RD 23",0,0,null,null,null,null,null,null,null,"Micha"]
["RD 24",0,0,null,null,null,null,"RD 24",0,0,null,null,null,null,"RD 24",0,0,null,null,null,null,null,null,null,"Joker"]
["RD 25",0,0,null,null,null,null,"RD 25",0,0,null,null,null,null,"RD 25",0,0,null,null,null,null,null,null,null,"Anja"]
["RD 26",0,0,null,null,null,null,"RD 26",0,0,null,null,null,null,"RD 26",0,0,null,null,null,null,null,null,null,"Vincent"]
["RD 27",0,0,null,null,null,null,"RD 27",0,0,null,null,null,null,"RD 27",0,0,null,null,null,null,null,null,null,"Erich"]
["RD 28",0,0,null,null,null,null,"RD 28",0,0,null,null,null,null,"RD 28",0,0,null,null,null,null,null,null,null,"Siggi"]
["RD 29",0,0,null,{"$f":"IF(E4=0,\"Sieg\",\"\")","v":""},null,null,"RD 29",0,0,null,{"$f":"IF(L4=0,\"Sieg\",\"\")","v":""},null,null,"RD 29",0,0,null,{"$f":"IF(S4=0,\"Sieg\",\"\")","v":""},null,null,null,null,null,"Ralf M."]
["RD 30",0,0,null,null,null,null,"RD 30",0,0,null,null,null,null,"RD 30",0,0,null,null,null,null,null,null,null,"Dirk B."]
[null,{"$f":"SUM(B4:B33)","v":0},{"$f":"SUM(C4:C33)","v":0},{"$f":"SUM(D4:D33)","v":0},{"$f":"SUM(D5:D32)","v":0},null,null,null,{"$f":"SUM(I4:I33)","v":0},{"$f":"SUM(J4:J33)","v":0},{"$f":"SUM(K4:K33)","v":0},{"$f":"SUM(K4:K32)","v":0},null,null,null,{"$f":"SUM(P4:P33)","v":0},{"$f":"SUM(Q4:Q33)","v":0},{"$f":"SUM(R4:R33)","v":0},{"$f":"SUM(R4:R32)","v":0}]
[]
[]
[]
[]
[]
[]
[]
[]
[]
[]
[null,null,null,{"$f":"D1","v":"Frank"},null,{"$f":"D34","v":0},null,null,null,{"$f":"INDEX(D45:E47,MATCH(MAX(F45:F47),F45:F47,0),1)","v":"Frank"},{"$f":"E1","v":"Anja"},null,{"$f":"SUM(D34)","v":0},null,null,null,null,{"$f":"INDEX(K45:L47,MATCH(MAX(M45:M47),M45:M47,0),1)","v":"Anja"}]
[null,null,null,{"$f":"K1","v":"Vincent"},null,{"$f":"SUM(K34)","v":0},null,null,null,null,{"$f":"L1","v":"Erich"},null,{"$f":"SUM(K34)","v":0}]
[null,null,null,{"$f":"R1","v":"Siggi"},null,{"$f":"SUM(S34)","v":0},null,null,null,null,{"$f":"S1","v":"Ralfie"},null,{"$f":"SUM(S3)","v":0}]
[null,null,null,"MAX(B2:B7",null,null,null,null,null,null,"MAX(B2:B7"]
[]
[null,null,null,{"$f":"D1","v":"Frank"},null,{"$f":"D34","v":0},null,null,null,{"$f":"INDEX(D45:E47,MATCH(MEDIAN(F45:F47),F45:F47,0),1)","v":"Frank"},{"$f":"E1","v":"Anja"},null,{"$f":"SUM(D34)","v":0},null,null,null,null,{"$f":"INDEX(K50:L52,MATCH(MEDIAN(M50:M52),M50:M52,0),1)","v":"Anja"}]
[null,null,null,{"$f":"K1","v":"Vincent"},null,{"$f":"SUM(K34)","v":0},null,null,null,null,{"$f":"L1","v":"Erich"},null,{"$f":"SUM(K34)","v":0}]
[null,null,null,{"$f":"R1","v":"Siggi"},null,{"$f":"SUM(S34)","v":0},null,null,null,null,{"$f":"S1","v":"Ralfie"},null,{"$f":"SUM(S34)","v":0}]
[null,null,null,"MAX(B2:B7",null,{"$f":"MAX(F50:F52)","v":0},null,null,null,null,"MAX(B2:B7",null,{"$f":"MAX(M50:M52)","v":0}]
[]
[null,null,null,{"$f":"D1","v":"Frank"},null,{"$f":"D34","v":0},null,null,null,{"$f":"INDEX(D55:E57,MATCH(MIN(F55:F57),F55:F57,0),1)","v":"Frank"},{"$f":"E1","v":"Anja"},null,{"$f":"SUM(D34)","v":0},null,null,null,null,{"$f":"INDEX(K55:L57,MATCH(MIN(M55:M57),M55:M57,0),1)","v":"Anja"}]
[null,null,null,{"$f":"K1","v":"Vincent"},null,{"$f":"SUM(K34)","v":0},null,null,null,null,{"$f":"L1","v":"Erich"},null,{"$f":"SUM(K34)","v":0}]
[null,null,null,{"$f":"R1","v":"Siggi"},null,{"$f":"SUM(S34)","v":0},null,null,null,null,{"$f":"S1","v":"Ralfie"},null,{"$f":"SUM(S34)","v":0}]
[null,null,null,null,null,null,{"$f":"SUM(F57)","v":0},null,null,null,null,null,null,{"$f":"SUM(M57)","v":0}]
[]
[]
[]
[null,null,null,null,null,null,null,null,null,{"$f":"SUM(F50:G52)/3","v":0}]

{"sheet":"Rd12","index":11,"n_rows":62,"n_cols":25,"rows_kept":62,"cut":false,"hidden":false,"merged":[[26,18,30,19],[31,4,32,5],[31,11,32,12],[31,18,32,19],[43,3,43,4],[43,5,43,6],[26,11,30,12],[26,4,30,5],[21,18,25,19],[7,4,7,5],[7,11,7,12],[7,18,7,19],[8,4,9,5],[8,11,9,12],[8,18,9,19],[10,4,12,5],[10,11,12,12],[10,18,12,19],[13,4,17,5],[13,11,17,12],[13,18,17,19],[21,4,25,5],[21,11,25,12],[56,3,56,4],[56,10,56,11],[50,3,50,4],[50,5,50,6],[50,10,50,11],[51,3,51,4],[51,5,51,6],[51,10,51,11],[54,3,54,4],[54,10,54,11],[55,3,55,4],[55,10,55,11],[46,3,46,4],[46,5,46,6],[44,5,44,6],[44,3,44,4],[45,3,45,4],[47,12,47,13],[48,3,48,4],[48,5,48,6],[49,3,49,4],[49,5,49,6],[49,10,49,11],[47,5,47,6]]}
[null,null,null,{"$f":"'Rd11'!R55","v":"Anja"},{"$f":"'Rd11'!J55","v":"Frank"},"Sp. 1",null,null,null,null,{"$f":"'Rd11'!R50","v":"Anja"},{"$f":"'Rd11'!J50","v":"Frank"},"Sp. 2",null,null,null,null,{"$f":"'Rd11'!R45","v":"Anja"},{"$f":"'Rd11'!J45","v":"Frank"},"Sp. 3",null,{"$f":"J45","v":"Anja"},{"$f":"R45","v":"Frank"}]
[null,null,null,"Punkte",501,"Start",null,null,null,null,"Punkte",501,"Start",null,null,null,null,"Punkte",501,"Start",null,{"$f":"J50","v":"Anja"},{"$f":"R50","v":"Frank"}]
[null,null,null,"Geworfen",{"$f":"SUM(D34)","v":0},"Punkte",null,null,null,null,"Geworfen",{"$f":"SUM(K34)","v":0},"Punkte",null,null,null,null,"Geworfen",{"$f":"SUM(R34)","v":0},"Punkte",null,{"$f":"J55","v":"Anja"},{"$f":"R55","v":"Frank"}]
["RD 1",{"$f":"COUNT(D4)*1","v":0},{"$f":"COUNT(D4)*3","v":0},null,{"$f":"SUM(E2-E3)","v":501},"Rest",null,"RD 1",{"$f":"COUNT(K4)*1","v":0},{"$f":"COUNT(K4)*3","v":0},null,{"$f":"SUM(L2-L3)","v":501},"Rest",null,"RD 1",{"$f":"COUNT(R4)*1","v":0},{"$f":"COUNT(R4)*3","v":0},null,{"$f":"SUM(S2-S3)","v":501},"Rest"]
["RD 2",{"$f":"COUNT(D5)*1","v":0},{"$f":"COUNT(D5)*3","v":0},null,null,null,null,"RD 2",0,0,null,null,null,null,"RD 2",0,0]
["RD 3",0,0,null,"ø pro Spiel",{"$f":"SUM(E3)/B34","v":{"$error":"#DIV/0!"}},null,"RD 3",0,0,null,"ø pro Spiel",{"$f":"SUM(L3)/I34","v":{"$error":"#DIV/0!"}},null,"RD 3",0,0,null,"ø pro Spiel",{"$f":"SUM(S3)/P34","v":{"$error":"#DIV/0!"}}]
["RD 4",0,0,null,"ø pro Pfeil",{"$f":"SUM(E3)/C34","v":{"$error":"#DIV/0!"}},null,"RD 4",0,0,null,"ø pro Pfeil",{"$f":"SUM(L3)/J34","v":{"$error":"#DIV/0!"}},null,"RD 4",0,0,null,"ø pro Pfeil",{"$f":"SUM(S3)/Q34","v":{"$error":"#DIV/0!"}}]
["RD 5",0,0,null,"Average",null,null,"RD 5",0,0,null,"Average",null,null,"RD 5",0,0,null,"Average"]
["RD 6",0,0,null,{"$f":"SUM(F6)","v":{"$error":"#DIV/0!"}},null,null,"RD 6",0,0,null,{"$f":"SUM(M6)","v":{"$error":"#DIV/0!"}},null,null,"RD 6",0,0,null,{"$f":"SUM(T6)","v":{"$error":"#DIV/0!"}}]
["RD 7",0,0,null,null,null,null,"RD 7",0,0,null,null,null,null,"RD 7",0,0]
["RD 8",0,0,null,"Nicht Gut",null,null,"RD 8",0,0,null,"Nicht Gut",null,null,"RD 8",0,0,null,"Nicht Gut"]
["RD 9",0,0,null,null,null,null,"RD 9",0,0,null,null,null,null,"RD 9",0,0]
["RD 10",0,0,null,null,null,null,"RD 10",0,0,null,null,null,null,"RD 10",0,0]
["RD 11",0,0,null,"Gut",null,null,"RD 11",0,0,null,"Gut",null,null,"RD 11",0,0,null,"Gut"]
["RD 12",0,0,null,null,null,null,"RD 12",0,0,null,null,null,null,"RD 12",0,0]
["RD 13",0,0,null,null,null,null,"RD 13",0,0,null,null,null,null,"RD 13",0,0]
["RD 14",0,0,null,null,null,null,"RD 14",0,0,null,null,null,null,"RD 14",0,0,null,null,null,null,null,null,null,"Ralf Kl."]
["RD 15",0,0,null,null,null,null,"RD 15",0,0,null,null,null,null,"RD 15",0,0,null,null,null,null,null,null,null,"Volker"]
["RD 16",0,0,null,{"$f":"D1","v":"Anja"},{"$f":"E1","v":"Frank"},null,"RD 16",0,0,null,{"$f":"K1","v":"Anja"},{"$f":"L1","v":"Frank"},null,"RD 16",0,0,null,{"$f":"R1","v":"Anja"},{"$f":"S1","v":"Frank"},null,null,null,null,"Rene"]
["RD 17",0,0,null,{"$f":"SUM(D4,D6,D8,D10,D12,D14,D16,D18,D20,D22,D24,D26,D28,D30,D32)","v":0},{"$f":"SUM(D5,D7,D9,D11,D13,D15,D17,D19,D21,D23,D25,D27,D29,D31,D33)","v":0},null,"RD 17",0,0,null,{"$f":"SUM(K4,K6,K8,K10,K12,K14,K16,K18,K20,K22,K24,K26,K28,K30,K32)","v":0},{"$f":"SUM(K5,K7,K9,K11,K13,K15,K17,K19,K21,K23,K25,K27,K29,K31,K33)","v":0},null,"RD 17",0,0,null,{"$f":"SUM(R4,R6,R8,R10,R12,R14,R16,R18,R20,R22,R24,R26,R28,R30,R32)","v":0},{"$f":"SUM(R5,R7,R9,R11,R13,R15,R17,R19,R21,R23,R25,R27,R29,R31,R33)","v":0},null,null,null,null,"Nicole"]
["RD 18",0,0,null,"Rest:",{"$f":"E4","v":501},null,"RD 18",0,0,null,"Rest:",{"$f":"L4","v":501},null,"RD 18",0,0,null,"Rest:",{"$f":"S4","v":501},null,"Micha",null,null,"Frank"]
["RD 19",0,0,null,"Sehr  Gut",null,null,"RD 19",0,0,null,"Sehr  Gut",null,null,"RD 19",0,0,null,"Sehr  Gut",null,null,null,null,null,"Rosi"]
["RD 20",0,0,null,null,null,null,"RD 20",0,0,null,null,null,null,"RD 20",0,0,null,null,null,null,null,null,null,"Werner"]
["RD 21",0,0,null,null,null,null,"RD 21",0,0,null,null,null,null,"RD 21",0,0,null,null,null,null,"Stefan",null,null,"Gast"]
["RD 22",0,0,null,null,null,null,"RD 22",0,0,null,null,null,null,"RD 22",0,0,null,null,null,null,null,null,null,"Stefan"]
["RD 23",0,0,null,null,null,null,"RD 23",0,0,null,null,null,null,"RD 23",0,0,null,null,null,null,null,null,null,"Micha"]
["RD 24",0,0,null,null,null,null,"RD 24",0,0,null,null,null,null,"RD 24",0,0,null,null,null,null,null,null,null,"Joker"]
["RD 25",0,0,null,null,null,null,"RD 25",0,0,null,null,null,null,"RD 25",0,0,null,null,null,null,null,null,null,"Anja"]
["RD 26",0,0,null,null,null,null,"RD 26",0,0,null,null,null,null,"RD 26",0,0,null,null,null,null,null,null,null,"Vincent"]
["RD 27",0,0,null,null,null,null,"RD 27",0,0,null,null,null,null,"RD 27",0,0,null,null,null,null,null,null,null,"Erich"]
["RD 28",0,0,null,null,null,null,"RD 28",0,0,null,null,null,null,"RD 28",0,0,null,null,null,null,null,null,null,"Siggi"]
["RD 29",0,0,null,{"$f":"IF(E4=0,\"Sieg\",\"\")","v":""},null,null,"RD 29",0,0,null,{"$f":"IF(L4=0,\"Sieg\",\"\")","v":""},null,null,"RD 29",0,0,null,{"$f":"IF(S4=0,\"Sieg\",\"\")","v":""},null,null,null,null,null,"Ralf M."]
["RD 30",0,0,null,null,null,null,"RD 30",0,0,null,null,null,null,"RD 30",0,0,null,null,null,null,null,null,null,"Dirk B."]
[null,{"$f":"SUM(B4:B33)","v":0},{"$f":"SUM(C4:C33)","v":0},{"$f":"SUM(D4:D33)","v":0},{"$f":"SUM(D5:D32)","v":0},null,null,null,{"$f":"SUM(I4:I33)","v":0},{"$f":"SUM(J4:J33)","v":0},{"$f":"SUM(K4:K33)","v":0},{"$f":"SUM(K4:K32)","v":0},null,null,null,{"$f":"SUM(P4:P33)","v":0},{"$f":"SUM(Q4:Q33)","v":0},{"$f":"SUM(R4:R33)","v":0},{"$f":"SUM(R4:R32)","v":0}]
[]
[]
[]
[]
[]
[]
[]
[]
[]
[]
[null,null,null,{"$f":"D1","v":"Anja"},null,{"$f":"D34","v":0},null,null,null,{"$f":"INDEX(D45:E47,MATCH(MAX(F45:F47),F45:F47,0),1)","v":"Anja"},{"$f":"E1","v":"Frank"},null,{"$f":"SUM(D34)","v":0},null,null,null,null,{"$f":"INDEX(K45:L47,MATCH(MAX(M45:M47),M45:M47,0),1)","v":"Frank"}]
[null,null,null,{"$f":"K1","v":"Anja"},null,{"$f":"SUM(K34)","v":0},null,null,null,null,{"$f":"L1","v":"Frank"},null,{"$f":"SUM(K34)","v":0}]
[null,null,null,{"$f":"R1","v":"Anja"},null,{"$f":"SUM(S34)","v":0},null,null,null,null,{"$f":"S1","v":"Frank"},null,{"$f":"SUM(S3)","v":0}]
[null,null,null,"MAX(B2:B7",null,null,null,null,null,null,"MAX(B2:B7"]
[]
[null,null,null,{"$f":"D1","v":"Anja"},null,{"$f":"D34","v":0},null,null,null,{"$f":"INDEX(D45:E47,MATCH(MEDIAN(F45:F47),F45:F47,0),1)","v":"Anja"},{"$f":"E1","v":"Frank"},null,{"$f":"SUM(D34)","v":0},null,null,null,null,{"$f":"INDEX(K50:L52,MATCH(MEDIAN(M50:M52),M50:M52,0),1)","v":"Frank"}]
[null,null,null,{"$f":"K1","v":"Anja"},null,{"$f":"SUM(K34)","v":0},null,null,null,null,{"$f":"L1","v":"Frank"},null,{"$f":"SUM(K34)","v":0}]
[null,null,null,{"$f":"R1","v":"Anja"},null,{"$f":"SUM(S34)","v":0},null,null,null,null,{"$f":"S1","v":"Frank"},null,{"$f":"SUM(S34)","v":0}]
[null,null,null,"MAX(B2:B7",null,{"$f":"MAX(F50:F52)","v":0},null,null,null,null,"MAX(B2:B7",null,{"$f":"MAX(M50:M52)","v":0}]
[]
[null,null,null,{"$f":"D1","v":"Anja"},null,{"$f":"D34","v":0},null,null,null,{"$f":"INDEX(D55:E57,MATCH(MIN(F55:F57),F55:F57,0),1)","v":"Anja"},{"$f":"E1","v":"Frank"},null,{"$f":"SUM(D34)","v":0},null,null,null,null,{"$f":"INDEX(K55:L57,MATCH(MIN(M55:M57),M55:M57,0),1)","v":"Frank"}]
[null,null,null,{"$f":"K1","v":"Anja"},null,{"$f":"SUM(K34)","v":0},null,null,null,null,{"$f":"L1","v":"Frank"},null,{"$f":"SUM(K34)","v":0}]
[null,null,null,{"$f":"R1","v":"Anja"},null,{"$f":"SUM(S34)","v":0},null,null,null,null,{"$f":"S1","v":"Frank"},null,{"$f":"SUM(S34)","v":0}]
[null,null,null,null,null,null,{"$f":"SUM(F57)","v":0},null,null,null,null,null,null,{"$f":"SUM(M57)","v":0}]
[]
[]
[]
[null,null,null,null,null,null,null,null,null,{"$f":"SUM(F50:G52)/3","v":0}]

{"sheet":"Siegerliste","index":12,"n_rows":14,"n_cols":10,"rows_kept":14,"cut":false,"hidden":false,"merged":[[0,1,0,2]]}
[null,"Sieger"]
[]
["Rd.1",{"$f":"'Rd1'!J45","v":"Anja"},{"$f":"'Rd1'!R45","v":"Vincent"},null,null,null,null,null,null,"Passwort"]
["Rd.2",{"$f":"'Rd2'!J45","v":"Vincent"},{"$f":"'Rd2'!R45","v":"Anja"}]
["Rd.3",{"$f":"'Rd3'!K45","v":"Erich"},{"$f":"'Rd3'!R45","v":"Erich"}]
["Rd.4",{"$f":"'Rd4'!J45","v":"Erich"},{"$f":"'Rd4'!R45","v":"Anja"}]
["Rd.5",{"$f":"'Rd5'!J45","v":"Erich"},{"$f":"'Rd5'!R45","v":"Vincent"}]
["Rd.6",{"$f":"'Rd6'!J45","v":"Vincent"},{"$f":"'Rd6'!R45","v":"Erich"}]
["Rd.7",{"$f":"'Rd7'!J45","v":"Erich"},{"$f":"'Rd7'!R45","v":"Frank"}]
["Rd.8",{"$f":"'Rd8'!J45","v":"Frank"},{"$f":"'Rd8'!R45","v":"Erich"}]
["Rd.9",{"$f":"'Rd9'!J45","v":"Frank"},{"$f":"'Rd9'!R45","v":"Vincent"}]
["Rd.10",{"$f":"'Rd10'!J45","v":"Vincent"},{"$f":"'Rd10'!R45","v":"Frank"}]
["Rd.11",{"$f":"'Rd11'!K45","v":"Anja"},{"$f":"'Rd11'!R45","v":"Anja"}]
["Rd.12",{"$f":"'Rd12'!J45","v":"Anja"},{"$f":"'Rd12'!R45","v":"Frank"}]

{"sheet":"Tabelle2","index":13,"n_rows":38,"n_cols":17,"rows_kept":38,"cut":false,"hidden":false,"merged":[]}
[{"$f":"G2","v":"Anja"},null,null,null,null,null,null,{"$f":"RAND()","v":0.16519489306391599}]
["Erich",null,null,null,null,null,{"$f":"'Rd1'!V38","v":"Anja"},{"$f":"RAND()","v":0.50550168981374288}]
["Ralfie",null,null,null,null,null,{"$f":"'Rd1'!V40","v":"Erich"},{"$f":"RAND()","v":0.88489471291229316}]
["Frank",null,null,null,null,null,{"$f":"'Rd1'!V42","v":"Ralfie"},{"$f":"RAND()","v":0.40385644971732848}]
["Siggi",null,null,null,null,null,{"$f":"'Rd1'!V43","v":"Frank"},{"$f":"RAND()","v":0.19786358993617514}]
["Vincent",null,null,null,null,null,{"$f":"'Rd1'!V41","v":"Siggi"},{"$f":"RAND()","v":8.4109007944490055E-2}]
[null,null,null,null,null,null,{"$f":"'Rd1'!V39","v":"Vincent"},{"$f":"RAND()","v":0.38483228586363882}]
[]
[null,null,null,null,null,null,null,null,null,null,null,null,null,null,null,null,"RD.1"]
[null,null,null,null,null,null,null,null,null,null,null,null,null,null,null,null,"RD.2"]
["Anja","Vincent",null,null,null,null,{"$f":"K11","v":"Anja"},{"$f":"M11","v":"Vincent"},null,1,{"$f":"A1","v":"Anja"},null,{"$f":"A6","v":"Vincent"},1,null,null,"RD.3"]
["Erich","Siggi",null,null,null,null,"Erich","Siggi",null,2,{"$f":"A2","v":"Erich"},null,{"$f":"A5","v":"Siggi"},null,null,null,"RD.4"]
["Ralfie","Frank",null,null,null,null,"Ralfie","Frank",null,3,{"$f":"A3","v":"Ralfie"},null,{"$f":"A4","v":"Frank"},3,null,null,"RD.5"]
["Anja","Siggi",null,null,null,null,"Anja","Erich",null,4,{"$f":"A1","v":"Anja"},null,{"$f":"A2","v":"Erich"},4,null,null,"RD.6"]
["Vincent","Frank",null,null,null,null,"Ralfie","Vincent",null,5,{"$f":"A3","v":"Ralfie"},null,{"$f":"A6","v":"Vincent"},5,null,null,"RD.7"]
["Erich","Ralfie",null,null,null,null,"Frank","Siggi",null,6,{"$f":"A4","v":"Frank"},null,{"$f":"A5","v":"Siggi"},6,null,null,"RD.8"]
["Anja","Frank",null,null,null,null,"Erich","Vincent",null,7,{"$f":"A2","v":"Erich"},null,{"$f":"A6","v":"Vincent"},7,null,null,"RD.9"]
["Siggi","Ralfie",null,null,null,null,"Anja","Frank",null,8,{"$f":"A1","v":"Anja"},null,{"$f":"A4","v":"Frank"},8,null,null,"RD.10"]
["Vincent","Erich",null,null,null,null,"Ralfie","Siggi",null,9,{"$f":"A3","v":"Ralfie"},null,{"$f":"A5","v":"Siggi"},9,null,null,"RD.11"]
["Anja","Ralfie",null,null,null,null,"Erich","Frank",null,10,{"$f":"A2","v":"Erich"},null,{"$f":"A4","v":"Frank"},10,null,null,"RD.12"]
["Frank","Erich",null,null,null,null,"Siggi","Vincent",null,11,{"$f":"A5","v":"Siggi"},null,{"$f":"A6","v":"Vincent"},11]
["Siggi","Vincent",null,null,null,null,"Anja","Ralfie",null,12,{"$f":"A1","v":"Anja"},null,{"$f":"A3","v":"Ralfie"},12]
["Anja","Erich",null,null,null,null,"Frank","Vincent",null,13,{"$f":"A4","v":"Frank"},null,{"$f":"A6","v":"Vincent"},13]
["Ralfie","Vincent",null,null,null,null,"Erich","Ralfie",null,14,{"$f":"A2","v":"Erich"},null,{"$f":"A3","v":"Ralfie"},14]
["Frank","Siggi",null,null,null,null,"Anja","Siggi",null,15,{"$f":"A1","v":"Anja"},null,{"$f":"A5","v":"Siggi"},15]
[null,"Anja"]
["Ralf M.","Erich"]
["Vincent","Siggi"]
["Thorsten","Anja"]
[]
["Ralf M.","Siggi"]
["Erich","Anja"]
["Vincent"]
["Thorsten"]
["Ralf M.","Anja"]
["Siggi"]
["Erich"]
["Vincent","Thorsten"]

{"sheet":"Tabelle1","index":14,"n_rows":48,"n_cols":4,"rows_kept":48,"cut":false,"hidden":false,"merged":[]}
["Joker","Ralf Kl.",null,"Ralf Kl."]
["Anja","Volker",null,"Volker"]
["Erich","Rene",null,"Rene"]
["Siggi","Nicole",null,"Nicole"]
["Ralf M.","Frank",null,"Frank"]
["Ralf Kl.","Rosi",null,"Rosi"]
["Volker","Werner",null,"Werner"]
["Rene","Thorsten",null,"Thorsten"]
["Nicole","Stefan",null,"Stefan"]
["Frank","Micha",null,"Micha"]
["Dirk B.","Joker",null,"Joker"]
["Anja/Erich","Anja",null,"Anja"]
["Anja/Siggi","Vincent",null,"Vincent"]
["Anja/Ralf M.","Erich",null,"Erich"]
["Anja/Ralf Kl.","Siggi",null,"Siggi"]
["Anja/Volker","Ralf M.",null,"Ralf M."]
["Anja/Rene","Dirk B.",null,"Dirk B."]
["Anja/Gast"]
["Erich/Siggi"]
["Erich/Ralf M."]
["Erich/Ralf Kl."]
["Erich/Volker"]
["Erich/Rene"]
["Erich/Gast"]
["Siggi/Ralf M."]
["Siggi/Ralf Kl."]
["Siggi/Volker"]
["Siggi/Rene"]
["Siggi/Gast"]
["Ralf M./Ralf Kl."]
["Ralf M./Volker"]
["Ralf M./Rene"]
["Ralf M./Gast"]
["Ralf Kl./Volker"]
["Ralf Kl./Rene"]
["Ralf Kl./Gast"]
["Volker/Rene"]
["Rene/Gast"]
["Joker"]
["Anja/Nicole"]
["Anja/Frank"]
["Erich/Nicole"]
["Erich/Frank"]
["Siggi/Nicole"]
["Siggi/Frank"]
["Ralf M./Nicole"]
["Ralf M./Frank"]
["Nicole/Frank"]