{"text_format":"1","workbook":"xlsx","n_sheets":3,"sheets":["Tabelle1","Etappen","Tabelle3"],"not_rendered":{"charts":0,"images":0,"macros":1,"external_links":0,"defined_names":0,"comments":0,"pivot_tables":0},"unopened":[],"bounds":{"document_bytes":16777216,"sheet_cells":100000,"rows_first":2000,"rows_last":500,"rows_between":2000,"halvings":0,"cell_chars":16384,"cell_head_chars":4096},"cells_cut":0,"cells_raw":0,"read":"whole","date_system":"1900"}

{"sheet":"Tabelle1","index":0,"n_rows":300,"n_cols":39,"rows_kept":300,"cut":false,"hidden":false,"merged":[[297,27,297,38],[298,27,298,38],[299,27,299,38],[74,27,74,38],[75,27,75,38],[76,27,76,38],[77,27,77,38],[50,27,50,38],[51,27,51,38],[52,27,52,38],[53,27,53,38],[111,27,111,38],[95,27,95,38],[96,27,96,38],[97,27,97,38],[98,27,98,38],[99,27,99,38],[100,27,100,38],[101,27,101,38],[102,27,102,38],[103,27,103,38],[104,27,104,38],[105,27,105,38],[106,27,106,38],[295,27,295,38],[296,27,296,38],[37,27,37,38],[38,27,38,38],[39,27,39,38],[42,27,42,38],[43,27,43,38],[44,27,44,38],[45,27,45,38],[56,27,56,38],[57,27,57,38],[58,27,58,38],[136,27,136,38],[137,27,137,38],[108,27,108,38],[109,27,109,38],[110,27,110,38],[207,27,207,38],[162,27,162,38],[163,27,163,38],[149,27,149,38],[150,27,150,38],[151,27,151,38],[152,27,152,38],[14,27,14,38],[15,27,15,38],[16,27,16,38],[22,27,22,38],[35,27,35,38],[36,27,36,38],[11,27,11,38],[12,27,12,38],[23,27,23,38],[24,27,24,38],[30,27,30,38],[153,27,153,38],[154,27,154,38],[3,12,3,21],[7,27,7,38],[8,27,8,38],[9,27,9,38],[31,27,31,38],[32,27,32,38],[33,27,33,38],[34,27,34,38],[40,27,40,38],[17,27,17,38],[18,27,18,38],[19,27,19,38],[20,27,20,38],[21,27,21,38],[6,27,6,38],[5,27,5,38],[10,27,10,38],[13,27,13,38],[138,27,138,38],[139,27,139,38],[140,27,140,38],[141,27,141,38],[144,27,144,38],[145,27,145,38],[146,27,146,38],[147,27,147,38],[148,27,148,38],[192,27,192,38],[193,27,193,38],[194,27,194,38],[195,27,195,38],[172,27,172,38],[173,27,173,38],[168,27,168,38],[169,27,169,38],[170,27,170,38],[171,27,171,38],[155,27,155,38],[156,27,156,38],[157,27,157,38],[158,27,158,38],[159,27,159,38],[160,27,160,38],[161,27,161,38],[164,27,164,38],[165,27,165,38],[204,27,204,38],[205,27,205,38],[206,27,206,38],[271,27,271,38],[208,27,208,38],[209,27,209,38],[210,27,210,38],[252,27,252,38],[253,27,253,38],[231,27,231,38],[215,27,215,38],[216,27,216,38],[217,27,217,38],[218,27,218,38],[211,27,211,38],[212,27,212,38],[213,27,213,38],[214,27,214,38],[219,27,219,38],[220,27,220,38],[221,27,221,38],[222,27,222,38],[223,27,223,38],[224,27,224,38],[225,27,225,38],[226,27,226,38],[227,27,227,38],[272,27,272,38],[273,27,273,38],[0,1,1,18],[0,22,1,22],[0,23,1,23],[0,24,1,24],[0,19,1,21],[241,27,241,38],[242,27,242,38],[243,27,243,38],[244,27,244,38],[228,27,228,38],[229,27,229,38],[230,27,230,38],[25,27,25,38],[26,27,26,38],[27,27,27,38],[28,27,28,38],[29,27,29,38],[41,27,41,38],[54,27,54,38],[283,27,283,38],[258,27,258,38],[259,27,259,38],[260,27,260,38],[261,27,261,38],[245,27,245,38],[246,27,246,38],[247,27,247,38],[248,27,248,38],[274,27,274,38],[275,27,275,38],[276,27,276,38],[277,27,277,38],[278,27,278,38],[279,27,279,38],[280,27,280,38],[281,27,281,38],[282,27,282,38],[254,27,254,38],[255,27,255,38],[256,27,256,38],[257,27,257,38],[55,27,55,38],[48,27,48,38],[49,27,49,38],[46,27,46,38],[47,27,47,38],[59,27,59,38],[60,27,60,38],[61,27,61,38],[62,27,62,38],[63,27,63,38],[64,27,64,38],[69,27,69,38],[70,27,70,38],[71,27,71,38],[72,27,72,38],[73,27,73,38],[84,27,84,38],[85,27,85,38],[82,27,82,38],[83,27,83,38],[78,27,78,38],[79,27,79,38],[80,27,80,38],[81,27,81,38],[65,27,65,38],[66,27,66,38],[67,27,67,38],[68,27,68,38],[86,27,86,38],[87,27,87,38],[88,27,88,38],[89,27,89,38],[90,27,90,38],[112,27,112,38],[113,27,113,38],[91,27,91,38],[92,27,92,38],[93,27,93,38],[94,27,94,38],[107,27,107,38],[114,27,114,38],[115,27,115,38],[116,27,116,38],[117,27,117,38],[118,27,118,38],[119,27,119,38],[120,27,120,38],[142,27,142,38],[143,27,143,38],[125,27,125,38],[126,27,126,38],[127,27,127,38],[128,27,128,38],[121,27,121,38],[122,27,122,38],[123,27,123,38],[124,27,124,38],[129,27,129,38],[130,27,130,38],[131,27,131,38],[132,27,132,38],[133,27,133,38],[134,27,134,38],[135,27,135,38],[166,27,166,38],[167,27,167,38],[174,27,174,38],[175,27,175,38],[176,27,176,38],[177,27,177,38],[178,27,178,38],[179,27,179,38],[180,27,180,38],[202,27,202,38],[203,27,203,38],[181,27,181,38],[182,27,182,38],[183,27,183,38],[184,27,184,38],[198,27,198,38],[199,27,199,38],[200,27,200,38],[201,27,201,38],[185,27,185,38],[186,27,186,38],[187,27,187,38],[188,27,188,38],[189,27,189,38],[190,27,190,38],[191,27,191,38],[196,27,196,38],[197,27,197,38],[232,27,232,38],[233,27,233,38],[234,27,234,38],[235,27,235,38],[236,27,236,38],[237,27,237,38],[238,27,238,38],[239,27,239,38],[240,27,240,38],[293,27,293,38],[294,27,294,38],[2,22,2,23],[284,27,284,38],[285,27,285,38],[286,27,286,38],[287,27,287,38],[288,27,288,38],[289,27,289,38],[290,27,290,38],[291,27,291,38],[292,27,292,38],[262,27,262,38],[263,27,263,38],[264,27,264,38],[265,27,265,38],[266,27,266,38],[267,27,267,38],[268,27,268,38],[269,27,269,38],[270,27,270,38],[249,27,249,38],[250,27,250,38],[251,27,251,38]]}
[null,"Fahradtouren 2025",null,null,null,null,null,null,null,null,null,null,null,null,null,null,null,null,null,"Gesamt    gefahren  ",null,null,{"$f":"SUM(W6:W295)","v":"00:00:00"},{"$f":"SUM(X7:X300)","v":22.09},{"$f":"SUM(Y7:Y300)","v":57.400000000000006},null,null,{"$f":"Etappen!A1","v":1},{"$f":"Etappen!B1","v":"Zuhause"},{"$f":"Etappen!A6","v":6},{"$f":"Etappen!B6","v":"Altmühlsee"},{"$f":"Etappen!A11","v":11},{"$f":"Etappen!B11","v":"Gerolfingen"},{"$f":"Etappen!A16","v":16},{"$f":"Etappen!B16","v":"Wettelsheim"},{"$f":"Etappen!A21","v":21},{"$f":"Etappen!B21","v":"Pappenh. Schleusinger"},{"$f":"Etappen!A26","v":26},{"$f":"Etappen!B26","v":"Krankenhaus WUG"}]
[{"$f":"A1","v":"00:00:00"},null,null,null,null,null,null,null,null,null,null,null,null,null,null,null,null,null,null,null,null,null,null,null,null,null,null,{"$f":"Etappen!A2","v":2},{"$f":"Etappen!B2","v":"Aldi"},{"$f":"Etappen!A7","v":7},{"$f":"Etappen!B7","v":"Mörnsheim"},{"$f":"Etappen!A12","v":12},{"$f":"Etappen!B12","v":"Campingplatz"},{"$f":"Etappen!A17","v":17},{"$f":"Etappen!B17","v":"MC Donald WUG"},{"$f":"Etappen!A22","v":22},{"$f":"Etappen!B22","v":"Kaufland WUG"},{"$f":"Etappen!A27","v":27},{"$f":"Etappen!B27","v":"Weißenburg"}]
[null,null,null,null,null,null,null,null,null,null,null,null,null,null,null,null,null,null,null,null,null,null,null,null,null,null,null,{"$f":"Etappen!A3","v":3},{"$f":"Etappen!B3","v":"Windsfeld"},{"$f":"Etappen!A8","v":8},{"$f":"Etappen!B8","v":"Rundfahrt"},{"$f":"Etappen!A13","v":13},{"$f":"Etappen!B13","v":"Laubental"},{"$f":"Etappen!A18","v":18},{"$f":"Etappen!B18","v":"Graben"},{"$f":"Etappen!A23","v":23},{"$f":"Etappen!B23","v":"Edersfeld"},{"$f":"Etappen!A28","v":28},{"$f":"Etappen!B28","v":"Nagelberg"}]
["Datum",null,null,null,null,null,null,null,null,null,null,"Akku ","Akkuanzeige nach Tour",null,null,null,null,null,null,null,null,null,"Fahrzeit","KM","KM","KM",null,{"$f":"Etappen!A4","v":4},{"$f":"Etappen!B4","v":"Dittenheim"},{"$f":"Etappen!A9","v":9},{"$f":"Etappen!B9","v":"Wassertrüdingen"},{"$f":"Etappen!A14","v":14},{"$f":"Etappen!B14","v":"Rehlingen"},{"$f":"Etappen!A19","v":19},{"$f":"Etappen!B19","v":"Bubenheim"},{"$f":"Etappen!A24","v":24},{"$f":"Etappen!B24","v":"Gunzenhausen"},{"$f":"Etappen!A29","v":29},{"$f":"Etappen!B29","v":"Markt Berolzheim"}]
[null,null,"Start",null,"über",null,"über",null,"über",null,"Ziel","vorher",4,null,3,null,2,null,1,null,"0","leer","Computer","Computer","Bosch","Bosch",null,{"$f":"Etappen!A5","v":5},{"$f":"Etappen!B5","v":"Brommbachsee"},{"$f":"Etappen!A10","v":10},{"$f":"Etappen!B10","v":"Aufkirchen"},{"$f":"Etappen!A15","v":15},{"$f":"Etappen!B15","v":"Auhausen"},{"$f":"Etappen!A20","v":20},{"$f":"Etappen!B20","v":"Lengenfeld"},{"$f":"Etappen!A25","v":25},{"$f":"Etappen!B25","v":"Hometrainer Tgkl. (Tagesklinik)"},{"$f":"Etappen!A30","v":30},{"$f":"Etappen!B30","v":0}]
[null,null,null,null,null,null,null,null,null,null,null,"geladen",null,{"$f":"IF(O6=\"\",\"\",\"wechsel \")","v":""},null,{"$f":"IF(Q6=\"\",\"\",\"wechsel \")","v":""},null,{"$f":"IF(S6=\"\",\"\",\"wechsel \")","v":""},null,null,null,null,null,null,null,null,null,"BEMERKUNG"]
["2025-07-10",1,{"$f":"IF(B7=0,\"\",VLOOKUP(B7,Etappen!$1:$65497,2,FALSE))","v":"Zuhause"},8,{"$f":"IF(D7=0,\"\",VLOOKUP(D7,Etappen!$1:$65497,2,FALSE))","v":"Rundfahrt"},null,{"$f":"IF(F7=0,\"\",VLOOKUP(F7,Etappen!$1:$65497,2,FALSE))","v":""},null,{"$f":"IF(H7=0,\"\",VLOOKUP(H7,Etappen!$1:$65497,2,FALSE))","v":""},null,{"$f":"IF(J7=0,\"\",VLOOKUP(J7,Etappen!$1:$65497,2,FALSE))","v":""},null,null,{"$f":"IF(AND(M7=\"x\",O7=\"x\"),\"wechsel\",IF(AND(M7=\"x\",O7<>\"x\"),\"\",IF(AND(O7=\"x\",M7<>\"x\"),\"M fehlt\",\"A + B fehlt\")))","v":"A + B fehlt"},null,{"$f":"IF(AND(O7=\"x\",Q7=\"x\"),\"wechsel\",IF(AND(O7=\"x\",Q7<>\"x\"),\"\",IF(AND(Q7=\"x\",O7<>\"x\"),\"M fehlt\",\"A + B fehlt\")))","v":"A + B fehlt"},null,{"$f":"IF(AND(Q7=\"x\",S7=\"x\"),\"wechsel\",IF(AND(Q7=\"x\",S7<>\"x\"),\"\",IF(AND(S7=\"x\",Q7<>\"x\"),\"M fehlt\",\"A + B fehlt\")))","v":"A + B fehlt"},null,{"$f":"IF(AND(S7=\"x\",U7=\"x\"),\"wechsel\",IF(AND(S7=\"x\",U7<>\"x\"),\"\",IF(AND(U7=\"x\",S7<>\"x\"),\"M fehlt\",\"A + B fehlt\")))","v":"A + B fehlt"},null,null,null,0,14.41,{"$f":"IF(WEEKNUM(A7,2)<>WEEKNUM(A8,2),SUM(Y$7:Y7)-SUM(Z$6:Z6),\"\")","v":""}]
["2025-07-12",1,{"$f":"IF(B8=0,\"\",VLOOKUP(B8,Etappen!$1:$65497,2,FALSE))","v":"Zuhause"},29,{"$f":"IF(D8=0,\"\",VLOOKUP(D8,Etappen!$1:$65497,2,FALSE))","v":"Markt Berolzheim"},null,{"$f":"IF(F8=0,\"\",VLOOKUP(F8,Etappen!$1:$65497,2,FALSE))","v":""},null,{"$f":"IF(H8=0,\"\",VLOOKUP(H8,Etappen!$1:$65497,2,FALSE))","v":""},1,{"$f":"IF(J8=0,\"\",VLOOKUP(J8,Etappen!$1:$65497,2,FALSE))","v":"Zuhause"},null,null,"A + B fehlt",null,"A + B fehlt",null,"A + B fehlt",null,null,null,null,null,0,20.9,{"$f":"IF(WEEKNUM(A8,2)<>WEEKNUM(A9,2),SUM(Y$7:Y8)-SUM(Z$6:Z7),\"\")","v":""}]
["2025-07-13",1,{"$f":"IF(B9=0,\"\",VLOOKUP(B9,Etappen!$1:$65497,2,FALSE))","v":"Zuhause"},27,{"$f":"IF(D9=0,\"\",VLOOKUP(D9,Etappen!$1:$65497,2,FALSE))","v":"Weißenburg"},null,{"$f":"IF(F9=0,\"\",VLOOKUP(F9,Etappen!$1:$65497,2,FALSE))","v":""},null,{"$f":"IF(H9=0,\"\",VLOOKUP(H9,Etappen!$1:$65497,2,FALSE))","v":""},1,{"$f":"IF(J9=0,\"\",VLOOKUP(J9,Etappen!$1:$65497,2,FALSE))","v":"Zuhause"},"j","x",{"$f":"IF(AND(M9=\"x\",O9=\"x\"),\"wechsel\",IF(AND(M9=\"x\",O9<>\"x\"),\"\",IF(AND(O9=\"x\",M9<>\"x\"),\"M fehlt\",\"A + B fehlt\")))","v":""},null,{"$f":"IF(AND(O9=\"x\",Q9=\"x\"),\"wechsel\",IF(AND(O9=\"x\",Q9<>\"x\"),\"\",IF(AND(Q9=\"x\",O9<>\"x\"),\"M fehlt\",\"A + B fehlt\")))","v":"A + B fehlt"},null,{"$f":"IF(AND(Q9=\"x\",S9=\"x\"),\"wechsel\",IF(AND(Q9=\"x\",S9<>\"x\"),\"\",IF(AND(S9=\"x\",Q9<>\"x\"),\"M fehlt\",\"A + B fehlt\")))","v":"A + B fehlt"},null,null,null,null,null,22.09,22.09,{"$f":"IF(WEEKNUM(A9,2)<>WEEKNUM(A10,2),SUM(Y$7:Y9)-SUM(Z$6:Z8),\"\")","v":57.400000000000006},57.4]
[null,null,{"$f":"IF(B10=0,\"\",VLOOKUP(B10,Etappen!$1:$65497,2,FALSE))","v":""},null,{"$f":"IF(D10=0,\"\",VLOOKUP(D10,Etappen!$1:$65497,2,FALSE))","v":""},null,{"$f":"IF(F10=0,\"\",VLOOKUP(F10,Etappen!$1:$65497,2,FALSE))","v":""},null,{"$f":"IF(H10=0,\"\",VLOOKUP(H10,Etappen!$1:$65497,2,FALSE))","v":""},null,{"$f":"IF(J10=0,\"\",VLOOKUP(J10,Etappen!$1:$65497,2,FALSE))","v":""},null,null,"A + B fehlt",null,"A + B fehlt",null,"A + B fehlt",null,null,null,null,null,null,null,{"$f":"IF(WEEKNUM(A10,2)<>WEEKNUM(A11,2),SUM(Y$7:Y10)-SUM(Z$6:Z9),\"\")","v":""},{"$f":"SUM(AA9+Y10)","v":57.4}]
[null,null,{"$f":"IF(B11=0,\"\",VLOOKUP(B11,Etappen!$1:$65497,2,FALSE))","v":""},null,{"$f":"IF(D11=0,\"\",VLOOKUP(D11,Etappen!$1:$65497,2,FALSE))","v":""},null,{"$f":"IF(F11=0,\"\",VLOOKUP(F11,Etappen!$1:$65497,2,FALSE))","v":""},null,{"$f":"IF(H11=0,\"\",VLOOKUP(H11,Etappen!$1:$65497,2,FALSE))","v":""},null,{"$f":"IF(J11=0,\"\",VLOOKUP(J11,Etappen!$1:$65497,2,FALSE))","v":""},null,null,{"$f":"IF(AND(M11=\"x\",O11=\"x\"),\"wechsel\",IF(AND(M11=\"x\",O11<>\"x\"),\"\",IF(AND(O11=\"x\",M11<>\"x\"),\"M fehlt\",\"A + B fehlt\")))","v":"A + B fehlt"},null,"A + B fehlt",null,"A + B fehlt",null,null,null,null,null,null,null,{"$f":"IF(WEEKNUM(A11,2)<>WEEKNUM(A12,2),SUM(Y$7:Y11)-SUM(Z$6:Z10),\"\")","v":""},{"$f":"SUM(AA10+Y11)","v":57.4}]
[null,null,{"$f":"IF(B12=0,\"\",VLOOKUP(B12,Etappen!$1:$65497,2,FALSE))","v":""},null,{"$f":"IF(D12=0,\"\",VLOOKUP(D12,Etappen!$1:$65497,2,FALSE))","v":""},null,{"$f":"IF(F12=0,\"\",VLOOKUP(F12,Etappen!$1:$65497,2,FALSE))","v":""},null,{"$f":"IF(H12=0,\"\",VLOOKUP(H12,Etappen!$1:$65497,2,FALSE))","v":""},null,{"$f":"IF(J12=0,\"\",VLOOKUP(J12,Etappen!$1:$65497,2,FALSE))","v":""},null,null,{"$f":"IF(AND(M12=\"x\",O12=\"x\"),\"wechsel\",IF(AND(M12=\"x\",O12<>\"x\"),\"\",IF(AND(O12=\"x\",M12<>\"x\"),\"M fehlt\",\"A + B fehlt\")))","v":"A + B fehlt"},null,{"$f":"IF(AND(O12=\"x\",Q12=\"x\"),\"wechsel\",IF(AND(O12=\"x\",Q12<>\"x\"),\"\",IF(AND(Q12=\"x\",O12<>\"x\"),\"M fehlt\",\"A + B fehlt\")))","v":"A + B fehlt"},null,{"$f":"IF(AND(Q12=\"x\",S12=\"x\"),\"wechsel\",IF(AND(Q12=\"x\",S12<>\"x\"),\"\",IF(AND(S12=\"x\",Q12<>\"x\"),\"M fehlt\",\"A + B fehlt\")))","v":"A + B fehlt"},null,null,null,null,null,null,null,{"$f":"IF(WEEKNUM(A12,2)<>WEEKNUM(A13,2),SUM(Y$7:Y12)-SUM(Z$6:Z11),\"\")","v":""},57.4]
[null,null,{"$f":"IF(B13=0,\"\",VLOOKUP(B13,Etappen!$1:$65497,2,FALSE))","v":""},null,{"$f":"IF(D13=0,\"\",VLOOKUP(D13,Etappen!$1:$65497,2,FALSE))","v":""},null,{"$f":"IF(F13=0,\"\",VLOOKUP(F13,Etappen!$1:$65497,2,FALSE))","v":""},null,{"$f":"IF(H13=0,\"\",VLOOKUP(H13,Etappen!$1:$65497,2,FALSE))","v":""},null,{"$f":"IF(J13=0,\"\",VLOOKUP(J13,Etappen!$1:$65497,2,FALSE))","v":""},null,null,"A + B fehlt",null,{"$f":"IF(AND(O13=\"x\",Q13=\"x\"),\"wechsel\",IF(AND(O13=\"x\",Q13<>\"x\"),\"\",IF(AND(Q13=\"x\",O13<>\"x\"),\"M fehlt\",\"A + B fehlt\")))","v":"A + B fehlt"},null,{"$f":"IF(AND(Q13=\"x\",S13=\"x\"),\"wechsel\",IF(AND(Q13=\"x\",S13<>\"x\"),\"\",IF(AND(S13=\"x\",Q13<>\"x\"),\"M fehlt\",\"A + B fehlt\")))","v":"A + B fehlt"},null,null,null,null,null,null,null,{"$f":"IF(WEEKNUM(A13,2)<>WEEKNUM(A14,2),SUM(Y$7:Y13)-SUM(Z$6:Z12),\"\")","v":""},57.4]
[null,null,{"$f":"IF(B14=0,\"\",VLOOKUP(B14,Etappen!$1:$65497,2,FALSE))","v":""},null,{"$f":"IF(D14=0,\"\",VLOOKUP(D14,Etappen!$1:$65497,2,FALSE))","v":""},null,{"$f":"IF(F14=0,\"\",VLOOKUP(F14,Etappen!$1:$65497,2,FALSE))","v":""},null,{"$f":"IF(H14=0,\"\",VLOOKUP(H14,Etappen!$1:$65497,2,FALSE))","v":""},null,{"$f":"IF(J14=0,\"\",VLOOKUP(J14,Etappen!$1:$65497,2,FALSE))","v":""},null,null,"A + B fehlt",null,{"$f":"IF(AND(O14=\"x\",Q14=\"x\"),\"wechsel\",IF(AND(O14=\"x\",Q14<>\"x\"),\"\",IF(AND(Q14=\"x\",O14<>\"x\"),\"M fehlt\",\"A + B fehlt\")))","v":"A + B fehlt"},null,{"$f":"IF(AND(Q14=\"x\",S14=\"x\"),\"wechsel\",IF(AND(Q14=\"x\",S14<>\"x\"),\"\",IF(AND(S14=\"x\",Q14<>\"x\"),\"M fehlt\",\"A + B fehlt\")))","v":"A + B fehlt"},null,null,null,null,null,null,null,{"$f":"IF(WEEKNUM(A14,2)<>WEEKNUM(A15,2),SUM(Y$7:Y14)-SUM(Z$6:Z13),\"\")","v":""},57.4]
[null,null,{"$f":"IF(B15=0,\"\",VLOOKUP(B15,Etappen!$1:$65497,2,FALSE))","v":""},null,{"$f":"IF(D15=0,\"\",VLOOKUP(D15,Etappen!$1:$65497,2,FALSE))","v":""},null,{"$f":"IF(F15=0,\"\",VLOOKUP(F15,Etappen!$1:$65497,2,FALSE))","v":""},null,{"$f":"IF(H15=0,\"\",VLOOKUP(H15,Etappen!$1:$65497,2,FALSE))","v":""},null,{"$f":"IF(J15=0,\"\",VLOOKUP(J15,Etappen!$1:$65497,2,FALSE))","v":""},null,null,"A + B fehlt",null,{"$f":"IF(AND(O15=\"x\",Q15=\"x\"),\"wechsel\",IF(AND(O15=\"x\",Q15<>\"x\"),\"\",IF(AND(Q15=\"x\",O15<>\"x\"),\"M fehlt\",\"A + B fehlt\")))","v":"A + B fehlt"},null,{"$f":"IF(AND(Q15=\"x\",S15=\"x\"),\"wechsel\",IF(AND(Q15=\"x\",S15<>\"x\"),\"\",IF(AND(S15=\"x\",Q15<>\"x\"),\"M fehlt\",\"A + B fehlt\")))","v":"A + B fehlt"},null,null,null,null,null,null,null,{"$f":"IF(WEEKNUM(A15,2)<>WEEKNUM(A16,2),SUM(Y$7:Y15)-SUM(Z$6:Z14),\"\")","v":""},57.4]
[null,null,{"$f":"IF(B16=0,\"\",VLOOKUP(B16,Etappen!$1:$65497,2,FALSE))","v":""},null,{"$f":"IF(D16=0,\"\",VLOOKUP(D16,Etappen!$1:$65497,2,FALSE))","v":""},null,{"$f":"IF(F16=0,\"\",VLOOKUP(F16,Etappen!$1:$65497,2,FALSE))","v":""},null,{"$f":"IF(H16=0,\"\",VLOOKUP(H16,Etappen!$1:$65497,2,FALSE))","v":""},null,{"$f":"IF(J16=0,\"\",VLOOKUP(J16,Etappen!$1:$65497,2,FALSE))","v":""},null,null,"A + B fehlt",null,{"$f":"IF(AND(O16=\"x\",Q16=\"x\"),\"wechsel\",IF(AND(O16=\"x\",Q16<>\"x\"),\"\",IF(AND(Q16=\"x\",O16<>\"x\"),\"M fehlt\",\"A + B fehlt\")))","v":"A + B fehlt"},null,{"$f":"IF(AND(Q16=\"x\",S16=\"x\"),\"wechsel\",IF(AND(Q16=\"x\",S16<>\"x\"),\"\",IF(AND(S16=\"x\",Q16<>\"x\"),\"M fehlt\",\"A + B fehlt\")))","v":"A + B fehlt"},null,null,null,null,null,null,null,{"$f":"IF(WEEKNUM(A16,2)<>WEEKNUM(A17,2),SUM(Y$7:Y16)-SUM(Z$6:Z15),\"\")","v":""},57.4]
[null,null,{"$f":"IF(B17=0,\"\",VLOOKUP(B17,Etappen!$1:$65497,2,FALSE))","v":""},null,{"$f":"IF(D17=0,\"\",VLOOKUP(D17,Etappen!$1:$65497,2,FALSE))","v":""},null,{"$f":"IF(F17=0,\"\",VLOOKUP(F17,Etappen!$1:$65497,2,FALSE))","v":""},null,{"$f":"IF(H17=0,\"\",VLOOKUP(H17,Etappen!$1:$65497,2,FALSE))","v":""},null,{"$f":"IF(J17=0,\"\",VLOOKUP(J17,Etappen!$1:$65497,2,FALSE))","v":""},null,null,"A + B fehlt",null,{"$f":"IF(AND(O17=\"x\",Q17=\"x\"),\"wechsel\",IF(AND(O17=\"x\",Q17<>\"x\"),\"\",IF(AND(Q17=\"x\",O17<>\"x\"),\"M fehlt\",\"A + B fehlt\")))","v":"A + B fehlt"},null,{"$f":"IF(AND(Q17=\"x\",S17=\"x\"),\"wechsel\",IF(AND(Q17=\"x\",S17<>\"x\"),\"\",IF(AND(S17=\"x\",Q17<>\"x\"),\"M fehlt\",\"A + B fehlt\")))","v":"A + B fehlt"},null,null,null,null,null,null,null,{"$f":"IF(WEEKNUM(A17,2)<>WEEKNUM(A18,2),SUM(Y$7:Y17)-SUM(Z$6:Z16),\"\")","v":""},57.4]
[null,null,{"$f":"IF(B18=0,\"\",VLOOKUP(B18,Etappen!$1:$65497,2,FALSE))","v":""},null,{"$f":"IF(D18=0,\"\",VLOOKUP(D18,Etappen!$1:$65497,2,FALSE))","v":""},null,{"$f":"IF(F18=0,\"\",VLOOKUP(F18,Etappen!$1:$65497,2,FALSE))","v":""},null,{"$f":"IF(H18=0,\"\",VLOOKUP(H18,Etappen!$1:$65497,2,FALSE))","v":""},null,{"$f":"IF(J18=0,\"\",VLOOKUP(J18,Etappen!$1:$65497,2,FALSE))","v":""},null,null,"A + B fehlt",null,{"$f":"IF(AND(O18=\"x\",Q18=\"x\"),\"wechsel\",IF(AND(O18=\"x\",Q18<>\"x\"),\"\",IF(AND(Q18=\"x\",O18<>\"x\"),\"M fehlt\",\"A + B fehlt\")))","v":"A + B fehlt"},null,{"$f":"IF(AND(Q18=\"x\",S18=\"x\"),\"wechsel\",IF(AND(Q18=\"x\",S18<>\"x\"),\"\",IF(AND(S18=\"x\",Q18<>\"x\"),\"M fehlt\",\"A + B fehlt\")))","v":"A + B fehlt"},null,null,null,null,null,null,null,{"$f":"IF(WEEKNUM(A18,2)<>WEEKNUM(A19,2),SUM(Y$7:Y18)-SUM(Z$6:Z17),\"\")","v":""},57.4]
[null,null,{"$f":"IF(B19=0,\"\",VLOOKUP(B19,Etappen!$1:$65497,2,FALSE))","v":""},null,{"$f":"IF(D19=0,\"\",VLOOKUP(D19,Etappen!$1:$65497,2,FALSE))","v":""},null,{"$f":"IF(F19=0,\"\",VLOOKUP(F19,Etappen!$1:$65497,2,FALSE))","v":""},null,{"$f":"IF(H19=0,\"\",VLOOKUP(H19,Etappen!$1:$65497,2,FALSE))","v":""},null,{"$f":"IF(J19=0,\"\",VLOOKUP(J19,Etappen!$1:$65497,2,FALSE))","v":""},null,null,"A + B fehlt",null,{"$f":"IF(AND(O19=\"x\",Q19=\"x\"),\"wechsel\",IF(AND(O19=\"x\",Q19<>\"x\"),\"\",IF(AND(Q19=\"x\",O19<>\"x\"),\"M fehlt\",\"A + B fehlt\")))","v":"A + B fehlt"},null,{"$f":"IF(AND(Q19=\"x\",S19=\"x\"),\"wechsel\",IF(AND(Q19=\"x\",S19<>\"x\"),\"\",IF(AND(S19=\"x\",Q19<>\"x\"),\"M fehlt\",\"A + B fehlt\")))","v":"A + B fehlt"},null,null,null,null,null,null,null,{"$f":"IF(WEEKNUM(A19,2)<>WEEKNUM(A20,2),SUM(Y$7:Y19)-SUM(Z$6:Z18),\"\")","v":""},57.4]
[null,null,{"$f":"IF(B20=0,\"\",VLOOKUP(B20,Etappen!$1:$65497,2,FALSE))","v":""},null,{"$f":"IF(D20=0,\"\",VLOOKUP(D20,Etappen!$1:$65497,2,FALSE))","v":""},null,{"$f":"IF(F20=0,\"\",VLOOKUP(F20,Etappen!$1:$65497,2,FALSE))","v":""},null,{"$f":"IF(H20=0,\"\",VLOOKUP(H20,Etappen!$1:$65497,2,FALSE))","v":""},null,{"$f":"IF(J20=0,\"\",VLOOKUP(J20,Etappen!$1:$65497,2,FALSE))","v":""},null,null,"A + B fehlt",null,{"$f":"IF(AND(O20=\"x\",Q20=\"x\"),\"wechsel\",IF(AND(O20=\"x\",Q20<>\"x\"),\"\",IF(AND(Q20=\"x\",O20<>\"x\"),\"M fehlt\",\"A + B fehlt\")))","v":"A + B fehlt"},null,{"$f":"IF(AND(Q20=\"x\",S20=\"x\"),\"wechsel\",IF(AND(Q20=\"x\",S20<>\"x\"),\"\",IF(AND(S20=\"x\",Q20<>\"x\"),\"M fehlt\",\"A + B fehlt\")))","v":"A + B fehlt"},null,null,null,null,null,null,null,{"$f":"IF(WEEKNUM(A20,2)<>WEEKNUM(A21,2),SUM(Y$7:Y20)-SUM(Z$6:Z19),\"\")","v":""}]
{"$rows_left_out":281}
{"sheet":"Etappen","index":1,"n_rows":40,"n_cols":2,"rows_kept":40,"cut":false,"hidden":false,"merged":[]}
[1,"Zuhause"]
[2,"Aldi"]
[3,"Windsfeld"]
[4,"Dittenheim"]
[5,"Brommbachsee"]
[6,"Altmühlsee"]
[7,"Mörnsheim"]
[8,"Rundfahrt"]
[9,"Wassertrüdingen"]
[10,"Aufkirchen"]
[11,"Gerolfingen"]
[12,"Campingplatz"]
[13,"Laubental"]
[14,"Rehlingen"]
[15,"Auhausen"]
[16,"Wettelsheim"]
[17,"MC Donald WUG"]
[18,"Graben"]
[19,"Bubenheim"]
[20,"Lengenfeld"]
{"$rows_left_out":21}
{"sheet":"Tabelle3","index":2,"n_rows":0,"n_cols":0,"rows_kept":0,"cut":false,"hidden":false,"merged":[]}