{"text_format":"1","workbook":"xlsx","n_sheets":3,"sheets":["Tabelle1","Etappen","Tabelle3"],"not_rendered":{"charts":0,"images":0,"macros":1,"external_links":0,"defined_names":0,"comments":0,"pivot_tables":0},"unopened":[],"bounds":{"document_bytes":16777216,"sheet_cells":100000,"rows_first":2000,"rows_last":500,"rows_between":2000,"halvings":0,"cell_chars":16384,"cell_head_chars":4096},"cells_cut":0,"cells_raw":0,"read":"whole","date_system":"1900"}

{"sheet":"Tabelle1","index":0,"n_rows":300,"n_cols":39,"rows_kept":300,"cut":false,"hidden":false,"merged":[[297,27,297,38],[298,27,298,38],[299,27,299,38],[74,27,74,38],[75,27,75,38],[76,27,76,38],[77,27,77,38],[50,27,50,38],[51,27,51,38],[52,27,52,38],[53,27,53,38],[111,27,111,38],[95,27,95,38],[96,27,96,38],[97,27,97,38],[98,27,98,38],[99,27,99,38],[100,27,100,38],[101,27,101,38],[102,27,102,38],[103,27,103,38],[104,27,104,38],[105,27,105,38],[106,27,106,38],[295,27,295,38],[296,27,296,38],[37,27,37,38],[38,27,38,38],[39,27,39,38],[42,27,42,38],[43,27,43,38],[44,27,44,38],[45,27,45,38],[56,27,56,38],[57,27,57,38],[58,27,58,38],[136,27,136,38],[137,27,137,38],[108,27,108,38],[109,27,109,38],[110,27,110,38],[207,27,207,38],[162,27,162,38],[163,27,163,38],[149,27,149,38],[150,27,150,38],[151,27,151,38],[152,27,152,38],[14,27,14,38],[15,27,15,38],[16,27,16,38],[22,27,22,38],[35,27,35,38],[36,27,36,38],[11,27,11,38],[12,27,12,38],[23,27,23,38],[24,27,24,38],[30,27,30,38],[153,27,153,38],[154,27,154,38],[3,12,3,21],[7,27,7,38],[8,27,8,38],[9,27,9,38],[31,27,31,38],[32,27,32,38],[33,27,33,38],[34,27,34,38],[40,27,40,38],[17,27,17,38],[18,27,18,38],[19,27,19,38],[20,27,20,38],[21,27,21,38],[6,27,6,38],[5,27,5,38],[10,27,10,38],[13,27,13,38],[138,27,138,38],[139,27,139,38],[140,27,140,38],[141,27,141,38],[144,27,144,38],[145,27,145,38],[146,27,146,38],[147,27,147,38],[148,27,148,38],[192,27,192,38],[193,27,193,38],[194,27,194,38],[195,27,195,38],[172,27,172,38],[173,27,173,38],[168,27,168,38],[169,27,169,38],[170,27,170,38],[171,27,171,38],[155,27,155,38],[156,27,156,38],[157,27,157,38],[158,27,158,38],[159,27,159,38],[160,27,160,38],[161,27,161,38],[164,27,164,38],[165,27,165,38],[204,27,204,38],[205,27,205,38],[206,27,206,38],[271,27,271,38],[208,27,208,38],[209,27,209,38],[210,27,210,38],[252,27,252,38],[253,27,253,38],[231,27,231,38],[215,27,215,38],[216,27,216,38],[217,27,217,38],[218,27,218,38],[211,27,211,38],[212,27,212,38],[213,27,213,38],[214,27,214,38],[219,27,219,38],[220,27,220,38],[221,27,221,38],[222,27,222,38],[223,27,223,38],[224,27,224,38],[225,27,225,38],[226,27,226,38],[227,27,227,38],[272,27,272,38],[273,27,273,38],[0,1,1,18],[0,22,1,22],[0,23,1,23],[0,24,1,24],[0,19,1,21],[241,27,241,38],[242,27,242,38],[243,27,243,38],[244,27,244,38],[228,27,228,38],[229,27,229,38],[230,27,230,38],[25,27,25,38],[26,27,26,38],[27,27,27,38],[28,27,28,38],[29,27,29,38],[41,27,41,38],[54,27,54,38],[283,27,283,38],[258,27,258,38],[259,27,259,38],[260,27,260,38],[261,27,261,38],[245,27,245,38],[246,27,246,38],[247,27,247,38],[248,27,248,38],[274,27,274,38],[275,27,275,38],[276,27,276,38],[277,27,277,38],[278,27,278,38],[279,27,279,38],[280,27,280,38],[281,27,281,38],[282,27,282,38],[254,27,254,38],[255,27,255,38],[256,27,256,38],[257,27,257,38],[55,27,55,38],[48,27,48,38],[49,27,49,38],[46,27,46,38],[47,27,47,38],[59,27,59,38],[60,27,60,38],[61,27,61,38],[62,27,62,38],[63,27,63,38],[64,27,64,38],[69,27,69,38],[70,27,70,38],[71,27,71,38],[72,27,72,38],[73,27,73,38],[84,27,84,38],[85,27,85,38],[82,27,82,38],[83,27,83,38],[78,27,78,38],[79,27,79,38],[80,27,80,38],[81,27,81,38],[65,27,65,38],[66,27,66,38],[67,27,67,38],[68,27,68,38],[86,27,86,38],[87,27,87,38],[88,27,88,38],[89,27,89,38],[90,27,90,38],[112,27,112,38],[113,27,113,38],[91,27,91,38],[92,27,92,38],[93,27,93,38],[94,27,94,38],[107,27,107,38],[114,27,114,38],[115,27,115,38],[116,27,116,38],[117,27,117,38],[118,27,118,38],[119,27,119,38],[120,27,120,38],[142,27,142,38],[143,27,143,38],[125,27,125,38],[126,27,126,38],[127,27,127,38],[128,27,128,38],[121,27,121,38],[122,27,122,38],[123,27,123,38],[124,27,124,38],[129,27,129,38],[130,27,130,38],[131,27,131,38],[132,27,132,38],[133,27,133,38],[134,27,134,38],[135,27,135,38],[166,27,166,38],[167,27,167,38],[174,27,174,38],[175,27,175,38],[176,27,176,38],[177,27,177,38],[178,27,178,38],[179,27,179,38],[180,27,180,38],[202,27,202,38],[203,27,203,38],[181,27,181,38],[182,27,182,38],[183,27,183,38],[184,27,184,38],[198,27,198,38],[199,27,199,38],[200,27,200,38],[201,27,201,38],[185,27,185,38],[186,27,186,38],[187,27,187,38],[188,27,188,38],[189,27,189,38],[190,27,190,38],[191,27,191,38],[196,27,196,38],[197,27,197,38],[232,27,232,38],[233,27,233,38],[234,27,234,38],[235,27,235,38],[236,27,236,38],[237,27,237,38],[238,27,238,38],[239,27,239,38],[240,27,240,38],[293,27,293,38],[294,27,294,38],[2,22,2,23],[284,27,284,38],[285,27,285,38],[286,27,286,38],[287,27,287,38],[288,27,288,38],[289,27,289,38],[290,27,290,38],[291,27,291,38],[292,27,292,38],[262,27,262,38],[263,27,263,38],[264,27,264,38],[265,27,265,38],[266,27,266,38],[267,27,267,38],[268,27,268,38],[269,27,269,38],[270,27,270,38],[249,27,249,38],[250,27,250,38],[251,27,251,38]]}
[null,"Fahradtouren 2025",null,null,null,null,null,null,null,null,null,null,null,null,null,null,null,null,null,"Gesamt    gefahren  ",null,null,{"$f":"SUM(W6:W295)","v":"00:00:00"},{"$f":"SUM(X7:X300)","v":22.09},{"$f":"SUM(Y7:Y300)","v":57.400000000000006},null,null,{"$f":"Etappen!A1","v":1},{"$f":"Etappen!B1","v":"Zuhause"},{"$f":"Etappen!A6","v":6},{"$f":"Etappen!B6","v":"Altmühlsee"},{"$f":"Etappen!A11","v":11},{"$f":"Etappen!B11","v":"Gerolfingen"},{"$f":"Etappen!A16","v":16},{"$f":"Etappen!B16","v":"Wettelsheim"},{"$f":"Etappen!A21","v":21},{"$f":"Etappen!B21","v":"Pappenh. Schleusinger"},{"$f":"Etappen!A26","v":26},{"$f":"Etappen!B26","v":"Krankenhaus WUG"}]
[{"$f":"A1","v":"00:00:00"},null,null,null,null,null,null,null,null,null,null,null,null,null,null,null,null,null,null,null,null,null,null,null,null,null,null,{"$f":"Etappen!A2","v":2},{"$f":"Etappen!B2","v":"Aldi"},{"$f":"Etappen!A7","v":7},{"$f":"Etappen!B7","v":"Mörnsheim"},{"$f":"Etappen!A12","v":12},{"$f":"Etappen!B12","v":"Campingplatz"},{"$f":"Etappen!A17","v":17},{"$f":"Etappen!B17","v":"MC Donald WUG"},{"$f":"Etappen!A22","v":22},{"$f":"Etappen!B22","v":"Kaufland WUG"},{"$f":"Etappen!A27","v":27},{"$f":"Etappen!B27","v":"Weißenburg"}]
[null,null,null,null,null,null,null,null,null,null,null,null,null,null,null,null,null,null,null,null,null,null,null,null,null,null,null,{"$f":"Etappen!A3","v":3},{"$f":"Etappen!B3","v":"Windsfeld"},{"$f":"Etappen!A8","v":8},{"$f":"Etappen!B8","v":"Rundfahrt"},{"$f":"Etappen!A13","v":13},{"$f":"Etappen!B13","v":"Laubental"},{"$f":"Etappen!A18","v":18},{"$f":"Etappen!B18","v":"Graben"},{"$f":"Etappen!A23","v":23},{"$f":"Etappen!B23","v":"Edersfeld"},{"$f":"Etappen!A28","v":28},{"$f":"Etappen!B28","v":"Nagelberg"}]
["Datum",null,null,null,null,null,null,null,null,null,null,"Akku ","Akkuanzeige nach Tour",null,null,null,null,null,null,null,null,null,"Fahrzeit","KM","KM","KM",null,{"$f":"Etappen!A4","v":4},{"$f":"Etappen!B4","v":"Dittenheim"},{"$f":"Etappen!A9","v":9},{"$f":"Etappen!B9","v":"Wassertrüdingen"},{"$f":"Etappen!A14","v":14},{"$f":"Etappen!B14","v":"Rehlingen"},{"$f":"Etappen!A19","v":19},{"$f":"Etappen!B19","v":"Bubenheim"},{"$f":"Etappen!A24","v":24},{"$f":"Etappen!B24","v":"Gunzenhausen"},{"$f":"Etappen!A29","v":29},{"$f":"Etappen!B29","v":"Markt Berolzheim"}]
[null,null,"Start",null,"über",null,"über",null,"über",null,"Ziel","vorher",4,null,3,null,2,null,1,null,"0","leer","Computer","Computer","Bosch","Bosch",null,{"$f":"Etappen!A5","v":5},{"$f":"Etappen!B5","v":"Brommbachsee"},{"$f":"Etappen!A10","v":10},{"$f":"Etappen!B10","v":"Aufkirchen"},{"$f":"Etappen!A15","v":15},{"$f":"Etappen!B15","v":"Auhausen"},{"$f":"Etappen!A20","v":20},{"$f":"Etappen!B20","v":"Lengenfeld"},{"$f":"Etappen!A25","v":25},{"$f":"Etappen!B25","v":"Hometrainer Tgkl. (Tagesklinik)"},{"$f":"Etappen!A30","v":30},{"$f":"Etappen!B30","v":0}]
[null,null,null,null,null,null,null,null,null,null,null,"geladen",null,{"$f":"IF(O6=\"\",\"\",\"wechsel \")","v":""},null,{"$f":"IF(Q6=\"\",\"\",\"wechsel \")","v":""},null,{"$f":"IF(S6=\"\",\"\",\"wechsel \")","v":""},null,null,null,null,null,null,null,null,null,"BEMERKUNG"]
["2025-07-10",1,{"$f":"IF(B7=0,\"\",VLOOKUP(B7,Etappen!$1:$65497,2,FALSE))","v":"Zuhause"},8,{"$f":"IF(D7=0,\"\",VLOOKUP(D7,Etappen!$1:$65497,2,FALSE))","v":"Rundfahrt"},null,{"$f":"IF(F7=0,\"\",VLOOKUP(F7,Etappen!$1:$65497,2,FALSE))","v":""},null,{"$f":"IF(H7=0,\"\",VLOOKUP(H7,Etappen!$1:$65497,2,FALSE))","v":""},null,{"$f":"IF(J7=0,\"\",VLOOKUP(J7,Etappen!$1:$65497,2,FALSE))","v":""},null,null,{"$f":"IF(AND(M7=\"x\",O7=\"x\"),\"wechsel\",IF(AND(M7=\"x\",O7<>\"x\"),\"\",IF(AND(O7=\"x\",M7<>\"x\"),\"M fehlt\",\"A + B fehlt\")))","v":"A + B fehlt"},null,{"$f":"IF(AND(O7=\"x\",Q7=\"x\"),\"wechsel\",IF(AND(O7=\"x\",Q7<>\"x\"),\"\",IF(AND(Q7=\"x\",O7<>\"x\"),\"M fehlt\",\"A + B fehlt\")))","v":"A + B fehlt"},null,{"$f":"IF(AND(Q7=\"x\",S7=\"x\"),\"wechsel\",IF(AND(Q7=\"x\",S7<>\"x\"),\"\",IF(AND(S7=\"x\",Q7<>\"x\"),\"M fehlt\",\"A + B fehlt\")))","v":"A + B fehlt"},null,{"$f":"IF(AND(S7=\"x\",U7=\"x\"),\"wechsel\",IF(AND(S7=\"x\",U7<>\"x\"),\"\",IF(AND(U7=\"x\",S7<>\"x\"),\"M fehlt\",\"A + B fehlt\")))","v":"A + B fehlt"},null,null,null,0,14.41,{"$f":"IF(WEEKNUM(A7,2)<>WEEKNUM(A8,2),SUM(Y$7:Y7)-SUM(Z$6:Z6),\"\")","v":""}]
["2025-07-12",1,{"$f":"IF(B8=0,\"\",VLOOKUP(B8,Etappen!$1:$65497,2,FALSE))","v":"Zuhause"},29,{"$f":"IF(D8=0,\"\",VLOOKUP(D8,Etappen!$1:$65497,2,FALSE))","v":"Markt Berolzheim"},null,{"$f":"IF(F8=0,\"\",VLOOKUP(F8,Etappen!$1:$65497,2,FALSE))","v":""},null,{"$f":"IF(H8=0,\"\",VLOOKUP(H8,Etappen!$1:$65497,2,FALSE))","v":""},1,{"$f":"IF(J8=0,\"\",VLOOKUP(J8,Etappen!$1:$65497,2,FALSE))","v":"Zuhause"},null,null,"A + B fehlt",null,"A + B fehlt",null,"A + B fehlt",null,null,null,null,null,0,20.9,{"$f":"IF(WEEKNUM(A8,2)<>WEEKNUM(A9,2),SUM(Y$7:Y8)-SUM(Z$6:Z7),\"\")","v":""}]
["2025-07-13",1,{"$f":"IF(B9=0,\"\",VLOOKUP(B9,Etappen!$1:$65497,2,FALSE))","v":"Zuhause"},27,{"$f":"IF(D9=0,\"\",VLOOKUP(D9,Etappen!$1:$65497,2,FALSE))","v":"Weißenburg"},null,{"$f":"IF(F9=0,\"\",VLOOKUP(F9,Etappen!$1:$65497,2,FALSE))","v":""},null,{"$f":"IF(H9=0,\"\",VLOOKUP(H9,Etappen!$1:$65497,2,FALSE))","v":""},1,{"$f":"IF(J9=0,\"\",VLOOKUP(J9,Etappen!$1:$65497,2,FALSE))","v":"Zuhause"},"j","x",{"$f":"IF(AND(M9=\"x\",O9=\"x\"),\"wechsel\",IF(AND(M9=\"x\",O9<>\"x\"),\"\",IF(AND(O9=\"x\",M9<>\"x\"),\"M fehlt\",\"A + B fehlt\")))","v":""},null,{"$f":"IF(AND(O9=\"x\",Q9=\"x\"),\"wechsel\",IF(AND(O9=\"x\",Q9<>\"x\"),\"\",IF(AND(Q9=\"x\",O9<>\"x\"),\"M fehlt\",\"A + B fehlt\")))","v":"A + B fehlt"},null,{"$f":"IF(AND(Q9=\"x\",S9=\"x\"),\"wechsel\",IF(AND(Q9=\"x\",S9<>\"x\"),\"\",IF(AND(S9=\"x\",Q9<>\"x\"),\"M fehlt\",\"A + B fehlt\")))","v":"A + B fehlt"},null,null,null,null,null,22.09,22.09,{"$f":"IF(WEEKNUM(A9,2)<>WEEKNUM(A10,2),SUM(Y$7:Y9)-SUM(Z$6:Z8),\"\")","v":57.400000000000006},57.4]
[null,null,{"$f":"IF(B10=0,\"\",VLOOKUP(B10,Etappen!$1:$65497,2,FALSE))","v":""},null,{"$f":"IF(D10=0,\"\",VLOOKUP(D10,Etappen!$1:$65497,2,FALSE))","v":""},null,{"$f":"IF(F10=0,\"\",VLOOKUP(F10,Etappen!$1:$65497,2,FALSE))","v":""},null,{"$f":"IF(H10=0,\"\",VLOOKUP(H10,Etappen!$1:$65497,2,FALSE))","v":""},null,{"$f":"IF(J10=0,\"\",VLOOKUP(J10,Etappen!$1:$65497,2,FALSE))","v":""},null,null,"A + B fehlt",null,"A + B fehlt",null,"A + B fehlt",null,null,null,null,null,null,null,{"$f":"IF(WEEKNUM(A10,2)<>WEEKNUM(A11,2),SUM(Y$7:Y10)-SUM(Z$6:Z9),\"\")","v":""},{"$f":"SUM(AA9+Y10)","v":57.4}]
[null,null,{"$f":"IF(B11=0,\"\",VLOOKUP(B11,Etappen!$1:$65497,2,FALSE))","v":""},null,{"$f":"IF(D11=0,\"\",VLOOKUP(D11,Etappen!$1:$65497,2,FALSE))","v":""},null,{"$f":"IF(F11=0,\"\",VLOOKUP(F11,Etappen!$1:$65497,2,FALSE))","v":""},null,{"$f":"IF(H11=0,\"\",VLOOKUP(H11,Etappen!$1:$65497,2,FALSE))","v":""},null,{"$f":"IF(J11=0,\"\",VLOOKUP(J11,Etappen!$1:$65497,2,FALSE))","v":""},null,null,{"$f":"IF(AND(M11=\"x\",O11=\"x\"),\"wechsel\",IF(AND(M11=\"x\",O11<>\"x\"),\"\",IF(AND(O11=\"x\",M11<>\"x\"),\"M fehlt\",\"A + B fehlt\")))","v":"A + B fehlt"},null,"A + B fehlt",null,"A + B fehlt",null,null,null,null,null,null,null,{"$f":"IF(WEEKNUM(A11,2)<>WEEKNUM(A12,2),SUM(Y$7:Y11)-SUM(Z$6:Z10),\"\")","v":""},{"$f":"SUM(AA10+Y11)","v":57.4}]
[null,null,{"$f":"IF(B12=0,\"\",VLOOKUP(B12,Etappen!$1:$65497,2,FALSE))","v":""},null,{"$f":"IF(D12=0,\"\",VLOOKUP(D12,Etappen!$1:$65497,2,FALSE))","v":""},null,{"$f":"IF(F12=0,\"\",VLOOKUP(F12,Etappen!$1:$65497,2,FALSE))","v":""},null,{"$f":"IF(H12=0,\"\",VLOOKUP(H12,Etappen!$1:$65497,2,FALSE))","v":""},null,{"$f":"IF(J12=0,\"\",VLOOKUP(J12,Etappen!$1:$65497,2,FALSE))","v":""},null,null,{"$f":"IF(AND(M12=\"x\",O12=\"x\"),\"wechsel\",IF(AND(M12=\"x\",O12<>\"x\"),\"\",IF(AND(O12=\"x\",M12<>\"x\"),\"M fehlt\",\"A + B fehlt\")))","v":"A + B fehlt"},null,{"$f":"IF(AND(O12=\"x\",Q12=\"x\"),\"wechsel\",IF(AND(O12=\"x\",Q12<>\"x\"),\"\",IF(AND(Q12=\"x\",O12<>\"x\"),\"M fehlt\",\"A + B fehlt\")))","v":"A + B fehlt"},null,{"$f":"IF(AND(Q12=\"x\",S12=\"x\"),\"wechsel\",IF(AND(Q12=\"x\",S12<>\"x\"),\"\",IF(AND(S12=\"x\",Q12<>\"x\"),\"M fehlt\",\"A + B fehlt\")))","v":"A + B fehlt"},null,null,null,null,null,null,null,{"$f":"IF(WEEKNUM(A12,2)<>WEEKNUM(A13,2),SUM(Y$7:Y12)-SUM(Z$6:Z11),\"\")","v":""},57.4]
[null,null,{"$f":"IF(B13=0,\"\",VLOOKUP(B13,Etappen!$1:$65497,2,FALSE))","v":""},null,{"$f":"IF(D13=0,\"\",VLOOKUP(D13,Etappen!$1:$65497,2,FALSE))","v":""},null,{"$f":"IF(F13=0,\"\",VLOOKUP(F13,Etappen!$1:$65497,2,FALSE))","v":""},null,{"$f":"IF(H13=0,\"\",VLOOKUP(H13,Etappen!$1:$65497,2,FALSE))","v":""},null,{"$f":"IF(J13=0,\"\",VLOOKUP(J13,Etappen!$1:$65497,2,FALSE))","v":""},null,null,"A + B fehlt",null,{"$f":"IF(AND(O13=\"x\",Q13=\"x\"),\"wechsel\",IF(AND(O13=\"x\",Q13<>\"x\"),\"\",IF(AND(Q13=\"x\",O13<>\"x\"),\"M fehlt\",\"A + B fehlt\")))","v":"A + B fehlt"},null,{"$f":"IF(AND(Q13=\"x\",S13=\"x\"),\"wechsel\",IF(AND(Q13=\"x\",S13<>\"x\"),\"\",IF(AND(S13=\"x\",Q13<>\"x\"),\"M fehlt\",\"A + B fehlt\")))","v":"A + B fehlt"},null,null,null,null,null,null,null,{"$f":"IF(WEEKNUM(A13,2)<>WEEKNUM(A14,2),SUM(Y$7:Y13)-SUM(Z$6:Z12),\"\")","v":""},57.4]
[null,null,{"$f":"IF(B14=0,\"\",VLOOKUP(B14,Etappen!$1:$65497,2,FALSE))","v":""},null,{"$f":"IF(D14=0,\"\",VLOOKUP(D14,Etappen!$1:$65497,2,FALSE))","v":""},null,{"$f":"IF(F14=0,\"\",VLOOKUP(F14,Etappen!$1:$65497,2,FALSE))","v":""},null,{"$f":"IF(H14=0,\"\",VLOOKUP(H14,Etappen!$1:$65497,2,FALSE))","v":""},null,{"$f":"IF(J14=0,\"\",VLOOKUP(J14,Etappen!$1:$65497,2,FALSE))","v":""},null,null,"A + B fehlt",null,{"$f":"IF(AND(O14=\"x\",Q14=\"x\"),\"wechsel\",IF(AND(O14=\"x\",Q14<>\"x\"),\"\",IF(AND(Q14=\"x\",O14<>\"x\"),\"M fehlt\",\"A + B fehlt\")))","v":"A + B fehlt"},null,{"$f":"IF(AND(Q14=\"x\",S14=\"x\"),\"wechsel\",IF(AND(Q14=\"x\",S14<>\"x\"),\"\",IF(AND(S14=\"x\",Q14<>\"x\"),\"M fehlt\",\"A + B fehlt\")))","v":"A + B fehlt"},null,null,null,null,null,null,null,{"$f":"IF(WEEKNUM(A14,2)<>WEEKNUM(A15,2),SUM(Y$7:Y14)-SUM(Z$6:Z13),\"\")","v":""},57.4]
[null,null,{"$f":"IF(B15=0,\"\",VLOOKUP(B15,Etappen!$1:$65497,2,FALSE))","v":""},null,{"$f":"IF(D15=0,\"\",VLOOKUP(D15,Etappen!$1:$65497,2,FALSE))","v":""},null,{"$f":"IF(F15=0,\"\",VLOOKUP(F15,Etappen!$1:$65497,2,FALSE))","v":""},null,{"$f":"IF(H15=0,\"\",VLOOKUP(H15,Etappen!$1:$65497,2,FALSE))","v":""},null,{"$f":"IF(J15=0,\"\",VLOOKUP(J15,Etappen!$1:$65497,2,FALSE))","v":""},null,null,"A + B fehlt",null,{"$f":"IF(AND(O15=\"x\",Q15=\"x\"),\"wechsel\",IF(AND(O15=\"x\",Q15<>\"x\"),\"\",IF(AND(Q15=\"x\",O15<>\"x\"),\"M fehlt\",\"A + B fehlt\")))","v":"A + B fehlt"},null,{"$f":"IF(AND(Q15=\"x\",S15=\"x\"),\"wechsel\",IF(AND(Q15=\"x\",S15<>\"x\"),\"\",IF(AND(S15=\"x\",Q15<>\"x\"),\"M fehlt\",\"A + B fehlt\")))","v":"A + B fehlt"},null,null,null,null,null,null,null,{"$f":"IF(WEEKNUM(A15,2)<>WEEKNUM(A16,2),SUM(Y$7:Y15)-SUM(Z$6:Z14),\"\")","v":""},57.4]
[null,null,{"$f":"IF(B16=0,\"\",VLOOKUP(B16,Etappen!$1:$65497,2,FALSE))","v":""},null,{"$f":"IF(D16=0,\"\",VLOOKUP(D16,Etappen!$1:$65497,2,FALSE))","v":""},null,{"$f":"IF(F16=0,\"\",VLOOKUP(F16,Etappen!$1:$65497,2,FALSE))","v":""},null,{"$f":"IF(H16=0,\"\",VLOOKUP(H16,Etappen!$1:$65497,2,FALSE))","v":""},null,{"$f":"IF(J16=0,\"\",VLOOKUP(J16,Etappen!$1:$65497,2,FALSE))","v":""},null,null,"A + B fehlt",null,{"$f":"IF(AND(O16=\"x\",Q16=\"x\"),\"wechsel\",IF(AND(O16=\"x\",Q16<>\"x\"),\"\",IF(AND(Q16=\"x\",O16<>\"x\"),\"M fehlt\",\"A + B fehlt\")))","v":"A + B fehlt"},null,{"$f":"IF(AND(Q16=\"x\",S16=\"x\"),\"wechsel\",IF(AND(Q16=\"x\",S16<>\"x\"),\"\",IF(AND(S16=\"x\",Q16<>\"x\"),\"M fehlt\",\"A + B fehlt\")))","v":"A + B fehlt"},null,null,null,null,null,null,null,{"$f":"IF(WEEKNUM(A16,2)<>WEEKNUM(A17,2),SUM(Y$7:Y16)-SUM(Z$6:Z15),\"\")","v":""},57.4]
[null,null,{"$f":"IF(B17=0,\"\",VLOOKUP(B17,Etappen!$1:$65497,2,FALSE))","v":""},null,{"$f":"IF(D17=0,\"\",VLOOKUP(D17,Etappen!$1:$65497,2,FALSE))","v":""},null,{"$f":"IF(F17=0,\"\",VLOOKUP(F17,Etappen!$1:$65497,2,FALSE))","v":""},null,{"$f":"IF(H17=0,\"\",VLOOKUP(H17,Etappen!$1:$65497,2,FALSE))","v":""},null,{"$f":"IF(J17=0,\"\",VLOOKUP(J17,Etappen!$1:$65497,2,FALSE))","v":""},null,null,"A + B fehlt",null,{"$f":"IF(AND(O17=\"x\",Q17=\"x\"),\"wechsel\",IF(AND(O17=\"x\",Q17<>\"x\"),\"\",IF(AND(Q17=\"x\",O17<>\"x\"),\"M fehlt\",\"A + B fehlt\")))","v":"A + B fehlt"},null,{"$f":"IF(AND(Q17=\"x\",S17=\"x\"),\"wechsel\",IF(AND(Q17=\"x\",S17<>\"x\"),\"\",IF(AND(S17=\"x\",Q17<>\"x\"),\"M fehlt\",\"A + B fehlt\")))","v":"A + B fehlt"},null,null,null,null,null,null,null,{"$f":"IF(WEEKNUM(A17,2)<>WEEKNUM(A18,2),SUM(Y$7:Y17)-SUM(Z$6:Z16),\"\")","v":""},57.4]
[null,null,{"$f":"IF(B18=0,\"\",VLOOKUP(B18,Etappen!$1:$65497,2,FALSE))","v":""},null,{"$f":"IF(D18=0,\"\",VLOOKUP(D18,Etappen!$1:$65497,2,FALSE))","v":""},null,{"$f":"IF(F18=0,\"\",VLOOKUP(F18,Etappen!$1:$65497,2,FALSE))","v":""},null,{"$f":"IF(H18=0,\"\",VLOOKUP(H18,Etappen!$1:$65497,2,FALSE))","v":""},null,{"$f":"IF(J18=0,\"\",VLOOKUP(J18,Etappen!$1:$65497,2,FALSE))","v":""},null,null,"A + B fehlt",null,{"$f":"IF(AND(O18=\"x\",Q18=\"x\"),\"wechsel\",IF(AND(O18=\"x\",Q18<>\"x\"),\"\",IF(AND(Q18=\"x\",O18<>\"x\"),\"M fehlt\",\"A + B fehlt\")))","v":"A + B fehlt"},null,{"$f":"IF(AND(Q18=\"x\",S18=\"x\"),\"wechsel\",IF(AND(Q18=\"x\",S18<>\"x\"),\"\",IF(AND(S18=\"x\",Q18<>\"x\"),\"M fehlt\",\"A + B fehlt\")))","v":"A + B fehlt"},null,null,null,null,null,null,null,{"$f":"IF(WEEKNUM(A18,2)<>WEEKNUM(A19,2),SUM(Y$7:Y18)-SUM(Z$6:Z17),\"\")","v":""},57.4]
[null,null,{"$f":"IF(B19=0,\"\",VLOOKUP(B19,Etappen!$1:$65497,2,FALSE))","v":""},null,{"$f":"IF(D19=0,\"\",VLOOKUP(D19,Etappen!$1:$65497,2,FALSE))","v":""},null,{"$f":"IF(F19=0,\"\",VLOOKUP(F19,Etappen!$1:$65497,2,FALSE))","v":""},null,{"$f":"IF(H19=0,\"\",VLOOKUP(H19,Etappen!$1:$65497,2,FALSE))","v":""},null,{"$f":"IF(J19=0,\"\",VLOOKUP(J19,Etappen!$1:$65497,2,FALSE))","v":""},null,null,"A + B fehlt",null,{"$f":"IF(AND(O19=\"x\",Q19=\"x\"),\"wechsel\",IF(AND(O19=\"x\",Q19<>\"x\"),\"\",IF(AND(Q19=\"x\",O19<>\"x\"),\"M fehlt\",\"A + B fehlt\")))","v":"A + B fehlt"},null,{"$f":"IF(AND(Q19=\"x\",S19=\"x\"),\"wechsel\",IF(AND(Q19=\"x\",S19<>\"x\"),\"\",IF(AND(S19=\"x\",Q19<>\"x\"),\"M fehlt\",\"A + B fehlt\")))","v":"A + B fehlt"},null,null,null,null,null,null,null,{"$f":"IF(WEEKNUM(A19,2)<>WEEKNUM(A20,2),SUM(Y$7:Y19)-SUM(Z$6:Z18),\"\")","v":""},57.4]
[null,null,{"$f":"IF(B20=0,\"\",VLOOKUP(B20,Etappen!$1:$65497,2,FALSE))","v":""},null,{"$f":"IF(D20=0,\"\",VLOOKUP(D20,Etappen!$1:$65497,2,FALSE))","v":""},null,{"$f":"IF(F20=0,\"\",VLOOKUP(F20,Etappen!$1:$65497,2,FALSE))","v":""},null,{"$f":"IF(H20=0,\"\",VLOOKUP(H20,Etappen!$1:$65497,2,FALSE))","v":""},null,{"$f":"IF(J20=0,\"\",VLOOKUP(J20,Etappen!$1:$65497,2,FALSE))","v":""},null,null,"A + B fehlt",null,{"$f":"IF(AND(O20=\"x\",Q20=\"x\"),\"wechsel\",IF(AND(O20=\"x\",Q20<>\"x\"),\"\",IF(AND(Q20=\"x\",O20<>\"x\"),\"M fehlt\",\"A + B fehlt\")))","v":"A + B fehlt"},null,{"$f":"IF(AND(Q20=\"x\",S20=\"x\"),\"wechsel\",IF(AND(Q20=\"x\",S20<>\"x\"),\"\",IF(AND(S20=\"x\",Q20<>\"x\"),\"M fehlt\",\"A + B fehlt\")))","v":"A + B fehlt"},null,null,null,null,null,null,null,{"$f":"IF(WEEKNUM(A20,2)<>WEEKNUM(A21,2),SUM(Y$7:Y20)-SUM(Z$6:Z19),\"\")","v":""}]
[null,null,{"$f":"IF(B21=0,\"\",VLOOKUP(B21,Etappen!$1:$65497,2,FALSE))","v":""},null,{"$f":"IF(D21=0,\"\",VLOOKUP(D21,Etappen!$1:$65497,2,FALSE))","v":""},null,{"$f":"IF(F21=0,\"\",VLOOKUP(F21,Etappen!$1:$65497,2,FALSE))","v":""},null,{"$f":"IF(H21=0,\"\",VLOOKUP(H21,Etappen!$1:$65497,2,FALSE))","v":""},null,{"$f":"IF(J21=0,\"\",VLOOKUP(J21,Etappen!$1:$65497,2,FALSE))","v":""},null,null,"A + B fehlt",null,{"$f":"IF(AND(O21=\"x\",Q21=\"x\"),\"wechsel\",IF(AND(O21=\"x\",Q21<>\"x\"),\"\",IF(AND(Q21=\"x\",O21<>\"x\"),\"M fehlt\",\"A + B fehlt\")))","v":"A + B fehlt"},null,{"$f":"IF(AND(Q21=\"x\",S21=\"x\"),\"wechsel\",IF(AND(Q21=\"x\",S21<>\"x\"),\"\",IF(AND(S21=\"x\",Q21<>\"x\"),\"M fehlt\",\"A + B fehlt\")))","v":"A + B fehlt"},null,null,null,null,null,null,null,{"$f":"IF(WEEKNUM(A21,2)<>WEEKNUM(A22,2),SUM(Y$7:Y21)-SUM(Z$6:Z20),\"\")","v":""}]
[null,null,{"$f":"IF(B22=0,\"\",VLOOKUP(B22,Etappen!$1:$65497,2,FALSE))","v":""},null,{"$f":"IF(D22=0,\"\",VLOOKUP(D22,Etappen!$1:$65497,2,FALSE))","v":""},null,{"$f":"IF(F22=0,\"\",VLOOKUP(F22,Etappen!$1:$65497,2,FALSE))","v":""},null,{"$f":"IF(H22=0,\"\",VLOOKUP(H22,Etappen!$1:$65497,2,FALSE))","v":""},null,{"$f":"IF(J22=0,\"\",VLOOKUP(J22,Etappen!$1:$65497,2,FALSE))","v":""},null,null,"A + B fehlt",null,{"$f":"IF(AND(O22=\"x\",Q22=\"x\"),\"wechsel\",IF(AND(O22=\"x\",Q22<>\"x\"),\"\",IF(AND(Q22=\"x\",O22<>\"x\"),\"M fehlt\",\"A + B fehlt\")))","v":"A + B fehlt"},null,{"$f":"IF(AND(Q22=\"x\",S22=\"x\"),\"wechsel\",IF(AND(Q22=\"x\",S22<>\"x\"),\"\",IF(AND(S22=\"x\",Q22<>\"x\"),\"M fehlt\",\"A + B fehlt\")))","v":"A + B fehlt"},null,null,null,null,null,null,null,{"$f":"IF(WEEKNUM(A22,2)<>WEEKNUM(A23,2),SUM(Y$7:Y22)-SUM(Z$6:Z21),\"\")","v":""}]
[null,null,{"$f":"IF(B23=0,\"\",VLOOKUP(B23,Etappen!$1:$65497,2,FALSE))","v":""},null,{"$f":"IF(D23=0,\"\",VLOOKUP(D23,Etappen!$1:$65497,2,FALSE))","v":""},null,{"$f":"IF(F23=0,\"\",VLOOKUP(F23,Etappen!$1:$65497,2,FALSE))","v":""},null,{"$f":"IF(H23=0,\"\",VLOOKUP(H23,Etappen!$1:$65497,2,FALSE))","v":""},null,{"$f":"IF(J23=0,\"\",VLOOKUP(J23,Etappen!$1:$65497,2,FALSE))","v":""},null,null,"A + B fehlt",null,{"$f":"IF(AND(O23=\"x\",Q23=\"x\"),\"wechsel\",IF(AND(O23=\"x\",Q23<>\"x\"),\"\",IF(AND(Q23=\"x\",O23<>\"x\"),\"M fehlt\",\"A + B fehlt\")))","v":"A + B fehlt"},null,{"$f":"IF(AND(Q23=\"x\",S23=\"x\"),\"wechsel\",IF(AND(Q23=\"x\",S23<>\"x\"),\"\",IF(AND(S23=\"x\",Q23<>\"x\"),\"M fehlt\",\"A + B fehlt\")))","v":"A + B fehlt"},null,null,null,null,null,null,null,{"$f":"IF(WEEKNUM(A23,2)<>WEEKNUM(A24,2),SUM(Y$7:Y23)-SUM(Z$6:Z22),\"\")","v":""}]
[null,null,{"$f":"IF(B24=0,\"\",VLOOKUP(B24,Etappen!$1:$65497,2,FALSE))","v":""},null,{"$f":"IF(D24=0,\"\",VLOOKUP(D24,Etappen!$1:$65497,2,FALSE))","v":""},null,{"$f":"IF(F24=0,\"\",VLOOKUP(F24,Etappen!$1:$65497,2,FALSE))","v":""},null,{"$f":"IF(H24=0,\"\",VLOOKUP(H24,Etappen!$1:$65497,2,FALSE))","v":""},null,{"$f":"IF(J24=0,\"\",VLOOKUP(J24,Etappen!$1:$65497,2,FALSE))","v":""},null,null,"A + B fehlt",null,{"$f":"IF(AND(O24=\"x\",Q24=\"x\"),\"wechsel\",IF(AND(O24=\"x\",Q24<>\"x\"),\"\",IF(AND(Q24=\"x\",O24<>\"x\"),\"M fehlt\",\"A + B fehlt\")))","v":"A + B fehlt"},null,{"$f":"IF(AND(Q24=\"x\",S24=\"x\"),\"wechsel\",IF(AND(Q24=\"x\",S24<>\"x\"),\"\",IF(AND(S24=\"x\",Q24<>\"x\"),\"M fehlt\",\"A + B fehlt\")))","v":"A + B fehlt"},null,null,null,null,null,null,null,{"$f":"IF(WEEKNUM(A24,2)<>WEEKNUM(A25,2),SUM(Y$7:Y24)-SUM(Z$6:Z23),\"\")","v":""}]
[null,null,{"$f":"IF(B25=0,\"\",VLOOKUP(B25,Etappen!$1:$65497,2,FALSE))","v":""},null,{"$f":"IF(D25=0,\"\",VLOOKUP(D25,Etappen!$1:$65497,2,FALSE))","v":""},null,{"$f":"IF(F25=0,\"\",VLOOKUP(F25,Etappen!$1:$65497,2,FALSE))","v":""},null,{"$f":"IF(H25=0,\"\",VLOOKUP(H25,Etappen!$1:$65497,2,FALSE))","v":""},null,{"$f":"IF(J25=0,\"\",VLOOKUP(J25,Etappen!$1:$65497,2,FALSE))","v":""},null,null,"A + B fehlt",null,{"$f":"IF(AND(O25=\"x\",Q25=\"x\"),\"wechsel\",IF(AND(O25=\"x\",Q25<>\"x\"),\"\",IF(AND(Q25=\"x\",O25<>\"x\"),\"M fehlt\",\"A + B fehlt\")))","v":"A + B fehlt"},null,{"$f":"IF(AND(Q25=\"x\",S25=\"x\"),\"wechsel\",IF(AND(Q25=\"x\",S25<>\"x\"),\"\",IF(AND(S25=\"x\",Q25<>\"x\"),\"M fehlt\",\"A + B fehlt\")))","v":"A + B fehlt"},null,null,null,null,null,null,null,{"$f":"IF(WEEKNUM(A25,2)<>WEEKNUM(A26,2),SUM(Y$7:Y25)-SUM(Z$6:Z24),\"\")","v":""}]
[null,null,{"$f":"IF(B26=0,\"\",VLOOKUP(B26,Etappen!$1:$65497,2,FALSE))","v":""},null,{"$f":"IF(D26=0,\"\",VLOOKUP(D26,Etappen!$1:$65497,2,FALSE))","v":""},null,{"$f":"IF(F26=0,\"\",VLOOKUP(F26,Etappen!$1:$65497,2,FALSE))","v":""},null,{"$f":"IF(H26=0,\"\",VLOOKUP(H26,Etappen!$1:$65497,2,FALSE))","v":""},null,{"$f":"IF(J26=0,\"\",VLOOKUP(J26,Etappen!$1:$65497,2,FALSE))","v":""},null,null,"A + B fehlt",null,{"$f":"IF(AND(O26=\"x\",Q26=\"x\"),\"wechsel\",IF(AND(O26=\"x\",Q26<>\"x\"),\"\",IF(AND(Q26=\"x\",O26<>\"x\"),\"M fehlt\",\"A + B fehlt\")))","v":"A + B fehlt"},null,{"$f":"IF(AND(Q26=\"x\",S26=\"x\"),\"wechsel\",IF(AND(Q26=\"x\",S26<>\"x\"),\"\",IF(AND(S26=\"x\",Q26<>\"x\"),\"M fehlt\",\"A + B fehlt\")))","v":"A + B fehlt"},null,null,null,null,null,null,null,{"$f":"IF(WEEKNUM(A26,2)<>WEEKNUM(A27,2),SUM(Y$7:Y26)-SUM(Z$6:Z25),\"\")","v":""}]
[null,null,{"$f":"IF(B27=0,\"\",VLOOKUP(B27,Etappen!$1:$65497,2,FALSE))","v":""},null,{"$f":"IF(D27=0,\"\",VLOOKUP(D27,Etappen!$1:$65497,2,FALSE))","v":""},null,{"$f":"IF(F27=0,\"\",VLOOKUP(F27,Etappen!$1:$65497,2,FALSE))","v":""},null,{"$f":"IF(H27=0,\"\",VLOOKUP(H27,Etappen!$1:$65497,2,FALSE))","v":""},null,{"$f":"IF(J27=0,\"\",VLOOKUP(J27,Etappen!$1:$65497,2,FALSE))","v":""},null,null,"A + B fehlt",null,{"$f":"IF(AND(O27=\"x\",Q27=\"x\"),\"wechsel\",IF(AND(O27=\"x\",Q27<>\"x\"),\"\",IF(AND(Q27=\"x\",O27<>\"x\"),\"M fehlt\",\"A + B fehlt\")))","v":"A + B fehlt"},null,{"$f":"IF(AND(Q27=\"x\",S27=\"x\"),\"wechsel\",IF(AND(Q27=\"x\",S27<>\"x\"),\"\",IF(AND(S27=\"x\",Q27<>\"x\"),\"M fehlt\",\"A + B fehlt\")))","v":"A + B fehlt"},null,null,null,null,null,null,null,{"$f":"IF(WEEKNUM(A27,2)<>WEEKNUM(A28,2),SUM(Y$7:Y27)-SUM(Z$6:Z26),\"\")","v":""}]
[null,null,{"$f":"IF(B28=0,\"\",VLOOKUP(B28,Etappen!$1:$65497,2,FALSE))","v":""},null,{"$f":"IF(D28=0,\"\",VLOOKUP(D28,Etappen!$1:$65497,2,FALSE))","v":""},null,{"$f":"IF(F28=0,\"\",VLOOKUP(F28,Etappen!$1:$65497,2,FALSE))","v":""},null,{"$f":"IF(H28=0,\"\",VLOOKUP(H28,Etappen!$1:$65497,2,FALSE))","v":""},null,{"$f":"IF(J28=0,\"\",VLOOKUP(J28,Etappen!$1:$65497,2,FALSE))","v":""},null,null,"A + B fehlt",null,{"$f":"IF(AND(O28=\"x\",Q28=\"x\"),\"wechsel\",IF(AND(O28=\"x\",Q28<>\"x\"),\"\",IF(AND(Q28=\"x\",O28<>\"x\"),\"M fehlt\",\"A + B fehlt\")))","v":"A + B fehlt"},null,{"$f":"IF(AND(Q28=\"x\",S28=\"x\"),\"wechsel\",IF(AND(Q28=\"x\",S28<>\"x\"),\"\",IF(AND(S28=\"x\",Q28<>\"x\"),\"M fehlt\",\"A + B fehlt\")))","v":"A + B fehlt"},null,null,null,null,null,null,null,{"$f":"IF(WEEKNUM(A28,2)<>WEEKNUM(A29,2),SUM(Y$7:Y28)-SUM(Z$6:Z27),\"\")","v":""}]
[null,null,{"$f":"IF(B29=0,\"\",VLOOKUP(B29,Etappen!$1:$65497,2,FALSE))","v":""},null,{"$f":"IF(D29=0,\"\",VLOOKUP(D29,Etappen!$1:$65497,2,FALSE))","v":""},null,{"$f":"IF(F29=0,\"\",VLOOKUP(F29,Etappen!$1:$65497,2,FALSE))","v":""},null,{"$f":"IF(H29=0,\"\",VLOOKUP(H29,Etappen!$1:$65497,2,FALSE))","v":""},null,{"$f":"IF(J29=0,\"\",VLOOKUP(J29,Etappen!$1:$65497,2,FALSE))","v":""},null,null,"A + B fehlt",null,{"$f":"IF(AND(O29=\"x\",Q29=\"x\"),\"wechsel\",IF(AND(O29=\"x\",Q29<>\"x\"),\"\",IF(AND(Q29=\"x\",O29<>\"x\"),\"M fehlt\",\"A + B fehlt\")))","v":"A + B fehlt"},null,{"$f":"IF(AND(Q29=\"x\",S29=\"x\"),\"wechsel\",IF(AND(Q29=\"x\",S29<>\"x\"),\"\",IF(AND(S29=\"x\",Q29<>\"x\"),\"M fehlt\",\"A + B fehlt\")))","v":"A + B fehlt"},null,null,null,null,null,null,null,{"$f":"IF(WEEKNUM(A29,2)<>WEEKNUM(A30,2),SUM(Y$7:Y29)-SUM(Z$6:Z28),\"\")","v":""}]
[null,null,{"$f":"IF(B30=0,\"\",VLOOKUP(B30,Etappen!$1:$65497,2,FALSE))","v":""},null,{"$f":"IF(D30=0,\"\",VLOOKUP(D30,Etappen!$1:$65497,2,FALSE))","v":""},null,{"$f":"IF(F30=0,\"\",VLOOKUP(F30,Etappen!$1:$65497,2,FALSE))","v":""},null,{"$f":"IF(H30=0,\"\",VLOOKUP(H30,Etappen!$1:$65497,2,FALSE))","v":""},null,{"$f":"IF(J30=0,\"\",VLOOKUP(J30,Etappen!$1:$65497,2,FALSE))","v":""},null,null,"A + B fehlt",null,{"$f":"IF(AND(O30=\"x\",Q30=\"x\"),\"wechsel\",IF(AND(O30=\"x\",Q30<>\"x\"),\"\",IF(AND(Q30=\"x\",O30<>\"x\"),\"M fehlt\",\"A + B fehlt\")))","v":"A + B fehlt"},null,{"$f":"IF(AND(Q30=\"x\",S30=\"x\"),\"wechsel\",IF(AND(Q30=\"x\",S30<>\"x\"),\"\",IF(AND(S30=\"x\",Q30<>\"x\"),\"M fehlt\",\"A + B fehlt\")))","v":"A + B fehlt"},null,null,null,null,null,null,null,{"$f":"IF(WEEKNUM(A30,2)<>WEEKNUM(A31,2),SUM(Y$7:Y30)-SUM(Z$6:Z29),\"\")","v":""}]
[null,null,{"$f":"IF(B31=0,\"\",VLOOKUP(B31,Etappen!$1:$65497,2,FALSE))","v":""},null,{"$f":"IF(D31=0,\"\",VLOOKUP(D31,Etappen!$1:$65497,2,FALSE))","v":""},null,{"$f":"IF(F31=0,\"\",VLOOKUP(F31,Etappen!$1:$65497,2,FALSE))","v":""},null,{"$f":"IF(H31=0,\"\",VLOOKUP(H31,Etappen!$1:$65497,2,FALSE))","v":""},null,{"$f":"IF(J31=0,\"\",VLOOKUP(J31,Etappen!$1:$65497,2,FALSE))","v":""},null,null,"A + B fehlt",null,{"$f":"IF(AND(O31=\"x\",Q31=\"x\"),\"wechsel\",IF(AND(O31=\"x\",Q31<>\"x\"),\"\",IF(AND(Q31=\"x\",O31<>\"x\"),\"M fehlt\",\"A + B fehlt\")))","v":"A + B fehlt"},null,{"$f":"IF(AND(Q31=\"x\",S31=\"x\"),\"wechsel\",IF(AND(Q31=\"x\",S31<>\"x\"),\"\",IF(AND(S31=\"x\",Q31<>\"x\"),\"M fehlt\",\"A + B fehlt\")))","v":"A + B fehlt"},null,null,null,null,null,null,null,{"$f":"IF(WEEKNUM(A31,2)<>WEEKNUM(A32,2),SUM(Y$7:Y31)-SUM(Z$6:Z30),\"\")","v":""}]
[null,null,{"$f":"IF(B32=0,\"\",VLOOKUP(B32,Etappen!$1:$65497,2,FALSE))","v":""},null,{"$f":"IF(D32=0,\"\",VLOOKUP(D32,Etappen!$1:$65497,2,FALSE))","v":""},null,{"$f":"IF(F32=0,\"\",VLOOKUP(F32,Etappen!$1:$65497,2,FALSE))","v":""},null,{"$f":"IF(H32=0,\"\",VLOOKUP(H32,Etappen!$1:$65497,2,FALSE))","v":""},null,{"$f":"IF(J32=0,\"\",VLOOKUP(J32,Etappen!$1:$65497,2,FALSE))","v":""},null,null,"A + B fehlt",null,{"$f":"IF(AND(O32=\"x\",Q32=\"x\"),\"wechsel\",IF(AND(O32=\"x\",Q32<>\"x\"),\"\",IF(AND(Q32=\"x\",O32<>\"x\"),\"M fehlt\",\"A + B fehlt\")))","v":"A + B fehlt"},null,{"$f":"IF(AND(Q32=\"x\",S32=\"x\"),\"wechsel\",IF(AND(Q32=\"x\",S32<>\"x\"),\"\",IF(AND(S32=\"x\",Q32<>\"x\"),\"M fehlt\",\"A + B fehlt\")))","v":"A + B fehlt"},null,null,null,null,null,null,null,{"$f":"IF(WEEKNUM(A32,2)<>WEEKNUM(A33,2),SUM(Y$7:Y32)-SUM(Z$6:Z31),\"\")","v":""}]
[null,null,{"$f":"IF(B33=0,\"\",VLOOKUP(B33,Etappen!$1:$65497,2,FALSE))","v":""},null,{"$f":"IF(D33=0,\"\",VLOOKUP(D33,Etappen!$1:$65497,2,FALSE))","v":""},null,{"$f":"IF(F33=0,\"\",VLOOKUP(F33,Etappen!$1:$65497,2,FALSE))","v":""},null,{"$f":"IF(H33=0,\"\",VLOOKUP(H33,Etappen!$1:$65497,2,FALSE))","v":""},null,{"$f":"IF(J33=0,\"\",VLOOKUP(J33,Etappen!$1:$65497,2,FALSE))","v":""},null,null,"A + B fehlt",null,{"$f":"IF(AND(O33=\"x\",Q33=\"x\"),\"wechsel\",IF(AND(O33=\"x\",Q33<>\"x\"),\"\",IF(AND(Q33=\"x\",O33<>\"x\"),\"M fehlt\",\"A + B fehlt\")))","v":"A + B fehlt"},null,{"$f":"IF(AND(Q33=\"x\",S33=\"x\"),\"wechsel\",IF(AND(Q33=\"x\",S33<>\"x\"),\"\",IF(AND(S33=\"x\",Q33<>\"x\"),\"M fehlt\",\"A + B fehlt\")))","v":"A + B fehlt"},null,null,null,null,null,null,null,{"$f":"IF(WEEKNUM(A33,2)<>WEEKNUM(A34,2),SUM(Y$7:Y33)-SUM(Z$6:Z32),\"\")","v":""}]
[null,null,{"$f":"IF(B34=0,\"\",VLOOKUP(B34,Etappen!$1:$65497,2,FALSE))","v":""},null,{"$f":"IF(D34=0,\"\",VLOOKUP(D34,Etappen!$1:$65497,2,FALSE))","v":""},null,{"$f":"IF(F34=0,\"\",VLOOKUP(F34,Etappen!$1:$65497,2,FALSE))","v":""},null,{"$f":"IF(H34=0,\"\",VLOOKUP(H34,Etappen!$1:$65497,2,FALSE))","v":""},null,{"$f":"IF(J34=0,\"\",VLOOKUP(J34,Etappen!$1:$65497,2,FALSE))","v":""},null,null,"A + B fehlt",null,{"$f":"IF(AND(O34=\"x\",Q34=\"x\"),\"wechsel\",IF(AND(O34=\"x\",Q34<>\"x\"),\"\",IF(AND(Q34=\"x\",O34<>\"x\"),\"M fehlt\",\"A + B fehlt\")))","v":"A + B fehlt"},null,{"$f":"IF(AND(Q34=\"x\",S34=\"x\"),\"wechsel\",IF(AND(Q34=\"x\",S34<>\"x\"),\"\",IF(AND(S34=\"x\",Q34<>\"x\"),\"M fehlt\",\"A + B fehlt\")))","v":"A + B fehlt"},null,null,null,null,null,null,null,{"$f":"IF(WEEKNUM(A34,2)<>WEEKNUM(A35,2),SUM(Y$7:Y34)-SUM(Z$6:Z33),\"\")","v":""}]
[null,null,{"$f":"IF(B35=0,\"\",VLOOKUP(B35,Etappen!$1:$65497,2,FALSE))","v":""},null,{"$f":"IF(D35=0,\"\",VLOOKUP(D35,Etappen!$1:$65497,2,FALSE))","v":""},null,{"$f":"IF(F35=0,\"\",VLOOKUP(F35,Etappen!$1:$65497,2,FALSE))","v":""},null,{"$f":"IF(H35=0,\"\",VLOOKUP(H35,Etappen!$1:$65497,2,FALSE))","v":""},null,{"$f":"IF(J35=0,\"\",VLOOKUP(J35,Etappen!$1:$65497,2,FALSE))","v":""},null,null,"A + B fehlt",null,{"$f":"IF(AND(O35=\"x\",Q35=\"x\"),\"wechsel\",IF(AND(O35=\"x\",Q35<>\"x\"),\"\",IF(AND(Q35=\"x\",O35<>\"x\"),\"M fehlt\",\"A + B fehlt\")))","v":"A + B fehlt"},null,{"$f":"IF(AND(Q35=\"x\",S35=\"x\"),\"wechsel\",IF(AND(Q35=\"x\",S35<>\"x\"),\"\",IF(AND(S35=\"x\",Q35<>\"x\"),\"M fehlt\",\"A + B fehlt\")))","v":"A + B fehlt"},null,null,null,null,null,null,null,{"$f":"IF(WEEKNUM(A35,2)<>WEEKNUM(A36,2),SUM(Y$7:Y35)-SUM(Z$6:Z34),\"\")","v":""}]
[null,null,{"$f":"IF(B36=0,\"\",VLOOKUP(B36,Etappen!$1:$65497,2,FALSE))","v":""},null,{"$f":"IF(D36=0,\"\",VLOOKUP(D36,Etappen!$1:$65497,2,FALSE))","v":""},null,{"$f":"IF(F36=0,\"\",VLOOKUP(F36,Etappen!$1:$65497,2,FALSE))","v":""},null,{"$f":"IF(H36=0,\"\",VLOOKUP(H36,Etappen!$1:$65497,2,FALSE))","v":""},null,{"$f":"IF(J36=0,\"\",VLOOKUP(J36,Etappen!$1:$65497,2,FALSE))","v":""},null,null,"A + B fehlt",null,{"$f":"IF(AND(O36=\"x\",Q36=\"x\"),\"wechsel\",IF(AND(O36=\"x\",Q36<>\"x\"),\"\",IF(AND(Q36=\"x\",O36<>\"x\"),\"M fehlt\",\"A + B fehlt\")))","v":"A + B fehlt"},null,{"$f":"IF(AND(Q36=\"x\",S36=\"x\"),\"wechsel\",IF(AND(Q36=\"x\",S36<>\"x\"),\"\",IF(AND(S36=\"x\",Q36<>\"x\"),\"M fehlt\",\"A + B fehlt\")))","v":"A + B fehlt"},null,null,null,null,null,null,null,{"$f":"IF(WEEKNUM(A36,2)<>WEEKNUM(A37,2),SUM(Y$7:Y36)-SUM(Z$6:Z35),\"\")","v":""}]
[null,null,{"$f":"IF(B37=0,\"\",VLOOKUP(B37,Etappen!$1:$65497,2,FALSE))","v":""},null,{"$f":"IF(D37=0,\"\",VLOOKUP(D37,Etappen!$1:$65497,2,FALSE))","v":""},null,{"$f":"IF(F37=0,\"\",VLOOKUP(F37,Etappen!$1:$65497,2,FALSE))","v":""},null,{"$f":"IF(H37=0,\"\",VLOOKUP(H37,Etappen!$1:$65497,2,FALSE))","v":""},null,{"$f":"IF(J37=0,\"\",VLOOKUP(J37,Etappen!$1:$65497,2,FALSE))","v":""},null,null,"A + B fehlt",null,{"$f":"IF(AND(O37=\"x\",Q37=\"x\"),\"wechsel\",IF(AND(O37=\"x\",Q37<>\"x\"),\"\",IF(AND(Q37=\"x\",O37<>\"x\"),\"M fehlt\",\"A + B fehlt\")))","v":"A + B fehlt"},null,{"$f":"IF(AND(Q37=\"x\",S37=\"x\"),\"wechsel\",IF(AND(Q37=\"x\",S37<>\"x\"),\"\",IF(AND(S37=\"x\",Q37<>\"x\"),\"M fehlt\",\"A + B fehlt\")))","v":"A + B fehlt"},null,null,null,null,null,null,null,{"$f":"IF(WEEKNUM(A37,2)<>WEEKNUM(A38,2),SUM(Y$7:Y37)-SUM(Z$6:Z36),\"\")","v":""}]
[null,null,{"$f":"IF(B38=0,\"\",VLOOKUP(B38,Etappen!$1:$65497,2,FALSE))","v":""},null,{"$f":"IF(D38=0,\"\",VLOOKUP(D38,Etappen!$1:$65497,2,FALSE))","v":""},null,{"$f":"IF(F38=0,\"\",VLOOKUP(F38,Etappen!$1:$65497,2,FALSE))","v":""},null,{"$f":"IF(H38=0,\"\",VLOOKUP(H38,Etappen!$1:$65497,2,FALSE))","v":""},null,{"$f":"IF(J38=0,\"\",VLOOKUP(J38,Etappen!$1:$65497,2,FALSE))","v":""},null,null,"A + B fehlt",null,{"$f":"IF(AND(O38=\"x\",Q38=\"x\"),\"wechsel\",IF(AND(O38=\"x\",Q38<>\"x\"),\"\",IF(AND(Q38=\"x\",O38<>\"x\"),\"M fehlt\",\"A + B fehlt\")))","v":"A + B fehlt"},null,{"$f":"IF(AND(Q38=\"x\",S38=\"x\"),\"wechsel\",IF(AND(Q38=\"x\",S38<>\"x\"),\"\",IF(AND(S38=\"x\",Q38<>\"x\"),\"M fehlt\",\"A + B fehlt\")))","v":"A + B fehlt"},null,null,null,null,null,null,null,{"$f":"IF(WEEKNUM(A38,2)<>WEEKNUM(A39,2),SUM(Y$7:Y38)-SUM(Z$6:Z37),\"\")","v":""}]
[null,null,{"$f":"IF(B39=0,\"\",VLOOKUP(B39,Etappen!$1:$65497,2,FALSE))","v":""},null,{"$f":"IF(D39=0,\"\",VLOOKUP(D39,Etappen!$1:$65497,2,FALSE))","v":""},null,{"$f":"IF(F39=0,\"\",VLOOKUP(F39,Etappen!$1:$65497,2,FALSE))","v":""},null,{"$f":"IF(H39=0,\"\",VLOOKUP(H39,Etappen!$1:$65497,2,FALSE))","v":""},null,{"$f":"IF(J39=0,\"\",VLOOKUP(J39,Etappen!$1:$65497,2,FALSE))","v":""},null,null,"A + B fehlt",null,{"$f":"IF(AND(O39=\"x\",Q39=\"x\"),\"wechsel\",IF(AND(O39=\"x\",Q39<>\"x\"),\"\",IF(AND(Q39=\"x\",O39<>\"x\"),\"M fehlt\",\"A + B fehlt\")))","v":"A + B fehlt"},null,{"$f":"IF(AND(Q39=\"x\",S39=\"x\"),\"wechsel\",IF(AND(Q39=\"x\",S39<>\"x\"),\"\",IF(AND(S39=\"x\",Q39<>\"x\"),\"M fehlt\",\"A + B fehlt\")))","v":"A + B fehlt"},null,null,null,null,null,null,null,{"$f":"IF(WEEKNUM(A39,2)<>WEEKNUM(A40,2),SUM(Y$7:Y39)-SUM(Z$6:Z38),\"\")","v":""}]
[null,null,{"$f":"IF(B40=0,\"\",VLOOKUP(B40,Etappen!$1:$65497,2,FALSE))","v":""},null,{"$f":"IF(D40=0,\"\",VLOOKUP(D40,Etappen!$1:$65497,2,FALSE))","v":""},null,{"$f":"IF(F40=0,\"\",VLOOKUP(F40,Etappen!$1:$65497,2,FALSE))","v":""},null,{"$f":"IF(H40=0,\"\",VLOOKUP(H40,Etappen!$1:$65497,2,FALSE))","v":""},null,{"$f":"IF(J40=0,\"\",VLOOKUP(J40,Etappen!$1:$65497,2,FALSE))","v":""},null,null,"A + B fehlt",null,{"$f":"IF(AND(O40=\"x\",Q40=\"x\"),\"wechsel\",IF(AND(O40=\"x\",Q40<>\"x\"),\"\",IF(AND(Q40=\"x\",O40<>\"x\"),\"M fehlt\",\"A + B fehlt\")))","v":"A + B fehlt"},null,{"$f":"IF(AND(Q40=\"x\",S40=\"x\"),\"wechsel\",IF(AND(Q40=\"x\",S40<>\"x\"),\"\",IF(AND(S40=\"x\",Q40<>\"x\"),\"M fehlt\",\"A + B fehlt\")))","v":"A + B fehlt"},null,null,null,null,null,null,null,{"$f":"IF(WEEKNUM(A40,2)<>WEEKNUM(A41,2),SUM(Y$7:Y40)-SUM(Z$6:Z39),\"\")","v":""}]
[null,null,{"$f":"IF(B41=0,\"\",VLOOKUP(B41,Etappen!$1:$65497,2,FALSE))","v":""},null,{"$f":"IF(D41=0,\"\",VLOOKUP(D41,Etappen!$1:$65497,2,FALSE))","v":""},null,{"$f":"IF(F41=0,\"\",VLOOKUP(F41,Etappen!$1:$65497,2,FALSE))","v":""},null,{"$f":"IF(H41=0,\"\",VLOOKUP(H41,Etappen!$1:$65497,2,FALSE))","v":""},null,{"$f":"IF(J41=0,\"\",VLOOKUP(J41,Etappen!$1:$65497,2,FALSE))","v":""},null,null,"A + B fehlt",null,{"$f":"IF(AND(O41=\"x\",Q41=\"x\"),\"wechsel\",IF(AND(O41=\"x\",Q41<>\"x\"),\"\",IF(AND(Q41=\"x\",O41<>\"x\"),\"M fehlt\",\"A + B fehlt\")))","v":"A + B fehlt"},null,{"$f":"IF(AND(Q41=\"x\",S41=\"x\"),\"wechsel\",IF(AND(Q41=\"x\",S41<>\"x\"),\"\",IF(AND(S41=\"x\",Q41<>\"x\"),\"M fehlt\",\"A + B fehlt\")))","v":"A + B fehlt"},null,null,null,null,null,null,null,{"$f":"IF(WEEKNUM(A41,2)<>WEEKNUM(A42,2),SUM(Y$7:Y41)-SUM(Z$6:Z40),\"\")","v":""}]
[null,null,{"$f":"IF(B42=0,\"\",VLOOKUP(B42,Etappen!$1:$65497,2,FALSE))","v":""},null,{"$f":"IF(D42=0,\"\",VLOOKUP(D42,Etappen!$1:$65497,2,FALSE))","v":""},null,{"$f":"IF(F42=0,\"\",VLOOKUP(F42,Etappen!$1:$65497,2,FALSE))","v":""},null,{"$f":"IF(H42=0,\"\",VLOOKUP(H42,Etappen!$1:$65497,2,FALSE))","v":""},null,{"$f":"IF(J42=0,\"\",VLOOKUP(J42,Etappen!$1:$65497,2,FALSE))","v":""},null,null,"A + B fehlt",null,{"$f":"IF(AND(O42=\"x\",Q42=\"x\"),\"wechsel\",IF(AND(O42=\"x\",Q42<>\"x\"),\"\",IF(AND(Q42=\"x\",O42<>\"x\"),\"M fehlt\",\"A + B fehlt\")))","v":"A + B fehlt"},null,{"$f":"IF(AND(Q42=\"x\",S42=\"x\"),\"wechsel\",IF(AND(Q42=\"x\",S42<>\"x\"),\"\",IF(AND(S42=\"x\",Q42<>\"x\"),\"M fehlt\",\"A + B fehlt\")))","v":"A + B fehlt"},null,null,null,null,null,null,null,{"$f":"IF(WEEKNUM(A42,2)<>WEEKNUM(A43,2),SUM(Y$7:Y42)-SUM(Z$6:Z41),\"\")","v":""}]
[null,null,{"$f":"IF(B43=0,\"\",VLOOKUP(B43,Etappen!$1:$65497,2,FALSE))","v":""},null,{"$f":"IF(D43=0,\"\",VLOOKUP(D43,Etappen!$1:$65497,2,FALSE))","v":""},null,{"$f":"IF(F43=0,\"\",VLOOKUP(F43,Etappen!$1:$65497,2,FALSE))","v":""},null,{"$f":"IF(H43=0,\"\",VLOOKUP(H43,Etappen!$1:$65497,2,FALSE))","v":""},null,{"$f":"IF(J43=0,\"\",VLOOKUP(J43,Etappen!$1:$65497,2,FALSE))","v":""},null,null,"A + B fehlt",null,{"$f":"IF(AND(O43=\"x\",Q43=\"x\"),\"wechsel\",IF(AND(O43=\"x\",Q43<>\"x\"),\"\",IF(AND(Q43=\"x\",O43<>\"x\"),\"M fehlt\",\"A + B fehlt\")))","v":"A + B fehlt"},null,{"$f":"IF(AND(Q43=\"x\",S43=\"x\"),\"wechsel\",IF(AND(Q43=\"x\",S43<>\"x\"),\"\",IF(AND(S43=\"x\",Q43<>\"x\"),\"M fehlt\",\"A + B fehlt\")))","v":"A + B fehlt"},null,null,null,null,null,null,null,{"$f":"IF(WEEKNUM(A43,2)<>WEEKNUM(A44,2),SUM(Y$7:Y43)-SUM(Z$6:Z42),\"\")","v":""}]
[null,null,{"$f":"IF(B44=0,\"\",VLOOKUP(B44,Etappen!$1:$65497,2,FALSE))","v":""},null,{"$f":"IF(D44=0,\"\",VLOOKUP(D44,Etappen!$1:$65497,2,FALSE))","v":""},null,{"$f":"IF(F44=0,\"\",VLOOKUP(F44,Etappen!$1:$65497,2,FALSE))","v":""},null,{"$f":"IF(H44=0,\"\",VLOOKUP(H44,Etappen!$1:$65497,2,FALSE))","v":""},null,{"$f":"IF(J44=0,\"\",VLOOKUP(J44,Etappen!$1:$65497,2,FALSE))","v":""},null,null,"A + B fehlt",null,{"$f":"IF(AND(O44=\"x\",Q44=\"x\"),\"wechsel\",IF(AND(O44=\"x\",Q44<>\"x\"),\"\",IF(AND(Q44=\"x\",O44<>\"x\"),\"M fehlt\",\"A + B fehlt\")))","v":"A + B fehlt"},null,{"$f":"IF(AND(Q44=\"x\",S44=\"x\"),\"wechsel\",IF(AND(Q44=\"x\",S44<>\"x\"),\"\",IF(AND(S44=\"x\",Q44<>\"x\"),\"M fehlt\",\"A + B fehlt\")))","v":"A + B fehlt"},null,null,null,null,null,null,null,{"$f":"IF(WEEKNUM(A44,2)<>WEEKNUM(A45,2),SUM(Y$7:Y44)-SUM(Z$6:Z43),\"\")","v":""}]
[null,null,{"$f":"IF(B45=0,\"\",VLOOKUP(B45,Etappen!$1:$65497,2,FALSE))","v":""},null,{"$f":"IF(D45=0,\"\",VLOOKUP(D45,Etappen!$1:$65497,2,FALSE))","v":""},null,{"$f":"IF(F45=0,\"\",VLOOKUP(F45,Etappen!$1:$65497,2,FALSE))","v":""},null,{"$f":"IF(H45=0,\"\",VLOOKUP(H45,Etappen!$1:$65497,2,FALSE))","v":""},null,{"$f":"IF(J45=0,\"\",VLOOKUP(J45,Etappen!$1:$65497,2,FALSE))","v":""},null,null,"A + B fehlt",null,{"$f":"IF(AND(O45=\"x\",Q45=\"x\"),\"wechsel\",IF(AND(O45=\"x\",Q45<>\"x\"),\"\",IF(AND(Q45=\"x\",O45<>\"x\"),\"M fehlt\",\"A + B fehlt\")))","v":"A + B fehlt"},null,{"$f":"IF(AND(Q45=\"x\",S45=\"x\"),\"wechsel\",IF(AND(Q45=\"x\",S45<>\"x\"),\"\",IF(AND(S45=\"x\",Q45<>\"x\"),\"M fehlt\",\"A + B fehlt\")))","v":"A + B fehlt"},null,null,null,null,null,null,null,{"$f":"IF(WEEKNUM(A45,2)<>WEEKNUM(A46,2),SUM(Y$7:Y45)-SUM(Z$6:Z44),\"\")","v":""}]
[null,null,{"$f":"IF(B46=0,\"\",VLOOKUP(B46,Etappen!$1:$65497,2,FALSE))","v":""},null,{"$f":"IF(D46=0,\"\",VLOOKUP(D46,Etappen!$1:$65497,2,FALSE))","v":""},null,{"$f":"IF(F46=0,\"\",VLOOKUP(F46,Etappen!$1:$65497,2,FALSE))","v":""},null,{"$f":"IF(H46=0,\"\",VLOOKUP(H46,Etappen!$1:$65497,2,FALSE))","v":""},null,{"$f":"IF(J46=0,\"\",VLOOKUP(J46,Etappen!$1:$65497,2,FALSE))","v":""},null,null,"A + B fehlt",null,{"$f":"IF(AND(O46=\"x\",Q46=\"x\"),\"wechsel\",IF(AND(O46=\"x\",Q46<>\"x\"),\"\",IF(AND(Q46=\"x\",O46<>\"x\"),\"M fehlt\",\"A + B fehlt\")))","v":"A + B fehlt"},null,{"$f":"IF(AND(Q46=\"x\",S46=\"x\"),\"wechsel\",IF(AND(Q46=\"x\",S46<>\"x\"),\"\",IF(AND(S46=\"x\",Q46<>\"x\"),\"M fehlt\",\"A + B fehlt\")))","v":"A + B fehlt"},null,null,null,null,null,null,null,{"$f":"IF(WEEKNUM(A46,2)<>WEEKNUM(A47,2),SUM(Y$7:Y46)-SUM(Z$6:Z45),\"\")","v":""}]
[null,null,{"$f":"IF(B47=0,\"\",VLOOKUP(B47,Etappen!$1:$65497,2,FALSE))","v":""},null,{"$f":"IF(D47=0,\"\",VLOOKUP(D47,Etappen!$1:$65497,2,FALSE))","v":""},null,{"$f":"IF(F47=0,\"\",VLOOKUP(F47,Etappen!$1:$65497,2,FALSE))","v":""},null,{"$f":"IF(H47=0,\"\",VLOOKUP(H47,Etappen!$1:$65497,2,FALSE))","v":""},null,{"$f":"IF(J47=0,\"\",VLOOKUP(J47,Etappen!$1:$65497,2,FALSE))","v":""},null,null,"A + B fehlt",null,{"$f":"IF(AND(O47=\"x\",Q47=\"x\"),\"wechsel\",IF(AND(O47=\"x\",Q47<>\"x\"),\"\",IF(AND(Q47=\"x\",O47<>\"x\"),\"M fehlt\",\"A + B fehlt\")))","v":"A + B fehlt"},null,{"$f":"IF(AND(Q47=\"x\",S47=\"x\"),\"wechsel\",IF(AND(Q47=\"x\",S47<>\"x\"),\"\",IF(AND(S47=\"x\",Q47<>\"x\"),\"M fehlt\",\"A + B fehlt\")))","v":"A + B fehlt"},null,null,null,null,null,null,null,{"$f":"IF(WEEKNUM(A47,2)<>WEEKNUM(A48,2),SUM(Y$7:Y47)-SUM(Z$6:Z46),\"\")","v":""}]
[null,null,{"$f":"IF(B48=0,\"\",VLOOKUP(B48,Etappen!$1:$65497,2,FALSE))","v":""},null,{"$f":"IF(D48=0,\"\",VLOOKUP(D48,Etappen!$1:$65497,2,FALSE))","v":""},null,{"$f":"IF(F48=0,\"\",VLOOKUP(F48,Etappen!$1:$65497,2,FALSE))","v":""},null,{"$f":"IF(H48=0,\"\",VLOOKUP(H48,Etappen!$1:$65497,2,FALSE))","v":""},null,{"$f":"IF(J48=0,\"\",VLOOKUP(J48,Etappen!$1:$65497,2,FALSE))","v":""},null,null,"A + B fehlt",null,{"$f":"IF(AND(O48=\"x\",Q48=\"x\"),\"wechsel\",IF(AND(O48=\"x\",Q48<>\"x\"),\"\",IF(AND(Q48=\"x\",O48<>\"x\"),\"M fehlt\",\"A + B fehlt\")))","v":"A + B fehlt"},null,{"$f":"IF(AND(Q48=\"x\",S48=\"x\"),\"wechsel\",IF(AND(Q48=\"x\",S48<>\"x\"),\"\",IF(AND(S48=\"x\",Q48<>\"x\"),\"M fehlt\",\"A + B fehlt\")))","v":"A + B fehlt"},null,null,null,null,null,null,null,{"$f":"IF(WEEKNUM(A48,2)<>WEEKNUM(A49,2),SUM(Y$7:Y48)-SUM(Z$6:Z47),\"\")","v":""}]
[null,null,{"$f":"IF(B49=0,\"\",VLOOKUP(B49,Etappen!$1:$65497,2,FALSE))","v":""},null,{"$f":"IF(D49=0,\"\",VLOOKUP(D49,Etappen!$1:$65497,2,FALSE))","v":""},null,{"$f":"IF(F49=0,\"\",VLOOKUP(F49,Etappen!$1:$65497,2,FALSE))","v":""},null,{"$f":"IF(H49=0,\"\",VLOOKUP(H49,Etappen!$1:$65497,2,FALSE))","v":""},null,{"$f":"IF(J49=0,\"\",VLOOKUP(J49,Etappen!$1:$65497,2,FALSE))","v":""},null,null,"A + B fehlt",null,{"$f":"IF(AND(O49=\"x\",Q49=\"x\"),\"wechsel\",IF(AND(O49=\"x\",Q49<>\"x\"),\"\",IF(AND(Q49=\"x\",O49<>\"x\"),\"M fehlt\",\"A + B fehlt\")))","v":"A + B fehlt"},null,{"$f":"IF(AND(Q49=\"x\",S49=\"x\"),\"wechsel\",IF(AND(Q49=\"x\",S49<>\"x\"),\"\",IF(AND(S49=\"x\",Q49<>\"x\"),\"M fehlt\",\"A + B fehlt\")))","v":"A + B fehlt"},null,null,null,null,null,null,null,{"$f":"IF(WEEKNUM(A49,2)<>WEEKNUM(A50,2),SUM(Y$7:Y49)-SUM(Z$6:Z48),\"\")","v":""}]
[null,null,{"$f":"IF(B50=0,\"\",VLOOKUP(B50,Etappen!$1:$65497,2,FALSE))","v":""},null,{"$f":"IF(D50=0,\"\",VLOOKUP(D50,Etappen!$1:$65497,2,FALSE))","v":""},null,{"$f":"IF(F50=0,\"\",VLOOKUP(F50,Etappen!$1:$65497,2,FALSE))","v":""},null,{"$f":"IF(H50=0,\"\",VLOOKUP(H50,Etappen!$1:$65497,2,FALSE))","v":""},null,{"$f":"IF(J50=0,\"\",VLOOKUP(J50,Etappen!$1:$65497,2,FALSE))","v":""},null,null,"A + B fehlt",null,{"$f":"IF(AND(O50=\"x\",Q50=\"x\"),\"wechsel\",IF(AND(O50=\"x\",Q50<>\"x\"),\"\",IF(AND(Q50=\"x\",O50<>\"x\"),\"M fehlt\",\"A + B fehlt\")))","v":"A + B fehlt"},null,{"$f":"IF(AND(Q50=\"x\",S50=\"x\"),\"wechsel\",IF(AND(Q50=\"x\",S50<>\"x\"),\"\",IF(AND(S50=\"x\",Q50<>\"x\"),\"M fehlt\",\"A + B fehlt\")))","v":"A + B fehlt"},null,null,null,null,null,null,null,{"$f":"IF(WEEKNUM(A50,2)<>WEEKNUM(A51,2),SUM(Y$7:Y50)-SUM(Z$6:Z49),\"\")","v":""}]
[null,null,{"$f":"IF(B51=0,\"\",VLOOKUP(B51,Etappen!$1:$65497,2,FALSE))","v":""},null,{"$f":"IF(D51=0,\"\",VLOOKUP(D51,Etappen!$1:$65497,2,FALSE))","v":""},null,{"$f":"IF(F51=0,\"\",VLOOKUP(F51,Etappen!$1:$65497,2,FALSE))","v":""},null,{"$f":"IF(H51=0,\"\",VLOOKUP(H51,Etappen!$1:$65497,2,FALSE))","v":""},null,{"$f":"IF(J51=0,\"\",VLOOKUP(J51,Etappen!$1:$65497,2,FALSE))","v":""},null,null,"A + B fehlt",null,{"$f":"IF(AND(O51=\"x\",Q51=\"x\"),\"wechsel\",IF(AND(O51=\"x\",Q51<>\"x\"),\"\",IF(AND(Q51=\"x\",O51<>\"x\"),\"M fehlt\",\"A + B fehlt\")))","v":"A + B fehlt"},null,{"$f":"IF(AND(Q51=\"x\",S51=\"x\"),\"wechsel\",IF(AND(Q51=\"x\",S51<>\"x\"),\"\",IF(AND(S51=\"x\",Q51<>\"x\"),\"M fehlt\",\"A + B fehlt\")))","v":"A + B fehlt"},null,null,null,null,null,null,null,{"$f":"IF(WEEKNUM(A51,2)<>WEEKNUM(A52,2),SUM(Y$7:Y51)-SUM(Z$6:Z50),\"\")","v":""}]
[null,null,{"$f":"IF(B52=0,\"\",VLOOKUP(B52,Etappen!$1:$65497,2,FALSE))","v":""},null,{"$f":"IF(D52=0,\"\",VLOOKUP(D52,Etappen!$1:$65497,2,FALSE))","v":""},null,{"$f":"IF(F52=0,\"\",VLOOKUP(F52,Etappen!$1:$65497,2,FALSE))","v":""},null,{"$f":"IF(H52=0,\"\",VLOOKUP(H52,Etappen!$1:$65497,2,FALSE))","v":""},null,{"$f":"IF(J52=0,\"\",VLOOKUP(J52,Etappen!$1:$65497,2,FALSE))","v":""},null,null,"A + B fehlt",null,{"$f":"IF(AND(O52=\"x\",Q52=\"x\"),\"wechsel\",IF(AND(O52=\"x\",Q52<>\"x\"),\"\",IF(AND(Q52=\"x\",O52<>\"x\"),\"M fehlt\",\"A + B fehlt\")))","v":"A + B fehlt"},null,{"$f":"IF(AND(Q52=\"x\",S52=\"x\"),\"wechsel\",IF(AND(Q52=\"x\",S52<>\"x\"),\"\",IF(AND(S52=\"x\",Q52<>\"x\"),\"M fehlt\",\"A + B fehlt\")))","v":"A + B fehlt"},null,null,null,null,null,null,null,{"$f":"IF(WEEKNUM(A52,2)<>WEEKNUM(A53,2),SUM(Y$7:Y52)-SUM(Z$6:Z51),\"\")","v":""}]
[null,null,{"$f":"IF(B53=0,\"\",VLOOKUP(B53,Etappen!$1:$65497,2,FALSE))","v":""},null,{"$f":"IF(D53=0,\"\",VLOOKUP(D53,Etappen!$1:$65497,2,FALSE))","v":""},null,{"$f":"IF(F53=0,\"\",VLOOKUP(F53,Etappen!$1:$65497,2,FALSE))","v":""},null,{"$f":"IF(H53=0,\"\",VLOOKUP(H53,Etappen!$1:$65497,2,FALSE))","v":""},null,{"$f":"IF(J53=0,\"\",VLOOKUP(J53,Etappen!$1:$65497,2,FALSE))","v":""},null,null,"A + B fehlt",null,{"$f":"IF(AND(O53=\"x\",Q53=\"x\"),\"wechsel\",IF(AND(O53=\"x\",Q53<>\"x\"),\"\",IF(AND(Q53=\"x\",O53<>\"x\"),\"M fehlt\",\"A + B fehlt\")))","v":"A + B fehlt"},null,{"$f":"IF(AND(Q53=\"x\",S53=\"x\"),\"wechsel\",IF(AND(Q53=\"x\",S53<>\"x\"),\"\",IF(AND(S53=\"x\",Q53<>\"x\"),\"M fehlt\",\"A + B fehlt\")))","v":"A + B fehlt"},null,null,null,null,null,null,null,{"$f":"IF(WEEKNUM(A53,2)<>WEEKNUM(A54,2),SUM(Y$7:Y53)-SUM(Z$6:Z52),\"\")","v":""}]
[null,null,{"$f":"IF(B54=0,\"\",VLOOKUP(B54,Etappen!$1:$65497,2,FALSE))","v":""},null,{"$f":"IF(D54=0,\"\",VLOOKUP(D54,Etappen!$1:$65497,2,FALSE))","v":""},null,{"$f":"IF(F54=0,\"\",VLOOKUP(F54,Etappen!$1:$65497,2,FALSE))","v":""},null,{"$f":"IF(H54=0,\"\",VLOOKUP(H54,Etappen!$1:$65497,2,FALSE))","v":""},null,{"$f":"IF(J54=0,\"\",VLOOKUP(J54,Etappen!$1:$65497,2,FALSE))","v":""},null,null,"A + B fehlt",null,{"$f":"IF(AND(O54=\"x\",Q54=\"x\"),\"wechsel\",IF(AND(O54=\"x\",Q54<>\"x\"),\"\",IF(AND(Q54=\"x\",O54<>\"x\"),\"M fehlt\",\"A + B fehlt\")))","v":"A + B fehlt"},null,{"$f":"IF(AND(Q54=\"x\",S54=\"x\"),\"wechsel\",IF(AND(Q54=\"x\",S54<>\"x\"),\"\",IF(AND(S54=\"x\",Q54<>\"x\"),\"M fehlt\",\"A + B fehlt\")))","v":"A + B fehlt"},null,null,null,null,null,null,null,{"$f":"IF(WEEKNUM(A54,2)<>WEEKNUM(A55,2),SUM(Y$7:Y54)-SUM(Z$6:Z53),\"\")","v":""}]
[null,null,{"$f":"IF(B55=0,\"\",VLOOKUP(B55,Etappen!$1:$65497,2,FALSE))","v":""},null,{"$f":"IF(D55=0,\"\",VLOOKUP(D55,Etappen!$1:$65497,2,FALSE))","v":""},null,{"$f":"IF(F55=0,\"\",VLOOKUP(F55,Etappen!$1:$65497,2,FALSE))","v":""},null,{"$f":"IF(H55=0,\"\",VLOOKUP(H55,Etappen!$1:$65497,2,FALSE))","v":""},null,{"$f":"IF(J55=0,\"\",VLOOKUP(J55,Etappen!$1:$65497,2,FALSE))","v":""},null,null,"A + B fehlt",null,{"$f":"IF(AND(O55=\"x\",Q55=\"x\"),\"wechsel\",IF(AND(O55=\"x\",Q55<>\"x\"),\"\",IF(AND(Q55=\"x\",O55<>\"x\"),\"M fehlt\",\"A + B fehlt\")))","v":"A + B fehlt"},null,{"$f":"IF(AND(Q55=\"x\",S55=\"x\"),\"wechsel\",IF(AND(Q55=\"x\",S55<>\"x\"),\"\",IF(AND(S55=\"x\",Q55<>\"x\"),\"M fehlt\",\"A + B fehlt\")))","v":"A + B fehlt"},null,null,null,null,null,null,null,{"$f":"IF(WEEKNUM(A55,2)<>WEEKNUM(A56,2),SUM(Y$7:Y55)-SUM(Z$6:Z54),\"\")","v":""}]
[null,null,{"$f":"IF(B56=0,\"\",VLOOKUP(B56,Etappen!$1:$65497,2,FALSE))","v":""},null,{"$f":"IF(D56=0,\"\",VLOOKUP(D56,Etappen!$1:$65497,2,FALSE))","v":""},null,{"$f":"IF(F56=0,\"\",VLOOKUP(F56,Etappen!$1:$65497,2,FALSE))","v":""},null,{"$f":"IF(H56=0,\"\",VLOOKUP(H56,Etappen!$1:$65497,2,FALSE))","v":""},null,{"$f":"IF(J56=0,\"\",VLOOKUP(J56,Etappen!$1:$65497,2,FALSE))","v":""},null,null,"A + B fehlt",null,{"$f":"IF(AND(O56=\"x\",Q56=\"x\"),\"wechsel\",IF(AND(O56=\"x\",Q56<>\"x\"),\"\",IF(AND(Q56=\"x\",O56<>\"x\"),\"M fehlt\",\"A + B fehlt\")))","v":"A + B fehlt"},null,{"$f":"IF(AND(Q56=\"x\",S56=\"x\"),\"wechsel\",IF(AND(Q56=\"x\",S56<>\"x\"),\"\",IF(AND(S56=\"x\",Q56<>\"x\"),\"M fehlt\",\"A + B fehlt\")))","v":"A + B fehlt"},null,null,null,null,null,null,null,{"$f":"IF(WEEKNUM(A56,2)<>WEEKNUM(A57,2),SUM(Y$7:Y56)-SUM(Z$6:Z55),\"\")","v":""}]
[null,null,{"$f":"IF(B57=0,\"\",VLOOKUP(B57,Etappen!$1:$65497,2,FALSE))","v":""},null,{"$f":"IF(D57=0,\"\",VLOOKUP(D57,Etappen!$1:$65497,2,FALSE))","v":""},null,{"$f":"IF(F57=0,\"\",VLOOKUP(F57,Etappen!$1:$65497,2,FALSE))","v":""},null,{"$f":"IF(H57=0,\"\",VLOOKUP(H57,Etappen!$1:$65497,2,FALSE))","v":""},null,{"$f":"IF(J57=0,\"\",VLOOKUP(J57,Etappen!$1:$65497,2,FALSE))","v":""},null,null,"A + B fehlt",null,{"$f":"IF(AND(O57=\"x\",Q57=\"x\"),\"wechsel\",IF(AND(O57=\"x\",Q57<>\"x\"),\"\",IF(AND(Q57=\"x\",O57<>\"x\"),\"M fehlt\",\"A + B fehlt\")))","v":"A + B fehlt"},null,{"$f":"IF(AND(Q57=\"x\",S57=\"x\"),\"wechsel\",IF(AND(Q57=\"x\",S57<>\"x\"),\"\",IF(AND(S57=\"x\",Q57<>\"x\"),\"M fehlt\",\"A + B fehlt\")))","v":"A + B fehlt"},null,null,null,null,null,null,null,{"$f":"IF(WEEKNUM(A57,2)<>WEEKNUM(A58,2),SUM(Y$7:Y57)-SUM(Z$6:Z56),\"\")","v":""}]
[null,null,{"$f":"IF(B58=0,\"\",VLOOKUP(B58,Etappen!$1:$65497,2,FALSE))","v":""},null,{"$f":"IF(D58=0,\"\",VLOOKUP(D58,Etappen!$1:$65497,2,FALSE))","v":""},null,{"$f":"IF(F58=0,\"\",VLOOKUP(F58,Etappen!$1:$65497,2,FALSE))","v":""},null,{"$f":"IF(H58=0,\"\",VLOOKUP(H58,Etappen!$1:$65497,2,FALSE))","v":""},null,{"$f":"IF(J58=0,\"\",VLOOKUP(J58,Etappen!$1:$65497,2,FALSE))","v":""},null,null,"A + B fehlt",null,{"$f":"IF(AND(O58=\"x\",Q58=\"x\"),\"wechsel\",IF(AND(O58=\"x\",Q58<>\"x\"),\"\",IF(AND(Q58=\"x\",O58<>\"x\"),\"M fehlt\",\"A + B fehlt\")))","v":"A + B fehlt"},null,{"$f":"IF(AND(Q58=\"x\",S58=\"x\"),\"wechsel\",IF(AND(Q58=\"x\",S58<>\"x\"),\"\",IF(AND(S58=\"x\",Q58<>\"x\"),\"M fehlt\",\"A + B fehlt\")))","v":"A + B fehlt"},null,null,null,null,null,null,null,{"$f":"IF(WEEKNUM(A58,2)<>WEEKNUM(A59,2),SUM(Y$7:Y58)-SUM(Z$6:Z57),\"\")","v":""}]
[null,null,{"$f":"IF(B59=0,\"\",VLOOKUP(B59,Etappen!$1:$65497,2,FALSE))","v":""},null,{"$f":"IF(D59=0,\"\",VLOOKUP(D59,Etappen!$1:$65497,2,FALSE))","v":""},null,{"$f":"IF(F59=0,\"\",VLOOKUP(F59,Etappen!$1:$65497,2,FALSE))","v":""},null,{"$f":"IF(H59=0,\"\",VLOOKUP(H59,Etappen!$1:$65497,2,FALSE))","v":""},null,{"$f":"IF(J59=0,\"\",VLOOKUP(J59,Etappen!$1:$65497,2,FALSE))","v":""},null,null,"A + B fehlt",null,{"$f":"IF(AND(O59=\"x\",Q59=\"x\"),\"wechsel\",IF(AND(O59=\"x\",Q59<>\"x\"),\"\",IF(AND(Q59=\"x\",O59<>\"x\"),\"M fehlt\",\"A + B fehlt\")))","v":"A + B fehlt"},null,{"$f":"IF(AND(Q59=\"x\",S59=\"x\"),\"wechsel\",IF(AND(Q59=\"x\",S59<>\"x\"),\"\",IF(AND(S59=\"x\",Q59<>\"x\"),\"M fehlt\",\"A + B fehlt\")))","v":"A + B fehlt"},null,null,null,null,null,null,null,{"$f":"IF(WEEKNUM(A59,2)<>WEEKNUM(A60,2),SUM(Y$7:Y59)-SUM(Z$6:Z58),\"\")","v":""}]
[null,null,{"$f":"IF(B60=0,\"\",VLOOKUP(B60,Etappen!$1:$65497,2,FALSE))","v":""},null,{"$f":"IF(D60=0,\"\",VLOOKUP(D60,Etappen!$1:$65497,2,FALSE))","v":""},null,{"$f":"IF(F60=0,\"\",VLOOKUP(F60,Etappen!$1:$65497,2,FALSE))","v":""},null,{"$f":"IF(H60=0,\"\",VLOOKUP(H60,Etappen!$1:$65497,2,FALSE))","v":""},null,{"$f":"IF(J60=0,\"\",VLOOKUP(J60,Etappen!$1:$65497,2,FALSE))","v":""},null,null,"A + B fehlt",null,{"$f":"IF(AND(O60=\"x\",Q60=\"x\"),\"wechsel\",IF(AND(O60=\"x\",Q60<>\"x\"),\"\",IF(AND(Q60=\"x\",O60<>\"x\"),\"M fehlt\",\"A + B fehlt\")))","v":"A + B fehlt"},null,{"$f":"IF(AND(Q60=\"x\",S60=\"x\"),\"wechsel\",IF(AND(Q60=\"x\",S60<>\"x\"),\"\",IF(AND(S60=\"x\",Q60<>\"x\"),\"M fehlt\",\"A + B fehlt\")))","v":"A + B fehlt"},null,null,null,null,null,null,null,{"$f":"IF(WEEKNUM(A60,2)<>WEEKNUM(A61,2),SUM(Y$7:Y60)-SUM(Z$6:Z59),\"\")","v":""}]
[null,null,{"$f":"IF(B61=0,\"\",VLOOKUP(B61,Etappen!$1:$65497,2,FALSE))","v":""},null,{"$f":"IF(D61=0,\"\",VLOOKUP(D61,Etappen!$1:$65497,2,FALSE))","v":""},null,{"$f":"IF(F61=0,\"\",VLOOKUP(F61,Etappen!$1:$65497,2,FALSE))","v":""},null,{"$f":"IF(H61=0,\"\",VLOOKUP(H61,Etappen!$1:$65497,2,FALSE))","v":""},null,{"$f":"IF(J61=0,\"\",VLOOKUP(J61,Etappen!$1:$65497,2,FALSE))","v":""},null,null,"A + B fehlt",null,{"$f":"IF(AND(O61=\"x\",Q61=\"x\"),\"wechsel\",IF(AND(O61=\"x\",Q61<>\"x\"),\"\",IF(AND(Q61=\"x\",O61<>\"x\"),\"M fehlt\",\"A + B fehlt\")))","v":"A + B fehlt"},null,{"$f":"IF(AND(Q61=\"x\",S61=\"x\"),\"wechsel\",IF(AND(Q61=\"x\",S61<>\"x\"),\"\",IF(AND(S61=\"x\",Q61<>\"x\"),\"M fehlt\",\"A + B fehlt\")))","v":"A + B fehlt"},null,null,null,null,null,null,null,{"$f":"IF(WEEKNUM(A61,2)<>WEEKNUM(A62,2),SUM(Y$7:Y61)-SUM(Z$6:Z60),\"\")","v":""}]
[null,null,{"$f":"IF(B62=0,\"\",VLOOKUP(B62,Etappen!$1:$65497,2,FALSE))","v":""},null,{"$f":"IF(D62=0,\"\",VLOOKUP(D62,Etappen!$1:$65497,2,FALSE))","v":""},null,{"$f":"IF(F62=0,\"\",VLOOKUP(F62,Etappen!$1:$65497,2,FALSE))","v":""},null,{"$f":"IF(H62=0,\"\",VLOOKUP(H62,Etappen!$1:$65497,2,FALSE))","v":""},null,{"$f":"IF(J62=0,\"\",VLOOKUP(J62,Etappen!$1:$65497,2,FALSE))","v":""},null,null,"A + B fehlt",null,{"$f":"IF(AND(O62=\"x\",Q62=\"x\"),\"wechsel\",IF(AND(O62=\"x\",Q62<>\"x\"),\"\",IF(AND(Q62=\"x\",O62<>\"x\"),\"M fehlt\",\"A + B fehlt\")))","v":"A + B fehlt"},null,{"$f":"IF(AND(Q62=\"x\",S62=\"x\"),\"wechsel\",IF(AND(Q62=\"x\",S62<>\"x\"),\"\",IF(AND(S62=\"x\",Q62<>\"x\"),\"M fehlt\",\"A + B fehlt\")))","v":"A + B fehlt"},null,null,null,null,null,null,null,{"$f":"IF(WEEKNUM(A62,2)<>WEEKNUM(A63,2),SUM(Y$7:Y62)-SUM(Z$6:Z61),\"\")","v":""}]
[null,null,{"$f":"IF(B63=0,\"\",VLOOKUP(B63,Etappen!$1:$65497,2,FALSE))","v":""},null,{"$f":"IF(D63=0,\"\",VLOOKUP(D63,Etappen!$1:$65497,2,FALSE))","v":""},null,{"$f":"IF(F63=0,\"\",VLOOKUP(F63,Etappen!$1:$65497,2,FALSE))","v":""},null,{"$f":"IF(H63=0,\"\",VLOOKUP(H63,Etappen!$1:$65497,2,FALSE))","v":""},null,{"$f":"IF(J63=0,\"\",VLOOKUP(J63,Etappen!$1:$65497,2,FALSE))","v":""},null,null,"A + B fehlt",null,{"$f":"IF(AND(O63=\"x\",Q63=\"x\"),\"wechsel\",IF(AND(O63=\"x\",Q63<>\"x\"),\"\",IF(AND(Q63=\"x\",O63<>\"x\"),\"M fehlt\",\"A + B fehlt\")))","v":"A + B fehlt"},null,{"$f":"IF(AND(Q63=\"x\",S63=\"x\"),\"wechsel\",IF(AND(Q63=\"x\",S63<>\"x\"),\"\",IF(AND(S63=\"x\",Q63<>\"x\"),\"M fehlt\",\"A + B fehlt\")))","v":"A + B fehlt"},null,null,null,null,null,null,null,{"$f":"IF(WEEKNUM(A63,2)<>WEEKNUM(A64,2),SUM(Y$7:Y63)-SUM(Z$6:Z62),\"\")","v":""}]
[null,null,{"$f":"IF(B64=0,\"\",VLOOKUP(B64,Etappen!$1:$65497,2,FALSE))","v":""},null,{"$f":"IF(D64=0,\"\",VLOOKUP(D64,Etappen!$1:$65497,2,FALSE))","v":""},null,{"$f":"IF(F64=0,\"\",VLOOKUP(F64,Etappen!$1:$65497,2,FALSE))","v":""},null,{"$f":"IF(H64=0,\"\",VLOOKUP(H64,Etappen!$1:$65497,2,FALSE))","v":""},null,{"$f":"IF(J64=0,\"\",VLOOKUP(J64,Etappen!$1:$65497,2,FALSE))","v":""},null,null,"A + B fehlt",null,{"$f":"IF(AND(O64=\"x\",Q64=\"x\"),\"wechsel\",IF(AND(O64=\"x\",Q64<>\"x\"),\"\",IF(AND(Q64=\"x\",O64<>\"x\"),\"M fehlt\",\"A + B fehlt\")))","v":"A + B fehlt"},null,{"$f":"IF(AND(Q64=\"x\",S64=\"x\"),\"wechsel\",IF(AND(Q64=\"x\",S64<>\"x\"),\"\",IF(AND(S64=\"x\",Q64<>\"x\"),\"M fehlt\",\"A + B fehlt\")))","v":"A + B fehlt"},null,null,null,null,null,null,null,{"$f":"IF(WEEKNUM(A64,2)<>WEEKNUM(A65,2),SUM(Y$7:Y64)-SUM(Z$6:Z63),\"\")","v":""}]
[null,null,{"$f":"IF(B65=0,\"\",VLOOKUP(B65,Etappen!$1:$65497,2,FALSE))","v":""},null,{"$f":"IF(D65=0,\"\",VLOOKUP(D65,Etappen!$1:$65497,2,FALSE))","v":""},null,{"$f":"IF(F65=0,\"\",VLOOKUP(F65,Etappen!$1:$65497,2,FALSE))","v":""},null,{"$f":"IF(H65=0,\"\",VLOOKUP(H65,Etappen!$1:$65497,2,FALSE))","v":""},null,{"$f":"IF(J65=0,\"\",VLOOKUP(J65,Etappen!$1:$65497,2,FALSE))","v":""},null,null,"A + B fehlt",null,{"$f":"IF(AND(O65=\"x\",Q65=\"x\"),\"wechsel\",IF(AND(O65=\"x\",Q65<>\"x\"),\"\",IF(AND(Q65=\"x\",O65<>\"x\"),\"M fehlt\",\"A + B fehlt\")))","v":"A + B fehlt"},null,{"$f":"IF(AND(Q65=\"x\",S65=\"x\"),\"wechsel\",IF(AND(Q65=\"x\",S65<>\"x\"),\"\",IF(AND(S65=\"x\",Q65<>\"x\"),\"M fehlt\",\"A + B fehlt\")))","v":"A + B fehlt"},null,null,null,null,null,null,null,{"$f":"IF(WEEKNUM(A65,2)<>WEEKNUM(A66,2),SUM(Y$7:Y65)-SUM(Z$6:Z64),\"\")","v":""}]
[null,null,{"$f":"IF(B66=0,\"\",VLOOKUP(B66,Etappen!$1:$65497,2,FALSE))","v":""},null,{"$f":"IF(D66=0,\"\",VLOOKUP(D66,Etappen!$1:$65497,2,FALSE))","v":""},null,{"$f":"IF(F66=0,\"\",VLOOKUP(F66,Etappen!$1:$65497,2,FALSE))","v":""},null,{"$f":"IF(H66=0,\"\",VLOOKUP(H66,Etappen!$1:$65497,2,FALSE))","v":""},null,{"$f":"IF(J66=0,\"\",VLOOKUP(J66,Etappen!$1:$65497,2,FALSE))","v":""},null,null,"A + B fehlt",null,{"$f":"IF(AND(O66=\"x\",Q66=\"x\"),\"wechsel\",IF(AND(O66=\"x\",Q66<>\"x\"),\"\",IF(AND(Q66=\"x\",O66<>\"x\"),\"M fehlt\",\"A + B fehlt\")))","v":"A + B fehlt"},null,{"$f":"IF(AND(Q66=\"x\",S66=\"x\"),\"wechsel\",IF(AND(Q66=\"x\",S66<>\"x\"),\"\",IF(AND(S66=\"x\",Q66<>\"x\"),\"M fehlt\",\"A + B fehlt\")))","v":"A + B fehlt"},null,null,null,null,null,null,null,{"$f":"IF(WEEKNUM(A66,2)<>WEEKNUM(A67,2),SUM(Y$7:Y66)-SUM(Z$6:Z65),\"\")","v":""}]
[null,null,{"$f":"IF(B67=0,\"\",VLOOKUP(B67,Etappen!$1:$65497,2,FALSE))","v":""},null,{"$f":"IF(D67=0,\"\",VLOOKUP(D67,Etappen!$1:$65497,2,FALSE))","v":""},null,{"$f":"IF(F67=0,\"\",VLOOKUP(F67,Etappen!$1:$65497,2,FALSE))","v":""},null,{"$f":"IF(H67=0,\"\",VLOOKUP(H67,Etappen!$1:$65497,2,FALSE))","v":""},null,{"$f":"IF(J67=0,\"\",VLOOKUP(J67,Etappen!$1:$65497,2,FALSE))","v":""},null,null,{"$f":"IF(AND(M67=\"x\",O67=\"x\"),\"wechsel\",IF(AND(M67=\"x\",O67<>\"x\"),\"\",IF(AND(O67=\"x\",M67<>\"x\"),\"M fehlt\",\"A + B fehlt\")))","v":"A + B fehlt"},null,{"$f":"IF(AND(O67=\"x\",Q67=\"x\"),\"wechsel\",IF(AND(O67=\"x\",Q67<>\"x\"),\"\",IF(AND(Q67=\"x\",O67<>\"x\"),\"M fehlt\",\"A + B fehlt\")))","v":"A + B fehlt"},null,{"$f":"IF(AND(Q67=\"x\",S67=\"x\"),\"wechsel\",IF(AND(Q67=\"x\",S67<>\"x\"),\"\",IF(AND(S67=\"x\",Q67<>\"x\"),\"M fehlt\",\"A + B fehlt\")))","v":"A + B fehlt"},null,null,null,null,null,null,null,{"$f":"IF(WEEKNUM(A67,2)<>WEEKNUM(A68,2),SUM(Y$7:Y67)-SUM(Z$6:Z66),\"\")","v":""}]
[null,null,{"$f":"IF(B68=0,\"\",VLOOKUP(B68,Etappen!$1:$65497,2,FALSE))","v":""},null,{"$f":"IF(D68=0,\"\",VLOOKUP(D68,Etappen!$1:$65497,2,FALSE))","v":""},null,{"$f":"IF(F68=0,\"\",VLOOKUP(F68,Etappen!$1:$65497,2,FALSE))","v":""},null,{"$f":"IF(H68=0,\"\",VLOOKUP(H68,Etappen!$1:$65497,2,FALSE))","v":""},null,{"$f":"IF(J68=0,\"\",VLOOKUP(J68,Etappen!$1:$65497,2,FALSE))","v":""},null,null,"A + B fehlt",null,{"$f":"IF(AND(O68=\"x\",Q68=\"x\"),\"wechsel\",IF(AND(O68=\"x\",Q68<>\"x\"),\"\",IF(AND(Q68=\"x\",O68<>\"x\"),\"M fehlt\",\"A + B fehlt\")))","v":"A + B fehlt"},null,{"$f":"IF(AND(Q68=\"x\",S68=\"x\"),\"wechsel\",IF(AND(Q68=\"x\",S68<>\"x\"),\"\",IF(AND(S68=\"x\",Q68<>\"x\"),\"M fehlt\",\"A + B fehlt\")))","v":"A + B fehlt"},null,null,null,null,null,null,null,{"$f":"IF(WEEKNUM(A68,2)<>WEEKNUM(A69,2),SUM(Y$7:Y68)-SUM(Z$6:Z67),\"\")","v":""}]
[null,null,{"$f":"IF(B69=0,\"\",VLOOKUP(B69,Etappen!$1:$65497,2,FALSE))","v":""},null,{"$f":"IF(D69=0,\"\",VLOOKUP(D69,Etappen!$1:$65497,2,FALSE))","v":""},null,{"$f":"IF(F69=0,\"\",VLOOKUP(F69,Etappen!$1:$65497,2,FALSE))","v":""},null,{"$f":"IF(H69=0,\"\",VLOOKUP(H69,Etappen!$1:$65497,2,FALSE))","v":""},null,{"$f":"IF(J69=0,\"\",VLOOKUP(J69,Etappen!$1:$65497,2,FALSE))","v":""},null,null,"A + B fehlt",null,{"$f":"IF(AND(O69=\"x\",Q69=\"x\"),\"wechsel\",IF(AND(O69=\"x\",Q69<>\"x\"),\"\",IF(AND(Q69=\"x\",O69<>\"x\"),\"M fehlt\",\"A + B fehlt\")))","v":"A + B fehlt"},null,{"$f":"IF(AND(Q69=\"x\",S69=\"x\"),\"wechsel\",IF(AND(Q69=\"x\",S69<>\"x\"),\"\",IF(AND(S69=\"x\",Q69<>\"x\"),\"M fehlt\",\"A + B fehlt\")))","v":"A + B fehlt"},null,null,null,null,null,null,null,{"$f":"IF(WEEKNUM(A69,2)<>WEEKNUM(A70,2),SUM(Y$7:Y69)-SUM(Z$6:Z68),\"\")","v":""}]
[null,null,{"$f":"IF(B70=0,\"\",VLOOKUP(B70,Etappen!$1:$65497,2,FALSE))","v":""},null,{"$f":"IF(D70=0,\"\",VLOOKUP(D70,Etappen!$1:$65497,2,FALSE))","v":""},null,{"$f":"IF(F70=0,\"\",VLOOKUP(F70,Etappen!$1:$65497,2,FALSE))","v":""},null,{"$f":"IF(H70=0,\"\",VLOOKUP(H70,Etappen!$1:$65497,2,FALSE))","v":""},null,{"$f":"IF(J70=0,\"\",VLOOKUP(J70,Etappen!$1:$65497,2,FALSE))","v":""},null,null,"A + B fehlt",null,{"$f":"IF(AND(O70=\"x\",Q70=\"x\"),\"wechsel\",IF(AND(O70=\"x\",Q70<>\"x\"),\"\",IF(AND(Q70=\"x\",O70<>\"x\"),\"M fehlt\",\"A + B fehlt\")))","v":"A + B fehlt"},null,{"$f":"IF(AND(Q70=\"x\",S70=\"x\"),\"wechsel\",IF(AND(Q70=\"x\",S70<>\"x\"),\"\",IF(AND(S70=\"x\",Q70<>\"x\"),\"M fehlt\",\"A + B fehlt\")))","v":"A + B fehlt"},null,null,null,null,null,null,null,{"$f":"IF(WEEKNUM(A70,2)<>WEEKNUM(A71,2),SUM(Y$7:Y70)-SUM(Z$6:Z69),\"\")","v":""}]
[null,null,{"$f":"IF(B71=0,\"\",VLOOKUP(B71,Etappen!$1:$65497,2,FALSE))","v":""},null,{"$f":"IF(D71=0,\"\",VLOOKUP(D71,Etappen!$1:$65497,2,FALSE))","v":""},null,{"$f":"IF(F71=0,\"\",VLOOKUP(F71,Etappen!$1:$65497,2,FALSE))","v":""},null,{"$f":"IF(H71=0,\"\",VLOOKUP(H71,Etappen!$1:$65497,2,FALSE))","v":""},null,{"$f":"IF(J71=0,\"\",VLOOKUP(J71,Etappen!$1:$65497,2,FALSE))","v":""},null,null,"A + B fehlt",null,{"$f":"IF(AND(O71=\"x\",Q71=\"x\"),\"wechsel\",IF(AND(O71=\"x\",Q71<>\"x\"),\"\",IF(AND(Q71=\"x\",O71<>\"x\"),\"M fehlt\",\"A + B fehlt\")))","v":"A + B fehlt"},null,{"$f":"IF(AND(Q71=\"x\",S71=\"x\"),\"wechsel\",IF(AND(Q71=\"x\",S71<>\"x\"),\"\",IF(AND(S71=\"x\",Q71<>\"x\"),\"M fehlt\",\"A + B fehlt\")))","v":"A + B fehlt"},null,null,null,null,null,null,null,{"$f":"IF(WEEKNUM(A71,2)<>WEEKNUM(A72,2),SUM(Y$7:Y71)-SUM(Z$6:Z70),\"\")","v":""}]
[null,null,{"$f":"IF(B72=0,\"\",VLOOKUP(B72,Etappen!$1:$65497,2,FALSE))","v":""},null,{"$f":"IF(D72=0,\"\",VLOOKUP(D72,Etappen!$1:$65497,2,FALSE))","v":""},null,{"$f":"IF(F72=0,\"\",VLOOKUP(F72,Etappen!$1:$65497,2,FALSE))","v":""},null,{"$f":"IF(H72=0,\"\",VLOOKUP(H72,Etappen!$1:$65497,2,FALSE))","v":""},null,{"$f":"IF(J72=0,\"\",VLOOKUP(J72,Etappen!$1:$65497,2,FALSE))","v":""},null,null,"A + B fehlt",null,{"$f":"IF(AND(O72=\"x\",Q72=\"x\"),\"wechsel\",IF(AND(O72=\"x\",Q72<>\"x\"),\"\",IF(AND(Q72=\"x\",O72<>\"x\"),\"M fehlt\",\"A + B fehlt\")))","v":"A + B fehlt"},null,{"$f":"IF(AND(Q72=\"x\",S72=\"x\"),\"wechsel\",IF(AND(Q72=\"x\",S72<>\"x\"),\"\",IF(AND(S72=\"x\",Q72<>\"x\"),\"M fehlt\",\"A + B fehlt\")))","v":"A + B fehlt"},null,null,null,null,null,null,null,{"$f":"IF(WEEKNUM(A72,2)<>WEEKNUM(A73,2),SUM(Y$7:Y72)-SUM(Z$6:Z71),\"\")","v":""}]
[null,null,{"$f":"IF(B73=0,\"\",VLOOKUP(B73,Etappen!$1:$65497,2,FALSE))","v":""},null,{"$f":"IF(D73=0,\"\",VLOOKUP(D73,Etappen!$1:$65497,2,FALSE))","v":""},null,{"$f":"IF(F73=0,\"\",VLOOKUP(F73,Etappen!$1:$65497,2,FALSE))","v":""},null,{"$f":"IF(H73=0,\"\",VLOOKUP(H73,Etappen!$1:$65497,2,FALSE))","v":""},null,{"$f":"IF(J73=0,\"\",VLOOKUP(J73,Etappen!$1:$65497,2,FALSE))","v":""},null,null,"A + B fehlt",null,{"$f":"IF(AND(O73=\"x\",Q73=\"x\"),\"wechsel\",IF(AND(O73=\"x\",Q73<>\"x\"),\"\",IF(AND(Q73=\"x\",O73<>\"x\"),\"M fehlt\",\"A + B fehlt\")))","v":"A + B fehlt"},null,{"$f":"IF(AND(Q73=\"x\",S73=\"x\"),\"wechsel\",IF(AND(Q73=\"x\",S73<>\"x\"),\"\",IF(AND(S73=\"x\",Q73<>\"x\"),\"M fehlt\",\"A + B fehlt\")))","v":"A + B fehlt"},null,null,null,null,null,null,null,{"$f":"IF(WEEKNUM(A73,2)<>WEEKNUM(A74,2),SUM(Y$7:Y73)-SUM(Z$6:Z72),\"\")","v":""}]
[null,null,{"$f":"IF(B74=0,\"\",VLOOKUP(B74,Etappen!$1:$65497,2,FALSE))","v":""},null,{"$f":"IF(D74=0,\"\",VLOOKUP(D74,Etappen!$1:$65497,2,FALSE))","v":""},null,{"$f":"IF(F74=0,\"\",VLOOKUP(F74,Etappen!$1:$65497,2,FALSE))","v":""},null,{"$f":"IF(H74=0,\"\",VLOOKUP(H74,Etappen!$1:$65497,2,FALSE))","v":""},null,{"$f":"IF(J74=0,\"\",VLOOKUP(J74,Etappen!$1:$65497,2,FALSE))","v":""},null,null,"A + B fehlt",null,{"$f":"IF(AND(O74=\"x\",Q74=\"x\"),\"wechsel\",IF(AND(O74=\"x\",Q74<>\"x\"),\"\",IF(AND(Q74=\"x\",O74<>\"x\"),\"M fehlt\",\"A + B fehlt\")))","v":"A + B fehlt"},null,{"$f":"IF(AND(Q74=\"x\",S74=\"x\"),\"wechsel\",IF(AND(Q74=\"x\",S74<>\"x\"),\"\",IF(AND(S74=\"x\",Q74<>\"x\"),\"M fehlt\",\"A + B fehlt\")))","v":"A + B fehlt"},null,null,null,null,null,null,null,{"$f":"IF(WEEKNUM(A74,2)<>WEEKNUM(A75,2),SUM(Y$7:Y74)-SUM(Z$6:Z73),\"\")","v":""}]
[null,null,{"$f":"IF(B75=0,\"\",VLOOKUP(B75,Etappen!$1:$65497,2,FALSE))","v":""},null,{"$f":"IF(D75=0,\"\",VLOOKUP(D75,Etappen!$1:$65497,2,FALSE))","v":""},null,{"$f":"IF(F75=0,\"\",VLOOKUP(F75,Etappen!$1:$65497,2,FALSE))","v":""},null,{"$f":"IF(H75=0,\"\",VLOOKUP(H75,Etappen!$1:$65497,2,FALSE))","v":""},null,{"$f":"IF(J75=0,\"\",VLOOKUP(J75,Etappen!$1:$65497,2,FALSE))","v":""},null,null,"A + B fehlt",null,{"$f":"IF(AND(O75=\"x\",Q75=\"x\"),\"wechsel\",IF(AND(O75=\"x\",Q75<>\"x\"),\"\",IF(AND(Q75=\"x\",O75<>\"x\"),\"M fehlt\",\"A + B fehlt\")))","v":"A + B fehlt"},null,{"$f":"IF(AND(Q75=\"x\",S75=\"x\"),\"wechsel\",IF(AND(Q75=\"x\",S75<>\"x\"),\"\",IF(AND(S75=\"x\",Q75<>\"x\"),\"M fehlt\",\"A + B fehlt\")))","v":"A + B fehlt"},null,null,null,null,null,null,null,{"$f":"IF(WEEKNUM(A75,2)<>WEEKNUM(A76,2),SUM(Y$7:Y75)-SUM(Z$6:Z74),\"\")","v":""}]
[null,null,{"$f":"IF(B76=0,\"\",VLOOKUP(B76,Etappen!$1:$65497,2,FALSE))","v":""},null,{"$f":"IF(D76=0,\"\",VLOOKUP(D76,Etappen!$1:$65497,2,FALSE))","v":""},null,{"$f":"IF(F76=0,\"\",VLOOKUP(F76,Etappen!$1:$65497,2,FALSE))","v":""},null,{"$f":"IF(H76=0,\"\",VLOOKUP(H76,Etappen!$1:$65497,2,FALSE))","v":""},null,{"$f":"IF(J76=0,\"\",VLOOKUP(J76,Etappen!$1:$65497,2,FALSE))","v":""},null,null,"A + B fehlt",null,{"$f":"IF(AND(O76=\"x\",Q76=\"x\"),\"wechsel\",IF(AND(O76=\"x\",Q76<>\"x\"),\"\",IF(AND(Q76=\"x\",O76<>\"x\"),\"M fehlt\",\"A + B fehlt\")))","v":"A + B fehlt"},null,{"$f":"IF(AND(Q76=\"x\",S76=\"x\"),\"wechsel\",IF(AND(Q76=\"x\",S76<>\"x\"),\"\",IF(AND(S76=\"x\",Q76<>\"x\"),\"M fehlt\",\"A + B fehlt\")))","v":"A + B fehlt"},null,null,null,null,null,null,null,{"$f":"IF(WEEKNUM(A76,2)<>WEEKNUM(A77,2),SUM(Y$7:Y76)-SUM(Z$6:Z75),\"\")","v":""}]
[null,null,{"$f":"IF(B77=0,\"\",VLOOKUP(B77,Etappen!$1:$65497,2,FALSE))","v":""},null,{"$f":"IF(D77=0,\"\",VLOOKUP(D77,Etappen!$1:$65497,2,FALSE))","v":""},null,{"$f":"IF(F77=0,\"\",VLOOKUP(F77,Etappen!$1:$65497,2,FALSE))","v":""},null,{"$f":"IF(H77=0,\"\",VLOOKUP(H77,Etappen!$1:$65497,2,FALSE))","v":""},null,{"$f":"IF(J77=0,\"\",VLOOKUP(J77,Etappen!$1:$65497,2,FALSE))","v":""},null,null,"A + B fehlt",null,{"$f":"IF(AND(O77=\"x\",Q77=\"x\"),\"wechsel\",IF(AND(O77=\"x\",Q77<>\"x\"),\"\",IF(AND(Q77=\"x\",O77<>\"x\"),\"M fehlt\",\"A + B fehlt\")))","v":"A + B fehlt"},null,{"$f":"IF(AND(Q77=\"x\",S77=\"x\"),\"wechsel\",IF(AND(Q77=\"x\",S77<>\"x\"),\"\",IF(AND(S77=\"x\",Q77<>\"x\"),\"M fehlt\",\"A + B fehlt\")))","v":"A + B fehlt"},null,null,null,null,null,null,null,{"$f":"IF(WEEKNUM(A77,2)<>WEEKNUM(A78,2),SUM(Y$7:Y77)-SUM(Z$6:Z76),\"\")","v":""}]
[null,null,{"$f":"IF(B78=0,\"\",VLOOKUP(B78,Etappen!$1:$65497,2,FALSE))","v":""},null,{"$f":"IF(D78=0,\"\",VLOOKUP(D78,Etappen!$1:$65497,2,FALSE))","v":""},null,{"$f":"IF(F78=0,\"\",VLOOKUP(F78,Etappen!$1:$65497,2,FALSE))","v":""},null,{"$f":"IF(H78=0,\"\",VLOOKUP(H78,Etappen!$1:$65497,2,FALSE))","v":""},null,{"$f":"IF(J78=0,\"\",VLOOKUP(J78,Etappen!$1:$65497,2,FALSE))","v":""},null,null,"A + B fehlt",null,{"$f":"IF(AND(O78=\"x\",Q78=\"x\"),\"wechsel\",IF(AND(O78=\"x\",Q78<>\"x\"),\"\",IF(AND(Q78=\"x\",O78<>\"x\"),\"M fehlt\",\"A + B fehlt\")))","v":"A + B fehlt"},null,{"$f":"IF(AND(Q78=\"x\",S78=\"x\"),\"wechsel\",IF(AND(Q78=\"x\",S78<>\"x\"),\"\",IF(AND(S78=\"x\",Q78<>\"x\"),\"M fehlt\",\"A + B fehlt\")))","v":"A + B fehlt"},null,null,null,null,null,null,null,{"$f":"IF(WEEKNUM(A78,2)<>WEEKNUM(A79,2),SUM(Y$7:Y78)-SUM(Z$6:Z77),\"\")","v":""}]
[null,null,{"$f":"IF(B79=0,\"\",VLOOKUP(B79,Etappen!$1:$65497,2,FALSE))","v":""},null,{"$f":"IF(D79=0,\"\",VLOOKUP(D79,Etappen!$1:$65497,2,FALSE))","v":""},null,{"$f":"IF(F79=0,\"\",VLOOKUP(F79,Etappen!$1:$65497,2,FALSE))","v":""},null,{"$f":"IF(H79=0,\"\",VLOOKUP(H79,Etappen!$1:$65497,2,FALSE))","v":""},null,{"$f":"IF(J79=0,\"\",VLOOKUP(J79,Etappen!$1:$65497,2,FALSE))","v":""},null,null,"A + B fehlt",null,{"$f":"IF(AND(O79=\"x\",Q79=\"x\"),\"wechsel\",IF(AND(O79=\"x\",Q79<>\"x\"),\"\",IF(AND(Q79=\"x\",O79<>\"x\"),\"M fehlt\",\"A + B fehlt\")))","v":"A + B fehlt"},null,{"$f":"IF(AND(Q79=\"x\",S79=\"x\"),\"wechsel\",IF(AND(Q79=\"x\",S79<>\"x\"),\"\",IF(AND(S79=\"x\",Q79<>\"x\"),\"M fehlt\",\"A + B fehlt\")))","v":"A + B fehlt"},null,null,null,null,null,null,null,{"$f":"IF(WEEKNUM(A79,2)<>WEEKNUM(A80,2),SUM(Y$7:Y79)-SUM(Z$6:Z78),\"\")","v":""}]
[null,null,{"$f":"IF(B80=0,\"\",VLOOKUP(B80,Etappen!$1:$65497,2,FALSE))","v":""},null,{"$f":"IF(D80=0,\"\",VLOOKUP(D80,Etappen!$1:$65497,2,FALSE))","v":""},null,{"$f":"IF(F80=0,\"\",VLOOKUP(F80,Etappen!$1:$65497,2,FALSE))","v":""},null,{"$f":"IF(H80=0,\"\",VLOOKUP(H80,Etappen!$1:$65497,2,FALSE))","v":""},null,{"$f":"IF(J80=0,\"\",VLOOKUP(J80,Etappen!$1:$65497,2,FALSE))","v":""},null,null,"A + B fehlt",null,{"$f":"IF(AND(O80=\"x\",Q80=\"x\"),\"wechsel\",IF(AND(O80=\"x\",Q80<>\"x\"),\"\",IF(AND(Q80=\"x\",O80<>\"x\"),\"M fehlt\",\"A + B fehlt\")))","v":"A + B fehlt"},null,{"$f":"IF(AND(Q80=\"x\",S80=\"x\"),\"wechsel\",IF(AND(Q80=\"x\",S80<>\"x\"),\"\",IF(AND(S80=\"x\",Q80<>\"x\"),\"M fehlt\",\"A + B fehlt\")))","v":"A + B fehlt"},null,null,null,null,null,null,null,{"$f":"IF(WEEKNUM(A80,2)<>WEEKNUM(A81,2),SUM(Y$7:Y80)-SUM(Z$6:Z79),\"\")","v":""}]
[null,null,{"$f":"IF(B81=0,\"\",VLOOKUP(B81,Etappen!$1:$65497,2,FALSE))","v":""},null,{"$f":"IF(D81=0,\"\",VLOOKUP(D81,Etappen!$1:$65497,2,FALSE))","v":""},null,{"$f":"IF(F81=0,\"\",VLOOKUP(F81,Etappen!$1:$65497,2,FALSE))","v":""},null,{"$f":"IF(H81=0,\"\",VLOOKUP(H81,Etappen!$1:$65497,2,FALSE))","v":""},null,{"$f":"IF(J81=0,\"\",VLOOKUP(J81,Etappen!$1:$65497,2,FALSE))","v":""},null,null,"A + B fehlt",null,{"$f":"IF(AND(O81=\"x\",Q81=\"x\"),\"wechsel\",IF(AND(O81=\"x\",Q81<>\"x\"),\"\",IF(AND(Q81=\"x\",O81<>\"x\"),\"M fehlt\",\"A + B fehlt\")))","v":"A + B fehlt"},null,{"$f":"IF(AND(Q81=\"x\",S81=\"x\"),\"wechsel\",IF(AND(Q81=\"x\",S81<>\"x\"),\"\",IF(AND(S81=\"x\",Q81<>\"x\"),\"M fehlt\",\"A + B fehlt\")))","v":"A + B fehlt"},null,null,null,null,null,null,null,{"$f":"IF(WEEKNUM(A81,2)<>WEEKNUM(A82,2),SUM(Y$7:Y81)-SUM(Z$6:Z80),\"\")","v":""}]
[null,null,{"$f":"IF(B82=0,\"\",VLOOKUP(B82,Etappen!$1:$65497,2,FALSE))","v":""},null,{"$f":"IF(D82=0,\"\",VLOOKUP(D82,Etappen!$1:$65497,2,FALSE))","v":""},null,{"$f":"IF(F82=0,\"\",VLOOKUP(F82,Etappen!$1:$65497,2,FALSE))","v":""},null,{"$f":"IF(H82=0,\"\",VLOOKUP(H82,Etappen!$1:$65497,2,FALSE))","v":""},null,{"$f":"IF(J82=0,\"\",VLOOKUP(J82,Etappen!$1:$65497,2,FALSE))","v":""},null,null,"A + B fehlt",null,{"$f":"IF(AND(O82=\"x\",Q82=\"x\"),\"wechsel\",IF(AND(O82=\"x\",Q82<>\"x\"),\"\",IF(AND(Q82=\"x\",O82<>\"x\"),\"M fehlt\",\"A + B fehlt\")))","v":"A + B fehlt"},null,{"$f":"IF(AND(Q82=\"x\",S82=\"x\"),\"wechsel\",IF(AND(Q82=\"x\",S82<>\"x\"),\"\",IF(AND(S82=\"x\",Q82<>\"x\"),\"M fehlt\",\"A + B fehlt\")))","v":"A + B fehlt"},null,null,null,null,null,null,null,{"$f":"IF(WEEKNUM(A82,2)<>WEEKNUM(A83,2),SUM(Y$7:Y82)-SUM(Z$6:Z81),\"\")","v":""}]
[null,null,{"$f":"IF(B83=0,\"\",VLOOKUP(B83,Etappen!$1:$65497,2,FALSE))","v":""},null,{"$f":"IF(D83=0,\"\",VLOOKUP(D83,Etappen!$1:$65497,2,FALSE))","v":""},null,{"$f":"IF(F83=0,\"\",VLOOKUP(F83,Etappen!$1:$65497,2,FALSE))","v":""},null,{"$f":"IF(H83=0,\"\",VLOOKUP(H83,Etappen!$1:$65497,2,FALSE))","v":""},null,{"$f":"IF(J83=0,\"\",VLOOKUP(J83,Etappen!$1:$65497,2,FALSE))","v":""},null,null,"A + B fehlt",null,{"$f":"IF(AND(O83=\"x\",Q83=\"x\"),\"wechsel\",IF(AND(O83=\"x\",Q83<>\"x\"),\"\",IF(AND(Q83=\"x\",O83<>\"x\"),\"M fehlt\",\"A + B fehlt\")))","v":"A + B fehlt"},null,{"$f":"IF(AND(Q83=\"x\",S83=\"x\"),\"wechsel\",IF(AND(Q83=\"x\",S83<>\"x\"),\"\",IF(AND(S83=\"x\",Q83<>\"x\"),\"M fehlt\",\"A + B fehlt\")))","v":"A + B fehlt"},null,null,null,null,null,null,null,{"$f":"IF(WEEKNUM(A83,2)<>WEEKNUM(A84,2),SUM(Y$7:Y83)-SUM(Z$6:Z82),\"\")","v":""}]
[null,null,{"$f":"IF(B84=0,\"\",VLOOKUP(B84,Etappen!$1:$65497,2,FALSE))","v":""},null,{"$f":"IF(D84=0,\"\",VLOOKUP(D84,Etappen!$1:$65497,2,FALSE))","v":""},null,{"$f":"IF(F84=0,\"\",VLOOKUP(F84,Etappen!$1:$65497,2,FALSE))","v":""},null,{"$f":"IF(H84=0,\"\",VLOOKUP(H84,Etappen!$1:$65497,2,FALSE))","v":""},null,{"$f":"IF(J84=0,\"\",VLOOKUP(J84,Etappen!$1:$65497,2,FALSE))","v":""},null,null,"A + B fehlt",null,{"$f":"IF(AND(O84=\"x\",Q84=\"x\"),\"wechsel\",IF(AND(O84=\"x\",Q84<>\"x\"),\"\",IF(AND(Q84=\"x\",O84<>\"x\"),\"M fehlt\",\"A + B fehlt\")))","v":"A + B fehlt"},null,{"$f":"IF(AND(Q84=\"x\",S84=\"x\"),\"wechsel\",IF(AND(Q84=\"x\",S84<>\"x\"),\"\",IF(AND(S84=\"x\",Q84<>\"x\"),\"M fehlt\",\"A + B fehlt\")))","v":"A + B fehlt"},null,null,null,null,null,null,null,{"$f":"IF(WEEKNUM(A84,2)<>WEEKNUM(A85,2),SUM(Y$7:Y84)-SUM(Z$6:Z83),\"\")","v":""}]
[null,null,{"$f":"IF(B85=0,\"\",VLOOKUP(B85,Etappen!$1:$65497,2,FALSE))","v":""},null,{"$f":"IF(D85=0,\"\",VLOOKUP(D85,Etappen!$1:$65497,2,FALSE))","v":""},null,{"$f":"IF(F85=0,\"\",VLOOKUP(F85,Etappen!$1:$65497,2,FALSE))","v":""},null,{"$f":"IF(H85=0,\"\",VLOOKUP(H85,Etappen!$1:$65497,2,FALSE))","v":""},null,{"$f":"IF(J85=0,\"\",VLOOKUP(J85,Etappen!$1:$65497,2,FALSE))","v":""},null,null,"A + B fehlt",null,{"$f":"IF(AND(O85=\"x\",Q85=\"x\"),\"wechsel\",IF(AND(O85=\"x\",Q85<>\"x\"),\"\",IF(AND(Q85=\"x\",O85<>\"x\"),\"M fehlt\",\"A + B fehlt\")))","v":"A + B fehlt"},null,{"$f":"IF(AND(Q85=\"x\",S85=\"x\"),\"wechsel\",IF(AND(Q85=\"x\",S85<>\"x\"),\"\",IF(AND(S85=\"x\",Q85<>\"x\"),\"M fehlt\",\"A + B fehlt\")))","v":"A + B fehlt"},null,null,null,null,null,null,null,{"$f":"IF(WEEKNUM(A85,2)<>WEEKNUM(A86,2),SUM(Y$7:Y85)-SUM(Z$6:Z84),\"\")","v":""}]
[null,null,{"$f":"IF(B86=0,\"\",VLOOKUP(B86,Etappen!$1:$65497,2,FALSE))","v":""},null,{"$f":"IF(D86=0,\"\",VLOOKUP(D86,Etappen!$1:$65497,2,FALSE))","v":""},null,{"$f":"IF(F86=0,\"\",VLOOKUP(F86,Etappen!$1:$65497,2,FALSE))","v":""},null,{"$f":"IF(H86=0,\"\",VLOOKUP(H86,Etappen!$1:$65497,2,FALSE))","v":""},null,{"$f":"IF(J86=0,\"\",VLOOKUP(J86,Etappen!$1:$65497,2,FALSE))","v":""},null,null,"A + B fehlt",null,{"$f":"IF(AND(O86=\"x\",Q86=\"x\"),\"wechsel\",IF(AND(O86=\"x\",Q86<>\"x\"),\"\",IF(AND(Q86=\"x\",O86<>\"x\"),\"M fehlt\",\"A + B fehlt\")))","v":"A + B fehlt"},null,{"$f":"IF(AND(Q86=\"x\",S86=\"x\"),\"wechsel\",IF(AND(Q86=\"x\",S86<>\"x\"),\"\",IF(AND(S86=\"x\",Q86<>\"x\"),\"M fehlt\",\"A + B fehlt\")))","v":"A + B fehlt"},null,null,null,null,null,null,null,{"$f":"IF(WEEKNUM(A86,2)<>WEEKNUM(A87,2),SUM(Y$7:Y86)-SUM(Z$6:Z85),\"\")","v":""}]
[null,null,{"$f":"IF(B87=0,\"\",VLOOKUP(B87,Etappen!$1:$65497,2,FALSE))","v":""},null,{"$f":"IF(D87=0,\"\",VLOOKUP(D87,Etappen!$1:$65497,2,FALSE))","v":""},null,{"$f":"IF(F87=0,\"\",VLOOKUP(F87,Etappen!$1:$65497,2,FALSE))","v":""},null,{"$f":"IF(H87=0,\"\",VLOOKUP(H87,Etappen!$1:$65497,2,FALSE))","v":""},null,{"$f":"IF(J87=0,\"\",VLOOKUP(J87,Etappen!$1:$65497,2,FALSE))","v":""},null,null,"A + B fehlt",null,{"$f":"IF(AND(O87=\"x\",Q87=\"x\"),\"wechsel\",IF(AND(O87=\"x\",Q87<>\"x\"),\"\",IF(AND(Q87=\"x\",O87<>\"x\"),\"M fehlt\",\"A + B fehlt\")))","v":"A + B fehlt"},null,{"$f":"IF(AND(Q87=\"x\",S87=\"x\"),\"wechsel\",IF(AND(Q87=\"x\",S87<>\"x\"),\"\",IF(AND(S87=\"x\",Q87<>\"x\"),\"M fehlt\",\"A + B fehlt\")))","v":"A + B fehlt"},null,null,null,null,null,null,null,{"$f":"IF(WEEKNUM(A87,2)<>WEEKNUM(A88,2),SUM(Y$7:Y87)-SUM(Z$6:Z86),\"\")","v":""}]
[null,null,{"$f":"IF(B88=0,\"\",VLOOKUP(B88,Etappen!$1:$65497,2,FALSE))","v":""},null,{"$f":"IF(D88=0,\"\",VLOOKUP(D88,Etappen!$1:$65497,2,FALSE))","v":""},null,{"$f":"IF(F88=0,\"\",VLOOKUP(F88,Etappen!$1:$65497,2,FALSE))","v":""},null,{"$f":"IF(H88=0,\"\",VLOOKUP(H88,Etappen!$1:$65497,2,FALSE))","v":""},null,{"$f":"IF(J88=0,\"\",VLOOKUP(J88,Etappen!$1:$65497,2,FALSE))","v":""},null,null,"A + B fehlt",null,{"$f":"IF(AND(O88=\"x\",Q88=\"x\"),\"wechsel\",IF(AND(O88=\"x\",Q88<>\"x\"),\"\",IF(AND(Q88=\"x\",O88<>\"x\"),\"M fehlt\",\"A + B fehlt\")))","v":"A + B fehlt"},null,{"$f":"IF(AND(Q88=\"x\",S88=\"x\"),\"wechsel\",IF(AND(Q88=\"x\",S88<>\"x\"),\"\",IF(AND(S88=\"x\",Q88<>\"x\"),\"M fehlt\",\"A + B fehlt\")))","v":"A + B fehlt"},null,null,null,null,null,null,null,{"$f":"IF(WEEKNUM(A88,2)<>WEEKNUM(A89,2),SUM(Y$7:Y88)-SUM(Z$6:Z87),\"\")","v":""}]
[null,null,{"$f":"IF(B89=0,\"\",VLOOKUP(B89,Etappen!$1:$65497,2,FALSE))","v":""},null,{"$f":"IF(D89=0,\"\",VLOOKUP(D89,Etappen!$1:$65497,2,FALSE))","v":""},null,{"$f":"IF(F89=0,\"\",VLOOKUP(F89,Etappen!$1:$65497,2,FALSE))","v":""},null,{"$f":"IF(H89=0,\"\",VLOOKUP(H89,Etappen!$1:$65497,2,FALSE))","v":""},null,{"$f":"IF(J89=0,\"\",VLOOKUP(J89,Etappen!$1:$65497,2,FALSE))","v":""},null,null,"A + B fehlt",null,{"$f":"IF(AND(O89=\"x\",Q89=\"x\"),\"wechsel\",IF(AND(O89=\"x\",Q89<>\"x\"),\"\",IF(AND(Q89=\"x\",O89<>\"x\"),\"M fehlt\",\"A + B fehlt\")))","v":"A + B fehlt"},null,{"$f":"IF(AND(Q89=\"x\",S89=\"x\"),\"wechsel\",IF(AND(Q89=\"x\",S89<>\"x\"),\"\",IF(AND(S89=\"x\",Q89<>\"x\"),\"M fehlt\",\"A + B fehlt\")))","v":"A + B fehlt"},null,null,null,null,null,null,null,{"$f":"IF(WEEKNUM(A89,2)<>WEEKNUM(A90,2),SUM(Y$7:Y89)-SUM(Z$6:Z88),\"\")","v":""}]
[null,null,{"$f":"IF(B90=0,\"\",VLOOKUP(B90,Etappen!$1:$65497,2,FALSE))","v":""},null,{"$f":"IF(D90=0,\"\",VLOOKUP(D90,Etappen!$1:$65497,2,FALSE))","v":""},null,{"$f":"IF(F90=0,\"\",VLOOKUP(F90,Etappen!$1:$65497,2,FALSE))","v":""},null,{"$f":"IF(H90=0,\"\",VLOOKUP(H90,Etappen!$1:$65497,2,FALSE))","v":""},null,{"$f":"IF(J90=0,\"\",VLOOKUP(J90,Etappen!$1:$65497,2,FALSE))","v":""},null,null,"A + B fehlt",null,{"$f":"IF(AND(O90=\"x\",Q90=\"x\"),\"wechsel\",IF(AND(O90=\"x\",Q90<>\"x\"),\"\",IF(AND(Q90=\"x\",O90<>\"x\"),\"M fehlt\",\"A + B fehlt\")))","v":"A + B fehlt"},null,{"$f":"IF(AND(Q90=\"x\",S90=\"x\"),\"wechsel\",IF(AND(Q90=\"x\",S90<>\"x\"),\"\",IF(AND(S90=\"x\",Q90<>\"x\"),\"M fehlt\",\"A + B fehlt\")))","v":"A + B fehlt"},null,null,null,null,null,null,null,{"$f":"IF(WEEKNUM(A90,2)<>WEEKNUM(A91,2),SUM(Y$7:Y90)-SUM(Z$6:Z89),\"\")","v":""}]
[null,null,{"$f":"IF(B91=0,\"\",VLOOKUP(B91,Etappen!$1:$65497,2,FALSE))","v":""},null,{"$f":"IF(D91=0,\"\",VLOOKUP(D91,Etappen!$1:$65497,2,FALSE))","v":""},null,{"$f":"IF(F91=0,\"\",VLOOKUP(F91,Etappen!$1:$65497,2,FALSE))","v":""},null,{"$f":"IF(H91=0,\"\",VLOOKUP(H91,Etappen!$1:$65497,2,FALSE))","v":""},null,{"$f":"IF(J91=0,\"\",VLOOKUP(J91,Etappen!$1:$65497,2,FALSE))","v":""},null,null,"A + B fehlt",null,{"$f":"IF(AND(O91=\"x\",Q91=\"x\"),\"wechsel\",IF(AND(O91=\"x\",Q91<>\"x\"),\"\",IF(AND(Q91=\"x\",O91<>\"x\"),\"M fehlt\",\"A + B fehlt\")))","v":"A + B fehlt"},null,{"$f":"IF(AND(Q91=\"x\",S91=\"x\"),\"wechsel\",IF(AND(Q91=\"x\",S91<>\"x\"),\"\",IF(AND(S91=\"x\",Q91<>\"x\"),\"M fehlt\",\"A + B fehlt\")))","v":"A + B fehlt"},null,null,null,null,null,null,null,{"$f":"IF(WEEKNUM(A91,2)<>WEEKNUM(A92,2),SUM(Y$7:Y91)-SUM(Z$6:Z90),\"\")","v":""}]
[null,null,{"$f":"IF(B92=0,\"\",VLOOKUP(B92,Etappen!$1:$65497,2,FALSE))","v":""},null,{"$f":"IF(D92=0,\"\",VLOOKUP(D92,Etappen!$1:$65497,2,FALSE))","v":""},null,{"$f":"IF(F92=0,\"\",VLOOKUP(F92,Etappen!$1:$65497,2,FALSE))","v":""},null,{"$f":"IF(H92=0,\"\",VLOOKUP(H92,Etappen!$1:$65497,2,FALSE))","v":""},null,{"$f":"IF(J92=0,\"\",VLOOKUP(J92,Etappen!$1:$65497,2,FALSE))","v":""},null,null,"A + B fehlt",null,{"$f":"IF(AND(O92=\"x\",Q92=\"x\"),\"wechsel\",IF(AND(O92=\"x\",Q92<>\"x\"),\"\",IF(AND(Q92=\"x\",O92<>\"x\"),\"M fehlt\",\"A + B fehlt\")))","v":"A + B fehlt"},null,{"$f":"IF(AND(Q92=\"x\",S92=\"x\"),\"wechsel\",IF(AND(Q92=\"x\",S92<>\"x\"),\"\",IF(AND(S92=\"x\",Q92<>\"x\"),\"M fehlt\",\"A + B fehlt\")))","v":"A + B fehlt"},null,null,null,null,null,null,null,{"$f":"IF(WEEKNUM(A92,2)<>WEEKNUM(A93,2),SUM(Y$7:Y92)-SUM(Z$6:Z91),\"\")","v":""}]
[null,null,{"$f":"IF(B93=0,\"\",VLOOKUP(B93,Etappen!$1:$65497,2,FALSE))","v":""},null,{"$f":"IF(D93=0,\"\",VLOOKUP(D93,Etappen!$1:$65497,2,FALSE))","v":""},null,{"$f":"IF(F93=0,\"\",VLOOKUP(F93,Etappen!$1:$65497,2,FALSE))","v":""},null,{"$f":"IF(H93=0,\"\",VLOOKUP(H93,Etappen!$1:$65497,2,FALSE))","v":""},null,{"$f":"IF(J93=0,\"\",VLOOKUP(J93,Etappen!$1:$65497,2,FALSE))","v":""},null,null,"A + B fehlt",null,{"$f":"IF(AND(O93=\"x\",Q93=\"x\"),\"wechsel\",IF(AND(O93=\"x\",Q93<>\"x\"),\"\",IF(AND(Q93=\"x\",O93<>\"x\"),\"M fehlt\",\"A + B fehlt\")))","v":"A + B fehlt"},null,{"$f":"IF(AND(Q93=\"x\",S93=\"x\"),\"wechsel\",IF(AND(Q93=\"x\",S93<>\"x\"),\"\",IF(AND(S93=\"x\",Q93<>\"x\"),\"M fehlt\",\"A + B fehlt\")))","v":"A + B fehlt"},null,null,null,null,null,null,null,{"$f":"IF(WEEKNUM(A93,2)<>WEEKNUM(A94,2),SUM(Y$7:Y93)-SUM(Z$6:Z92),\"\")","v":""}]
[null,null,{"$f":"IF(B94=0,\"\",VLOOKUP(B94,Etappen!$1:$65497,2,FALSE))","v":""},null,{"$f":"IF(D94=0,\"\",VLOOKUP(D94,Etappen!$1:$65497,2,FALSE))","v":""},null,{"$f":"IF(F94=0,\"\",VLOOKUP(F94,Etappen!$1:$65497,2,FALSE))","v":""},null,{"$f":"IF(H94=0,\"\",VLOOKUP(H94,Etappen!$1:$65497,2,FALSE))","v":""},null,{"$f":"IF(J94=0,\"\",VLOOKUP(J94,Etappen!$1:$65497,2,FALSE))","v":""},null,null,"A + B fehlt",null,{"$f":"IF(AND(O94=\"x\",Q94=\"x\"),\"wechsel\",IF(AND(O94=\"x\",Q94<>\"x\"),\"\",IF(AND(Q94=\"x\",O94<>\"x\"),\"M fehlt\",\"A + B fehlt\")))","v":"A + B fehlt"},null,{"$f":"IF(AND(Q94=\"x\",S94=\"x\"),\"wechsel\",IF(AND(Q94=\"x\",S94<>\"x\"),\"\",IF(AND(S94=\"x\",Q94<>\"x\"),\"M fehlt\",\"A + B fehlt\")))","v":"A + B fehlt"},null,null,null,null,null,null,null,{"$f":"IF(WEEKNUM(A94,2)<>WEEKNUM(A95,2),SUM(Y$7:Y94)-SUM(Z$6:Z93),\"\")","v":""}]
[null,null,{"$f":"IF(B95=0,\"\",VLOOKUP(B95,Etappen!$1:$65497,2,FALSE))","v":""},null,{"$f":"IF(D95=0,\"\",VLOOKUP(D95,Etappen!$1:$65497,2,FALSE))","v":""},null,{"$f":"IF(F95=0,\"\",VLOOKUP(F95,Etappen!$1:$65497,2,FALSE))","v":""},null,{"$f":"IF(H95=0,\"\",VLOOKUP(H95,Etappen!$1:$65497,2,FALSE))","v":""},null,{"$f":"IF(J95=0,\"\",VLOOKUP(J95,Etappen!$1:$65497,2,FALSE))","v":""},null,null,"A + B fehlt",null,{"$f":"IF(AND(O95=\"x\",Q95=\"x\"),\"wechsel\",IF(AND(O95=\"x\",Q95<>\"x\"),\"\",IF(AND(Q95=\"x\",O95<>\"x\"),\"M fehlt\",\"A + B fehlt\")))","v":"A + B fehlt"},null,{"$f":"IF(AND(Q95=\"x\",S95=\"x\"),\"wechsel\",IF(AND(Q95=\"x\",S95<>\"x\"),\"\",IF(AND(S95=\"x\",Q95<>\"x\"),\"M fehlt\",\"A + B fehlt\")))","v":"A + B fehlt"},null,null,null,null,null,null,null,{"$f":"IF(WEEKNUM(A95,2)<>WEEKNUM(A96,2),SUM(Y$7:Y95)-SUM(Z$6:Z94),\"\")","v":""}]
[null,null,{"$f":"IF(B96=0,\"\",VLOOKUP(B96,Etappen!$1:$65497,2,FALSE))","v":""},null,{"$f":"IF(D96=0,\"\",VLOOKUP(D96,Etappen!$1:$65497,2,FALSE))","v":""},null,{"$f":"IF(F96=0,\"\",VLOOKUP(F96,Etappen!$1:$65497,2,FALSE))","v":""},null,{"$f":"IF(H96=0,\"\",VLOOKUP(H96,Etappen!$1:$65497,2,FALSE))","v":""},null,{"$f":"IF(J96=0,\"\",VLOOKUP(J96,Etappen!$1:$65497,2,FALSE))","v":""},null,null,"A + B fehlt",null,{"$f":"IF(AND(O96=\"x\",Q96=\"x\"),\"wechsel\",IF(AND(O96=\"x\",Q96<>\"x\"),\"\",IF(AND(Q96=\"x\",O96<>\"x\"),\"M fehlt\",\"A + B fehlt\")))","v":"A + B fehlt"},null,{"$f":"IF(AND(Q96=\"x\",S96=\"x\"),\"wechsel\",IF(AND(Q96=\"x\",S96<>\"x\"),\"\",IF(AND(S96=\"x\",Q96<>\"x\"),\"M fehlt\",\"A + B fehlt\")))","v":"A + B fehlt"},null,null,null,null,null,null,null,{"$f":"IF(WEEKNUM(A96,2)<>WEEKNUM(A97,2),SUM(Y$7:Y96)-SUM(Z$6:Z95),\"\")","v":""}]
[null,null,{"$f":"IF(B97=0,\"\",VLOOKUP(B97,Etappen!$1:$65497,2,FALSE))","v":""},null,{"$f":"IF(D97=0,\"\",VLOOKUP(D97,Etappen!$1:$65497,2,FALSE))","v":""},null,{"$f":"IF(F97=0,\"\",VLOOKUP(F97,Etappen!$1:$65497,2,FALSE))","v":""},null,{"$f":"IF(H97=0,\"\",VLOOKUP(H97,Etappen!$1:$65497,2,FALSE))","v":""},null,{"$f":"IF(J97=0,\"\",VLOOKUP(J97,Etappen!$1:$65497,2,FALSE))","v":""},null,null,"A + B fehlt",null,{"$f":"IF(AND(O97=\"x\",Q97=\"x\"),\"wechsel\",IF(AND(O97=\"x\",Q97<>\"x\"),\"\",IF(AND(Q97=\"x\",O97<>\"x\"),\"M fehlt\",\"A + B fehlt\")))","v":"A + B fehlt"},null,{"$f":"IF(AND(Q97=\"x\",S97=\"x\"),\"wechsel\",IF(AND(Q97=\"x\",S97<>\"x\"),\"\",IF(AND(S97=\"x\",Q97<>\"x\"),\"M fehlt\",\"A + B fehlt\")))","v":"A + B fehlt"},null,null,null,null,null,null,null,{"$f":"IF(WEEKNUM(A97,2)<>WEEKNUM(A98,2),SUM(Y$7:Y97)-SUM(Z$6:Z96),\"\")","v":""}]
[null,null,{"$f":"IF(B98=0,\"\",VLOOKUP(B98,Etappen!$1:$65497,2,FALSE))","v":""},null,{"$f":"IF(D98=0,\"\",VLOOKUP(D98,Etappen!$1:$65497,2,FALSE))","v":""},null,{"$f":"IF(F98=0,\"\",VLOOKUP(F98,Etappen!$1:$65497,2,FALSE))","v":""},null,{"$f":"IF(H98=0,\"\",VLOOKUP(H98,Etappen!$1:$65497,2,FALSE))","v":""},null,{"$f":"IF(J98=0,\"\",VLOOKUP(J98,Etappen!$1:$65497,2,FALSE))","v":""},null,null,"A + B fehlt",null,{"$f":"IF(AND(O98=\"x\",Q98=\"x\"),\"wechsel\",IF(AND(O98=\"x\",Q98<>\"x\"),\"\",IF(AND(Q98=\"x\",O98<>\"x\"),\"M fehlt\",\"A + B fehlt\")))","v":"A + B fehlt"},null,{"$f":"IF(AND(Q98=\"x\",S98=\"x\"),\"wechsel\",IF(AND(Q98=\"x\",S98<>\"x\"),\"\",IF(AND(S98=\"x\",Q98<>\"x\"),\"M fehlt\",\"A + B fehlt\")))","v":"A + B fehlt"},null,null,null,null,null,null,null,{"$f":"IF(WEEKNUM(A98,2)<>WEEKNUM(A99,2),SUM(Y$7:Y98)-SUM(Z$6:Z97),\"\")","v":""}]
[null,null,{"$f":"IF(B99=0,\"\",VLOOKUP(B99,Etappen!$1:$65497,2,FALSE))","v":""},null,{"$f":"IF(D99=0,\"\",VLOOKUP(D99,Etappen!$1:$65497,2,FALSE))","v":""},null,{"$f":"IF(F99=0,\"\",VLOOKUP(F99,Etappen!$1:$65497,2,FALSE))","v":""},null,{"$f":"IF(H99=0,\"\",VLOOKUP(H99,Etappen!$1:$65497,2,FALSE))","v":""},null,{"$f":"IF(J99=0,\"\",VLOOKUP(J99,Etappen!$1:$65497,2,FALSE))","v":""},null,null,"A + B fehlt",null,{"$f":"IF(AND(O99=\"x\",Q99=\"x\"),\"wechsel\",IF(AND(O99=\"x\",Q99<>\"x\"),\"\",IF(AND(Q99=\"x\",O99<>\"x\"),\"M fehlt\",\"A + B fehlt\")))","v":"A + B fehlt"},null,{"$f":"IF(AND(Q99=\"x\",S99=\"x\"),\"wechsel\",IF(AND(Q99=\"x\",S99<>\"x\"),\"\",IF(AND(S99=\"x\",Q99<>\"x\"),\"M fehlt\",\"A + B fehlt\")))","v":"A + B fehlt"},null,null,null,null,null,null,null,{"$f":"IF(WEEKNUM(A99,2)<>WEEKNUM(A100,2),SUM(Y$7:Y99)-SUM(Z$6:Z98),\"\")","v":""}]
[null,null,{"$f":"IF(B100=0,\"\",VLOOKUP(B100,Etappen!$1:$65497,2,FALSE))","v":""},null,{"$f":"IF(D100=0,\"\",VLOOKUP(D100,Etappen!$1:$65497,2,FALSE))","v":""},null,{"$f":"IF(F100=0,\"\",VLOOKUP(F100,Etappen!$1:$65497,2,FALSE))","v":""},null,{"$f":"IF(H100=0,\"\",VLOOKUP(H100,Etappen!$1:$65497,2,FALSE))","v":""},null,{"$f":"IF(J100=0,\"\",VLOOKUP(J100,Etappen!$1:$65497,2,FALSE))","v":""},null,null,"A + B fehlt",null,{"$f":"IF(AND(O100=\"x\",Q100=\"x\"),\"wechsel\",IF(AND(O100=\"x\",Q100<>\"x\"),\"\",IF(AND(Q100=\"x\",O100<>\"x\"),\"M fehlt\",\"A + B fehlt\")))","v":"A + B fehlt"},null,{"$f":"IF(AND(Q100=\"x\",S100=\"x\"),\"wechsel\",IF(AND(Q100=\"x\",S100<>\"x\"),\"\",IF(AND(S100=\"x\",Q100<>\"x\"),\"M fehlt\",\"A + B fehlt\")))","v":"A + B fehlt"},null,null,null,null,null,null,null,{"$f":"IF(WEEKNUM(A100,2)<>WEEKNUM(A101,2),SUM(Y$7:Y100)-SUM(Z$6:Z99),\"\")","v":""}]
[null,null,{"$f":"IF(B101=0,\"\",VLOOKUP(B101,Etappen!$1:$65497,2,FALSE))","v":""},null,{"$f":"IF(D101=0,\"\",VLOOKUP(D101,Etappen!$1:$65497,2,FALSE))","v":""},null,{"$f":"IF(F101=0,\"\",VLOOKUP(F101,Etappen!$1:$65497,2,FALSE))","v":""},null,{"$f":"IF(H101=0,\"\",VLOOKUP(H101,Etappen!$1:$65497,2,FALSE))","v":""},null,{"$f":"IF(J101=0,\"\",VLOOKUP(J101,Etappen!$1:$65497,2,FALSE))","v":""},null,null,"A + B fehlt",null,{"$f":"IF(AND(O101=\"x\",Q101=\"x\"),\"wechsel\",IF(AND(O101=\"x\",Q101<>\"x\"),\"\",IF(AND(Q101=\"x\",O101<>\"x\"),\"M fehlt\",\"A + B fehlt\")))","v":"A + B fehlt"},null,{"$f":"IF(AND(Q101=\"x\",S101=\"x\"),\"wechsel\",IF(AND(Q101=\"x\",S101<>\"x\"),\"\",IF(AND(S101=\"x\",Q101<>\"x\"),\"M fehlt\",\"A + B fehlt\")))","v":"A + B fehlt"},null,null,null,null,null,null,null,{"$f":"IF(WEEKNUM(A101,2)<>WEEKNUM(A102,2),SUM(Y$7:Y101)-SUM(Z$6:Z100),\"\")","v":""}]
[null,null,{"$f":"IF(B102=0,\"\",VLOOKUP(B102,Etappen!$1:$65497,2,FALSE))","v":""},null,{"$f":"IF(D102=0,\"\",VLOOKUP(D102,Etappen!$1:$65497,2,FALSE))","v":""},null,{"$f":"IF(F102=0,\"\",VLOOKUP(F102,Etappen!$1:$65497,2,FALSE))","v":""},null,{"$f":"IF(H102=0,\"\",VLOOKUP(H102,Etappen!$1:$65497,2,FALSE))","v":""},null,{"$f":"IF(J102=0,\"\",VLOOKUP(J102,Etappen!$1:$65497,2,FALSE))","v":""},null,null,"A + B fehlt",null,{"$f":"IF(AND(O102=\"x\",Q102=\"x\"),\"wechsel\",IF(AND(O102=\"x\",Q102<>\"x\"),\"\",IF(AND(Q102=\"x\",O102<>\"x\"),\"M fehlt\",\"A + B fehlt\")))","v":"A + B fehlt"},null,{"$f":"IF(AND(Q102=\"x\",S102=\"x\"),\"wechsel\",IF(AND(Q102=\"x\",S102<>\"x\"),\"\",IF(AND(S102=\"x\",Q102<>\"x\"),\"M fehlt\",\"A + B fehlt\")))","v":"A + B fehlt"},null,null,null,null,null,null,null,{"$f":"IF(WEEKNUM(A102,2)<>WEEKNUM(A103,2),SUM(Y$7:Y102)-SUM(Z$6:Z101),\"\")","v":""}]
[null,null,{"$f":"IF(B103=0,\"\",VLOOKUP(B103,Etappen!$1:$65497,2,FALSE))","v":""},null,{"$f":"IF(D103=0,\"\",VLOOKUP(D103,Etappen!$1:$65497,2,FALSE))","v":""},null,{"$f":"IF(F103=0,\"\",VLOOKUP(F103,Etappen!$1:$65497,2,FALSE))","v":""},null,{"$f":"IF(H103=0,\"\",VLOOKUP(H103,Etappen!$1:$65497,2,FALSE))","v":""},null,{"$f":"IF(J103=0,\"\",VLOOKUP(J103,Etappen!$1:$65497,2,FALSE))","v":""},null,null,"A + B fehlt",null,{"$f":"IF(AND(O103=\"x\",Q103=\"x\"),\"wechsel\",IF(AND(O103=\"x\",Q103<>\"x\"),\"\",IF(AND(Q103=\"x\",O103<>\"x\"),\"M fehlt\",\"A + B fehlt\")))","v":"A + B fehlt"},null,{"$f":"IF(AND(Q103=\"x\",S103=\"x\"),\"wechsel\",IF(AND(Q103=\"x\",S103<>\"x\"),\"\",IF(AND(S103=\"x\",Q103<>\"x\"),\"M fehlt\",\"A + B fehlt\")))","v":"A + B fehlt"},null,null,null,null,null,null,null,{"$f":"IF(WEEKNUM(A103,2)<>WEEKNUM(A104,2),SUM(Y$7:Y103)-SUM(Z$6:Z102),\"\")","v":""}]
[null,null,{"$f":"IF(B104=0,\"\",VLOOKUP(B104,Etappen!$1:$65497,2,FALSE))","v":""},null,{"$f":"IF(D104=0,\"\",VLOOKUP(D104,Etappen!$1:$65497,2,FALSE))","v":""},null,{"$f":"IF(F104=0,\"\",VLOOKUP(F104,Etappen!$1:$65497,2,FALSE))","v":""},null,{"$f":"IF(H104=0,\"\",VLOOKUP(H104,Etappen!$1:$65497,2,FALSE))","v":""},null,{"$f":"IF(J104=0,\"\",VLOOKUP(J104,Etappen!$1:$65497,2,FALSE))","v":""},null,null,"A + B fehlt",null,{"$f":"IF(AND(O104=\"x\",Q104=\"x\"),\"wechsel\",IF(AND(O104=\"x\",Q104<>\"x\"),\"\",IF(AND(Q104=\"x\",O104<>\"x\"),\"M fehlt\",\"A + B fehlt\")))","v":"A + B fehlt"},null,{"$f":"IF(AND(Q104=\"x\",S104=\"x\"),\"wechsel\",IF(AND(Q104=\"x\",S104<>\"x\"),\"\",IF(AND(S104=\"x\",Q104<>\"x\"),\"M fehlt\",\"A + B fehlt\")))","v":"A + B fehlt"},null,null,null,null,null,null,null,{"$f":"IF(WEEKNUM(A104,2)<>WEEKNUM(A105,2),SUM(Y$7:Y104)-SUM(Z$6:Z103),\"\")","v":""}]
[null,null,{"$f":"IF(B105=0,\"\",VLOOKUP(B105,Etappen!$1:$65497,2,FALSE))","v":""},null,{"$f":"IF(D105=0,\"\",VLOOKUP(D105,Etappen!$1:$65497,2,FALSE))","v":""},null,{"$f":"IF(F105=0,\"\",VLOOKUP(F105,Etappen!$1:$65497,2,FALSE))","v":""},null,{"$f":"IF(H105=0,\"\",VLOOKUP(H105,Etappen!$1:$65497,2,FALSE))","v":""},null,{"$f":"IF(J105=0,\"\",VLOOKUP(J105,Etappen!$1:$65497,2,FALSE))","v":""},null,null,"A + B fehlt",null,{"$f":"IF(AND(O105=\"x\",Q105=\"x\"),\"wechsel\",IF(AND(O105=\"x\",Q105<>\"x\"),\"\",IF(AND(Q105=\"x\",O105<>\"x\"),\"M fehlt\",\"A + B fehlt\")))","v":"A + B fehlt"},null,{"$f":"IF(AND(Q105=\"x\",S105=\"x\"),\"wechsel\",IF(AND(Q105=\"x\",S105<>\"x\"),\"\",IF(AND(S105=\"x\",Q105<>\"x\"),\"M fehlt\",\"A + B fehlt\")))","v":"A + B fehlt"},null,null,null,null,null,null,null,{"$f":"IF(WEEKNUM(A105,2)<>WEEKNUM(A106,2),SUM(Y$7:Y105)-SUM(Z$6:Z104),\"\")","v":""}]
[null,null,{"$f":"IF(B106=0,\"\",VLOOKUP(B106,Etappen!$1:$65497,2,FALSE))","v":""},null,{"$f":"IF(D106=0,\"\",VLOOKUP(D106,Etappen!$1:$65497,2,FALSE))","v":""},null,{"$f":"IF(F106=0,\"\",VLOOKUP(F106,Etappen!$1:$65497,2,FALSE))","v":""},null,{"$f":"IF(H106=0,\"\",VLOOKUP(H106,Etappen!$1:$65497,2,FALSE))","v":""},null,{"$f":"IF(J106=0,\"\",VLOOKUP(J106,Etappen!$1:$65497,2,FALSE))","v":""},null,null,"A + B fehlt",null,{"$f":"IF(AND(O106=\"x\",Q106=\"x\"),\"wechsel\",IF(AND(O106=\"x\",Q106<>\"x\"),\"\",IF(AND(Q106=\"x\",O106<>\"x\"),\"M fehlt\",\"A + B fehlt\")))","v":"A + B fehlt"},null,{"$f":"IF(AND(Q106=\"x\",S106=\"x\"),\"wechsel\",IF(AND(Q106=\"x\",S106<>\"x\"),\"\",IF(AND(S106=\"x\",Q106<>\"x\"),\"M fehlt\",\"A + B fehlt\")))","v":"A + B fehlt"},null,null,null,null,null,null,null,{"$f":"IF(WEEKNUM(A106,2)<>WEEKNUM(A107,2),SUM(Y$7:Y106)-SUM(Z$6:Z105),\"\")","v":""}]
[null,null,{"$f":"IF(B107=0,\"\",VLOOKUP(B107,Etappen!$1:$65497,2,FALSE))","v":""},null,{"$f":"IF(D107=0,\"\",VLOOKUP(D107,Etappen!$1:$65497,2,FALSE))","v":""},null,{"$f":"IF(F107=0,\"\",VLOOKUP(F107,Etappen!$1:$65497,2,FALSE))","v":""},null,{"$f":"IF(H107=0,\"\",VLOOKUP(H107,Etappen!$1:$65497,2,FALSE))","v":""},null,{"$f":"IF(J107=0,\"\",VLOOKUP(J107,Etappen!$1:$65497,2,FALSE))","v":""},null,null,"A + B fehlt",null,{"$f":"IF(AND(O107=\"x\",Q107=\"x\"),\"wechsel\",IF(AND(O107=\"x\",Q107<>\"x\"),\"\",IF(AND(Q107=\"x\",O107<>\"x\"),\"M fehlt\",\"A + B fehlt\")))","v":"A + B fehlt"},null,{"$f":"IF(AND(Q107=\"x\",S107=\"x\"),\"wechsel\",IF(AND(Q107=\"x\",S107<>\"x\"),\"\",IF(AND(S107=\"x\",Q107<>\"x\"),\"M fehlt\",\"A + B fehlt\")))","v":"A + B fehlt"},null,null,null,null,null,null,null,{"$f":"IF(WEEKNUM(A107,2)<>WEEKNUM(A108,2),SUM(Y$7:Y107)-SUM(Z$6:Z106),\"\")","v":""}]
[null,null,{"$f":"IF(B108=0,\"\",VLOOKUP(B108,Etappen!$1:$65497,2,FALSE))","v":""},null,{"$f":"IF(D108=0,\"\",VLOOKUP(D108,Etappen!$1:$65497,2,FALSE))","v":""},null,{"$f":"IF(F108=0,\"\",VLOOKUP(F108,Etappen!$1:$65497,2,FALSE))","v":""},null,{"$f":"IF(H108=0,\"\",VLOOKUP(H108,Etappen!$1:$65497,2,FALSE))","v":""},null,{"$f":"IF(J108=0,\"\",VLOOKUP(J108,Etappen!$1:$65497,2,FALSE))","v":""},null,null,"A + B fehlt",null,{"$f":"IF(AND(O108=\"x\",Q108=\"x\"),\"wechsel\",IF(AND(O108=\"x\",Q108<>\"x\"),\"\",IF(AND(Q108=\"x\",O108<>\"x\"),\"M fehlt\",\"A + B fehlt\")))","v":"A + B fehlt"},null,{"$f":"IF(AND(Q108=\"x\",S108=\"x\"),\"wechsel\",IF(AND(Q108=\"x\",S108<>\"x\"),\"\",IF(AND(S108=\"x\",Q108<>\"x\"),\"M fehlt\",\"A + B fehlt\")))","v":"A + B fehlt"},null,null,null,null,null,null,null,{"$f":"IF(WEEKNUM(A108,2)<>WEEKNUM(A109,2),SUM(Y$7:Y108)-SUM(Z$6:Z107),\"\")","v":""}]
[null,null,{"$f":"IF(B109=0,\"\",VLOOKUP(B109,Etappen!$1:$65497,2,FALSE))","v":""},null,{"$f":"IF(D109=0,\"\",VLOOKUP(D109,Etappen!$1:$65497,2,FALSE))","v":""},null,{"$f":"IF(F109=0,\"\",VLOOKUP(F109,Etappen!$1:$65497,2,FALSE))","v":""},null,{"$f":"IF(H109=0,\"\",VLOOKUP(H109,Etappen!$1:$65497,2,FALSE))","v":""},null,{"$f":"IF(J109=0,\"\",VLOOKUP(J109,Etappen!$1:$65497,2,FALSE))","v":""},null,null,"A + B fehlt",null,{"$f":"IF(AND(O109=\"x\",Q109=\"x\"),\"wechsel\",IF(AND(O109=\"x\",Q109<>\"x\"),\"\",IF(AND(Q109=\"x\",O109<>\"x\"),\"M fehlt\",\"A + B fehlt\")))","v":"A + B fehlt"},null,{"$f":"IF(AND(Q109=\"x\",S109=\"x\"),\"wechsel\",IF(AND(Q109=\"x\",S109<>\"x\"),\"\",IF(AND(S109=\"x\",Q109<>\"x\"),\"M fehlt\",\"A + B fehlt\")))","v":"A + B fehlt"},null,null,null,null,null,null,null,{"$f":"IF(WEEKNUM(A109,2)<>WEEKNUM(A110,2),SUM(Y$7:Y109)-SUM(Z$6:Z108),\"\")","v":""}]
[null,null,{"$f":"IF(B110=0,\"\",VLOOKUP(B110,Etappen!$1:$65497,2,FALSE))","v":""},null,{"$f":"IF(D110=0,\"\",VLOOKUP(D110,Etappen!$1:$65497,2,FALSE))","v":""},null,{"$f":"IF(F110=0,\"\",VLOOKUP(F110,Etappen!$1:$65497,2,FALSE))","v":""},null,{"$f":"IF(H110=0,\"\",VLOOKUP(H110,Etappen!$1:$65497,2,FALSE))","v":""},null,{"$f":"IF(J110=0,\"\",VLOOKUP(J110,Etappen!$1:$65497,2,FALSE))","v":""},null,null,"A + B fehlt",null,{"$f":"IF(AND(O110=\"x\",Q110=\"x\"),\"wechsel\",IF(AND(O110=\"x\",Q110<>\"x\"),\"\",IF(AND(Q110=\"x\",O110<>\"x\"),\"M fehlt\",\"A + B fehlt\")))","v":"A + B fehlt"},null,{"$f":"IF(AND(Q110=\"x\",S110=\"x\"),\"wechsel\",IF(AND(Q110=\"x\",S110<>\"x\"),\"\",IF(AND(S110=\"x\",Q110<>\"x\"),\"M fehlt\",\"A + B fehlt\")))","v":"A + B fehlt"},null,null,null,null,null,null,null,{"$f":"IF(WEEKNUM(A110,2)<>WEEKNUM(A111,2),SUM(Y$7:Y110)-SUM(Z$6:Z109),\"\")","v":""}]
[null,null,{"$f":"IF(B111=0,\"\",VLOOKUP(B111,Etappen!$1:$65497,2,FALSE))","v":""},null,{"$f":"IF(D111=0,\"\",VLOOKUP(D111,Etappen!$1:$65497,2,FALSE))","v":""},null,{"$f":"IF(F111=0,\"\",VLOOKUP(F111,Etappen!$1:$65497,2,FALSE))","v":""},null,{"$f":"IF(H111=0,\"\",VLOOKUP(H111,Etappen!$1:$65497,2,FALSE))","v":""},null,{"$f":"IF(J111=0,\"\",VLOOKUP(J111,Etappen!$1:$65497,2,FALSE))","v":""},null,null,"A + B fehlt",null,{"$f":"IF(AND(O111=\"x\",Q111=\"x\"),\"wechsel\",IF(AND(O111=\"x\",Q111<>\"x\"),\"\",IF(AND(Q111=\"x\",O111<>\"x\"),\"M fehlt\",\"A + B fehlt\")))","v":"A + B fehlt"},null,{"$f":"IF(AND(Q111=\"x\",S111=\"x\"),\"wechsel\",IF(AND(Q111=\"x\",S111<>\"x\"),\"\",IF(AND(S111=\"x\",Q111<>\"x\"),\"M fehlt\",\"A + B fehlt\")))","v":"A + B fehlt"},null,null,null,null,null,null,null,{"$f":"IF(WEEKNUM(A111,2)<>WEEKNUM(A112,2),SUM(Y$7:Y111)-SUM(Z$6:Z110),\"\")","v":""}]
[null,null,{"$f":"IF(B112=0,\"\",VLOOKUP(B112,Etappen!$1:$65497,2,FALSE))","v":""},null,{"$f":"IF(D112=0,\"\",VLOOKUP(D112,Etappen!$1:$65497,2,FALSE))","v":""},null,{"$f":"IF(F112=0,\"\",VLOOKUP(F112,Etappen!$1:$65497,2,FALSE))","v":""},null,{"$f":"IF(H112=0,\"\",VLOOKUP(H112,Etappen!$1:$65497,2,FALSE))","v":""},null,{"$f":"IF(J112=0,\"\",VLOOKUP(J112,Etappen!$1:$65497,2,FALSE))","v":""},null,null,"A + B fehlt",null,{"$f":"IF(AND(O112=\"x\",Q112=\"x\"),\"wechsel\",IF(AND(O112=\"x\",Q112<>\"x\"),\"\",IF(AND(Q112=\"x\",O112<>\"x\"),\"M fehlt\",\"A + B fehlt\")))","v":"A + B fehlt"},null,{"$f":"IF(AND(Q112=\"x\",S112=\"x\"),\"wechsel\",IF(AND(Q112=\"x\",S112<>\"x\"),\"\",IF(AND(S112=\"x\",Q112<>\"x\"),\"M fehlt\",\"A + B fehlt\")))","v":"A + B fehlt"},null,null,null,null,null,null,null,{"$f":"IF(WEEKNUM(A112,2)<>WEEKNUM(A113,2),SUM(Y$7:Y112)-SUM(Z$6:Z111),\"\")","v":""}]
[null,null,{"$f":"IF(B113=0,\"\",VLOOKUP(B113,Etappen!$1:$65497,2,FALSE))","v":""},null,{"$f":"IF(D113=0,\"\",VLOOKUP(D113,Etappen!$1:$65497,2,FALSE))","v":""},null,{"$f":"IF(F113=0,\"\",VLOOKUP(F113,Etappen!$1:$65497,2,FALSE))","v":""},null,{"$f":"IF(H113=0,\"\",VLOOKUP(H113,Etappen!$1:$65497,2,FALSE))","v":""},null,{"$f":"IF(J113=0,\"\",VLOOKUP(J113,Etappen!$1:$65497,2,FALSE))","v":""},null,null,"A + B fehlt",null,{"$f":"IF(AND(O113=\"x\",Q113=\"x\"),\"wechsel\",IF(AND(O113=\"x\",Q113<>\"x\"),\"\",IF(AND(Q113=\"x\",O113<>\"x\"),\"M fehlt\",\"A + B fehlt\")))","v":"A + B fehlt"},null,{"$f":"IF(AND(Q113=\"x\",S113=\"x\"),\"wechsel\",IF(AND(Q113=\"x\",S113<>\"x\"),\"\",IF(AND(S113=\"x\",Q113<>\"x\"),\"M fehlt\",\"A + B fehlt\")))","v":"A + B fehlt"},null,null,null,null,null,null,null,{"$f":"IF(WEEKNUM(A113,2)<>WEEKNUM(A114,2),SUM(Y$7:Y113)-SUM(Z$6:Z112),\"\")","v":""}]
[null,null,{"$f":"IF(B114=0,\"\",VLOOKUP(B114,Etappen!$1:$65497,2,FALSE))","v":""},null,{"$f":"IF(D114=0,\"\",VLOOKUP(D114,Etappen!$1:$65497,2,FALSE))","v":""},null,{"$f":"IF(F114=0,\"\",VLOOKUP(F114,Etappen!$1:$65497,2,FALSE))","v":""},null,{"$f":"IF(H114=0,\"\",VLOOKUP(H114,Etappen!$1:$65497,2,FALSE))","v":""},null,{"$f":"IF(J114=0,\"\",VLOOKUP(J114,Etappen!$1:$65497,2,FALSE))","v":""},null,null,"A + B fehlt",null,{"$f":"IF(AND(O114=\"x\",Q114=\"x\"),\"wechsel\",IF(AND(O114=\"x\",Q114<>\"x\"),\"\",IF(AND(Q114=\"x\",O114<>\"x\"),\"M fehlt\",\"A + B fehlt\")))","v":"A + B fehlt"},null,{"$f":"IF(AND(Q114=\"x\",S114=\"x\"),\"wechsel\",IF(AND(Q114=\"x\",S114<>\"x\"),\"\",IF(AND(S114=\"x\",Q114<>\"x\"),\"M fehlt\",\"A + B fehlt\")))","v":"A + B fehlt"},null,null,null,null,null,null,null,{"$f":"IF(WEEKNUM(A114,2)<>WEEKNUM(A115,2),SUM(Y$7:Y114)-SUM(Z$6:Z113),\"\")","v":""}]
[null,null,{"$f":"IF(B115=0,\"\",VLOOKUP(B115,Etappen!$1:$65497,2,FALSE))","v":""},null,{"$f":"IF(D115=0,\"\",VLOOKUP(D115,Etappen!$1:$65497,2,FALSE))","v":""},null,{"$f":"IF(F115=0,\"\",VLOOKUP(F115,Etappen!$1:$65497,2,FALSE))","v":""},null,{"$f":"IF(H115=0,\"\",VLOOKUP(H115,Etappen!$1:$65497,2,FALSE))","v":""},null,{"$f":"IF(J115=0,\"\",VLOOKUP(J115,Etappen!$1:$65497,2,FALSE))","v":""},null,null,"A + B fehlt",null,{"$f":"IF(AND(O115=\"x\",Q115=\"x\"),\"wechsel\",IF(AND(O115=\"x\",Q115<>\"x\"),\"\",IF(AND(Q115=\"x\",O115<>\"x\"),\"M fehlt\",\"A + B fehlt\")))","v":"A + B fehlt"},null,{"$f":"IF(AND(Q115=\"x\",S115=\"x\"),\"wechsel\",IF(AND(Q115=\"x\",S115<>\"x\"),\"\",IF(AND(S115=\"x\",Q115<>\"x\"),\"M fehlt\",\"A + B fehlt\")))","v":"A + B fehlt"},null,null,null,null,null,null,null,{"$f":"IF(WEEKNUM(A115,2)<>WEEKNUM(A116,2),SUM(Y$7:Y115)-SUM(Z$6:Z114),\"\")","v":""}]
[null,null,{"$f":"IF(B116=0,\"\",VLOOKUP(B116,Etappen!$1:$65497,2,FALSE))","v":""},null,{"$f":"IF(D116=0,\"\",VLOOKUP(D116,Etappen!$1:$65497,2,FALSE))","v":""},null,{"$f":"IF(F116=0,\"\",VLOOKUP(F116,Etappen!$1:$65497,2,FALSE))","v":""},null,{"$f":"IF(H116=0,\"\",VLOOKUP(H116,Etappen!$1:$65497,2,FALSE))","v":""},null,{"$f":"IF(J116=0,\"\",VLOOKUP(J116,Etappen!$1:$65497,2,FALSE))","v":""},null,null,"A + B fehlt",null,{"$f":"IF(AND(O116=\"x\",Q116=\"x\"),\"wechsel\",IF(AND(O116=\"x\",Q116<>\"x\"),\"\",IF(AND(Q116=\"x\",O116<>\"x\"),\"M fehlt\",\"A + B fehlt\")))","v":"A + B fehlt"},null,{"$f":"IF(AND(Q116=\"x\",S116=\"x\"),\"wechsel\",IF(AND(Q116=\"x\",S116<>\"x\"),\"\",IF(AND(S116=\"x\",Q116<>\"x\"),\"M fehlt\",\"A + B fehlt\")))","v":"A + B fehlt"},null,null,null,null,null,null,null,{"$f":"IF(WEEKNUM(A116,2)<>WEEKNUM(A117,2),SUM(Y$7:Y116)-SUM(Z$6:Z115),\"\")","v":""}]
[null,null,{"$f":"IF(B117=0,\"\",VLOOKUP(B117,Etappen!$1:$65497,2,FALSE))","v":""},null,{"$f":"IF(D117=0,\"\",VLOOKUP(D117,Etappen!$1:$65497,2,FALSE))","v":""},null,{"$f":"IF(F117=0,\"\",VLOOKUP(F117,Etappen!$1:$65497,2,FALSE))","v":""},null,{"$f":"IF(H117=0,\"\",VLOOKUP(H117,Etappen!$1:$65497,2,FALSE))","v":""},null,{"$f":"IF(J117=0,\"\",VLOOKUP(J117,Etappen!$1:$65497,2,FALSE))","v":""},null,null,"A + B fehlt",null,{"$f":"IF(AND(O117=\"x\",Q117=\"x\"),\"wechsel\",IF(AND(O117=\"x\",Q117<>\"x\"),\"\",IF(AND(Q117=\"x\",O117<>\"x\"),\"M fehlt\",\"A + B fehlt\")))","v":"A + B fehlt"},null,{"$f":"IF(AND(Q117=\"x\",S117=\"x\"),\"wechsel\",IF(AND(Q117=\"x\",S117<>\"x\"),\"\",IF(AND(S117=\"x\",Q117<>\"x\"),\"M fehlt\",\"A + B fehlt\")))","v":"A + B fehlt"},null,null,null,null,null,null,null,{"$f":"IF(WEEKNUM(A117,2)<>WEEKNUM(A118,2),SUM(Y$7:Y117)-SUM(Z$6:Z116),\"\")","v":""}]
[null,null,{"$f":"IF(B118=0,\"\",VLOOKUP(B118,Etappen!$1:$65497,2,FALSE))","v":""},null,{"$f":"IF(D118=0,\"\",VLOOKUP(D118,Etappen!$1:$65497,2,FALSE))","v":""},null,{"$f":"IF(F118=0,\"\",VLOOKUP(F118,Etappen!$1:$65497,2,FALSE))","v":""},null,{"$f":"IF(H118=0,\"\",VLOOKUP(H118,Etappen!$1:$65497,2,FALSE))","v":""},null,{"$f":"IF(J118=0,\"\",VLOOKUP(J118,Etappen!$1:$65497,2,FALSE))","v":""},null,null,"A + B fehlt",null,{"$f":"IF(AND(O118=\"x\",Q118=\"x\"),\"wechsel\",IF(AND(O118=\"x\",Q118<>\"x\"),\"\",IF(AND(Q118=\"x\",O118<>\"x\"),\"M fehlt\",\"A + B fehlt\")))","v":"A + B fehlt"},null,{"$f":"IF(AND(Q118=\"x\",S118=\"x\"),\"wechsel\",IF(AND(Q118=\"x\",S118<>\"x\"),\"\",IF(AND(S118=\"x\",Q118<>\"x\"),\"M fehlt\",\"A + B fehlt\")))","v":"A + B fehlt"},null,null,null,null,null,null,null,{"$f":"IF(WEEKNUM(A118,2)<>WEEKNUM(A119,2),SUM(Y$7:Y118)-SUM(Z$6:Z117),\"\")","v":""}]
[null,null,{"$f":"IF(B119=0,\"\",VLOOKUP(B119,Etappen!$1:$65497,2,FALSE))","v":""},null,{"$f":"IF(D119=0,\"\",VLOOKUP(D119,Etappen!$1:$65497,2,FALSE))","v":""},null,{"$f":"IF(F119=0,\"\",VLOOKUP(F119,Etappen!$1:$65497,2,FALSE))","v":""},null,{"$f":"IF(H119=0,\"\",VLOOKUP(H119,Etappen!$1:$65497,2,FALSE))","v":""},null,{"$f":"IF(J119=0,\"\",VLOOKUP(J119,Etappen!$1:$65497,2,FALSE))","v":""},null,null,"A + B fehlt",null,{"$f":"IF(AND(O119=\"x\",Q119=\"x\"),\"wechsel\",IF(AND(O119=\"x\",Q119<>\"x\"),\"\",IF(AND(Q119=\"x\",O119<>\"x\"),\"M fehlt\",\"A + B fehlt\")))","v":"A + B fehlt"},null,{"$f":"IF(AND(Q119=\"x\",S119=\"x\"),\"wechsel\",IF(AND(Q119=\"x\",S119<>\"x\"),\"\",IF(AND(S119=\"x\",Q119<>\"x\"),\"M fehlt\",\"A + B fehlt\")))","v":"A + B fehlt"},null,null,null,null,null,null,null,{"$f":"IF(WEEKNUM(A119,2)<>WEEKNUM(A120,2),SUM(Y$7:Y119)-SUM(Z$6:Z118),\"\")","v":""}]
[null,null,{"$f":"IF(B120=0,\"\",VLOOKUP(B120,Etappen!$1:$65497,2,FALSE))","v":""},null,{"$f":"IF(D120=0,\"\",VLOOKUP(D120,Etappen!$1:$65497,2,FALSE))","v":""},null,{"$f":"IF(F120=0,\"\",VLOOKUP(F120,Etappen!$1:$65497,2,FALSE))","v":""},null,{"$f":"IF(H120=0,\"\",VLOOKUP(H120,Etappen!$1:$65497,2,FALSE))","v":""},null,{"$f":"IF(J120=0,\"\",VLOOKUP(J120,Etappen!$1:$65497,2,FALSE))","v":""},null,null,"A + B fehlt",null,{"$f":"IF(AND(O120=\"x\",Q120=\"x\"),\"wechsel\",IF(AND(O120=\"x\",Q120<>\"x\"),\"\",IF(AND(Q120=\"x\",O120<>\"x\"),\"M fehlt\",\"A + B fehlt\")))","v":"A + B fehlt"},null,{"$f":"IF(AND(Q120=\"x\",S120=\"x\"),\"wechsel\",IF(AND(Q120=\"x\",S120<>\"x\"),\"\",IF(AND(S120=\"x\",Q120<>\"x\"),\"M fehlt\",\"A + B fehlt\")))","v":"A + B fehlt"},null,null,null,null,null,null,null,{"$f":"IF(WEEKNUM(A120,2)<>WEEKNUM(A121,2),SUM(Y$7:Y120)-SUM(Z$6:Z119),\"\")","v":""}]
[null,null,{"$f":"IF(B121=0,\"\",VLOOKUP(B121,Etappen!$1:$65497,2,FALSE))","v":""},null,{"$f":"IF(D121=0,\"\",VLOOKUP(D121,Etappen!$1:$65497,2,FALSE))","v":""},null,{"$f":"IF(F121=0,\"\",VLOOKUP(F121,Etappen!$1:$65497,2,FALSE))","v":""},null,{"$f":"IF(H121=0,\"\",VLOOKUP(H121,Etappen!$1:$65497,2,FALSE))","v":""},null,{"$f":"IF(J121=0,\"\",VLOOKUP(J121,Etappen!$1:$65497,2,FALSE))","v":""},null,null,"A + B fehlt",null,{"$f":"IF(AND(O121=\"x\",Q121=\"x\"),\"wechsel\",IF(AND(O121=\"x\",Q121<>\"x\"),\"\",IF(AND(Q121=\"x\",O121<>\"x\"),\"M fehlt\",\"A + B fehlt\")))","v":"A + B fehlt"},null,{"$f":"IF(AND(Q121=\"x\",S121=\"x\"),\"wechsel\",IF(AND(Q121=\"x\",S121<>\"x\"),\"\",IF(AND(S121=\"x\",Q121<>\"x\"),\"M fehlt\",\"A + B fehlt\")))","v":"A + B fehlt"},null,null,null,null,null,null,null,{"$f":"IF(WEEKNUM(A121,2)<>WEEKNUM(A122,2),SUM(Y$7:Y121)-SUM(Z$6:Z120),\"\")","v":""}]
[null,null,{"$f":"IF(B122=0,\"\",VLOOKUP(B122,Etappen!$1:$65497,2,FALSE))","v":""},null,{"$f":"IF(D122=0,\"\",VLOOKUP(D122,Etappen!$1:$65497,2,FALSE))","v":""},null,{"$f":"IF(F122=0,\"\",VLOOKUP(F122,Etappen!$1:$65497,2,FALSE))","v":""},null,{"$f":"IF(H122=0,\"\",VLOOKUP(H122,Etappen!$1:$65497,2,FALSE))","v":""},null,{"$f":"IF(J122=0,\"\",VLOOKUP(J122,Etappen!$1:$65497,2,FALSE))","v":""},null,null,"A + B fehlt",null,{"$f":"IF(AND(O122=\"x\",Q122=\"x\"),\"wechsel\",IF(AND(O122=\"x\",Q122<>\"x\"),\"\",IF(AND(Q122=\"x\",O122<>\"x\"),\"M fehlt\",\"A + B fehlt\")))","v":"A + B fehlt"},null,{"$f":"IF(AND(Q122=\"x\",S122=\"x\"),\"wechsel\",IF(AND(Q122=\"x\",S122<>\"x\"),\"\",IF(AND(S122=\"x\",Q122<>\"x\"),\"M fehlt\",\"A + B fehlt\")))","v":"A + B fehlt"},null,null,null,null,null,null,null,{"$f":"IF(WEEKNUM(A122,2)<>WEEKNUM(A123,2),SUM(Y$7:Y122)-SUM(Z$6:Z121),\"\")","v":""}]
[null,null,{"$f":"IF(B123=0,\"\",VLOOKUP(B123,Etappen!$1:$65497,2,FALSE))","v":""},null,{"$f":"IF(D123=0,\"\",VLOOKUP(D123,Etappen!$1:$65497,2,FALSE))","v":""},null,{"$f":"IF(F123=0,\"\",VLOOKUP(F123,Etappen!$1:$65497,2,FALSE))","v":""},null,{"$f":"IF(H123=0,\"\",VLOOKUP(H123,Etappen!$1:$65497,2,FALSE))","v":""},null,{"$f":"IF(J123=0,\"\",VLOOKUP(J123,Etappen!$1:$65497,2,FALSE))","v":""},null,null,"A + B fehlt",null,{"$f":"IF(AND(O123=\"x\",Q123=\"x\"),\"wechsel\",IF(AND(O123=\"x\",Q123<>\"x\"),\"\",IF(AND(Q123=\"x\",O123<>\"x\"),\"M fehlt\",\"A + B fehlt\")))","v":"A + B fehlt"},null,{"$f":"IF(AND(Q123=\"x\",S123=\"x\"),\"wechsel\",IF(AND(Q123=\"x\",S123<>\"x\"),\"\",IF(AND(S123=\"x\",Q123<>\"x\"),\"M fehlt\",\"A + B fehlt\")))","v":"A + B fehlt"},null,null,null,null,null,null,null,{"$f":"IF(WEEKNUM(A123,2)<>WEEKNUM(A124,2),SUM(Y$7:Y123)-SUM(Z$6:Z122),\"\")","v":""}]
[null,null,{"$f":"IF(B124=0,\"\",VLOOKUP(B124,Etappen!$1:$65497,2,FALSE))","v":""},null,{"$f":"IF(D124=0,\"\",VLOOKUP(D124,Etappen!$1:$65497,2,FALSE))","v":""},null,{"$f":"IF(F124=0,\"\",VLOOKUP(F124,Etappen!$1:$65497,2,FALSE))","v":""},null,{"$f":"IF(H124=0,\"\",VLOOKUP(H124,Etappen!$1:$65497,2,FALSE))","v":""},null,{"$f":"IF(J124=0,\"\",VLOOKUP(J124,Etappen!$1:$65497,2,FALSE))","v":""},null,null,"A + B fehlt",null,{"$f":"IF(AND(O124=\"x\",Q124=\"x\"),\"wechsel\",IF(AND(O124=\"x\",Q124<>\"x\"),\"\",IF(AND(Q124=\"x\",O124<>\"x\"),\"M fehlt\",\"A + B fehlt\")))","v":"A + B fehlt"},null,{"$f":"IF(AND(Q124=\"x\",S124=\"x\"),\"wechsel\",IF(AND(Q124=\"x\",S124<>\"x\"),\"\",IF(AND(S124=\"x\",Q124<>\"x\"),\"M fehlt\",\"A + B fehlt\")))","v":"A + B fehlt"},null,null,null,null,null,null,null,{"$f":"IF(WEEKNUM(A124,2)<>WEEKNUM(A125,2),SUM(Y$7:Y124)-SUM(Z$6:Z123),\"\")","v":""}]
[null,null,{"$f":"IF(B125=0,\"\",VLOOKUP(B125,Etappen!$1:$65497,2,FALSE))","v":""},null,{"$f":"IF(D125=0,\"\",VLOOKUP(D125,Etappen!$1:$65497,2,FALSE))","v":""},null,{"$f":"IF(F125=0,\"\",VLOOKUP(F125,Etappen!$1:$65497,2,FALSE))","v":""},null,{"$f":"IF(H125=0,\"\",VLOOKUP(H125,Etappen!$1:$65497,2,FALSE))","v":""},null,{"$f":"IF(J125=0,\"\",VLOOKUP(J125,Etappen!$1:$65497,2,FALSE))","v":""},null,null,"A + B fehlt",null,{"$f":"IF(AND(O125=\"x\",Q125=\"x\"),\"wechsel\",IF(AND(O125=\"x\",Q125<>\"x\"),\"\",IF(AND(Q125=\"x\",O125<>\"x\"),\"M fehlt\",\"A + B fehlt\")))","v":"A + B fehlt"},null,{"$f":"IF(AND(Q125=\"x\",S125=\"x\"),\"wechsel\",IF(AND(Q125=\"x\",S125<>\"x\"),\"\",IF(AND(S125=\"x\",Q125<>\"x\"),\"M fehlt\",\"A + B fehlt\")))","v":"A + B fehlt"},null,null,null,null,null,null,null,{"$f":"IF(WEEKNUM(A125,2)<>WEEKNUM(A126,2),SUM(Y$7:Y125)-SUM(Z$6:Z124),\"\")","v":""}]
[null,null,{"$f":"IF(B126=0,\"\",VLOOKUP(B126,Etappen!$1:$65497,2,FALSE))","v":""},null,{"$f":"IF(D126=0,\"\",VLOOKUP(D126,Etappen!$1:$65497,2,FALSE))","v":""},null,{"$f":"IF(F126=0,\"\",VLOOKUP(F126,Etappen!$1:$65497,2,FALSE))","v":""},null,{"$f":"IF(H126=0,\"\",VLOOKUP(H126,Etappen!$1:$65497,2,FALSE))","v":""},null,{"$f":"IF(J126=0,\"\",VLOOKUP(J126,Etappen!$1:$65497,2,FALSE))","v":""},null,null,"A + B fehlt",null,{"$f":"IF(AND(O126=\"x\",Q126=\"x\"),\"wechsel\",IF(AND(O126=\"x\",Q126<>\"x\"),\"\",IF(AND(Q126=\"x\",O126<>\"x\"),\"M fehlt\",\"A + B fehlt\")))","v":"A + B fehlt"},null,{"$f":"IF(AND(Q126=\"x\",S126=\"x\"),\"wechsel\",IF(AND(Q126=\"x\",S126<>\"x\"),\"\",IF(AND(S126=\"x\",Q126<>\"x\"),\"M fehlt\",\"A + B fehlt\")))","v":"A + B fehlt"},null,null,null,null,null,null,null,{"$f":"IF(WEEKNUM(A126,2)<>WEEKNUM(A127,2),SUM(Y$7:Y126)-SUM(Z$6:Z125),\"\")","v":""}]
[null,null,{"$f":"IF(B127=0,\"\",VLOOKUP(B127,Etappen!$1:$65497,2,FALSE))","v":""},null,{"$f":"IF(D127=0,\"\",VLOOKUP(D127,Etappen!$1:$65497,2,FALSE))","v":""},null,{"$f":"IF(F127=0,\"\",VLOOKUP(F127,Etappen!$1:$65497,2,FALSE))","v":""},null,{"$f":"IF(H127=0,\"\",VLOOKUP(H127,Etappen!$1:$65497,2,FALSE))","v":""},null,{"$f":"IF(J127=0,\"\",VLOOKUP(J127,Etappen!$1:$65497,2,FALSE))","v":""},null,null,"A + B fehlt",null,{"$f":"IF(AND(O127=\"x\",Q127=\"x\"),\"wechsel\",IF(AND(O127=\"x\",Q127<>\"x\"),\"\",IF(AND(Q127=\"x\",O127<>\"x\"),\"M fehlt\",\"A + B fehlt\")))","v":"A + B fehlt"},null,{"$f":"IF(AND(Q127=\"x\",S127=\"x\"),\"wechsel\",IF(AND(Q127=\"x\",S127<>\"x\"),\"\",IF(AND(S127=\"x\",Q127<>\"x\"),\"M fehlt\",\"A + B fehlt\")))","v":"A + B fehlt"},null,null,null,null,null,null,null,{"$f":"IF(WEEKNUM(A127,2)<>WEEKNUM(A128,2),SUM(Y$7:Y127)-SUM(Z$6:Z126),\"\")","v":""}]
[null,null,{"$f":"IF(B128=0,\"\",VLOOKUP(B128,Etappen!$1:$65497,2,FALSE))","v":""},null,{"$f":"IF(D128=0,\"\",VLOOKUP(D128,Etappen!$1:$65497,2,FALSE))","v":""},null,{"$f":"IF(F128=0,\"\",VLOOKUP(F128,Etappen!$1:$65497,2,FALSE))","v":""},null,{"$f":"IF(H128=0,\"\",VLOOKUP(H128,Etappen!$1:$65497,2,FALSE))","v":""},null,{"$f":"IF(J128=0,\"\",VLOOKUP(J128,Etappen!$1:$65497,2,FALSE))","v":""},null,null,"A + B fehlt",null,{"$f":"IF(AND(O128=\"x\",Q128=\"x\"),\"wechsel\",IF(AND(O128=\"x\",Q128<>\"x\"),\"\",IF(AND(Q128=\"x\",O128<>\"x\"),\"M fehlt\",\"A + B fehlt\")))","v":"A + B fehlt"},null,{"$f":"IF(AND(Q128=\"x\",S128=\"x\"),\"wechsel\",IF(AND(Q128=\"x\",S128<>\"x\"),\"\",IF(AND(S128=\"x\",Q128<>\"x\"),\"M fehlt\",\"A + B fehlt\")))","v":"A + B fehlt"},null,null,null,null,null,null,null,{"$f":"IF(WEEKNUM(A128,2)<>WEEKNUM(A129,2),SUM(Y$7:Y128)-SUM(Z$6:Z127),\"\")","v":""}]
[null,null,{"$f":"IF(B129=0,\"\",VLOOKUP(B129,Etappen!$1:$65497,2,FALSE))","v":""},null,{"$f":"IF(D129=0,\"\",VLOOKUP(D129,Etappen!$1:$65497,2,FALSE))","v":""},null,{"$f":"IF(F129=0,\"\",VLOOKUP(F129,Etappen!$1:$65497,2,FALSE))","v":""},null,{"$f":"IF(H129=0,\"\",VLOOKUP(H129,Etappen!$1:$65497,2,FALSE))","v":""},null,{"$f":"IF(J129=0,\"\",VLOOKUP(J129,Etappen!$1:$65497,2,FALSE))","v":""},null,null,"A + B fehlt",null,{"$f":"IF(AND(O129=\"x\",Q129=\"x\"),\"wechsel\",IF(AND(O129=\"x\",Q129<>\"x\"),\"\",IF(AND(Q129=\"x\",O129<>\"x\"),\"M fehlt\",\"A + B fehlt\")))","v":"A + B fehlt"},null,{"$f":"IF(AND(Q129=\"x\",S129=\"x\"),\"wechsel\",IF(AND(Q129=\"x\",S129<>\"x\"),\"\",IF(AND(S129=\"x\",Q129<>\"x\"),\"M fehlt\",\"A + B fehlt\")))","v":"A + B fehlt"},null,null,null,null,null,null,null,{"$f":"IF(WEEKNUM(A129,2)<>WEEKNUM(A130,2),SUM(Y$7:Y129)-SUM(Z$6:Z128),\"\")","v":""}]
[null,null,{"$f":"IF(B130=0,\"\",VLOOKUP(B130,Etappen!$1:$65497,2,FALSE))","v":""},null,{"$f":"IF(D130=0,\"\",VLOOKUP(D130,Etappen!$1:$65497,2,FALSE))","v":""},null,{"$f":"IF(F130=0,\"\",VLOOKUP(F130,Etappen!$1:$65497,2,FALSE))","v":""},null,{"$f":"IF(H130=0,\"\",VLOOKUP(H130,Etappen!$1:$65497,2,FALSE))","v":""},null,{"$f":"IF(J130=0,\"\",VLOOKUP(J130,Etappen!$1:$65497,2,FALSE))","v":""},null,null,"A + B fehlt",null,{"$f":"IF(AND(O130=\"x\",Q130=\"x\"),\"wechsel\",IF(AND(O130=\"x\",Q130<>\"x\"),\"\",IF(AND(Q130=\"x\",O130<>\"x\"),\"M fehlt\",\"A + B fehlt\")))","v":"A + B fehlt"},null,{"$f":"IF(AND(Q130=\"x\",S130=\"x\"),\"wechsel\",IF(AND(Q130=\"x\",S130<>\"x\"),\"\",IF(AND(S130=\"x\",Q130<>\"x\"),\"M fehlt\",\"A + B fehlt\")))","v":"A + B fehlt"},null,null,null,null,null,null,null,{"$f":"IF(WEEKNUM(A130,2)<>WEEKNUM(A131,2),SUM(Y$7:Y130)-SUM(Z$6:Z129),\"\")","v":""}]
[null,null,{"$f":"IF(B131=0,\"\",VLOOKUP(B131,Etappen!$1:$65497,2,FALSE))","v":""},null,{"$f":"IF(D131=0,\"\",VLOOKUP(D131,Etappen!$1:$65497,2,FALSE))","v":""},null,{"$f":"IF(F131=0,\"\",VLOOKUP(F131,Etappen!$1:$65497,2,FALSE))","v":""},null,{"$f":"IF(H131=0,\"\",VLOOKUP(H131,Etappen!$1:$65497,2,FALSE))","v":""},null,{"$f":"IF(J131=0,\"\",VLOOKUP(J131,Etappen!$1:$65497,2,FALSE))","v":""},null,null,{"$f":"IF(AND(M131=\"x\",O131=\"x\"),\"wechsel\",IF(AND(M131=\"x\",O131<>\"x\"),\"\",IF(AND(O131=\"x\",M131<>\"x\"),\"M fehlt\",\"A + B fehlt\")))","v":"A + B fehlt"},null,{"$f":"IF(AND(O131=\"x\",Q131=\"x\"),\"wechsel\",IF(AND(O131=\"x\",Q131<>\"x\"),\"\",IF(AND(Q131=\"x\",O131<>\"x\"),\"M fehlt\",\"A + B fehlt\")))","v":"A + B fehlt"},null,{"$f":"IF(AND(Q131=\"x\",S131=\"x\"),\"wechsel\",IF(AND(Q131=\"x\",S131<>\"x\"),\"\",IF(AND(S131=\"x\",Q131<>\"x\"),\"M fehlt\",\"A + B fehlt\")))","v":"A + B fehlt"},null,null,null,null,null,null,null,{"$f":"IF(WEEKNUM(A131,2)<>WEEKNUM(A132,2),SUM(Y$7:Y131)-SUM(Z$6:Z130),\"\")","v":""}]
[null,null,{"$f":"IF(B132=0,\"\",VLOOKUP(B132,Etappen!$1:$65497,2,FALSE))","v":""},null,{"$f":"IF(D132=0,\"\",VLOOKUP(D132,Etappen!$1:$65497,2,FALSE))","v":""},null,{"$f":"IF(F132=0,\"\",VLOOKUP(F132,Etappen!$1:$65497,2,FALSE))","v":""},null,{"$f":"IF(H132=0,\"\",VLOOKUP(H132,Etappen!$1:$65497,2,FALSE))","v":""},null,{"$f":"IF(J132=0,\"\",VLOOKUP(J132,Etappen!$1:$65497,2,FALSE))","v":""},null,null,"A + B fehlt",null,{"$f":"IF(AND(O132=\"x\",Q132=\"x\"),\"wechsel\",IF(AND(O132=\"x\",Q132<>\"x\"),\"\",IF(AND(Q132=\"x\",O132<>\"x\"),\"M fehlt\",\"A + B fehlt\")))","v":"A + B fehlt"},null,{"$f":"IF(AND(Q132=\"x\",S132=\"x\"),\"wechsel\",IF(AND(Q132=\"x\",S132<>\"x\"),\"\",IF(AND(S132=\"x\",Q132<>\"x\"),\"M fehlt\",\"A + B fehlt\")))","v":"A + B fehlt"},null,null,null,null,null,null,null,{"$f":"IF(WEEKNUM(A132,2)<>WEEKNUM(A133,2),SUM(Y$7:Y132)-SUM(Z$6:Z131),\"\")","v":""}]
[null,null,{"$f":"IF(B133=0,\"\",VLOOKUP(B133,Etappen!$1:$65497,2,FALSE))","v":""},null,{"$f":"IF(D133=0,\"\",VLOOKUP(D133,Etappen!$1:$65497,2,FALSE))","v":""},null,{"$f":"IF(F133=0,\"\",VLOOKUP(F133,Etappen!$1:$65497,2,FALSE))","v":""},null,{"$f":"IF(H133=0,\"\",VLOOKUP(H133,Etappen!$1:$65497,2,FALSE))","v":""},null,{"$f":"IF(J133=0,\"\",VLOOKUP(J133,Etappen!$1:$65497,2,FALSE))","v":""},null,null,"A + B fehlt",null,{"$f":"IF(AND(O133=\"x\",Q133=\"x\"),\"wechsel\",IF(AND(O133=\"x\",Q133<>\"x\"),\"\",IF(AND(Q133=\"x\",O133<>\"x\"),\"M fehlt\",\"A + B fehlt\")))","v":"A + B fehlt"},null,{"$f":"IF(AND(Q133=\"x\",S133=\"x\"),\"wechsel\",IF(AND(Q133=\"x\",S133<>\"x\"),\"\",IF(AND(S133=\"x\",Q133<>\"x\"),\"M fehlt\",\"A + B fehlt\")))","v":"A + B fehlt"},null,null,null,null,null,null,null,{"$f":"IF(WEEKNUM(A133,2)<>WEEKNUM(A134,2),SUM(Y$7:Y133)-SUM(Z$6:Z132),\"\")","v":""}]
[null,null,{"$f":"IF(B134=0,\"\",VLOOKUP(B134,Etappen!$1:$65497,2,FALSE))","v":""},null,{"$f":"IF(D134=0,\"\",VLOOKUP(D134,Etappen!$1:$65497,2,FALSE))","v":""},null,{"$f":"IF(F134=0,\"\",VLOOKUP(F134,Etappen!$1:$65497,2,FALSE))","v":""},null,{"$f":"IF(H134=0,\"\",VLOOKUP(H134,Etappen!$1:$65497,2,FALSE))","v":""},null,{"$f":"IF(J134=0,\"\",VLOOKUP(J134,Etappen!$1:$65497,2,FALSE))","v":""},null,null,"A + B fehlt",null,{"$f":"IF(AND(O134=\"x\",Q134=\"x\"),\"wechsel\",IF(AND(O134=\"x\",Q134<>\"x\"),\"\",IF(AND(Q134=\"x\",O134<>\"x\"),\"M fehlt\",\"A + B fehlt\")))","v":"A + B fehlt"},null,{"$f":"IF(AND(Q134=\"x\",S134=\"x\"),\"wechsel\",IF(AND(Q134=\"x\",S134<>\"x\"),\"\",IF(AND(S134=\"x\",Q134<>\"x\"),\"M fehlt\",\"A + B fehlt\")))","v":"A + B fehlt"},null,null,null,null,null,null,null,{"$f":"IF(WEEKNUM(A134,2)<>WEEKNUM(A135,2),SUM(Y$7:Y134)-SUM(Z$6:Z133),\"\")","v":""}]
[null,null,{"$f":"IF(B135=0,\"\",VLOOKUP(B135,Etappen!$1:$65497,2,FALSE))","v":""},null,{"$f":"IF(D135=0,\"\",VLOOKUP(D135,Etappen!$1:$65497,2,FALSE))","v":""},null,{"$f":"IF(F135=0,\"\",VLOOKUP(F135,Etappen!$1:$65497,2,FALSE))","v":""},null,{"$f":"IF(H135=0,\"\",VLOOKUP(H135,Etappen!$1:$65497,2,FALSE))","v":""},null,{"$f":"IF(J135=0,\"\",VLOOKUP(J135,Etappen!$1:$65497,2,FALSE))","v":""},null,null,"A + B fehlt",null,{"$f":"IF(AND(O135=\"x\",Q135=\"x\"),\"wechsel\",IF(AND(O135=\"x\",Q135<>\"x\"),\"\",IF(AND(Q135=\"x\",O135<>\"x\"),\"M fehlt\",\"A + B fehlt\")))","v":"A + B fehlt"},null,{"$f":"IF(AND(Q135=\"x\",S135=\"x\"),\"wechsel\",IF(AND(Q135=\"x\",S135<>\"x\"),\"\",IF(AND(S135=\"x\",Q135<>\"x\"),\"M fehlt\",\"A + B fehlt\")))","v":"A + B fehlt"},null,null,null,null,null,null,null,{"$f":"IF(WEEKNUM(A135,2)<>WEEKNUM(A136,2),SUM(Y$7:Y135)-SUM(Z$6:Z134),\"\")","v":""}]
[null,null,{"$f":"IF(B136=0,\"\",VLOOKUP(B136,Etappen!$1:$65497,2,FALSE))","v":""},null,{"$f":"IF(D136=0,\"\",VLOOKUP(D136,Etappen!$1:$65497,2,FALSE))","v":""},null,{"$f":"IF(F136=0,\"\",VLOOKUP(F136,Etappen!$1:$65497,2,FALSE))","v":""},null,{"$f":"IF(H136=0,\"\",VLOOKUP(H136,Etappen!$1:$65497,2,FALSE))","v":""},null,{"$f":"IF(J136=0,\"\",VLOOKUP(J136,Etappen!$1:$65497,2,FALSE))","v":""},null,null,"A + B fehlt",null,{"$f":"IF(AND(O136=\"x\",Q136=\"x\"),\"wechsel\",IF(AND(O136=\"x\",Q136<>\"x\"),\"\",IF(AND(Q136=\"x\",O136<>\"x\"),\"M fehlt\",\"A + B fehlt\")))","v":"A + B fehlt"},null,{"$f":"IF(AND(Q136=\"x\",S136=\"x\"),\"wechsel\",IF(AND(Q136=\"x\",S136<>\"x\"),\"\",IF(AND(S136=\"x\",Q136<>\"x\"),\"M fehlt\",\"A + B fehlt\")))","v":"A + B fehlt"},null,null,null,null,null,null,null,{"$f":"IF(WEEKNUM(A136,2)<>WEEKNUM(A137,2),SUM(Y$7:Y136)-SUM(Z$6:Z135),\"\")","v":""}]
[null,null,{"$f":"IF(B137=0,\"\",VLOOKUP(B137,Etappen!$1:$65497,2,FALSE))","v":""},null,{"$f":"IF(D137=0,\"\",VLOOKUP(D137,Etappen!$1:$65497,2,FALSE))","v":""},null,{"$f":"IF(F137=0,\"\",VLOOKUP(F137,Etappen!$1:$65497,2,FALSE))","v":""},null,{"$f":"IF(H137=0,\"\",VLOOKUP(H137,Etappen!$1:$65497,2,FALSE))","v":""},null,{"$f":"IF(J137=0,\"\",VLOOKUP(J137,Etappen!$1:$65497,2,FALSE))","v":""},null,null,"A + B fehlt",null,{"$f":"IF(AND(O137=\"x\",Q137=\"x\"),\"wechsel\",IF(AND(O137=\"x\",Q137<>\"x\"),\"\",IF(AND(Q137=\"x\",O137<>\"x\"),\"M fehlt\",\"A + B fehlt\")))","v":"A + B fehlt"},null,{"$f":"IF(AND(Q137=\"x\",S137=\"x\"),\"wechsel\",IF(AND(Q137=\"x\",S137<>\"x\"),\"\",IF(AND(S137=\"x\",Q137<>\"x\"),\"M fehlt\",\"A + B fehlt\")))","v":"A + B fehlt"},null,null,null,null,null,null,null,{"$f":"IF(WEEKNUM(A137,2)<>WEEKNUM(A138,2),SUM(Y$7:Y137)-SUM(Z$6:Z136),\"\")","v":""}]
[null,null,{"$f":"IF(B138=0,\"\",VLOOKUP(B138,Etappen!$1:$65497,2,FALSE))","v":""},null,{"$f":"IF(D138=0,\"\",VLOOKUP(D138,Etappen!$1:$65497,2,FALSE))","v":""},null,{"$f":"IF(F138=0,\"\",VLOOKUP(F138,Etappen!$1:$65497,2,FALSE))","v":""},null,{"$f":"IF(H138=0,\"\",VLOOKUP(H138,Etappen!$1:$65497,2,FALSE))","v":""},null,{"$f":"IF(J138=0,\"\",VLOOKUP(J138,Etappen!$1:$65497,2,FALSE))","v":""},null,null,"A + B fehlt",null,{"$f":"IF(AND(O138=\"x\",Q138=\"x\"),\"wechsel\",IF(AND(O138=\"x\",Q138<>\"x\"),\"\",IF(AND(Q138=\"x\",O138<>\"x\"),\"M fehlt\",\"A + B fehlt\")))","v":"A + B fehlt"},null,{"$f":"IF(AND(Q138=\"x\",S138=\"x\"),\"wechsel\",IF(AND(Q138=\"x\",S138<>\"x\"),\"\",IF(AND(S138=\"x\",Q138<>\"x\"),\"M fehlt\",\"A + B fehlt\")))","v":"A + B fehlt"},null,null,null,null,null,null,null,{"$f":"IF(WEEKNUM(A138,2)<>WEEKNUM(A139,2),SUM(Y$7:Y138)-SUM(Z$6:Z137),\"\")","v":""}]
[null,null,{"$f":"IF(B139=0,\"\",VLOOKUP(B139,Etappen!$1:$65497,2,FALSE))","v":""},null,{"$f":"IF(D139=0,\"\",VLOOKUP(D139,Etappen!$1:$65497,2,FALSE))","v":""},null,{"$f":"IF(F139=0,\"\",VLOOKUP(F139,Etappen!$1:$65497,2,FALSE))","v":""},null,{"$f":"IF(H139=0,\"\",VLOOKUP(H139,Etappen!$1:$65497,2,FALSE))","v":""},null,{"$f":"IF(J139=0,\"\",VLOOKUP(J139,Etappen!$1:$65497,2,FALSE))","v":""},null,null,"A + B fehlt",null,{"$f":"IF(AND(O139=\"x\",Q139=\"x\"),\"wechsel\",IF(AND(O139=\"x\",Q139<>\"x\"),\"\",IF(AND(Q139=\"x\",O139<>\"x\"),\"M fehlt\",\"A + B fehlt\")))","v":"A + B fehlt"},null,{"$f":"IF(AND(Q139=\"x\",S139=\"x\"),\"wechsel\",IF(AND(Q139=\"x\",S139<>\"x\"),\"\",IF(AND(S139=\"x\",Q139<>\"x\"),\"M fehlt\",\"A + B fehlt\")))","v":"A + B fehlt"},null,null,null,null,null,null,null,{"$f":"IF(WEEKNUM(A139,2)<>WEEKNUM(A140,2),SUM(Y$7:Y139)-SUM(Z$6:Z138),\"\")","v":""}]
[null,null,{"$f":"IF(B140=0,\"\",VLOOKUP(B140,Etappen!$1:$65497,2,FALSE))","v":""},null,{"$f":"IF(D140=0,\"\",VLOOKUP(D140,Etappen!$1:$65497,2,FALSE))","v":""},null,{"$f":"IF(F140=0,\"\",VLOOKUP(F140,Etappen!$1:$65497,2,FALSE))","v":""},null,{"$f":"IF(H140=0,\"\",VLOOKUP(H140,Etappen!$1:$65497,2,FALSE))","v":""},null,{"$f":"IF(J140=0,\"\",VLOOKUP(J140,Etappen!$1:$65497,2,FALSE))","v":""},null,null,"A + B fehlt",null,{"$f":"IF(AND(O140=\"x\",Q140=\"x\"),\"wechsel\",IF(AND(O140=\"x\",Q140<>\"x\"),\"\",IF(AND(Q140=\"x\",O140<>\"x\"),\"M fehlt\",\"A + B fehlt\")))","v":"A + B fehlt"},null,{"$f":"IF(AND(Q140=\"x\",S140=\"x\"),\"wechsel\",IF(AND(Q140=\"x\",S140<>\"x\"),\"\",IF(AND(S140=\"x\",Q140<>\"x\"),\"M fehlt\",\"A + B fehlt\")))","v":"A + B fehlt"},null,null,null,null,null,null,null,{"$f":"IF(WEEKNUM(A140,2)<>WEEKNUM(A141,2),SUM(Y$7:Y140)-SUM(Z$6:Z139),\"\")","v":""}]
[null,null,{"$f":"IF(B141=0,\"\",VLOOKUP(B141,Etappen!$1:$65497,2,FALSE))","v":""},null,{"$f":"IF(D141=0,\"\",VLOOKUP(D141,Etappen!$1:$65497,2,FALSE))","v":""},null,{"$f":"IF(F141=0,\"\",VLOOKUP(F141,Etappen!$1:$65497,2,FALSE))","v":""},null,{"$f":"IF(H141=0,\"\",VLOOKUP(H141,Etappen!$1:$65497,2,FALSE))","v":""},null,{"$f":"IF(J141=0,\"\",VLOOKUP(J141,Etappen!$1:$65497,2,FALSE))","v":""},null,null,"A + B fehlt",null,{"$f":"IF(AND(O141=\"x\",Q141=\"x\"),\"wechsel\",IF(AND(O141=\"x\",Q141<>\"x\"),\"\",IF(AND(Q141=\"x\",O141<>\"x\"),\"M fehlt\",\"A + B fehlt\")))","v":"A + B fehlt"},null,{"$f":"IF(AND(Q141=\"x\",S141=\"x\"),\"wechsel\",IF(AND(Q141=\"x\",S141<>\"x\"),\"\",IF(AND(S141=\"x\",Q141<>\"x\"),\"M fehlt\",\"A + B fehlt\")))","v":"A + B fehlt"},null,null,null,null,null,null,null,{"$f":"IF(WEEKNUM(A141,2)<>WEEKNUM(A142,2),SUM(Y$7:Y141)-SUM(Z$6:Z140),\"\")","v":""}]
[null,null,{"$f":"IF(B142=0,\"\",VLOOKUP(B142,Etappen!$1:$65497,2,FALSE))","v":""},null,{"$f":"IF(D142=0,\"\",VLOOKUP(D142,Etappen!$1:$65497,2,FALSE))","v":""},null,{"$f":"IF(F142=0,\"\",VLOOKUP(F142,Etappen!$1:$65497,2,FALSE))","v":""},null,{"$f":"IF(H142=0,\"\",VLOOKUP(H142,Etappen!$1:$65497,2,FALSE))","v":""},null,{"$f":"IF(J142=0,\"\",VLOOKUP(J142,Etappen!$1:$65497,2,FALSE))","v":""},null,null,"A + B fehlt",null,{"$f":"IF(AND(O142=\"x\",Q142=\"x\"),\"wechsel\",IF(AND(O142=\"x\",Q142<>\"x\"),\"\",IF(AND(Q142=\"x\",O142<>\"x\"),\"M fehlt\",\"A + B fehlt\")))","v":"A + B fehlt"},null,{"$f":"IF(AND(Q142=\"x\",S142=\"x\"),\"wechsel\",IF(AND(Q142=\"x\",S142<>\"x\"),\"\",IF(AND(S142=\"x\",Q142<>\"x\"),\"M fehlt\",\"A + B fehlt\")))","v":"A + B fehlt"},null,null,null,null,null,null,null,{"$f":"IF(WEEKNUM(A142,2)<>WEEKNUM(A143,2),SUM(Y$7:Y142)-SUM(Z$6:Z141),\"\")","v":""}]
[null,null,{"$f":"IF(B143=0,\"\",VLOOKUP(B143,Etappen!$1:$65497,2,FALSE))","v":""},null,{"$f":"IF(D143=0,\"\",VLOOKUP(D143,Etappen!$1:$65497,2,FALSE))","v":""},null,{"$f":"IF(F143=0,\"\",VLOOKUP(F143,Etappen!$1:$65497,2,FALSE))","v":""},null,{"$f":"IF(H143=0,\"\",VLOOKUP(H143,Etappen!$1:$65497,2,FALSE))","v":""},null,{"$f":"IF(J143=0,\"\",VLOOKUP(J143,Etappen!$1:$65497,2,FALSE))","v":""},null,null,"A + B fehlt",null,{"$f":"IF(AND(O143=\"x\",Q143=\"x\"),\"wechsel\",IF(AND(O143=\"x\",Q143<>\"x\"),\"\",IF(AND(Q143=\"x\",O143<>\"x\"),\"M fehlt\",\"A + B fehlt\")))","v":"A + B fehlt"},null,{"$f":"IF(AND(Q143=\"x\",S143=\"x\"),\"wechsel\",IF(AND(Q143=\"x\",S143<>\"x\"),\"\",IF(AND(S143=\"x\",Q143<>\"x\"),\"M fehlt\",\"A + B fehlt\")))","v":"A + B fehlt"},null,null,null,null,null,null,null,{"$f":"IF(WEEKNUM(A143,2)<>WEEKNUM(A144,2),SUM(Y$7:Y143)-SUM(Z$6:Z142),\"\")","v":""}]
[null,null,{"$f":"IF(B144=0,\"\",VLOOKUP(B144,Etappen!$1:$65497,2,FALSE))","v":""},null,{"$f":"IF(D144=0,\"\",VLOOKUP(D144,Etappen!$1:$65497,2,FALSE))","v":""},null,{"$f":"IF(F144=0,\"\",VLOOKUP(F144,Etappen!$1:$65497,2,FALSE))","v":""},null,{"$f":"IF(H144=0,\"\",VLOOKUP(H144,Etappen!$1:$65497,2,FALSE))","v":""},null,{"$f":"IF(J144=0,\"\",VLOOKUP(J144,Etappen!$1:$65497,2,FALSE))","v":""},null,null,"A + B fehlt",null,{"$f":"IF(AND(O144=\"x\",Q144=\"x\"),\"wechsel\",IF(AND(O144=\"x\",Q144<>\"x\"),\"\",IF(AND(Q144=\"x\",O144<>\"x\"),\"M fehlt\",\"A + B fehlt\")))","v":"A + B fehlt"},null,{"$f":"IF(AND(Q144=\"x\",S144=\"x\"),\"wechsel\",IF(AND(Q144=\"x\",S144<>\"x\"),\"\",IF(AND(S144=\"x\",Q144<>\"x\"),\"M fehlt\",\"A + B fehlt\")))","v":"A + B fehlt"},null,null,null,null,null,null,null,{"$f":"IF(WEEKNUM(A144,2)<>WEEKNUM(A145,2),SUM(Y$7:Y144)-SUM(Z$6:Z143),\"\")","v":""}]
[null,null,{"$f":"IF(B145=0,\"\",VLOOKUP(B145,Etappen!$1:$65497,2,FALSE))","v":""},null,{"$f":"IF(D145=0,\"\",VLOOKUP(D145,Etappen!$1:$65497,2,FALSE))","v":""},null,{"$f":"IF(F145=0,\"\",VLOOKUP(F145,Etappen!$1:$65497,2,FALSE))","v":""},null,{"$f":"IF(H145=0,\"\",VLOOKUP(H145,Etappen!$1:$65497,2,FALSE))","v":""},null,{"$f":"IF(J145=0,\"\",VLOOKUP(J145,Etappen!$1:$65497,2,FALSE))","v":""},null,null,"A + B fehlt",null,{"$f":"IF(AND(O145=\"x\",Q145=\"x\"),\"wechsel\",IF(AND(O145=\"x\",Q145<>\"x\"),\"\",IF(AND(Q145=\"x\",O145<>\"x\"),\"M fehlt\",\"A + B fehlt\")))","v":"A + B fehlt"},null,{"$f":"IF(AND(Q145=\"x\",S145=\"x\"),\"wechsel\",IF(AND(Q145=\"x\",S145<>\"x\"),\"\",IF(AND(S145=\"x\",Q145<>\"x\"),\"M fehlt\",\"A + B fehlt\")))","v":"A + B fehlt"},null,null,null,null,null,null,null,{"$f":"IF(WEEKNUM(A145,2)<>WEEKNUM(A146,2),SUM(Y$7:Y145)-SUM(Z$6:Z144),\"\")","v":""}]
[null,null,{"$f":"IF(B146=0,\"\",VLOOKUP(B146,Etappen!$1:$65497,2,FALSE))","v":""},null,{"$f":"IF(D146=0,\"\",VLOOKUP(D146,Etappen!$1:$65497,2,FALSE))","v":""},null,{"$f":"IF(F146=0,\"\",VLOOKUP(F146,Etappen!$1:$65497,2,FALSE))","v":""},null,{"$f":"IF(H146=0,\"\",VLOOKUP(H146,Etappen!$1:$65497,2,FALSE))","v":""},null,{"$f":"IF(J146=0,\"\",VLOOKUP(J146,Etappen!$1:$65497,2,FALSE))","v":""},null,null,"A + B fehlt",null,{"$f":"IF(AND(O146=\"x\",Q146=\"x\"),\"wechsel\",IF(AND(O146=\"x\",Q146<>\"x\"),\"\",IF(AND(Q146=\"x\",O146<>\"x\"),\"M fehlt\",\"A + B fehlt\")))","v":"A + B fehlt"},null,{"$f":"IF(AND(Q146=\"x\",S146=\"x\"),\"wechsel\",IF(AND(Q146=\"x\",S146<>\"x\"),\"\",IF(AND(S146=\"x\",Q146<>\"x\"),\"M fehlt\",\"A + B fehlt\")))","v":"A + B fehlt"},null,null,null,null,null,null,null,{"$f":"IF(WEEKNUM(A146,2)<>WEEKNUM(A147,2),SUM(Y$7:Y146)-SUM(Z$6:Z145),\"\")","v":""}]
[null,null,{"$f":"IF(B147=0,\"\",VLOOKUP(B147,Etappen!$1:$65497,2,FALSE))","v":""},null,{"$f":"IF(D147=0,\"\",VLOOKUP(D147,Etappen!$1:$65497,2,FALSE))","v":""},null,{"$f":"IF(F147=0,\"\",VLOOKUP(F147,Etappen!$1:$65497,2,FALSE))","v":""},null,{"$f":"IF(H147=0,\"\",VLOOKUP(H147,Etappen!$1:$65497,2,FALSE))","v":""},null,{"$f":"IF(J147=0,\"\",VLOOKUP(J147,Etappen!$1:$65497,2,FALSE))","v":""},null,null,"A + B fehlt",null,{"$f":"IF(AND(O147=\"x\",Q147=\"x\"),\"wechsel\",IF(AND(O147=\"x\",Q147<>\"x\"),\"\",IF(AND(Q147=\"x\",O147<>\"x\"),\"M fehlt\",\"A + B fehlt\")))","v":"A + B fehlt"},null,{"$f":"IF(AND(Q147=\"x\",S147=\"x\"),\"wechsel\",IF(AND(Q147=\"x\",S147<>\"x\"),\"\",IF(AND(S147=\"x\",Q147<>\"x\"),\"M fehlt\",\"A + B fehlt\")))","v":"A + B fehlt"},null,null,null,null,null,null,null,{"$f":"IF(WEEKNUM(A147,2)<>WEEKNUM(A148,2),SUM(Y$7:Y147)-SUM(Z$6:Z146),\"\")","v":""}]
[null,null,{"$f":"IF(B148=0,\"\",VLOOKUP(B148,Etappen!$1:$65497,2,FALSE))","v":""},null,{"$f":"IF(D148=0,\"\",VLOOKUP(D148,Etappen!$1:$65497,2,FALSE))","v":""},null,{"$f":"IF(F148=0,\"\",VLOOKUP(F148,Etappen!$1:$65497,2,FALSE))","v":""},null,{"$f":"IF(H148=0,\"\",VLOOKUP(H148,Etappen!$1:$65497,2,FALSE))","v":""},null,{"$f":"IF(J148=0,\"\",VLOOKUP(J148,Etappen!$1:$65497,2,FALSE))","v":""},null,null,"A + B fehlt",null,{"$f":"IF(AND(O148=\"x\",Q148=\"x\"),\"wechsel\",IF(AND(O148=\"x\",Q148<>\"x\"),\"\",IF(AND(Q148=\"x\",O148<>\"x\"),\"M fehlt\",\"A + B fehlt\")))","v":"A + B fehlt"},null,{"$f":"IF(AND(Q148=\"x\",S148=\"x\"),\"wechsel\",IF(AND(Q148=\"x\",S148<>\"x\"),\"\",IF(AND(S148=\"x\",Q148<>\"x\"),\"M fehlt\",\"A + B fehlt\")))","v":"A + B fehlt"},null,null,null,null,null,null,null,{"$f":"IF(WEEKNUM(A148,2)<>WEEKNUM(A149,2),SUM(Y$7:Y148)-SUM(Z$6:Z147),\"\")","v":""}]
[null,null,{"$f":"IF(B149=0,\"\",VLOOKUP(B149,Etappen!$1:$65497,2,FALSE))","v":""},null,{"$f":"IF(D149=0,\"\",VLOOKUP(D149,Etappen!$1:$65497,2,FALSE))","v":""},null,{"$f":"IF(F149=0,\"\",VLOOKUP(F149,Etappen!$1:$65497,2,FALSE))","v":""},null,{"$f":"IF(H149=0,\"\",VLOOKUP(H149,Etappen!$1:$65497,2,FALSE))","v":""},null,{"$f":"IF(J149=0,\"\",VLOOKUP(J149,Etappen!$1:$65497,2,FALSE))","v":""},null,null,"A + B fehlt",null,{"$f":"IF(AND(O149=\"x\",Q149=\"x\"),\"wechsel\",IF(AND(O149=\"x\",Q149<>\"x\"),\"\",IF(AND(Q149=\"x\",O149<>\"x\"),\"M fehlt\",\"A + B fehlt\")))","v":"A + B fehlt"},null,{"$f":"IF(AND(Q149=\"x\",S149=\"x\"),\"wechsel\",IF(AND(Q149=\"x\",S149<>\"x\"),\"\",IF(AND(S149=\"x\",Q149<>\"x\"),\"M fehlt\",\"A + B fehlt\")))","v":"A + B fehlt"},null,null,null,null,null,null,null,{"$f":"IF(WEEKNUM(A149,2)<>WEEKNUM(A150,2),SUM(Y$7:Y149)-SUM(Z$6:Z148),\"\")","v":""}]
[null,null,{"$f":"IF(B150=0,\"\",VLOOKUP(B150,Etappen!$1:$65497,2,FALSE))","v":""},null,{"$f":"IF(D150=0,\"\",VLOOKUP(D150,Etappen!$1:$65497,2,FALSE))","v":""},null,{"$f":"IF(F150=0,\"\",VLOOKUP(F150,Etappen!$1:$65497,2,FALSE))","v":""},null,{"$f":"IF(H150=0,\"\",VLOOKUP(H150,Etappen!$1:$65497,2,FALSE))","v":""},null,{"$f":"IF(J150=0,\"\",VLOOKUP(J150,Etappen!$1:$65497,2,FALSE))","v":""},null,null,"A + B fehlt",null,{"$f":"IF(AND(O150=\"x\",Q150=\"x\"),\"wechsel\",IF(AND(O150=\"x\",Q150<>\"x\"),\"\",IF(AND(Q150=\"x\",O150<>\"x\"),\"M fehlt\",\"A + B fehlt\")))","v":"A + B fehlt"},null,{"$f":"IF(AND(Q150=\"x\",S150=\"x\"),\"wechsel\",IF(AND(Q150=\"x\",S150<>\"x\"),\"\",IF(AND(S150=\"x\",Q150<>\"x\"),\"M fehlt\",\"A + B fehlt\")))","v":"A + B fehlt"},null,null,null,null,null,null,null,{"$f":"IF(WEEKNUM(A150,2)<>WEEKNUM(A151,2),SUM(Y$7:Y150)-SUM(Z$6:Z149),\"\")","v":""}]
[null,null,{"$f":"IF(B151=0,\"\",VLOOKUP(B151,Etappen!$1:$65497,2,FALSE))","v":""},null,{"$f":"IF(D151=0,\"\",VLOOKUP(D151,Etappen!$1:$65497,2,FALSE))","v":""},null,{"$f":"IF(F151=0,\"\",VLOOKUP(F151,Etappen!$1:$65497,2,FALSE))","v":""},null,{"$f":"IF(H151=0,\"\",VLOOKUP(H151,Etappen!$1:$65497,2,FALSE))","v":""},null,{"$f":"IF(J151=0,\"\",VLOOKUP(J151,Etappen!$1:$65497,2,FALSE))","v":""},null,null,"A + B fehlt",null,{"$f":"IF(AND(O151=\"x\",Q151=\"x\"),\"wechsel\",IF(AND(O151=\"x\",Q151<>\"x\"),\"\",IF(AND(Q151=\"x\",O151<>\"x\"),\"M fehlt\",\"A + B fehlt\")))","v":"A + B fehlt"},null,{"$f":"IF(AND(Q151=\"x\",S151=\"x\"),\"wechsel\",IF(AND(Q151=\"x\",S151<>\"x\"),\"\",IF(AND(S151=\"x\",Q151<>\"x\"),\"M fehlt\",\"A + B fehlt\")))","v":"A + B fehlt"},null,null,null,null,null,null,null,{"$f":"IF(WEEKNUM(A151,2)<>WEEKNUM(A152,2),SUM(Y$7:Y151)-SUM(Z$6:Z150),\"\")","v":""}]
[null,null,{"$f":"IF(B152=0,\"\",VLOOKUP(B152,Etappen!$1:$65497,2,FALSE))","v":""},null,{"$f":"IF(D152=0,\"\",VLOOKUP(D152,Etappen!$1:$65497,2,FALSE))","v":""},null,{"$f":"IF(F152=0,\"\",VLOOKUP(F152,Etappen!$1:$65497,2,FALSE))","v":""},null,{"$f":"IF(H152=0,\"\",VLOOKUP(H152,Etappen!$1:$65497,2,FALSE))","v":""},null,{"$f":"IF(J152=0,\"\",VLOOKUP(J152,Etappen!$1:$65497,2,FALSE))","v":""},null,null,"A + B fehlt",null,{"$f":"IF(AND(O152=\"x\",Q152=\"x\"),\"wechsel\",IF(AND(O152=\"x\",Q152<>\"x\"),\"\",IF(AND(Q152=\"x\",O152<>\"x\"),\"M fehlt\",\"A + B fehlt\")))","v":"A + B fehlt"},null,{"$f":"IF(AND(Q152=\"x\",S152=\"x\"),\"wechsel\",IF(AND(Q152=\"x\",S152<>\"x\"),\"\",IF(AND(S152=\"x\",Q152<>\"x\"),\"M fehlt\",\"A + B fehlt\")))","v":"A + B fehlt"},null,null,null,null,null,null,null,{"$f":"IF(WEEKNUM(A152,2)<>WEEKNUM(A153,2),SUM(Y$7:Y152)-SUM(Z$6:Z151),\"\")","v":""}]
[null,null,{"$f":"IF(B153=0,\"\",VLOOKUP(B153,Etappen!$1:$65497,2,FALSE))","v":""},null,{"$f":"IF(D153=0,\"\",VLOOKUP(D153,Etappen!$1:$65497,2,FALSE))","v":""},null,{"$f":"IF(F153=0,\"\",VLOOKUP(F153,Etappen!$1:$65497,2,FALSE))","v":""},null,{"$f":"IF(H153=0,\"\",VLOOKUP(H153,Etappen!$1:$65497,2,FALSE))","v":""},null,{"$f":"IF(J153=0,\"\",VLOOKUP(J153,Etappen!$1:$65497,2,FALSE))","v":""},null,null,"A + B fehlt",null,{"$f":"IF(AND(O153=\"x\",Q153=\"x\"),\"wechsel\",IF(AND(O153=\"x\",Q153<>\"x\"),\"\",IF(AND(Q153=\"x\",O153<>\"x\"),\"M fehlt\",\"A + B fehlt\")))","v":"A + B fehlt"},null,{"$f":"IF(AND(Q153=\"x\",S153=\"x\"),\"wechsel\",IF(AND(Q153=\"x\",S153<>\"x\"),\"\",IF(AND(S153=\"x\",Q153<>\"x\"),\"M fehlt\",\"A + B fehlt\")))","v":"A + B fehlt"},null,null,null,null,null,null,null,{"$f":"IF(WEEKNUM(A153,2)<>WEEKNUM(A154,2),SUM(Y$7:Y153)-SUM(Z$6:Z152),\"\")","v":""}]
[null,null,{"$f":"IF(B154=0,\"\",VLOOKUP(B154,Etappen!$1:$65497,2,FALSE))","v":""},null,{"$f":"IF(D154=0,\"\",VLOOKUP(D154,Etappen!$1:$65497,2,FALSE))","v":""},null,{"$f":"IF(F154=0,\"\",VLOOKUP(F154,Etappen!$1:$65497,2,FALSE))","v":""},null,{"$f":"IF(H154=0,\"\",VLOOKUP(H154,Etappen!$1:$65497,2,FALSE))","v":""},null,{"$f":"IF(J154=0,\"\",VLOOKUP(J154,Etappen!$1:$65497,2,FALSE))","v":""},null,null,"A + B fehlt",null,{"$f":"IF(AND(O154=\"x\",Q154=\"x\"),\"wechsel\",IF(AND(O154=\"x\",Q154<>\"x\"),\"\",IF(AND(Q154=\"x\",O154<>\"x\"),\"M fehlt\",\"A + B fehlt\")))","v":"A + B fehlt"},null,{"$f":"IF(AND(Q154=\"x\",S154=\"x\"),\"wechsel\",IF(AND(Q154=\"x\",S154<>\"x\"),\"\",IF(AND(S154=\"x\",Q154<>\"x\"),\"M fehlt\",\"A + B fehlt\")))","v":"A + B fehlt"},null,null,null,null,null,null,null,{"$f":"IF(WEEKNUM(A154,2)<>WEEKNUM(A155,2),SUM(Y$7:Y154)-SUM(Z$6:Z153),\"\")","v":""}]
[null,null,{"$f":"IF(B155=0,\"\",VLOOKUP(B155,Etappen!$1:$65497,2,FALSE))","v":""},null,{"$f":"IF(D155=0,\"\",VLOOKUP(D155,Etappen!$1:$65497,2,FALSE))","v":""},null,{"$f":"IF(F155=0,\"\",VLOOKUP(F155,Etappen!$1:$65497,2,FALSE))","v":""},null,{"$f":"IF(H155=0,\"\",VLOOKUP(H155,Etappen!$1:$65497,2,FALSE))","v":""},null,{"$f":"IF(J155=0,\"\",VLOOKUP(J155,Etappen!$1:$65497,2,FALSE))","v":""},null,null,"A + B fehlt",null,{"$f":"IF(AND(O155=\"x\",Q155=\"x\"),\"wechsel\",IF(AND(O155=\"x\",Q155<>\"x\"),\"\",IF(AND(Q155=\"x\",O155<>\"x\"),\"M fehlt\",\"A + B fehlt\")))","v":"A + B fehlt"},null,{"$f":"IF(AND(Q155=\"x\",S155=\"x\"),\"wechsel\",IF(AND(Q155=\"x\",S155<>\"x\"),\"\",IF(AND(S155=\"x\",Q155<>\"x\"),\"M fehlt\",\"A + B fehlt\")))","v":"A + B fehlt"},null,null,null,null,null,null,null,{"$f":"IF(WEEKNUM(A155,2)<>WEEKNUM(A156,2),SUM(Y$7:Y155)-SUM(Z$6:Z154),\"\")","v":""}]
[null,null,{"$f":"IF(B156=0,\"\",VLOOKUP(B156,Etappen!$1:$65497,2,FALSE))","v":""},null,{"$f":"IF(D156=0,\"\",VLOOKUP(D156,Etappen!$1:$65497,2,FALSE))","v":""},null,{"$f":"IF(F156=0,\"\",VLOOKUP(F156,Etappen!$1:$65497,2,FALSE))","v":""},null,{"$f":"IF(H156=0,\"\",VLOOKUP(H156,Etappen!$1:$65497,2,FALSE))","v":""},null,{"$f":"IF(J156=0,\"\",VLOOKUP(J156,Etappen!$1:$65497,2,FALSE))","v":""},null,null,"A + B fehlt",null,{"$f":"IF(AND(O156=\"x\",Q156=\"x\"),\"wechsel\",IF(AND(O156=\"x\",Q156<>\"x\"),\"\",IF(AND(Q156=\"x\",O156<>\"x\"),\"M fehlt\",\"A + B fehlt\")))","v":"A + B fehlt"},null,{"$f":"IF(AND(Q156=\"x\",S156=\"x\"),\"wechsel\",IF(AND(Q156=\"x\",S156<>\"x\"),\"\",IF(AND(S156=\"x\",Q156<>\"x\"),\"M fehlt\",\"A + B fehlt\")))","v":"A + B fehlt"},null,null,null,null,null,null,null,{"$f":"IF(WEEKNUM(A156,2)<>WEEKNUM(A157,2),SUM(Y$7:Y156)-SUM(Z$6:Z155),\"\")","v":""}]
[null,null,{"$f":"IF(B157=0,\"\",VLOOKUP(B157,Etappen!$1:$65497,2,FALSE))","v":""},null,{"$f":"IF(D157=0,\"\",VLOOKUP(D157,Etappen!$1:$65497,2,FALSE))","v":""},null,{"$f":"IF(F157=0,\"\",VLOOKUP(F157,Etappen!$1:$65497,2,FALSE))","v":""},null,{"$f":"IF(H157=0,\"\",VLOOKUP(H157,Etappen!$1:$65497,2,FALSE))","v":""},null,{"$f":"IF(J157=0,\"\",VLOOKUP(J157,Etappen!$1:$65497,2,FALSE))","v":""},null,null,"A + B fehlt",null,{"$f":"IF(AND(O157=\"x\",Q157=\"x\"),\"wechsel\",IF(AND(O157=\"x\",Q157<>\"x\"),\"\",IF(AND(Q157=\"x\",O157<>\"x\"),\"M fehlt\",\"A + B fehlt\")))","v":"A + B fehlt"},null,{"$f":"IF(AND(Q157=\"x\",S157=\"x\"),\"wechsel\",IF(AND(Q157=\"x\",S157<>\"x\"),\"\",IF(AND(S157=\"x\",Q157<>\"x\"),\"M fehlt\",\"A + B fehlt\")))","v":"A + B fehlt"},null,null,null,null,null,null,null,{"$f":"IF(WEEKNUM(A157,2)<>WEEKNUM(A158,2),SUM(Y$7:Y157)-SUM(Z$6:Z156),\"\")","v":""}]
[null,null,{"$f":"IF(B158=0,\"\",VLOOKUP(B158,Etappen!$1:$65497,2,FALSE))","v":""},null,{"$f":"IF(D158=0,\"\",VLOOKUP(D158,Etappen!$1:$65497,2,FALSE))","v":""},null,{"$f":"IF(F158=0,\"\",VLOOKUP(F158,Etappen!$1:$65497,2,FALSE))","v":""},null,{"$f":"IF(H158=0,\"\",VLOOKUP(H158,Etappen!$1:$65497,2,FALSE))","v":""},null,{"$f":"IF(J158=0,\"\",VLOOKUP(J158,Etappen!$1:$65497,2,FALSE))","v":""},null,null,"A + B fehlt",null,{"$f":"IF(AND(O158=\"x\",Q158=\"x\"),\"wechsel\",IF(AND(O158=\"x\",Q158<>\"x\"),\"\",IF(AND(Q158=\"x\",O158<>\"x\"),\"M fehlt\",\"A + B fehlt\")))","v":"A + B fehlt"},null,{"$f":"IF(AND(Q158=\"x\",S158=\"x\"),\"wechsel\",IF(AND(Q158=\"x\",S158<>\"x\"),\"\",IF(AND(S158=\"x\",Q158<>\"x\"),\"M fehlt\",\"A + B fehlt\")))","v":"A + B fehlt"},null,null,null,null,null,null,null,{"$f":"IF(WEEKNUM(A158,2)<>WEEKNUM(A159,2),SUM(Y$7:Y158)-SUM(Z$6:Z157),\"\")","v":""}]
[null,null,{"$f":"IF(B159=0,\"\",VLOOKUP(B159,Etappen!$1:$65497,2,FALSE))","v":""},null,{"$f":"IF(D159=0,\"\",VLOOKUP(D159,Etappen!$1:$65497,2,FALSE))","v":""},null,{"$f":"IF(F159=0,\"\",VLOOKUP(F159,Etappen!$1:$65497,2,FALSE))","v":""},null,{"$f":"IF(H159=0,\"\",VLOOKUP(H159,Etappen!$1:$65497,2,FALSE))","v":""},null,{"$f":"IF(J159=0,\"\",VLOOKUP(J159,Etappen!$1:$65497,2,FALSE))","v":""},null,null,"A + B fehlt",null,{"$f":"IF(AND(O159=\"x\",Q159=\"x\"),\"wechsel\",IF(AND(O159=\"x\",Q159<>\"x\"),\"\",IF(AND(Q159=\"x\",O159<>\"x\"),\"M fehlt\",\"A + B fehlt\")))","v":"A + B fehlt"},null,{"$f":"IF(AND(Q159=\"x\",S159=\"x\"),\"wechsel\",IF(AND(Q159=\"x\",S159<>\"x\"),\"\",IF(AND(S159=\"x\",Q159<>\"x\"),\"M fehlt\",\"A + B fehlt\")))","v":"A + B fehlt"},null,null,null,null,null,null,null,{"$f":"IF(WEEKNUM(A159,2)<>WEEKNUM(A160,2),SUM(Y$7:Y159)-SUM(Z$6:Z158),\"\")","v":""}]
[null,null,{"$f":"IF(B160=0,\"\",VLOOKUP(B160,Etappen!$1:$65497,2,FALSE))","v":""},null,{"$f":"IF(D160=0,\"\",VLOOKUP(D160,Etappen!$1:$65497,2,FALSE))","v":""},null,{"$f":"IF(F160=0,\"\",VLOOKUP(F160,Etappen!$1:$65497,2,FALSE))","v":""},null,{"$f":"IF(H160=0,\"\",VLOOKUP(H160,Etappen!$1:$65497,2,FALSE))","v":""},null,{"$f":"IF(J160=0,\"\",VLOOKUP(J160,Etappen!$1:$65497,2,FALSE))","v":""},null,null,"A + B fehlt",null,{"$f":"IF(AND(O160=\"x\",Q160=\"x\"),\"wechsel\",IF(AND(O160=\"x\",Q160<>\"x\"),\"\",IF(AND(Q160=\"x\",O160<>\"x\"),\"M fehlt\",\"A + B fehlt\")))","v":"A + B fehlt"},null,{"$f":"IF(AND(Q160=\"x\",S160=\"x\"),\"wechsel\",IF(AND(Q160=\"x\",S160<>\"x\"),\"\",IF(AND(S160=\"x\",Q160<>\"x\"),\"M fehlt\",\"A + B fehlt\")))","v":"A + B fehlt"},null,null,null,null,null,null,null,{"$f":"IF(WEEKNUM(A160,2)<>WEEKNUM(A161,2),SUM(Y$7:Y160)-SUM(Z$6:Z159),\"\")","v":""}]
[null,null,{"$f":"IF(B161=0,\"\",VLOOKUP(B161,Etappen!$1:$65497,2,FALSE))","v":""},null,{"$f":"IF(D161=0,\"\",VLOOKUP(D161,Etappen!$1:$65497,2,FALSE))","v":""},null,{"$f":"IF(F161=0,\"\",VLOOKUP(F161,Etappen!$1:$65497,2,FALSE))","v":""},null,{"$f":"IF(H161=0,\"\",VLOOKUP(H161,Etappen!$1:$65497,2,FALSE))","v":""},null,{"$f":"IF(J161=0,\"\",VLOOKUP(J161,Etappen!$1:$65497,2,FALSE))","v":""},null,null,"A + B fehlt",null,{"$f":"IF(AND(O161=\"x\",Q161=\"x\"),\"wechsel\",IF(AND(O161=\"x\",Q161<>\"x\"),\"\",IF(AND(Q161=\"x\",O161<>\"x\"),\"M fehlt\",\"A + B fehlt\")))","v":"A + B fehlt"},null,{"$f":"IF(AND(Q161=\"x\",S161=\"x\"),\"wechsel\",IF(AND(Q161=\"x\",S161<>\"x\"),\"\",IF(AND(S161=\"x\",Q161<>\"x\"),\"M fehlt\",\"A + B fehlt\")))","v":"A + B fehlt"},null,null,null,null,null,null,null,{"$f":"IF(WEEKNUM(A161,2)<>WEEKNUM(A162,2),SUM(Y$7:Y161)-SUM(Z$6:Z160),\"\")","v":""}]
[null,null,{"$f":"IF(B162=0,\"\",VLOOKUP(B162,Etappen!$1:$65497,2,FALSE))","v":""},null,{"$f":"IF(D162=0,\"\",VLOOKUP(D162,Etappen!$1:$65497,2,FALSE))","v":""},null,{"$f":"IF(F162=0,\"\",VLOOKUP(F162,Etappen!$1:$65497,2,FALSE))","v":""},null,{"$f":"IF(H162=0,\"\",VLOOKUP(H162,Etappen!$1:$65497,2,FALSE))","v":""},null,{"$f":"IF(J162=0,\"\",VLOOKUP(J162,Etappen!$1:$65497,2,FALSE))","v":""},null,null,"A + B fehlt",null,{"$f":"IF(AND(O162=\"x\",Q162=\"x\"),\"wechsel\",IF(AND(O162=\"x\",Q162<>\"x\"),\"\",IF(AND(Q162=\"x\",O162<>\"x\"),\"M fehlt\",\"A + B fehlt\")))","v":"A + B fehlt"},null,{"$f":"IF(AND(Q162=\"x\",S162=\"x\"),\"wechsel\",IF(AND(Q162=\"x\",S162<>\"x\"),\"\",IF(AND(S162=\"x\",Q162<>\"x\"),\"M fehlt\",\"A + B fehlt\")))","v":"A + B fehlt"},null,null,null,null,null,null,null,{"$f":"IF(WEEKNUM(A162,2)<>WEEKNUM(A163,2),SUM(Y$7:Y162)-SUM(Z$6:Z161),\"\")","v":""}]
[null,null,{"$f":"IF(B163=0,\"\",VLOOKUP(B163,Etappen!$1:$65497,2,FALSE))","v":""},null,{"$f":"IF(D163=0,\"\",VLOOKUP(D163,Etappen!$1:$65497,2,FALSE))","v":""},null,{"$f":"IF(F163=0,\"\",VLOOKUP(F163,Etappen!$1:$65497,2,FALSE))","v":""},null,{"$f":"IF(H163=0,\"\",VLOOKUP(H163,Etappen!$1:$65497,2,FALSE))","v":""},null,{"$f":"IF(J163=0,\"\",VLOOKUP(J163,Etappen!$1:$65497,2,FALSE))","v":""},null,null,"A + B fehlt",null,{"$f":"IF(AND(O163=\"x\",Q163=\"x\"),\"wechsel\",IF(AND(O163=\"x\",Q163<>\"x\"),\"\",IF(AND(Q163=\"x\",O163<>\"x\"),\"M fehlt\",\"A + B fehlt\")))","v":"A + B fehlt"},null,{"$f":"IF(AND(Q163=\"x\",S163=\"x\"),\"wechsel\",IF(AND(Q163=\"x\",S163<>\"x\"),\"\",IF(AND(S163=\"x\",Q163<>\"x\"),\"M fehlt\",\"A + B fehlt\")))","v":"A + B fehlt"},null,null,null,null,null,null,null,{"$f":"IF(WEEKNUM(A163,2)<>WEEKNUM(A164,2),SUM(Y$7:Y163)-SUM(Z$6:Z162),\"\")","v":""}]
[null,null,{"$f":"IF(B164=0,\"\",VLOOKUP(B164,Etappen!$1:$65497,2,FALSE))","v":""},null,{"$f":"IF(D164=0,\"\",VLOOKUP(D164,Etappen!$1:$65497,2,FALSE))","v":""},null,{"$f":"IF(F164=0,\"\",VLOOKUP(F164,Etappen!$1:$65497,2,FALSE))","v":""},null,{"$f":"IF(H164=0,\"\",VLOOKUP(H164,Etappen!$1:$65497,2,FALSE))","v":""},null,{"$f":"IF(J164=0,\"\",VLOOKUP(J164,Etappen!$1:$65497,2,FALSE))","v":""},null,null,"A + B fehlt",null,{"$f":"IF(AND(O164=\"x\",Q164=\"x\"),\"wechsel\",IF(AND(O164=\"x\",Q164<>\"x\"),\"\",IF(AND(Q164=\"x\",O164<>\"x\"),\"M fehlt\",\"A + B fehlt\")))","v":"A + B fehlt"},null,{"$f":"IF(AND(Q164=\"x\",S164=\"x\"),\"wechsel\",IF(AND(Q164=\"x\",S164<>\"x\"),\"\",IF(AND(S164=\"x\",Q164<>\"x\"),\"M fehlt\",\"A + B fehlt\")))","v":"A + B fehlt"},null,null,null,null,null,null,null,{"$f":"IF(WEEKNUM(A164,2)<>WEEKNUM(A165,2),SUM(Y$7:Y164)-SUM(Z$6:Z163),\"\")","v":""}]
[null,null,{"$f":"IF(B165=0,\"\",VLOOKUP(B165,Etappen!$1:$65497,2,FALSE))","v":""},null,{"$f":"IF(D165=0,\"\",VLOOKUP(D165,Etappen!$1:$65497,2,FALSE))","v":""},null,{"$f":"IF(F165=0,\"\",VLOOKUP(F165,Etappen!$1:$65497,2,FALSE))","v":""},null,{"$f":"IF(H165=0,\"\",VLOOKUP(H165,Etappen!$1:$65497,2,FALSE))","v":""},null,{"$f":"IF(J165=0,\"\",VLOOKUP(J165,Etappen!$1:$65497,2,FALSE))","v":""},null,null,"A + B fehlt",null,{"$f":"IF(AND(O165=\"x\",Q165=\"x\"),\"wechsel\",IF(AND(O165=\"x\",Q165<>\"x\"),\"\",IF(AND(Q165=\"x\",O165<>\"x\"),\"M fehlt\",\"A + B fehlt\")))","v":"A + B fehlt"},null,{"$f":"IF(AND(Q165=\"x\",S165=\"x\"),\"wechsel\",IF(AND(Q165=\"x\",S165<>\"x\"),\"\",IF(AND(S165=\"x\",Q165<>\"x\"),\"M fehlt\",\"A + B fehlt\")))","v":"A + B fehlt"},null,null,null,null,null,null,null,{"$f":"IF(WEEKNUM(A165,2)<>WEEKNUM(A166,2),SUM(Y$7:Y165)-SUM(Z$6:Z164),\"\")","v":""}]
[null,null,{"$f":"IF(B166=0,\"\",VLOOKUP(B166,Etappen!$1:$65497,2,FALSE))","v":""},null,{"$f":"IF(D166=0,\"\",VLOOKUP(D166,Etappen!$1:$65497,2,FALSE))","v":""},null,{"$f":"IF(F166=0,\"\",VLOOKUP(F166,Etappen!$1:$65497,2,FALSE))","v":""},null,{"$f":"IF(H166=0,\"\",VLOOKUP(H166,Etappen!$1:$65497,2,FALSE))","v":""},null,{"$f":"IF(J166=0,\"\",VLOOKUP(J166,Etappen!$1:$65497,2,FALSE))","v":""},null,null,"A + B fehlt",null,{"$f":"IF(AND(O166=\"x\",Q166=\"x\"),\"wechsel\",IF(AND(O166=\"x\",Q166<>\"x\"),\"\",IF(AND(Q166=\"x\",O166<>\"x\"),\"M fehlt\",\"A + B fehlt\")))","v":"A + B fehlt"},null,{"$f":"IF(AND(Q166=\"x\",S166=\"x\"),\"wechsel\",IF(AND(Q166=\"x\",S166<>\"x\"),\"\",IF(AND(S166=\"x\",Q166<>\"x\"),\"M fehlt\",\"A + B fehlt\")))","v":"A + B fehlt"},null,null,null,null,null,null,null,{"$f":"IF(WEEKNUM(A166,2)<>WEEKNUM(A167,2),SUM(Y$7:Y166)-SUM(Z$6:Z165),\"\")","v":""}]
[null,null,{"$f":"IF(B167=0,\"\",VLOOKUP(B167,Etappen!$1:$65497,2,FALSE))","v":""},null,{"$f":"IF(D167=0,\"\",VLOOKUP(D167,Etappen!$1:$65497,2,FALSE))","v":""},null,{"$f":"IF(F167=0,\"\",VLOOKUP(F167,Etappen!$1:$65497,2,FALSE))","v":""},null,{"$f":"IF(H167=0,\"\",VLOOKUP(H167,Etappen!$1:$65497,2,FALSE))","v":""},null,{"$f":"IF(J167=0,\"\",VLOOKUP(J167,Etappen!$1:$65497,2,FALSE))","v":""},null,null,"A + B fehlt",null,{"$f":"IF(AND(O167=\"x\",Q167=\"x\"),\"wechsel\",IF(AND(O167=\"x\",Q167<>\"x\"),\"\",IF(AND(Q167=\"x\",O167<>\"x\"),\"M fehlt\",\"A + B fehlt\")))","v":"A + B fehlt"},null,{"$f":"IF(AND(Q167=\"x\",S167=\"x\"),\"wechsel\",IF(AND(Q167=\"x\",S167<>\"x\"),\"\",IF(AND(S167=\"x\",Q167<>\"x\"),\"M fehlt\",\"A + B fehlt\")))","v":"A + B fehlt"},null,null,null,null,null,null,null,{"$f":"IF(WEEKNUM(A167,2)<>WEEKNUM(A168,2),SUM(Y$7:Y167)-SUM(Z$6:Z166),\"\")","v":""}]
[null,null,{"$f":"IF(B168=0,\"\",VLOOKUP(B168,Etappen!$1:$65497,2,FALSE))","v":""},null,{"$f":"IF(D168=0,\"\",VLOOKUP(D168,Etappen!$1:$65497,2,FALSE))","v":""},null,{"$f":"IF(F168=0,\"\",VLOOKUP(F168,Etappen!$1:$65497,2,FALSE))","v":""},null,{"$f":"IF(H168=0,\"\",VLOOKUP(H168,Etappen!$1:$65497,2,FALSE))","v":""},null,{"$f":"IF(J168=0,\"\",VLOOKUP(J168,Etappen!$1:$65497,2,FALSE))","v":""},null,null,"A + B fehlt",null,{"$f":"IF(AND(O168=\"x\",Q168=\"x\"),\"wechsel\",IF(AND(O168=\"x\",Q168<>\"x\"),\"\",IF(AND(Q168=\"x\",O168<>\"x\"),\"M fehlt\",\"A + B fehlt\")))","v":"A + B fehlt"},null,{"$f":"IF(AND(Q168=\"x\",S168=\"x\"),\"wechsel\",IF(AND(Q168=\"x\",S168<>\"x\"),\"\",IF(AND(S168=\"x\",Q168<>\"x\"),\"M fehlt\",\"A + B fehlt\")))","v":"A + B fehlt"},null,null,null,null,null,null,null,{"$f":"IF(WEEKNUM(A168,2)<>WEEKNUM(A169,2),SUM(Y$7:Y168)-SUM(Z$6:Z167),\"\")","v":""}]
[null,null,{"$f":"IF(B169=0,\"\",VLOOKUP(B169,Etappen!$1:$65497,2,FALSE))","v":""},null,{"$f":"IF(D169=0,\"\",VLOOKUP(D169,Etappen!$1:$65497,2,FALSE))","v":""},null,{"$f":"IF(F169=0,\"\",VLOOKUP(F169,Etappen!$1:$65497,2,FALSE))","v":""},null,{"$f":"IF(H169=0,\"\",VLOOKUP(H169,Etappen!$1:$65497,2,FALSE))","v":""},null,{"$f":"IF(J169=0,\"\",VLOOKUP(J169,Etappen!$1:$65497,2,FALSE))","v":""},null,null,"A + B fehlt",null,{"$f":"IF(AND(O169=\"x\",Q169=\"x\"),\"wechsel\",IF(AND(O169=\"x\",Q169<>\"x\"),\"\",IF(AND(Q169=\"x\",O169<>\"x\"),\"M fehlt\",\"A + B fehlt\")))","v":"A + B fehlt"},null,{"$f":"IF(AND(Q169=\"x\",S169=\"x\"),\"wechsel\",IF(AND(Q169=\"x\",S169<>\"x\"),\"\",IF(AND(S169=\"x\",Q169<>\"x\"),\"M fehlt\",\"A + B fehlt\")))","v":"A + B fehlt"},null,null,null,null,null,null,null,{"$f":"IF(WEEKNUM(A169,2)<>WEEKNUM(A170,2),SUM(Y$7:Y169)-SUM(Z$6:Z168),\"\")","v":""}]
[null,null,{"$f":"IF(B170=0,\"\",VLOOKUP(B170,Etappen!$1:$65497,2,FALSE))","v":""},null,{"$f":"IF(D170=0,\"\",VLOOKUP(D170,Etappen!$1:$65497,2,FALSE))","v":""},null,{"$f":"IF(F170=0,\"\",VLOOKUP(F170,Etappen!$1:$65497,2,FALSE))","v":""},null,{"$f":"IF(H170=0,\"\",VLOOKUP(H170,Etappen!$1:$65497,2,FALSE))","v":""},null,{"$f":"IF(J170=0,\"\",VLOOKUP(J170,Etappen!$1:$65497,2,FALSE))","v":""},null,null,"A + B fehlt",null,{"$f":"IF(AND(O170=\"x\",Q170=\"x\"),\"wechsel\",IF(AND(O170=\"x\",Q170<>\"x\"),\"\",IF(AND(Q170=\"x\",O170<>\"x\"),\"M fehlt\",\"A + B fehlt\")))","v":"A + B fehlt"},null,{"$f":"IF(AND(Q170=\"x\",S170=\"x\"),\"wechsel\",IF(AND(Q170=\"x\",S170<>\"x\"),\"\",IF(AND(S170=\"x\",Q170<>\"x\"),\"M fehlt\",\"A + B fehlt\")))","v":"A + B fehlt"},null,null,null,null,null,null,null,{"$f":"IF(WEEKNUM(A170,2)<>WEEKNUM(A171,2),SUM(Y$7:Y170)-SUM(Z$6:Z169),\"\")","v":""}]
[null,null,{"$f":"IF(B171=0,\"\",VLOOKUP(B171,Etappen!$1:$65497,2,FALSE))","v":""},null,{"$f":"IF(D171=0,\"\",VLOOKUP(D171,Etappen!$1:$65497,2,FALSE))","v":""},null,{"$f":"IF(F171=0,\"\",VLOOKUP(F171,Etappen!$1:$65497,2,FALSE))","v":""},null,{"$f":"IF(H171=0,\"\",VLOOKUP(H171,Etappen!$1:$65497,2,FALSE))","v":""},null,{"$f":"IF(J171=0,\"\",VLOOKUP(J171,Etappen!$1:$65497,2,FALSE))","v":""},null,null,"A + B fehlt",null,{"$f":"IF(AND(O171=\"x\",Q171=\"x\"),\"wechsel\",IF(AND(O171=\"x\",Q171<>\"x\"),\"\",IF(AND(Q171=\"x\",O171<>\"x\"),\"M fehlt\",\"A + B fehlt\")))","v":"A + B fehlt"},null,{"$f":"IF(AND(Q171=\"x\",S171=\"x\"),\"wechsel\",IF(AND(Q171=\"x\",S171<>\"x\"),\"\",IF(AND(S171=\"x\",Q171<>\"x\"),\"M fehlt\",\"A + B fehlt\")))","v":"A + B fehlt"},null,null,null,null,null,null,null,{"$f":"IF(WEEKNUM(A171,2)<>WEEKNUM(A172,2),SUM(Y$7:Y171)-SUM(Z$6:Z170),\"\")","v":""}]
[null,null,{"$f":"IF(B172=0,\"\",VLOOKUP(B172,Etappen!$1:$65497,2,FALSE))","v":""},null,{"$f":"IF(D172=0,\"\",VLOOKUP(D172,Etappen!$1:$65497,2,FALSE))","v":""},null,{"$f":"IF(F172=0,\"\",VLOOKUP(F172,Etappen!$1:$65497,2,FALSE))","v":""},null,{"$f":"IF(H172=0,\"\",VLOOKUP(H172,Etappen!$1:$65497,2,FALSE))","v":""},null,{"$f":"IF(J172=0,\"\",VLOOKUP(J172,Etappen!$1:$65497,2,FALSE))","v":""},null,null,"A + B fehlt",null,{"$f":"IF(AND(O172=\"x\",Q172=\"x\"),\"wechsel\",IF(AND(O172=\"x\",Q172<>\"x\"),\"\",IF(AND(Q172=\"x\",O172<>\"x\"),\"M fehlt\",\"A + B fehlt\")))","v":"A + B fehlt"},null,{"$f":"IF(AND(Q172=\"x\",S172=\"x\"),\"wechsel\",IF(AND(Q172=\"x\",S172<>\"x\"),\"\",IF(AND(S172=\"x\",Q172<>\"x\"),\"M fehlt\",\"A + B fehlt\")))","v":"A + B fehlt"},null,null,null,null,null,null,null,{"$f":"IF(WEEKNUM(A172,2)<>WEEKNUM(A173,2),SUM(Y$7:Y172)-SUM(Z$6:Z171),\"\")","v":""}]
[null,null,{"$f":"IF(B173=0,\"\",VLOOKUP(B173,Etappen!$1:$65497,2,FALSE))","v":""},null,{"$f":"IF(D173=0,\"\",VLOOKUP(D173,Etappen!$1:$65497,2,FALSE))","v":""},null,{"$f":"IF(F173=0,\"\",VLOOKUP(F173,Etappen!$1:$65497,2,FALSE))","v":""},null,{"$f":"IF(H173=0,\"\",VLOOKUP(H173,Etappen!$1:$65497,2,FALSE))","v":""},null,{"$f":"IF(J173=0,\"\",VLOOKUP(J173,Etappen!$1:$65497,2,FALSE))","v":""},null,null,"A + B fehlt",null,{"$f":"IF(AND(O173=\"x\",Q173=\"x\"),\"wechsel\",IF(AND(O173=\"x\",Q173<>\"x\"),\"\",IF(AND(Q173=\"x\",O173<>\"x\"),\"M fehlt\",\"A + B fehlt\")))","v":"A + B fehlt"},null,{"$f":"IF(AND(Q173=\"x\",S173=\"x\"),\"wechsel\",IF(AND(Q173=\"x\",S173<>\"x\"),\"\",IF(AND(S173=\"x\",Q173<>\"x\"),\"M fehlt\",\"A + B fehlt\")))","v":"A + B fehlt"},null,null,null,null,null,null,null,{"$f":"IF(WEEKNUM(A173,2)<>WEEKNUM(A174,2),SUM(Y$7:Y173)-SUM(Z$6:Z172),\"\")","v":""}]
[null,null,{"$f":"IF(B174=0,\"\",VLOOKUP(B174,Etappen!$1:$65497,2,FALSE))","v":""},null,{"$f":"IF(D174=0,\"\",VLOOKUP(D174,Etappen!$1:$65497,2,FALSE))","v":""},null,{"$f":"IF(F174=0,\"\",VLOOKUP(F174,Etappen!$1:$65497,2,FALSE))","v":""},null,{"$f":"IF(H174=0,\"\",VLOOKUP(H174,Etappen!$1:$65497,2,FALSE))","v":""},null,{"$f":"IF(J174=0,\"\",VLOOKUP(J174,Etappen!$1:$65497,2,FALSE))","v":""},null,null,"A + B fehlt",null,{"$f":"IF(AND(O174=\"x\",Q174=\"x\"),\"wechsel\",IF(AND(O174=\"x\",Q174<>\"x\"),\"\",IF(AND(Q174=\"x\",O174<>\"x\"),\"M fehlt\",\"A + B fehlt\")))","v":"A + B fehlt"},null,{"$f":"IF(AND(Q174=\"x\",S174=\"x\"),\"wechsel\",IF(AND(Q174=\"x\",S174<>\"x\"),\"\",IF(AND(S174=\"x\",Q174<>\"x\"),\"M fehlt\",\"A + B fehlt\")))","v":"A + B fehlt"},null,null,null,null,null,null,null,{"$f":"IF(WEEKNUM(A174,2)<>WEEKNUM(A175,2),SUM(Y$7:Y174)-SUM(Z$6:Z173),\"\")","v":""}]
[null,null,{"$f":"IF(B175=0,\"\",VLOOKUP(B175,Etappen!$1:$65497,2,FALSE))","v":""},null,{"$f":"IF(D175=0,\"\",VLOOKUP(D175,Etappen!$1:$65497,2,FALSE))","v":""},null,{"$f":"IF(F175=0,\"\",VLOOKUP(F175,Etappen!$1:$65497,2,FALSE))","v":""},null,{"$f":"IF(H175=0,\"\",VLOOKUP(H175,Etappen!$1:$65497,2,FALSE))","v":""},null,{"$f":"IF(J175=0,\"\",VLOOKUP(J175,Etappen!$1:$65497,2,FALSE))","v":""},null,null,"A + B fehlt",null,{"$f":"IF(AND(O175=\"x\",Q175=\"x\"),\"wechsel\",IF(AND(O175=\"x\",Q175<>\"x\"),\"\",IF(AND(Q175=\"x\",O175<>\"x\"),\"M fehlt\",\"A + B fehlt\")))","v":"A + B fehlt"},null,{"$f":"IF(AND(Q175=\"x\",S175=\"x\"),\"wechsel\",IF(AND(Q175=\"x\",S175<>\"x\"),\"\",IF(AND(S175=\"x\",Q175<>\"x\"),\"M fehlt\",\"A + B fehlt\")))","v":"A + B fehlt"},null,null,null,null,null,null,null,{"$f":"IF(WEEKNUM(A175,2)<>WEEKNUM(A176,2),SUM(Y$7:Y175)-SUM(Z$6:Z174),\"\")","v":""}]
[null,null,{"$f":"IF(B176=0,\"\",VLOOKUP(B176,Etappen!$1:$65497,2,FALSE))","v":""},null,{"$f":"IF(D176=0,\"\",VLOOKUP(D176,Etappen!$1:$65497,2,FALSE))","v":""},null,{"$f":"IF(F176=0,\"\",VLOOKUP(F176,Etappen!$1:$65497,2,FALSE))","v":""},null,{"$f":"IF(H176=0,\"\",VLOOKUP(H176,Etappen!$1:$65497,2,FALSE))","v":""},null,{"$f":"IF(J176=0,\"\",VLOOKUP(J176,Etappen!$1:$65497,2,FALSE))","v":""},null,null,"A + B fehlt",null,{"$f":"IF(AND(O176=\"x\",Q176=\"x\"),\"wechsel\",IF(AND(O176=\"x\",Q176<>\"x\"),\"\",IF(AND(Q176=\"x\",O176<>\"x\"),\"M fehlt\",\"A + B fehlt\")))","v":"A + B fehlt"},null,{"$f":"IF(AND(Q176=\"x\",S176=\"x\"),\"wechsel\",IF(AND(Q176=\"x\",S176<>\"x\"),\"\",IF(AND(S176=\"x\",Q176<>\"x\"),\"M fehlt\",\"A + B fehlt\")))","v":"A + B fehlt"},null,null,null,null,null,null,null,{"$f":"IF(WEEKNUM(A176,2)<>WEEKNUM(A177,2),SUM(Y$7:Y176)-SUM(Z$6:Z175),\"\")","v":""}]
[null,null,{"$f":"IF(B177=0,\"\",VLOOKUP(B177,Etappen!$1:$65497,2,FALSE))","v":""},null,{"$f":"IF(D177=0,\"\",VLOOKUP(D177,Etappen!$1:$65497,2,FALSE))","v":""},null,{"$f":"IF(F177=0,\"\",VLOOKUP(F177,Etappen!$1:$65497,2,FALSE))","v":""},null,{"$f":"IF(H177=0,\"\",VLOOKUP(H177,Etappen!$1:$65497,2,FALSE))","v":""},null,{"$f":"IF(J177=0,\"\",VLOOKUP(J177,Etappen!$1:$65497,2,FALSE))","v":""},null,null,"A + B fehlt",null,{"$f":"IF(AND(O177=\"x\",Q177=\"x\"),\"wechsel\",IF(AND(O177=\"x\",Q177<>\"x\"),\"\",IF(AND(Q177=\"x\",O177<>\"x\"),\"M fehlt\",\"A + B fehlt\")))","v":"A + B fehlt"},null,{"$f":"IF(AND(Q177=\"x\",S177=\"x\"),\"wechsel\",IF(AND(Q177=\"x\",S177<>\"x\"),\"\",IF(AND(S177=\"x\",Q177<>\"x\"),\"M fehlt\",\"A + B fehlt\")))","v":"A + B fehlt"},null,null,null,null,null,null,null,{"$f":"IF(WEEKNUM(A177,2)<>WEEKNUM(A178,2),SUM(Y$7:Y177)-SUM(Z$6:Z176),\"\")","v":""}]
[null,null,{"$f":"IF(B178=0,\"\",VLOOKUP(B178,Etappen!$1:$65497,2,FALSE))","v":""},null,{"$f":"IF(D178=0,\"\",VLOOKUP(D178,Etappen!$1:$65497,2,FALSE))","v":""},null,{"$f":"IF(F178=0,\"\",VLOOKUP(F178,Etappen!$1:$65497,2,FALSE))","v":""},null,{"$f":"IF(H178=0,\"\",VLOOKUP(H178,Etappen!$1:$65497,2,FALSE))","v":""},null,{"$f":"IF(J178=0,\"\",VLOOKUP(J178,Etappen!$1:$65497,2,FALSE))","v":""},null,null,"A + B fehlt",null,{"$f":"IF(AND(O178=\"x\",Q178=\"x\"),\"wechsel\",IF(AND(O178=\"x\",Q178<>\"x\"),\"\",IF(AND(Q178=\"x\",O178<>\"x\"),\"M fehlt\",\"A + B fehlt\")))","v":"A + B fehlt"},null,{"$f":"IF(AND(Q178=\"x\",S178=\"x\"),\"wechsel\",IF(AND(Q178=\"x\",S178<>\"x\"),\"\",IF(AND(S178=\"x\",Q178<>\"x\"),\"M fehlt\",\"A + B fehlt\")))","v":"A + B fehlt"},null,null,null,null,null,null,null,{"$f":"IF(WEEKNUM(A178,2)<>WEEKNUM(A179,2),SUM(Y$7:Y178)-SUM(Z$6:Z177),\"\")","v":""}]
[null,null,{"$f":"IF(B179=0,\"\",VLOOKUP(B179,Etappen!$1:$65497,2,FALSE))","v":""},null,{"$f":"IF(D179=0,\"\",VLOOKUP(D179,Etappen!$1:$65497,2,FALSE))","v":""},null,{"$f":"IF(F179=0,\"\",VLOOKUP(F179,Etappen!$1:$65497,2,FALSE))","v":""},null,{"$f":"IF(H179=0,\"\",VLOOKUP(H179,Etappen!$1:$65497,2,FALSE))","v":""},null,{"$f":"IF(J179=0,\"\",VLOOKUP(J179,Etappen!$1:$65497,2,FALSE))","v":""},null,null,"A + B fehlt",null,{"$f":"IF(AND(O179=\"x\",Q179=\"x\"),\"wechsel\",IF(AND(O179=\"x\",Q179<>\"x\"),\"\",IF(AND(Q179=\"x\",O179<>\"x\"),\"M fehlt\",\"A + B fehlt\")))","v":"A + B fehlt"},null,{"$f":"IF(AND(Q179=\"x\",S179=\"x\"),\"wechsel\",IF(AND(Q179=\"x\",S179<>\"x\"),\"\",IF(AND(S179=\"x\",Q179<>\"x\"),\"M fehlt\",\"A + B fehlt\")))","v":"A + B fehlt"},null,null,null,null,null,null,null,{"$f":"IF(WEEKNUM(A179,2)<>WEEKNUM(A180,2),SUM(Y$7:Y179)-SUM(Z$6:Z178),\"\")","v":""}]
[null,null,{"$f":"IF(B180=0,\"\",VLOOKUP(B180,Etappen!$1:$65497,2,FALSE))","v":""},null,{"$f":"IF(D180=0,\"\",VLOOKUP(D180,Etappen!$1:$65497,2,FALSE))","v":""},null,{"$f":"IF(F180=0,\"\",VLOOKUP(F180,Etappen!$1:$65497,2,FALSE))","v":""},null,{"$f":"IF(H180=0,\"\",VLOOKUP(H180,Etappen!$1:$65497,2,FALSE))","v":""},null,{"$f":"IF(J180=0,\"\",VLOOKUP(J180,Etappen!$1:$65497,2,FALSE))","v":""},null,null,"A + B fehlt",null,{"$f":"IF(AND(O180=\"x\",Q180=\"x\"),\"wechsel\",IF(AND(O180=\"x\",Q180<>\"x\"),\"\",IF(AND(Q180=\"x\",O180<>\"x\"),\"M fehlt\",\"A + B fehlt\")))","v":"A + B fehlt"},null,{"$f":"IF(AND(Q180=\"x\",S180=\"x\"),\"wechsel\",IF(AND(Q180=\"x\",S180<>\"x\"),\"\",IF(AND(S180=\"x\",Q180<>\"x\"),\"M fehlt\",\"A + B fehlt\")))","v":"A + B fehlt"},null,null,null,null,null,null,null,{"$f":"IF(WEEKNUM(A180,2)<>WEEKNUM(A181,2),SUM(Y$7:Y180)-SUM(Z$6:Z179),\"\")","v":""}]
[null,null,{"$f":"IF(B181=0,\"\",VLOOKUP(B181,Etappen!$1:$65497,2,FALSE))","v":""},null,{"$f":"IF(D181=0,\"\",VLOOKUP(D181,Etappen!$1:$65497,2,FALSE))","v":""},null,{"$f":"IF(F181=0,\"\",VLOOKUP(F181,Etappen!$1:$65497,2,FALSE))","v":""},null,{"$f":"IF(H181=0,\"\",VLOOKUP(H181,Etappen!$1:$65497,2,FALSE))","v":""},null,{"$f":"IF(J181=0,\"\",VLOOKUP(J181,Etappen!$1:$65497,2,FALSE))","v":""},null,null,"A + B fehlt",null,{"$f":"IF(AND(O181=\"x\",Q181=\"x\"),\"wechsel\",IF(AND(O181=\"x\",Q181<>\"x\"),\"\",IF(AND(Q181=\"x\",O181<>\"x\"),\"M fehlt\",\"A + B fehlt\")))","v":"A + B fehlt"},null,{"$f":"IF(AND(Q181=\"x\",S181=\"x\"),\"wechsel\",IF(AND(Q181=\"x\",S181<>\"x\"),\"\",IF(AND(S181=\"x\",Q181<>\"x\"),\"M fehlt\",\"A + B fehlt\")))","v":"A + B fehlt"},null,null,null,null,null,null,null,{"$f":"IF(WEEKNUM(A181,2)<>WEEKNUM(A182,2),SUM(Y$7:Y181)-SUM(Z$6:Z180),\"\")","v":""}]
[null,null,{"$f":"IF(B182=0,\"\",VLOOKUP(B182,Etappen!$1:$65497,2,FALSE))","v":""},null,{"$f":"IF(D182=0,\"\",VLOOKUP(D182,Etappen!$1:$65497,2,FALSE))","v":""},null,{"$f":"IF(F182=0,\"\",VLOOKUP(F182,Etappen!$1:$65497,2,FALSE))","v":""},null,{"$f":"IF(H182=0,\"\",VLOOKUP(H182,Etappen!$1:$65497,2,FALSE))","v":""},null,{"$f":"IF(J182=0,\"\",VLOOKUP(J182,Etappen!$1:$65497,2,FALSE))","v":""},null,null,"A + B fehlt",null,{"$f":"IF(AND(O182=\"x\",Q182=\"x\"),\"wechsel\",IF(AND(O182=\"x\",Q182<>\"x\"),\"\",IF(AND(Q182=\"x\",O182<>\"x\"),\"M fehlt\",\"A + B fehlt\")))","v":"A + B fehlt"},null,{"$f":"IF(AND(Q182=\"x\",S182=\"x\"),\"wechsel\",IF(AND(Q182=\"x\",S182<>\"x\"),\"\",IF(AND(S182=\"x\",Q182<>\"x\"),\"M fehlt\",\"A + B fehlt\")))","v":"A + B fehlt"},null,null,null,null,null,null,null,{"$f":"IF(WEEKNUM(A182,2)<>WEEKNUM(A183,2),SUM(Y$7:Y182)-SUM(Z$6:Z181),\"\")","v":""}]
[null,null,{"$f":"IF(B183=0,\"\",VLOOKUP(B183,Etappen!$1:$65497,2,FALSE))","v":""},null,{"$f":"IF(D183=0,\"\",VLOOKUP(D183,Etappen!$1:$65497,2,FALSE))","v":""},null,{"$f":"IF(F183=0,\"\",VLOOKUP(F183,Etappen!$1:$65497,2,FALSE))","v":""},null,{"$f":"IF(H183=0,\"\",VLOOKUP(H183,Etappen!$1:$65497,2,FALSE))","v":""},null,{"$f":"IF(J183=0,\"\",VLOOKUP(J183,Etappen!$1:$65497,2,FALSE))","v":""},null,null,"A + B fehlt",null,{"$f":"IF(AND(O183=\"x\",Q183=\"x\"),\"wechsel\",IF(AND(O183=\"x\",Q183<>\"x\"),\"\",IF(AND(Q183=\"x\",O183<>\"x\"),\"M fehlt\",\"A + B fehlt\")))","v":"A + B fehlt"},null,{"$f":"IF(AND(Q183=\"x\",S183=\"x\"),\"wechsel\",IF(AND(Q183=\"x\",S183<>\"x\"),\"\",IF(AND(S183=\"x\",Q183<>\"x\"),\"M fehlt\",\"A + B fehlt\")))","v":"A + B fehlt"},null,null,null,null,null,null,null,{"$f":"IF(WEEKNUM(A183,2)<>WEEKNUM(A184,2),SUM(Y$7:Y183)-SUM(Z$6:Z182),\"\")","v":""}]
[null,null,{"$f":"IF(B184=0,\"\",VLOOKUP(B184,Etappen!$1:$65497,2,FALSE))","v":""},null,{"$f":"IF(D184=0,\"\",VLOOKUP(D184,Etappen!$1:$65497,2,FALSE))","v":""},null,{"$f":"IF(F184=0,\"\",VLOOKUP(F184,Etappen!$1:$65497,2,FALSE))","v":""},null,{"$f":"IF(H184=0,\"\",VLOOKUP(H184,Etappen!$1:$65497,2,FALSE))","v":""},null,{"$f":"IF(J184=0,\"\",VLOOKUP(J184,Etappen!$1:$65497,2,FALSE))","v":""},null,null,"A + B fehlt",null,{"$f":"IF(AND(O184=\"x\",Q184=\"x\"),\"wechsel\",IF(AND(O184=\"x\",Q184<>\"x\"),\"\",IF(AND(Q184=\"x\",O184<>\"x\"),\"M fehlt\",\"A + B fehlt\")))","v":"A + B fehlt"},null,{"$f":"IF(AND(Q184=\"x\",S184=\"x\"),\"wechsel\",IF(AND(Q184=\"x\",S184<>\"x\"),\"\",IF(AND(S184=\"x\",Q184<>\"x\"),\"M fehlt\",\"A + B fehlt\")))","v":"A + B fehlt"},null,null,null,null,null,null,null,{"$f":"IF(WEEKNUM(A184,2)<>WEEKNUM(A185,2),SUM(Y$7:Y184)-SUM(Z$6:Z183),\"\")","v":""}]
[null,null,{"$f":"IF(B185=0,\"\",VLOOKUP(B185,Etappen!$1:$65497,2,FALSE))","v":""},null,{"$f":"IF(D185=0,\"\",VLOOKUP(D185,Etappen!$1:$65497,2,FALSE))","v":""},null,{"$f":"IF(F185=0,\"\",VLOOKUP(F185,Etappen!$1:$65497,2,FALSE))","v":""},null,{"$f":"IF(H185=0,\"\",VLOOKUP(H185,Etappen!$1:$65497,2,FALSE))","v":""},null,{"$f":"IF(J185=0,\"\",VLOOKUP(J185,Etappen!$1:$65497,2,FALSE))","v":""},null,null,"A + B fehlt",null,{"$f":"IF(AND(O185=\"x\",Q185=\"x\"),\"wechsel\",IF(AND(O185=\"x\",Q185<>\"x\"),\"\",IF(AND(Q185=\"x\",O185<>\"x\"),\"M fehlt\",\"A + B fehlt\")))","v":"A + B fehlt"},null,{"$f":"IF(AND(Q185=\"x\",S185=\"x\"),\"wechsel\",IF(AND(Q185=\"x\",S185<>\"x\"),\"\",IF(AND(S185=\"x\",Q185<>\"x\"),\"M fehlt\",\"A + B fehlt\")))","v":"A + B fehlt"},null,null,null,null,null,null,null,{"$f":"IF(WEEKNUM(A185,2)<>WEEKNUM(A186,2),SUM(Y$7:Y185)-SUM(Z$6:Z184),\"\")","v":""}]
[null,null,{"$f":"IF(B186=0,\"\",VLOOKUP(B186,Etappen!$1:$65497,2,FALSE))","v":""},null,{"$f":"IF(D186=0,\"\",VLOOKUP(D186,Etappen!$1:$65497,2,FALSE))","v":""},null,{"$f":"IF(F186=0,\"\",VLOOKUP(F186,Etappen!$1:$65497,2,FALSE))","v":""},null,{"$f":"IF(H186=0,\"\",VLOOKUP(H186,Etappen!$1:$65497,2,FALSE))","v":""},null,{"$f":"IF(J186=0,\"\",VLOOKUP(J186,Etappen!$1:$65497,2,FALSE))","v":""},null,null,"A + B fehlt",null,{"$f":"IF(AND(O186=\"x\",Q186=\"x\"),\"wechsel\",IF(AND(O186=\"x\",Q186<>\"x\"),\"\",IF(AND(Q186=\"x\",O186<>\"x\"),\"M fehlt\",\"A + B fehlt\")))","v":"A + B fehlt"},null,{"$f":"IF(AND(Q186=\"x\",S186=\"x\"),\"wechsel\",IF(AND(Q186=\"x\",S186<>\"x\"),\"\",IF(AND(S186=\"x\",Q186<>\"x\"),\"M fehlt\",\"A + B fehlt\")))","v":"A + B fehlt"},null,null,null,null,null,null,null,{"$f":"IF(WEEKNUM(A186,2)<>WEEKNUM(A187,2),SUM(Y$7:Y186)-SUM(Z$6:Z185),\"\")","v":""}]
[null,null,{"$f":"IF(B187=0,\"\",VLOOKUP(B187,Etappen!$1:$65497,2,FALSE))","v":""},null,{"$f":"IF(D187=0,\"\",VLOOKUP(D187,Etappen!$1:$65497,2,FALSE))","v":""},null,{"$f":"IF(F187=0,\"\",VLOOKUP(F187,Etappen!$1:$65497,2,FALSE))","v":""},null,{"$f":"IF(H187=0,\"\",VLOOKUP(H187,Etappen!$1:$65497,2,FALSE))","v":""},null,{"$f":"IF(J187=0,\"\",VLOOKUP(J187,Etappen!$1:$65497,2,FALSE))","v":""},null,null,"A + B fehlt",null,{"$f":"IF(AND(O187=\"x\",Q187=\"x\"),\"wechsel\",IF(AND(O187=\"x\",Q187<>\"x\"),\"\",IF(AND(Q187=\"x\",O187<>\"x\"),\"M fehlt\",\"A + B fehlt\")))","v":"A + B fehlt"},null,{"$f":"IF(AND(Q187=\"x\",S187=\"x\"),\"wechsel\",IF(AND(Q187=\"x\",S187<>\"x\"),\"\",IF(AND(S187=\"x\",Q187<>\"x\"),\"M fehlt\",\"A + B fehlt\")))","v":"A + B fehlt"},null,null,null,null,null,null,null,{"$f":"IF(WEEKNUM(A187,2)<>WEEKNUM(A188,2),SUM(Y$7:Y187)-SUM(Z$6:Z186),\"\")","v":""}]
[null,null,{"$f":"IF(B188=0,\"\",VLOOKUP(B188,Etappen!$1:$65497,2,FALSE))","v":""},null,{"$f":"IF(D188=0,\"\",VLOOKUP(D188,Etappen!$1:$65497,2,FALSE))","v":""},null,{"$f":"IF(F188=0,\"\",VLOOKUP(F188,Etappen!$1:$65497,2,FALSE))","v":""},null,{"$f":"IF(H188=0,\"\",VLOOKUP(H188,Etappen!$1:$65497,2,FALSE))","v":""},null,{"$f":"IF(J188=0,\"\",VLOOKUP(J188,Etappen!$1:$65497,2,FALSE))","v":""},null,null,"A + B fehlt",null,{"$f":"IF(AND(O188=\"x\",Q188=\"x\"),\"wechsel\",IF(AND(O188=\"x\",Q188<>\"x\"),\"\",IF(AND(Q188=\"x\",O188<>\"x\"),\"M fehlt\",\"A + B fehlt\")))","v":"A + B fehlt"},null,{"$f":"IF(AND(Q188=\"x\",S188=\"x\"),\"wechsel\",IF(AND(Q188=\"x\",S188<>\"x\"),\"\",IF(AND(S188=\"x\",Q188<>\"x\"),\"M fehlt\",\"A + B fehlt\")))","v":"A + B fehlt"},null,null,null,null,null,null,null,{"$f":"IF(WEEKNUM(A188,2)<>WEEKNUM(A189,2),SUM(Y$7:Y188)-SUM(Z$6:Z187),\"\")","v":""}]
[null,null,{"$f":"IF(B189=0,\"\",VLOOKUP(B189,Etappen!$1:$65497,2,FALSE))","v":""},null,{"$f":"IF(D189=0,\"\",VLOOKUP(D189,Etappen!$1:$65497,2,FALSE))","v":""},null,{"$f":"IF(F189=0,\"\",VLOOKUP(F189,Etappen!$1:$65497,2,FALSE))","v":""},null,{"$f":"IF(H189=0,\"\",VLOOKUP(H189,Etappen!$1:$65497,2,FALSE))","v":""},null,{"$f":"IF(J189=0,\"\",VLOOKUP(J189,Etappen!$1:$65497,2,FALSE))","v":""},null,null,"A + B fehlt",null,{"$f":"IF(AND(O189=\"x\",Q189=\"x\"),\"wechsel\",IF(AND(O189=\"x\",Q189<>\"x\"),\"\",IF(AND(Q189=\"x\",O189<>\"x\"),\"M fehlt\",\"A + B fehlt\")))","v":"A + B fehlt"},null,{"$f":"IF(AND(Q189=\"x\",S189=\"x\"),\"wechsel\",IF(AND(Q189=\"x\",S189<>\"x\"),\"\",IF(AND(S189=\"x\",Q189<>\"x\"),\"M fehlt\",\"A + B fehlt\")))","v":"A + B fehlt"},null,null,null,null,null,null,null,{"$f":"IF(WEEKNUM(A189,2)<>WEEKNUM(A190,2),SUM(Y$7:Y189)-SUM(Z$6:Z188),\"\")","v":""}]
[null,null,{"$f":"IF(B190=0,\"\",VLOOKUP(B190,Etappen!$1:$65497,2,FALSE))","v":""},null,{"$f":"IF(D190=0,\"\",VLOOKUP(D190,Etappen!$1:$65497,2,FALSE))","v":""},null,{"$f":"IF(F190=0,\"\",VLOOKUP(F190,Etappen!$1:$65497,2,FALSE))","v":""},null,{"$f":"IF(H190=0,\"\",VLOOKUP(H190,Etappen!$1:$65497,2,FALSE))","v":""},null,{"$f":"IF(J190=0,\"\",VLOOKUP(J190,Etappen!$1:$65497,2,FALSE))","v":""},null,null,"A + B fehlt",null,{"$f":"IF(AND(O190=\"x\",Q190=\"x\"),\"wechsel\",IF(AND(O190=\"x\",Q190<>\"x\"),\"\",IF(AND(Q190=\"x\",O190<>\"x\"),\"M fehlt\",\"A + B fehlt\")))","v":"A + B fehlt"},null,{"$f":"IF(AND(Q190=\"x\",S190=\"x\"),\"wechsel\",IF(AND(Q190=\"x\",S190<>\"x\"),\"\",IF(AND(S190=\"x\",Q190<>\"x\"),\"M fehlt\",\"A + B fehlt\")))","v":"A + B fehlt"},null,null,null,null,null,null,null,{"$f":"IF(WEEKNUM(A190,2)<>WEEKNUM(A191,2),SUM(Y$7:Y190)-SUM(Z$6:Z189),\"\")","v":""}]
[null,null,{"$f":"IF(B191=0,\"\",VLOOKUP(B191,Etappen!$1:$65497,2,FALSE))","v":""},null,{"$f":"IF(D191=0,\"\",VLOOKUP(D191,Etappen!$1:$65497,2,FALSE))","v":""},null,{"$f":"IF(F191=0,\"\",VLOOKUP(F191,Etappen!$1:$65497,2,FALSE))","v":""},null,{"$f":"IF(H191=0,\"\",VLOOKUP(H191,Etappen!$1:$65497,2,FALSE))","v":""},null,{"$f":"IF(J191=0,\"\",VLOOKUP(J191,Etappen!$1:$65497,2,FALSE))","v":""},null,null,"A + B fehlt",null,{"$f":"IF(AND(O191=\"x\",Q191=\"x\"),\"wechsel\",IF(AND(O191=\"x\",Q191<>\"x\"),\"\",IF(AND(Q191=\"x\",O191<>\"x\"),\"M fehlt\",\"A + B fehlt\")))","v":"A + B fehlt"},null,{"$f":"IF(AND(Q191=\"x\",S191=\"x\"),\"wechsel\",IF(AND(Q191=\"x\",S191<>\"x\"),\"\",IF(AND(S191=\"x\",Q191<>\"x\"),\"M fehlt\",\"A + B fehlt\")))","v":"A + B fehlt"},null,null,null,null,null,null,null,{"$f":"IF(WEEKNUM(A191,2)<>WEEKNUM(A192,2),SUM(Y$7:Y191)-SUM(Z$6:Z190),\"\")","v":""}]
[null,null,{"$f":"IF(B192=0,\"\",VLOOKUP(B192,Etappen!$1:$65497,2,FALSE))","v":""},null,{"$f":"IF(D192=0,\"\",VLOOKUP(D192,Etappen!$1:$65497,2,FALSE))","v":""},null,{"$f":"IF(F192=0,\"\",VLOOKUP(F192,Etappen!$1:$65497,2,FALSE))","v":""},null,{"$f":"IF(H192=0,\"\",VLOOKUP(H192,Etappen!$1:$65497,2,FALSE))","v":""},null,{"$f":"IF(J192=0,\"\",VLOOKUP(J192,Etappen!$1:$65497,2,FALSE))","v":""},null,null,"A + B fehlt",null,{"$f":"IF(AND(O192=\"x\",Q192=\"x\"),\"wechsel\",IF(AND(O192=\"x\",Q192<>\"x\"),\"\",IF(AND(Q192=\"x\",O192<>\"x\"),\"M fehlt\",\"A + B fehlt\")))","v":"A + B fehlt"},null,{"$f":"IF(AND(Q192=\"x\",S192=\"x\"),\"wechsel\",IF(AND(Q192=\"x\",S192<>\"x\"),\"\",IF(AND(S192=\"x\",Q192<>\"x\"),\"M fehlt\",\"A + B fehlt\")))","v":"A + B fehlt"},null,null,null,null,null,null,null,{"$f":"IF(WEEKNUM(A192,2)<>WEEKNUM(A193,2),SUM(Y$7:Y192)-SUM(Z$6:Z191),\"\")","v":""}]
[null,null,{"$f":"IF(B193=0,\"\",VLOOKUP(B193,Etappen!$1:$65497,2,FALSE))","v":""},null,{"$f":"IF(D193=0,\"\",VLOOKUP(D193,Etappen!$1:$65497,2,FALSE))","v":""},null,{"$f":"IF(F193=0,\"\",VLOOKUP(F193,Etappen!$1:$65497,2,FALSE))","v":""},null,{"$f":"IF(H193=0,\"\",VLOOKUP(H193,Etappen!$1:$65497,2,FALSE))","v":""},null,{"$f":"IF(J193=0,\"\",VLOOKUP(J193,Etappen!$1:$65497,2,FALSE))","v":""},null,null,"A + B fehlt",null,{"$f":"IF(AND(O193=\"x\",Q193=\"x\"),\"wechsel\",IF(AND(O193=\"x\",Q193<>\"x\"),\"\",IF(AND(Q193=\"x\",O193<>\"x\"),\"M fehlt\",\"A + B fehlt\")))","v":"A + B fehlt"},null,{"$f":"IF(AND(Q193=\"x\",S193=\"x\"),\"wechsel\",IF(AND(Q193=\"x\",S193<>\"x\"),\"\",IF(AND(S193=\"x\",Q193<>\"x\"),\"M fehlt\",\"A + B fehlt\")))","v":"A + B fehlt"},null,null,null,null,null,null,null,{"$f":"IF(WEEKNUM(A193,2)<>WEEKNUM(A194,2),SUM(Y$7:Y193)-SUM(Z$6:Z192),\"\")","v":""}]
[null,null,{"$f":"IF(B194=0,\"\",VLOOKUP(B194,Etappen!$1:$65497,2,FALSE))","v":""},null,{"$f":"IF(D194=0,\"\",VLOOKUP(D194,Etappen!$1:$65497,2,FALSE))","v":""},null,{"$f":"IF(F194=0,\"\",VLOOKUP(F194,Etappen!$1:$65497,2,FALSE))","v":""},null,{"$f":"IF(H194=0,\"\",VLOOKUP(H194,Etappen!$1:$65497,2,FALSE))","v":""},null,{"$f":"IF(J194=0,\"\",VLOOKUP(J194,Etappen!$1:$65497,2,FALSE))","v":""},null,null,"A + B fehlt",null,{"$f":"IF(AND(O194=\"x\",Q194=\"x\"),\"wechsel\",IF(AND(O194=\"x\",Q194<>\"x\"),\"\",IF(AND(Q194=\"x\",O194<>\"x\"),\"M fehlt\",\"A + B fehlt\")))","v":"A + B fehlt"},null,{"$f":"IF(AND(Q194=\"x\",S194=\"x\"),\"wechsel\",IF(AND(Q194=\"x\",S194<>\"x\"),\"\",IF(AND(S194=\"x\",Q194<>\"x\"),\"M fehlt\",\"A + B fehlt\")))","v":"A + B fehlt"},null,null,null,null,null,null,null,{"$f":"IF(WEEKNUM(A194,2)<>WEEKNUM(A195,2),SUM(Y$7:Y194)-SUM(Z$6:Z193),\"\")","v":""}]
[null,null,{"$f":"IF(B195=0,\"\",VLOOKUP(B195,Etappen!$1:$65497,2,FALSE))","v":""},null,{"$f":"IF(D195=0,\"\",VLOOKUP(D195,Etappen!$1:$65497,2,FALSE))","v":""},null,{"$f":"IF(F195=0,\"\",VLOOKUP(F195,Etappen!$1:$65497,2,FALSE))","v":""},null,{"$f":"IF(H195=0,\"\",VLOOKUP(H195,Etappen!$1:$65497,2,FALSE))","v":""},null,{"$f":"IF(J195=0,\"\",VLOOKUP(J195,Etappen!$1:$65497,2,FALSE))","v":""},null,null,{"$f":"IF(AND(M195=\"x\",O195=\"x\"),\"wechsel\",IF(AND(M195=\"x\",O195<>\"x\"),\"\",IF(AND(O195=\"x\",M195<>\"x\"),\"M fehlt\",\"A + B fehlt\")))","v":"A + B fehlt"},null,{"$f":"IF(AND(O195=\"x\",Q195=\"x\"),\"wechsel\",IF(AND(O195=\"x\",Q195<>\"x\"),\"\",IF(AND(Q195=\"x\",O195<>\"x\"),\"M fehlt\",\"A + B fehlt\")))","v":"A + B fehlt"},null,{"$f":"IF(AND(Q195=\"x\",S195=\"x\"),\"wechsel\",IF(AND(Q195=\"x\",S195<>\"x\"),\"\",IF(AND(S195=\"x\",Q195<>\"x\"),\"M fehlt\",\"A + B fehlt\")))","v":"A + B fehlt"},null,null,null,null,null,null,null,{"$f":"IF(WEEKNUM(A195,2)<>WEEKNUM(A196,2),SUM(Y$7:Y195)-SUM(Z$6:Z194),\"\")","v":""}]
[null,null,{"$f":"IF(B196=0,\"\",VLOOKUP(B196,Etappen!$1:$65497,2,FALSE))","v":""},null,{"$f":"IF(D196=0,\"\",VLOOKUP(D196,Etappen!$1:$65497,2,FALSE))","v":""},null,{"$f":"IF(F196=0,\"\",VLOOKUP(F196,Etappen!$1:$65497,2,FALSE))","v":""},null,{"$f":"IF(H196=0,\"\",VLOOKUP(H196,Etappen!$1:$65497,2,FALSE))","v":""},null,{"$f":"IF(J196=0,\"\",VLOOKUP(J196,Etappen!$1:$65497,2,FALSE))","v":""},null,null,"A + B fehlt",null,{"$f":"IF(AND(O196=\"x\",Q196=\"x\"),\"wechsel\",IF(AND(O196=\"x\",Q196<>\"x\"),\"\",IF(AND(Q196=\"x\",O196<>\"x\"),\"M fehlt\",\"A + B fehlt\")))","v":"A + B fehlt"},null,{"$f":"IF(AND(Q196=\"x\",S196=\"x\"),\"wechsel\",IF(AND(Q196=\"x\",S196<>\"x\"),\"\",IF(AND(S196=\"x\",Q196<>\"x\"),\"M fehlt\",\"A + B fehlt\")))","v":"A + B fehlt"},null,null,null,null,null,null,null,{"$f":"IF(WEEKNUM(A196,2)<>WEEKNUM(A197,2),SUM(Y$7:Y196)-SUM(Z$6:Z195),\"\")","v":""}]
[null,null,{"$f":"IF(B197=0,\"\",VLOOKUP(B197,Etappen!$1:$65497,2,FALSE))","v":""},null,{"$f":"IF(D197=0,\"\",VLOOKUP(D197,Etappen!$1:$65497,2,FALSE))","v":""},null,{"$f":"IF(F197=0,\"\",VLOOKUP(F197,Etappen!$1:$65497,2,FALSE))","v":""},null,{"$f":"IF(H197=0,\"\",VLOOKUP(H197,Etappen!$1:$65497,2,FALSE))","v":""},null,{"$f":"IF(J197=0,\"\",VLOOKUP(J197,Etappen!$1:$65497,2,FALSE))","v":""},null,null,"A + B fehlt",null,{"$f":"IF(AND(O197=\"x\",Q197=\"x\"),\"wechsel\",IF(AND(O197=\"x\",Q197<>\"x\"),\"\",IF(AND(Q197=\"x\",O197<>\"x\"),\"M fehlt\",\"A + B fehlt\")))","v":"A + B fehlt"},null,{"$f":"IF(AND(Q197=\"x\",S197=\"x\"),\"wechsel\",IF(AND(Q197=\"x\",S197<>\"x\"),\"\",IF(AND(S197=\"x\",Q197<>\"x\"),\"M fehlt\",\"A + B fehlt\")))","v":"A + B fehlt"},null,null,null,null,null,null,null,{"$f":"IF(WEEKNUM(A197,2)<>WEEKNUM(A198,2),SUM(Y$7:Y197)-SUM(Z$6:Z196),\"\")","v":""}]
[null,null,{"$f":"IF(B198=0,\"\",VLOOKUP(B198,Etappen!$1:$65497,2,FALSE))","v":""},null,{"$f":"IF(D198=0,\"\",VLOOKUP(D198,Etappen!$1:$65497,2,FALSE))","v":""},null,{"$f":"IF(F198=0,\"\",VLOOKUP(F198,Etappen!$1:$65497,2,FALSE))","v":""},null,{"$f":"IF(H198=0,\"\",VLOOKUP(H198,Etappen!$1:$65497,2,FALSE))","v":""},null,{"$f":"IF(J198=0,\"\",VLOOKUP(J198,Etappen!$1:$65497,2,FALSE))","v":""},null,null,"A + B fehlt",null,{"$f":"IF(AND(O198=\"x\",Q198=\"x\"),\"wechsel\",IF(AND(O198=\"x\",Q198<>\"x\"),\"\",IF(AND(Q198=\"x\",O198<>\"x\"),\"M fehlt\",\"A + B fehlt\")))","v":"A + B fehlt"},null,{"$f":"IF(AND(Q198=\"x\",S198=\"x\"),\"wechsel\",IF(AND(Q198=\"x\",S198<>\"x\"),\"\",IF(AND(S198=\"x\",Q198<>\"x\"),\"M fehlt\",\"A + B fehlt\")))","v":"A + B fehlt"},null,null,null,null,null,null,null,{"$f":"IF(WEEKNUM(A198,2)<>WEEKNUM(A199,2),SUM(Y$7:Y198)-SUM(Z$6:Z197),\"\")","v":""}]
[null,null,{"$f":"IF(B199=0,\"\",VLOOKUP(B199,Etappen!$1:$65497,2,FALSE))","v":""},null,{"$f":"IF(D199=0,\"\",VLOOKUP(D199,Etappen!$1:$65497,2,FALSE))","v":""},null,{"$f":"IF(F199=0,\"\",VLOOKUP(F199,Etappen!$1:$65497,2,FALSE))","v":""},null,{"$f":"IF(H199=0,\"\",VLOOKUP(H199,Etappen!$1:$65497,2,FALSE))","v":""},null,{"$f":"IF(J199=0,\"\",VLOOKUP(J199,Etappen!$1:$65497,2,FALSE))","v":""},null,null,"A + B fehlt",null,{"$f":"IF(AND(O199=\"x\",Q199=\"x\"),\"wechsel\",IF(AND(O199=\"x\",Q199<>\"x\"),\"\",IF(AND(Q199=\"x\",O199<>\"x\"),\"M fehlt\",\"A + B fehlt\")))","v":"A + B fehlt"},null,{"$f":"IF(AND(Q199=\"x\",S199=\"x\"),\"wechsel\",IF(AND(Q199=\"x\",S199<>\"x\"),\"\",IF(AND(S199=\"x\",Q199<>\"x\"),\"M fehlt\",\"A + B fehlt\")))","v":"A + B fehlt"},null,null,null,null,null,null,null,{"$f":"IF(WEEKNUM(A199,2)<>WEEKNUM(A200,2),SUM(Y$7:Y199)-SUM(Z$6:Z198),\"\")","v":""}]
[null,null,{"$f":"IF(B200=0,\"\",VLOOKUP(B200,Etappen!$1:$65497,2,FALSE))","v":""},null,{"$f":"IF(D200=0,\"\",VLOOKUP(D200,Etappen!$1:$65497,2,FALSE))","v":""},null,{"$f":"IF(F200=0,\"\",VLOOKUP(F200,Etappen!$1:$65497,2,FALSE))","v":""},null,{"$f":"IF(H200=0,\"\",VLOOKUP(H200,Etappen!$1:$65497,2,FALSE))","v":""},null,{"$f":"IF(J200=0,\"\",VLOOKUP(J200,Etappen!$1:$65497,2,FALSE))","v":""},null,null,"A + B fehlt",null,{"$f":"IF(AND(O200=\"x\",Q200=\"x\"),\"wechsel\",IF(AND(O200=\"x\",Q200<>\"x\"),\"\",IF(AND(Q200=\"x\",O200<>\"x\"),\"M fehlt\",\"A + B fehlt\")))","v":"A + B fehlt"},null,{"$f":"IF(AND(Q200=\"x\",S200=\"x\"),\"wechsel\",IF(AND(Q200=\"x\",S200<>\"x\"),\"\",IF(AND(S200=\"x\",Q200<>\"x\"),\"M fehlt\",\"A + B fehlt\")))","v":"A + B fehlt"},null,null,null,null,null,null,null,{"$f":"IF(WEEKNUM(A200,2)<>WEEKNUM(A201,2),SUM(Y$7:Y200)-SUM(Z$6:Z199),\"\")","v":""}]
[null,null,{"$f":"IF(B201=0,\"\",VLOOKUP(B201,Etappen!$1:$65497,2,FALSE))","v":""},null,{"$f":"IF(D201=0,\"\",VLOOKUP(D201,Etappen!$1:$65497,2,FALSE))","v":""},null,{"$f":"IF(F201=0,\"\",VLOOKUP(F201,Etappen!$1:$65497,2,FALSE))","v":""},null,{"$f":"IF(H201=0,\"\",VLOOKUP(H201,Etappen!$1:$65497,2,FALSE))","v":""},null,{"$f":"IF(J201=0,\"\",VLOOKUP(J201,Etappen!$1:$65497,2,FALSE))","v":""},null,null,"A + B fehlt",null,{"$f":"IF(AND(O201=\"x\",Q201=\"x\"),\"wechsel\",IF(AND(O201=\"x\",Q201<>\"x\"),\"\",IF(AND(Q201=\"x\",O201<>\"x\"),\"M fehlt\",\"A + B fehlt\")))","v":"A + B fehlt"},null,{"$f":"IF(AND(Q201=\"x\",S201=\"x\"),\"wechsel\",IF(AND(Q201=\"x\",S201<>\"x\"),\"\",IF(AND(S201=\"x\",Q201<>\"x\"),\"M fehlt\",\"A + B fehlt\")))","v":"A + B fehlt"},null,null,null,null,null,null,null,{"$f":"IF(WEEKNUM(A201,2)<>WEEKNUM(A202,2),SUM(Y$7:Y201)-SUM(Z$6:Z200),\"\")","v":""}]
[null,null,{"$f":"IF(B202=0,\"\",VLOOKUP(B202,Etappen!$1:$65497,2,FALSE))","v":""},null,{"$f":"IF(D202=0,\"\",VLOOKUP(D202,Etappen!$1:$65497,2,FALSE))","v":""},null,{"$f":"IF(F202=0,\"\",VLOOKUP(F202,Etappen!$1:$65497,2,FALSE))","v":""},null,{"$f":"IF(H202=0,\"\",VLOOKUP(H202,Etappen!$1:$65497,2,FALSE))","v":""},null,{"$f":"IF(J202=0,\"\",VLOOKUP(J202,Etappen!$1:$65497,2,FALSE))","v":""},null,null,"A + B fehlt",null,{"$f":"IF(AND(O202=\"x\",Q202=\"x\"),\"wechsel\",IF(AND(O202=\"x\",Q202<>\"x\"),\"\",IF(AND(Q202=\"x\",O202<>\"x\"),\"M fehlt\",\"A + B fehlt\")))","v":"A + B fehlt"},null,{"$f":"IF(AND(Q202=\"x\",S202=\"x\"),\"wechsel\",IF(AND(Q202=\"x\",S202<>\"x\"),\"\",IF(AND(S202=\"x\",Q202<>\"x\"),\"M fehlt\",\"A + B fehlt\")))","v":"A + B fehlt"},null,null,null,null,null,null,null,{"$f":"IF(WEEKNUM(A202,2)<>WEEKNUM(A203,2),SUM(Y$7:Y202)-SUM(Z$6:Z201),\"\")","v":""}]
[null,null,{"$f":"IF(B203=0,\"\",VLOOKUP(B203,Etappen!$1:$65497,2,FALSE))","v":""},null,{"$f":"IF(D203=0,\"\",VLOOKUP(D203,Etappen!$1:$65497,2,FALSE))","v":""},null,{"$f":"IF(F203=0,\"\",VLOOKUP(F203,Etappen!$1:$65497,2,FALSE))","v":""},null,{"$f":"IF(H203=0,\"\",VLOOKUP(H203,Etappen!$1:$65497,2,FALSE))","v":""},null,{"$f":"IF(J203=0,\"\",VLOOKUP(J203,Etappen!$1:$65497,2,FALSE))","v":""},null,null,"A + B fehlt",null,{"$f":"IF(AND(O203=\"x\",Q203=\"x\"),\"wechsel\",IF(AND(O203=\"x\",Q203<>\"x\"),\"\",IF(AND(Q203=\"x\",O203<>\"x\"),\"M fehlt\",\"A + B fehlt\")))","v":"A + B fehlt"},null,{"$f":"IF(AND(Q203=\"x\",S203=\"x\"),\"wechsel\",IF(AND(Q203=\"x\",S203<>\"x\"),\"\",IF(AND(S203=\"x\",Q203<>\"x\"),\"M fehlt\",\"A + B fehlt\")))","v":"A + B fehlt"},null,null,null,null,null,null,null,{"$f":"IF(WEEKNUM(A203,2)<>WEEKNUM(A204,2),SUM(Y$7:Y203)-SUM(Z$6:Z202),\"\")","v":""}]
[null,null,{"$f":"IF(B204=0,\"\",VLOOKUP(B204,Etappen!$1:$65497,2,FALSE))","v":""},null,{"$f":"IF(D204=0,\"\",VLOOKUP(D204,Etappen!$1:$65497,2,FALSE))","v":""},null,{"$f":"IF(F204=0,\"\",VLOOKUP(F204,Etappen!$1:$65497,2,FALSE))","v":""},null,{"$f":"IF(H204=0,\"\",VLOOKUP(H204,Etappen!$1:$65497,2,FALSE))","v":""},null,{"$f":"IF(J204=0,\"\",VLOOKUP(J204,Etappen!$1:$65497,2,FALSE))","v":""},null,null,"A + B fehlt",null,{"$f":"IF(AND(O204=\"x\",Q204=\"x\"),\"wechsel\",IF(AND(O204=\"x\",Q204<>\"x\"),\"\",IF(AND(Q204=\"x\",O204<>\"x\"),\"M fehlt\",\"A + B fehlt\")))","v":"A + B fehlt"},null,{"$f":"IF(AND(Q204=\"x\",S204=\"x\"),\"wechsel\",IF(AND(Q204=\"x\",S204<>\"x\"),\"\",IF(AND(S204=\"x\",Q204<>\"x\"),\"M fehlt\",\"A + B fehlt\")))","v":"A + B fehlt"},null,null,null,null,null,null,null,{"$f":"IF(WEEKNUM(A204,2)<>WEEKNUM(A205,2),SUM(Y$7:Y204)-SUM(Z$6:Z203),\"\")","v":""}]
[null,null,{"$f":"IF(B205=0,\"\",VLOOKUP(B205,Etappen!$1:$65497,2,FALSE))","v":""},null,{"$f":"IF(D205=0,\"\",VLOOKUP(D205,Etappen!$1:$65497,2,FALSE))","v":""},null,{"$f":"IF(F205=0,\"\",VLOOKUP(F205,Etappen!$1:$65497,2,FALSE))","v":""},null,{"$f":"IF(H205=0,\"\",VLOOKUP(H205,Etappen!$1:$65497,2,FALSE))","v":""},null,{"$f":"IF(J205=0,\"\",VLOOKUP(J205,Etappen!$1:$65497,2,FALSE))","v":""},null,null,"A + B fehlt",null,{"$f":"IF(AND(O205=\"x\",Q205=\"x\"),\"wechsel\",IF(AND(O205=\"x\",Q205<>\"x\"),\"\",IF(AND(Q205=\"x\",O205<>\"x\"),\"M fehlt\",\"A + B fehlt\")))","v":"A + B fehlt"},null,{"$f":"IF(AND(Q205=\"x\",S205=\"x\"),\"wechsel\",IF(AND(Q205=\"x\",S205<>\"x\"),\"\",IF(AND(S205=\"x\",Q205<>\"x\"),\"M fehlt\",\"A + B fehlt\")))","v":"A + B fehlt"},null,null,null,null,null,null,null,{"$f":"IF(WEEKNUM(A205,2)<>WEEKNUM(A206,2),SUM(Y$7:Y205)-SUM(Z$6:Z204),\"\")","v":""}]
[null,null,{"$f":"IF(B206=0,\"\",VLOOKUP(B206,Etappen!$1:$65497,2,FALSE))","v":""},null,{"$f":"IF(D206=0,\"\",VLOOKUP(D206,Etappen!$1:$65497,2,FALSE))","v":""},null,{"$f":"IF(F206=0,\"\",VLOOKUP(F206,Etappen!$1:$65497,2,FALSE))","v":""},null,{"$f":"IF(H206=0,\"\",VLOOKUP(H206,Etappen!$1:$65497,2,FALSE))","v":""},null,{"$f":"IF(J206=0,\"\",VLOOKUP(J206,Etappen!$1:$65497,2,FALSE))","v":""},null,null,"A + B fehlt",null,{"$f":"IF(AND(O206=\"x\",Q206=\"x\"),\"wechsel\",IF(AND(O206=\"x\",Q206<>\"x\"),\"\",IF(AND(Q206=\"x\",O206<>\"x\"),\"M fehlt\",\"A + B fehlt\")))","v":"A + B fehlt"},null,{"$f":"IF(AND(Q206=\"x\",S206=\"x\"),\"wechsel\",IF(AND(Q206=\"x\",S206<>\"x\"),\"\",IF(AND(S206=\"x\",Q206<>\"x\"),\"M fehlt\",\"A + B fehlt\")))","v":"A + B fehlt"},null,null,null,null,null,null,null,{"$f":"IF(WEEKNUM(A206,2)<>WEEKNUM(A207,2),SUM(Y$7:Y206)-SUM(Z$6:Z205),\"\")","v":""}]
[null,null,{"$f":"IF(B207=0,\"\",VLOOKUP(B207,Etappen!$1:$65497,2,FALSE))","v":""},null,{"$f":"IF(D207=0,\"\",VLOOKUP(D207,Etappen!$1:$65497,2,FALSE))","v":""},null,{"$f":"IF(F207=0,\"\",VLOOKUP(F207,Etappen!$1:$65497,2,FALSE))","v":""},null,{"$f":"IF(H207=0,\"\",VLOOKUP(H207,Etappen!$1:$65497,2,FALSE))","v":""},null,{"$f":"IF(J207=0,\"\",VLOOKUP(J207,Etappen!$1:$65497,2,FALSE))","v":""},null,null,"A + B fehlt",null,{"$f":"IF(AND(O207=\"x\",Q207=\"x\"),\"wechsel\",IF(AND(O207=\"x\",Q207<>\"x\"),\"\",IF(AND(Q207=\"x\",O207<>\"x\"),\"M fehlt\",\"A + B fehlt\")))","v":"A + B fehlt"},null,{"$f":"IF(AND(Q207=\"x\",S207=\"x\"),\"wechsel\",IF(AND(Q207=\"x\",S207<>\"x\"),\"\",IF(AND(S207=\"x\",Q207<>\"x\"),\"M fehlt\",\"A + B fehlt\")))","v":"A + B fehlt"},null,null,null,null,null,null,null,{"$f":"IF(WEEKNUM(A207,2)<>WEEKNUM(A208,2),SUM(Y$7:Y207)-SUM(Z$6:Z206),\"\")","v":""}]
[null,null,{"$f":"IF(B208=0,\"\",VLOOKUP(B208,Etappen!$1:$65497,2,FALSE))","v":""},null,{"$f":"IF(D208=0,\"\",VLOOKUP(D208,Etappen!$1:$65497,2,FALSE))","v":""},null,{"$f":"IF(F208=0,\"\",VLOOKUP(F208,Etappen!$1:$65497,2,FALSE))","v":""},null,{"$f":"IF(H208=0,\"\",VLOOKUP(H208,Etappen!$1:$65497,2,FALSE))","v":""},null,{"$f":"IF(J208=0,\"\",VLOOKUP(J208,Etappen!$1:$65497,2,FALSE))","v":""},null,null,"A + B fehlt",null,{"$f":"IF(AND(O208=\"x\",Q208=\"x\"),\"wechsel\",IF(AND(O208=\"x\",Q208<>\"x\"),\"\",IF(AND(Q208=\"x\",O208<>\"x\"),\"M fehlt\",\"A + B fehlt\")))","v":"A + B fehlt"},null,{"$f":"IF(AND(Q208=\"x\",S208=\"x\"),\"wechsel\",IF(AND(Q208=\"x\",S208<>\"x\"),\"\",IF(AND(S208=\"x\",Q208<>\"x\"),\"M fehlt\",\"A + B fehlt\")))","v":"A + B fehlt"},null,null,null,null,null,null,null,{"$f":"IF(WEEKNUM(A208,2)<>WEEKNUM(A209,2),SUM(Y$7:Y208)-SUM(Z$6:Z207),\"\")","v":""}]
[null,null,{"$f":"IF(B209=0,\"\",VLOOKUP(B209,Etappen!$1:$65497,2,FALSE))","v":""},null,{"$f":"IF(D209=0,\"\",VLOOKUP(D209,Etappen!$1:$65497,2,FALSE))","v":""},null,{"$f":"IF(F209=0,\"\",VLOOKUP(F209,Etappen!$1:$65497,2,FALSE))","v":""},null,{"$f":"IF(H209=0,\"\",VLOOKUP(H209,Etappen!$1:$65497,2,FALSE))","v":""},null,{"$f":"IF(J209=0,\"\",VLOOKUP(J209,Etappen!$1:$65497,2,FALSE))","v":""},null,null,"A + B fehlt",null,{"$f":"IF(AND(O209=\"x\",Q209=\"x\"),\"wechsel\",IF(AND(O209=\"x\",Q209<>\"x\"),\"\",IF(AND(Q209=\"x\",O209<>\"x\"),\"M fehlt\",\"A + B fehlt\")))","v":"A + B fehlt"},null,{"$f":"IF(AND(Q209=\"x\",S209=\"x\"),\"wechsel\",IF(AND(Q209=\"x\",S209<>\"x\"),\"\",IF(AND(S209=\"x\",Q209<>\"x\"),\"M fehlt\",\"A + B fehlt\")))","v":"A + B fehlt"},null,null,null,null,null,null,null,{"$f":"IF(WEEKNUM(A209,2)<>WEEKNUM(A210,2),SUM(Y$7:Y209)-SUM(Z$6:Z208),\"\")","v":""}]
[null,null,{"$f":"IF(B210=0,\"\",VLOOKUP(B210,Etappen!$1:$65497,2,FALSE))","v":""},null,{"$f":"IF(D210=0,\"\",VLOOKUP(D210,Etappen!$1:$65497,2,FALSE))","v":""},null,{"$f":"IF(F210=0,\"\",VLOOKUP(F210,Etappen!$1:$65497,2,FALSE))","v":""},null,{"$f":"IF(H210=0,\"\",VLOOKUP(H210,Etappen!$1:$65497,2,FALSE))","v":""},null,{"$f":"IF(J210=0,\"\",VLOOKUP(J210,Etappen!$1:$65497,2,FALSE))","v":""},null,null,"A + B fehlt",null,{"$f":"IF(AND(O210=\"x\",Q210=\"x\"),\"wechsel\",IF(AND(O210=\"x\",Q210<>\"x\"),\"\",IF(AND(Q210=\"x\",O210<>\"x\"),\"M fehlt\",\"A + B fehlt\")))","v":"A + B fehlt"},null,{"$f":"IF(AND(Q210=\"x\",S210=\"x\"),\"wechsel\",IF(AND(Q210=\"x\",S210<>\"x\"),\"\",IF(AND(S210=\"x\",Q210<>\"x\"),\"M fehlt\",\"A + B fehlt\")))","v":"A + B fehlt"},null,null,null,null,null,null,null,{"$f":"IF(WEEKNUM(A210,2)<>WEEKNUM(A211,2),SUM(Y$7:Y210)-SUM(Z$6:Z209),\"\")","v":""}]
[null,null,{"$f":"IF(B211=0,\"\",VLOOKUP(B211,Etappen!$1:$65497,2,FALSE))","v":""},null,{"$f":"IF(D211=0,\"\",VLOOKUP(D211,Etappen!$1:$65497,2,FALSE))","v":""},null,{"$f":"IF(F211=0,\"\",VLOOKUP(F211,Etappen!$1:$65497,2,FALSE))","v":""},null,{"$f":"IF(H211=0,\"\",VLOOKUP(H211,Etappen!$1:$65497,2,FALSE))","v":""},null,{"$f":"IF(J211=0,\"\",VLOOKUP(J211,Etappen!$1:$65497,2,FALSE))","v":""},null,null,"A + B fehlt",null,{"$f":"IF(AND(O211=\"x\",Q211=\"x\"),\"wechsel\",IF(AND(O211=\"x\",Q211<>\"x\"),\"\",IF(AND(Q211=\"x\",O211<>\"x\"),\"M fehlt\",\"A + B fehlt\")))","v":"A + B fehlt"},null,{"$f":"IF(AND(Q211=\"x\",S211=\"x\"),\"wechsel\",IF(AND(Q211=\"x\",S211<>\"x\"),\"\",IF(AND(S211=\"x\",Q211<>\"x\"),\"M fehlt\",\"A + B fehlt\")))","v":"A + B fehlt"},null,null,null,null,null,null,null,{"$f":"IF(WEEKNUM(A211,2)<>WEEKNUM(A212,2),SUM(Y$7:Y211)-SUM(Z$6:Z210),\"\")","v":""}]
[null,null,{"$f":"IF(B212=0,\"\",VLOOKUP(B212,Etappen!$1:$65497,2,FALSE))","v":""},null,{"$f":"IF(D212=0,\"\",VLOOKUP(D212,Etappen!$1:$65497,2,FALSE))","v":""},null,{"$f":"IF(F212=0,\"\",VLOOKUP(F212,Etappen!$1:$65497,2,FALSE))","v":""},null,{"$f":"IF(H212=0,\"\",VLOOKUP(H212,Etappen!$1:$65497,2,FALSE))","v":""},null,{"$f":"IF(J212=0,\"\",VLOOKUP(J212,Etappen!$1:$65497,2,FALSE))","v":""},null,null,"A + B fehlt",null,{"$f":"IF(AND(O212=\"x\",Q212=\"x\"),\"wechsel\",IF(AND(O212=\"x\",Q212<>\"x\"),\"\",IF(AND(Q212=\"x\",O212<>\"x\"),\"M fehlt\",\"A + B fehlt\")))","v":"A + B fehlt"},null,{"$f":"IF(AND(Q212=\"x\",S212=\"x\"),\"wechsel\",IF(AND(Q212=\"x\",S212<>\"x\"),\"\",IF(AND(S212=\"x\",Q212<>\"x\"),\"M fehlt\",\"A + B fehlt\")))","v":"A + B fehlt"},null,null,null,null,null,null,null,{"$f":"IF(WEEKNUM(A212,2)<>WEEKNUM(A213,2),SUM(Y$7:Y212)-SUM(Z$6:Z211),\"\")","v":""}]
[null,null,{"$f":"IF(B213=0,\"\",VLOOKUP(B213,Etappen!$1:$65497,2,FALSE))","v":""},null,{"$f":"IF(D213=0,\"\",VLOOKUP(D213,Etappen!$1:$65497,2,FALSE))","v":""},null,{"$f":"IF(F213=0,\"\",VLOOKUP(F213,Etappen!$1:$65497,2,FALSE))","v":""},null,{"$f":"IF(H213=0,\"\",VLOOKUP(H213,Etappen!$1:$65497,2,FALSE))","v":""},null,{"$f":"IF(J213=0,\"\",VLOOKUP(J213,Etappen!$1:$65497,2,FALSE))","v":""},null,null,"A + B fehlt",null,{"$f":"IF(AND(O213=\"x\",Q213=\"x\"),\"wechsel\",IF(AND(O213=\"x\",Q213<>\"x\"),\"\",IF(AND(Q213=\"x\",O213<>\"x\"),\"M fehlt\",\"A + B fehlt\")))","v":"A + B fehlt"},null,{"$f":"IF(AND(Q213=\"x\",S213=\"x\"),\"wechsel\",IF(AND(Q213=\"x\",S213<>\"x\"),\"\",IF(AND(S213=\"x\",Q213<>\"x\"),\"M fehlt\",\"A + B fehlt\")))","v":"A + B fehlt"},null,null,null,null,null,null,null,{"$f":"IF(WEEKNUM(A213,2)<>WEEKNUM(A214,2),SUM(Y$7:Y213)-SUM(Z$6:Z212),\"\")","v":""}]
[null,null,{"$f":"IF(B214=0,\"\",VLOOKUP(B214,Etappen!$1:$65497,2,FALSE))","v":""},null,{"$f":"IF(D214=0,\"\",VLOOKUP(D214,Etappen!$1:$65497,2,FALSE))","v":""},null,{"$f":"IF(F214=0,\"\",VLOOKUP(F214,Etappen!$1:$65497,2,FALSE))","v":""},null,{"$f":"IF(H214=0,\"\",VLOOKUP(H214,Etappen!$1:$65497,2,FALSE))","v":""},null,{"$f":"IF(J214=0,\"\",VLOOKUP(J214,Etappen!$1:$65497,2,FALSE))","v":""},null,null,"A + B fehlt",null,{"$f":"IF(AND(O214=\"x\",Q214=\"x\"),\"wechsel\",IF(AND(O214=\"x\",Q214<>\"x\"),\"\",IF(AND(Q214=\"x\",O214<>\"x\"),\"M fehlt\",\"A + B fehlt\")))","v":"A + B fehlt"},null,{"$f":"IF(AND(Q214=\"x\",S214=\"x\"),\"wechsel\",IF(AND(Q214=\"x\",S214<>\"x\"),\"\",IF(AND(S214=\"x\",Q214<>\"x\"),\"M fehlt\",\"A + B fehlt\")))","v":"A + B fehlt"},null,null,null,null,null,null,null,{"$f":"IF(WEEKNUM(A214,2)<>WEEKNUM(A215,2),SUM(Y$7:Y214)-SUM(Z$6:Z213),\"\")","v":""}]
[null,null,{"$f":"IF(B215=0,\"\",VLOOKUP(B215,Etappen!$1:$65497,2,FALSE))","v":""},null,{"$f":"IF(D215=0,\"\",VLOOKUP(D215,Etappen!$1:$65497,2,FALSE))","v":""},null,{"$f":"IF(F215=0,\"\",VLOOKUP(F215,Etappen!$1:$65497,2,FALSE))","v":""},null,{"$f":"IF(H215=0,\"\",VLOOKUP(H215,Etappen!$1:$65497,2,FALSE))","v":""},null,{"$f":"IF(J215=0,\"\",VLOOKUP(J215,Etappen!$1:$65497,2,FALSE))","v":""},null,null,"A + B fehlt",null,{"$f":"IF(AND(O215=\"x\",Q215=\"x\"),\"wechsel\",IF(AND(O215=\"x\",Q215<>\"x\"),\"\",IF(AND(Q215=\"x\",O215<>\"x\"),\"M fehlt\",\"A + B fehlt\")))","v":"A + B fehlt"},null,{"$f":"IF(AND(Q215=\"x\",S215=\"x\"),\"wechsel\",IF(AND(Q215=\"x\",S215<>\"x\"),\"\",IF(AND(S215=\"x\",Q215<>\"x\"),\"M fehlt\",\"A + B fehlt\")))","v":"A + B fehlt"},null,null,null,null,null,null,null,{"$f":"IF(WEEKNUM(A215,2)<>WEEKNUM(A216,2),SUM(Y$7:Y215)-SUM(Z$6:Z214),\"\")","v":""}]
[null,null,{"$f":"IF(B216=0,\"\",VLOOKUP(B216,Etappen!$1:$65497,2,FALSE))","v":""},null,{"$f":"IF(D216=0,\"\",VLOOKUP(D216,Etappen!$1:$65497,2,FALSE))","v":""},null,{"$f":"IF(F216=0,\"\",VLOOKUP(F216,Etappen!$1:$65497,2,FALSE))","v":""},null,{"$f":"IF(H216=0,\"\",VLOOKUP(H216,Etappen!$1:$65497,2,FALSE))","v":""},null,{"$f":"IF(J216=0,\"\",VLOOKUP(J216,Etappen!$1:$65497,2,FALSE))","v":""},null,null,"A + B fehlt",null,{"$f":"IF(AND(O216=\"x\",Q216=\"x\"),\"wechsel\",IF(AND(O216=\"x\",Q216<>\"x\"),\"\",IF(AND(Q216=\"x\",O216<>\"x\"),\"M fehlt\",\"A + B fehlt\")))","v":"A + B fehlt"},null,{"$f":"IF(AND(Q216=\"x\",S216=\"x\"),\"wechsel\",IF(AND(Q216=\"x\",S216<>\"x\"),\"\",IF(AND(S216=\"x\",Q216<>\"x\"),\"M fehlt\",\"A + B fehlt\")))","v":"A + B fehlt"},null,null,null,null,null,null,null,{"$f":"IF(WEEKNUM(A216,2)<>WEEKNUM(A217,2),SUM(Y$7:Y216)-SUM(Z$6:Z215),\"\")","v":""}]
[null,null,{"$f":"IF(B217=0,\"\",VLOOKUP(B217,Etappen!$1:$65497,2,FALSE))","v":""},null,{"$f":"IF(D217=0,\"\",VLOOKUP(D217,Etappen!$1:$65497,2,FALSE))","v":""},null,{"$f":"IF(F217=0,\"\",VLOOKUP(F217,Etappen!$1:$65497,2,FALSE))","v":""},null,{"$f":"IF(H217=0,\"\",VLOOKUP(H217,Etappen!$1:$65497,2,FALSE))","v":""},null,{"$f":"IF(J217=0,\"\",VLOOKUP(J217,Etappen!$1:$65497,2,FALSE))","v":""},null,null,"A + B fehlt",null,{"$f":"IF(AND(O217=\"x\",Q217=\"x\"),\"wechsel\",IF(AND(O217=\"x\",Q217<>\"x\"),\"\",IF(AND(Q217=\"x\",O217<>\"x\"),\"M fehlt\",\"A + B fehlt\")))","v":"A + B fehlt"},null,{"$f":"IF(AND(Q217=\"x\",S217=\"x\"),\"wechsel\",IF(AND(Q217=\"x\",S217<>\"x\"),\"\",IF(AND(S217=\"x\",Q217<>\"x\"),\"M fehlt\",\"A + B fehlt\")))","v":"A + B fehlt"},null,null,null,null,null,null,null,{"$f":"IF(WEEKNUM(A217,2)<>WEEKNUM(A218,2),SUM(Y$7:Y217)-SUM(Z$6:Z216),\"\")","v":""}]
[null,null,{"$f":"IF(B218=0,\"\",VLOOKUP(B218,Etappen!$1:$65497,2,FALSE))","v":""},null,{"$f":"IF(D218=0,\"\",VLOOKUP(D218,Etappen!$1:$65497,2,FALSE))","v":""},null,{"$f":"IF(F218=0,\"\",VLOOKUP(F218,Etappen!$1:$65497,2,FALSE))","v":""},null,{"$f":"IF(H218=0,\"\",VLOOKUP(H218,Etappen!$1:$65497,2,FALSE))","v":""},null,{"$f":"IF(J218=0,\"\",VLOOKUP(J218,Etappen!$1:$65497,2,FALSE))","v":""},null,null,"A + B fehlt",null,{"$f":"IF(AND(O218=\"x\",Q218=\"x\"),\"wechsel\",IF(AND(O218=\"x\",Q218<>\"x\"),\"\",IF(AND(Q218=\"x\",O218<>\"x\"),\"M fehlt\",\"A + B fehlt\")))","v":"A + B fehlt"},null,{"$f":"IF(AND(Q218=\"x\",S218=\"x\"),\"wechsel\",IF(AND(Q218=\"x\",S218<>\"x\"),\"\",IF(AND(S218=\"x\",Q218<>\"x\"),\"M fehlt\",\"A + B fehlt\")))","v":"A + B fehlt"},null,null,null,null,null,null,null,{"$f":"IF(WEEKNUM(A218,2)<>WEEKNUM(A219,2),SUM(Y$7:Y218)-SUM(Z$6:Z217),\"\")","v":""}]
[null,null,{"$f":"IF(B219=0,\"\",VLOOKUP(B219,Etappen!$1:$65497,2,FALSE))","v":""},null,{"$f":"IF(D219=0,\"\",VLOOKUP(D219,Etappen!$1:$65497,2,FALSE))","v":""},null,{"$f":"IF(F219=0,\"\",VLOOKUP(F219,Etappen!$1:$65497,2,FALSE))","v":""},null,{"$f":"IF(H219=0,\"\",VLOOKUP(H219,Etappen!$1:$65497,2,FALSE))","v":""},null,{"$f":"IF(J219=0,\"\",VLOOKUP(J219,Etappen!$1:$65497,2,FALSE))","v":""},null,null,"A + B fehlt",null,{"$f":"IF(AND(O219=\"x\",Q219=\"x\"),\"wechsel\",IF(AND(O219=\"x\",Q219<>\"x\"),\"\",IF(AND(Q219=\"x\",O219<>\"x\"),\"M fehlt\",\"A + B fehlt\")))","v":"A + B fehlt"},null,{"$f":"IF(AND(Q219=\"x\",S219=\"x\"),\"wechsel\",IF(AND(Q219=\"x\",S219<>\"x\"),\"\",IF(AND(S219=\"x\",Q219<>\"x\"),\"M fehlt\",\"A + B fehlt\")))","v":"A + B fehlt"},null,null,null,null,null,null,null,{"$f":"IF(WEEKNUM(A219,2)<>WEEKNUM(A220,2),SUM(Y$7:Y219)-SUM(Z$6:Z218),\"\")","v":""}]
[null,null,{"$f":"IF(B220=0,\"\",VLOOKUP(B220,Etappen!$1:$65497,2,FALSE))","v":""},null,{"$f":"IF(D220=0,\"\",VLOOKUP(D220,Etappen!$1:$65497,2,FALSE))","v":""},null,{"$f":"IF(F220=0,\"\",VLOOKUP(F220,Etappen!$1:$65497,2,FALSE))","v":""},null,{"$f":"IF(H220=0,\"\",VLOOKUP(H220,Etappen!$1:$65497,2,FALSE))","v":""},null,{"$f":"IF(J220=0,\"\",VLOOKUP(J220,Etappen!$1:$65497,2,FALSE))","v":""},null,null,"A + B fehlt",null,{"$f":"IF(AND(O220=\"x\",Q220=\"x\"),\"wechsel\",IF(AND(O220=\"x\",Q220<>\"x\"),\"\",IF(AND(Q220=\"x\",O220<>\"x\"),\"M fehlt\",\"A + B fehlt\")))","v":"A + B fehlt"},null,{"$f":"IF(AND(Q220=\"x\",S220=\"x\"),\"wechsel\",IF(AND(Q220=\"x\",S220<>\"x\"),\"\",IF(AND(S220=\"x\",Q220<>\"x\"),\"M fehlt\",\"A + B fehlt\")))","v":"A + B fehlt"},null,null,null,null,null,null,null,{"$f":"IF(WEEKNUM(A220,2)<>WEEKNUM(A221,2),SUM(Y$7:Y220)-SUM(Z$6:Z219),\"\")","v":""}]
[null,null,{"$f":"IF(B221=0,\"\",VLOOKUP(B221,Etappen!$1:$65497,2,FALSE))","v":""},null,{"$f":"IF(D221=0,\"\",VLOOKUP(D221,Etappen!$1:$65497,2,FALSE))","v":""},null,{"$f":"IF(F221=0,\"\",VLOOKUP(F221,Etappen!$1:$65497,2,FALSE))","v":""},null,{"$f":"IF(H221=0,\"\",VLOOKUP(H221,Etappen!$1:$65497,2,FALSE))","v":""},null,{"$f":"IF(J221=0,\"\",VLOOKUP(J221,Etappen!$1:$65497,2,FALSE))","v":""},null,null,"A + B fehlt",null,{"$f":"IF(AND(O221=\"x\",Q221=\"x\"),\"wechsel\",IF(AND(O221=\"x\",Q221<>\"x\"),\"\",IF(AND(Q221=\"x\",O221<>\"x\"),\"M fehlt\",\"A + B fehlt\")))","v":"A + B fehlt"},null,{"$f":"IF(AND(Q221=\"x\",S221=\"x\"),\"wechsel\",IF(AND(Q221=\"x\",S221<>\"x\"),\"\",IF(AND(S221=\"x\",Q221<>\"x\"),\"M fehlt\",\"A + B fehlt\")))","v":"A + B fehlt"},null,null,null,null,null,null,null,{"$f":"IF(WEEKNUM(A221,2)<>WEEKNUM(A222,2),SUM(Y$7:Y221)-SUM(Z$6:Z220),\"\")","v":""}]
[null,null,{"$f":"IF(B222=0,\"\",VLOOKUP(B222,Etappen!$1:$65497,2,FALSE))","v":""},null,{"$f":"IF(D222=0,\"\",VLOOKUP(D222,Etappen!$1:$65497,2,FALSE))","v":""},null,{"$f":"IF(F222=0,\"\",VLOOKUP(F222,Etappen!$1:$65497,2,FALSE))","v":""},null,{"$f":"IF(H222=0,\"\",VLOOKUP(H222,Etappen!$1:$65497,2,FALSE))","v":""},null,{"$f":"IF(J222=0,\"\",VLOOKUP(J222,Etappen!$1:$65497,2,FALSE))","v":""},null,null,"A + B fehlt",null,{"$f":"IF(AND(O222=\"x\",Q222=\"x\"),\"wechsel\",IF(AND(O222=\"x\",Q222<>\"x\"),\"\",IF(AND(Q222=\"x\",O222<>\"x\"),\"M fehlt\",\"A + B fehlt\")))","v":"A + B fehlt"},null,{"$f":"IF(AND(Q222=\"x\",S222=\"x\"),\"wechsel\",IF(AND(Q222=\"x\",S222<>\"x\"),\"\",IF(AND(S222=\"x\",Q222<>\"x\"),\"M fehlt\",\"A + B fehlt\")))","v":"A + B fehlt"},null,null,null,null,null,null,null,{"$f":"IF(WEEKNUM(A222,2)<>WEEKNUM(A223,2),SUM(Y$7:Y222)-SUM(Z$6:Z221),\"\")","v":""}]
[null,null,{"$f":"IF(B223=0,\"\",VLOOKUP(B223,Etappen!$1:$65497,2,FALSE))","v":""},null,{"$f":"IF(D223=0,\"\",VLOOKUP(D223,Etappen!$1:$65497,2,FALSE))","v":""},null,{"$f":"IF(F223=0,\"\",VLOOKUP(F223,Etappen!$1:$65497,2,FALSE))","v":""},null,{"$f":"IF(H223=0,\"\",VLOOKUP(H223,Etappen!$1:$65497,2,FALSE))","v":""},null,{"$f":"IF(J223=0,\"\",VLOOKUP(J223,Etappen!$1:$65497,2,FALSE))","v":""},null,null,"A + B fehlt",null,{"$f":"IF(AND(O223=\"x\",Q223=\"x\"),\"wechsel\",IF(AND(O223=\"x\",Q223<>\"x\"),\"\",IF(AND(Q223=\"x\",O223<>\"x\"),\"M fehlt\",\"A + B fehlt\")))","v":"A + B fehlt"},null,{"$f":"IF(AND(Q223=\"x\",S223=\"x\"),\"wechsel\",IF(AND(Q223=\"x\",S223<>\"x\"),\"\",IF(AND(S223=\"x\",Q223<>\"x\"),\"M fehlt\",\"A + B fehlt\")))","v":"A + B fehlt"},null,null,null,null,null,null,null,{"$f":"IF(WEEKNUM(A223,2)<>WEEKNUM(A224,2),SUM(Y$7:Y223)-SUM(Z$6:Z222),\"\")","v":""}]
[null,null,{"$f":"IF(B224=0,\"\",VLOOKUP(B224,Etappen!$1:$65497,2,FALSE))","v":""},null,{"$f":"IF(D224=0,\"\",VLOOKUP(D224,Etappen!$1:$65497,2,FALSE))","v":""},null,{"$f":"IF(F224=0,\"\",VLOOKUP(F224,Etappen!$1:$65497,2,FALSE))","v":""},null,{"$f":"IF(H224=0,\"\",VLOOKUP(H224,Etappen!$1:$65497,2,FALSE))","v":""},null,{"$f":"IF(J224=0,\"\",VLOOKUP(J224,Etappen!$1:$65497,2,FALSE))","v":""},null,null,"A + B fehlt",null,{"$f":"IF(AND(O224=\"x\",Q224=\"x\"),\"wechsel\",IF(AND(O224=\"x\",Q224<>\"x\"),\"\",IF(AND(Q224=\"x\",O224<>\"x\"),\"M fehlt\",\"A + B fehlt\")))","v":"A + B fehlt"},null,{"$f":"IF(AND(Q224=\"x\",S224=\"x\"),\"wechsel\",IF(AND(Q224=\"x\",S224<>\"x\"),\"\",IF(AND(S224=\"x\",Q224<>\"x\"),\"M fehlt\",\"A + B fehlt\")))","v":"A + B fehlt"},null,null,null,null,null,null,null,{"$f":"IF(WEEKNUM(A224,2)<>WEEKNUM(A225,2),SUM(Y$7:Y224)-SUM(Z$6:Z223),\"\")","v":""}]
[null,null,{"$f":"IF(B225=0,\"\",VLOOKUP(B225,Etappen!$1:$65497,2,FALSE))","v":""},null,{"$f":"IF(D225=0,\"\",VLOOKUP(D225,Etappen!$1:$65497,2,FALSE))","v":""},null,{"$f":"IF(F225=0,\"\",VLOOKUP(F225,Etappen!$1:$65497,2,FALSE))","v":""},null,{"$f":"IF(H225=0,\"\",VLOOKUP(H225,Etappen!$1:$65497,2,FALSE))","v":""},null,{"$f":"IF(J225=0,\"\",VLOOKUP(J225,Etappen!$1:$65497,2,FALSE))","v":""},null,null,"A + B fehlt",null,{"$f":"IF(AND(O225=\"x\",Q225=\"x\"),\"wechsel\",IF(AND(O225=\"x\",Q225<>\"x\"),\"\",IF(AND(Q225=\"x\",O225<>\"x\"),\"M fehlt\",\"A + B fehlt\")))","v":"A + B fehlt"},null,{"$f":"IF(AND(Q225=\"x\",S225=\"x\"),\"wechsel\",IF(AND(Q225=\"x\",S225<>\"x\"),\"\",IF(AND(S225=\"x\",Q225<>\"x\"),\"M fehlt\",\"A + B fehlt\")))","v":"A + B fehlt"},null,null,null,null,null,null,null,{"$f":"IF(WEEKNUM(A225,2)<>WEEKNUM(A226,2),SUM(Y$7:Y225)-SUM(Z$6:Z224),\"\")","v":""}]
[null,null,{"$f":"IF(B226=0,\"\",VLOOKUP(B226,Etappen!$1:$65497,2,FALSE))","v":""},null,{"$f":"IF(D226=0,\"\",VLOOKUP(D226,Etappen!$1:$65497,2,FALSE))","v":""},null,{"$f":"IF(F226=0,\"\",VLOOKUP(F226,Etappen!$1:$65497,2,FALSE))","v":""},null,{"$f":"IF(H226=0,\"\",VLOOKUP(H226,Etappen!$1:$65497,2,FALSE))","v":""},null,{"$f":"IF(J226=0,\"\",VLOOKUP(J226,Etappen!$1:$65497,2,FALSE))","v":""},null,null,"A + B fehlt",null,{"$f":"IF(AND(O226=\"x\",Q226=\"x\"),\"wechsel\",IF(AND(O226=\"x\",Q226<>\"x\"),\"\",IF(AND(Q226=\"x\",O226<>\"x\"),\"M fehlt\",\"A + B fehlt\")))","v":"A + B fehlt"},null,{"$f":"IF(AND(Q226=\"x\",S226=\"x\"),\"wechsel\",IF(AND(Q226=\"x\",S226<>\"x\"),\"\",IF(AND(S226=\"x\",Q226<>\"x\"),\"M fehlt\",\"A + B fehlt\")))","v":"A + B fehlt"},null,null,null,null,null,null,null,{"$f":"IF(WEEKNUM(A226,2)<>WEEKNUM(A227,2),SUM(Y$7:Y226)-SUM(Z$6:Z225),\"\")","v":""}]
[null,null,{"$f":"IF(B227=0,\"\",VLOOKUP(B227,Etappen!$1:$65497,2,FALSE))","v":""},null,{"$f":"IF(D227=0,\"\",VLOOKUP(D227,Etappen!$1:$65497,2,FALSE))","v":""},null,{"$f":"IF(F227=0,\"\",VLOOKUP(F227,Etappen!$1:$65497,2,FALSE))","v":""},null,{"$f":"IF(H227=0,\"\",VLOOKUP(H227,Etappen!$1:$65497,2,FALSE))","v":""},null,{"$f":"IF(J227=0,\"\",VLOOKUP(J227,Etappen!$1:$65497,2,FALSE))","v":""},null,null,"A + B fehlt",null,{"$f":"IF(AND(O227=\"x\",Q227=\"x\"),\"wechsel\",IF(AND(O227=\"x\",Q227<>\"x\"),\"\",IF(AND(Q227=\"x\",O227<>\"x\"),\"M fehlt\",\"A + B fehlt\")))","v":"A + B fehlt"},null,{"$f":"IF(AND(Q227=\"x\",S227=\"x\"),\"wechsel\",IF(AND(Q227=\"x\",S227<>\"x\"),\"\",IF(AND(S227=\"x\",Q227<>\"x\"),\"M fehlt\",\"A + B fehlt\")))","v":"A + B fehlt"},null,null,null,null,null,null,null,{"$f":"IF(WEEKNUM(A227,2)<>WEEKNUM(A228,2),SUM(Y$7:Y227)-SUM(Z$6:Z226),\"\")","v":""}]
[null,null,{"$f":"IF(B228=0,\"\",VLOOKUP(B228,Etappen!$1:$65497,2,FALSE))","v":""},null,{"$f":"IF(D228=0,\"\",VLOOKUP(D228,Etappen!$1:$65497,2,FALSE))","v":""},null,{"$f":"IF(F228=0,\"\",VLOOKUP(F228,Etappen!$1:$65497,2,FALSE))","v":""},null,{"$f":"IF(H228=0,\"\",VLOOKUP(H228,Etappen!$1:$65497,2,FALSE))","v":""},null,{"$f":"IF(J228=0,\"\",VLOOKUP(J228,Etappen!$1:$65497,2,FALSE))","v":""},null,null,"A + B fehlt",null,{"$f":"IF(AND(O228=\"x\",Q228=\"x\"),\"wechsel\",IF(AND(O228=\"x\",Q228<>\"x\"),\"\",IF(AND(Q228=\"x\",O228<>\"x\"),\"M fehlt\",\"A + B fehlt\")))","v":"A + B fehlt"},null,{"$f":"IF(AND(Q228=\"x\",S228=\"x\"),\"wechsel\",IF(AND(Q228=\"x\",S228<>\"x\"),\"\",IF(AND(S228=\"x\",Q228<>\"x\"),\"M fehlt\",\"A + B fehlt\")))","v":"A + B fehlt"},null,null,null,null,null,null,null,{"$f":"IF(WEEKNUM(A228,2)<>WEEKNUM(A229,2),SUM(Y$7:Y228)-SUM(Z$6:Z227),\"\")","v":""}]
[null,null,{"$f":"IF(B229=0,\"\",VLOOKUP(B229,Etappen!$1:$65497,2,FALSE))","v":""},null,{"$f":"IF(D229=0,\"\",VLOOKUP(D229,Etappen!$1:$65497,2,FALSE))","v":""},null,{"$f":"IF(F229=0,\"\",VLOOKUP(F229,Etappen!$1:$65497,2,FALSE))","v":""},null,{"$f":"IF(H229=0,\"\",VLOOKUP(H229,Etappen!$1:$65497,2,FALSE))","v":""},null,{"$f":"IF(J229=0,\"\",VLOOKUP(J229,Etappen!$1:$65497,2,FALSE))","v":""},null,null,"A + B fehlt",null,{"$f":"IF(AND(O229=\"x\",Q229=\"x\"),\"wechsel\",IF(AND(O229=\"x\",Q229<>\"x\"),\"\",IF(AND(Q229=\"x\",O229<>\"x\"),\"M fehlt\",\"A + B fehlt\")))","v":"A + B fehlt"},null,{"$f":"IF(AND(Q229=\"x\",S229=\"x\"),\"wechsel\",IF(AND(Q229=\"x\",S229<>\"x\"),\"\",IF(AND(S229=\"x\",Q229<>\"x\"),\"M fehlt\",\"A + B fehlt\")))","v":"A + B fehlt"},null,null,null,null,null,null,null,{"$f":"IF(WEEKNUM(A229,2)<>WEEKNUM(A230,2),SUM(Y$7:Y229)-SUM(Z$6:Z228),\"\")","v":""}]
[null,null,{"$f":"IF(B230=0,\"\",VLOOKUP(B230,Etappen!$1:$65497,2,FALSE))","v":""},null,{"$f":"IF(D230=0,\"\",VLOOKUP(D230,Etappen!$1:$65497,2,FALSE))","v":""},null,{"$f":"IF(F230=0,\"\",VLOOKUP(F230,Etappen!$1:$65497,2,FALSE))","v":""},null,{"$f":"IF(H230=0,\"\",VLOOKUP(H230,Etappen!$1:$65497,2,FALSE))","v":""},null,{"$f":"IF(J230=0,\"\",VLOOKUP(J230,Etappen!$1:$65497,2,FALSE))","v":""},null,null,"A + B fehlt",null,{"$f":"IF(AND(O230=\"x\",Q230=\"x\"),\"wechsel\",IF(AND(O230=\"x\",Q230<>\"x\"),\"\",IF(AND(Q230=\"x\",O230<>\"x\"),\"M fehlt\",\"A + B fehlt\")))","v":"A + B fehlt"},null,{"$f":"IF(AND(Q230=\"x\",S230=\"x\"),\"wechsel\",IF(AND(Q230=\"x\",S230<>\"x\"),\"\",IF(AND(S230=\"x\",Q230<>\"x\"),\"M fehlt\",\"A + B fehlt\")))","v":"A + B fehlt"},null,null,null,null,null,null,null,{"$f":"IF(WEEKNUM(A230,2)<>WEEKNUM(A231,2),SUM(Y$7:Y230)-SUM(Z$6:Z229),\"\")","v":""}]
[null,null,{"$f":"IF(B231=0,\"\",VLOOKUP(B231,Etappen!$1:$65497,2,FALSE))","v":""},null,{"$f":"IF(D231=0,\"\",VLOOKUP(D231,Etappen!$1:$65497,2,FALSE))","v":""},null,{"$f":"IF(F231=0,\"\",VLOOKUP(F231,Etappen!$1:$65497,2,FALSE))","v":""},null,{"$f":"IF(H231=0,\"\",VLOOKUP(H231,Etappen!$1:$65497,2,FALSE))","v":""},null,{"$f":"IF(J231=0,\"\",VLOOKUP(J231,Etappen!$1:$65497,2,FALSE))","v":""},null,null,"A + B fehlt",null,{"$f":"IF(AND(O231=\"x\",Q231=\"x\"),\"wechsel\",IF(AND(O231=\"x\",Q231<>\"x\"),\"\",IF(AND(Q231=\"x\",O231<>\"x\"),\"M fehlt\",\"A + B fehlt\")))","v":"A + B fehlt"},null,{"$f":"IF(AND(Q231=\"x\",S231=\"x\"),\"wechsel\",IF(AND(Q231=\"x\",S231<>\"x\"),\"\",IF(AND(S231=\"x\",Q231<>\"x\"),\"M fehlt\",\"A + B fehlt\")))","v":"A + B fehlt"},null,null,null,null,null,null,null,{"$f":"IF(WEEKNUM(A231,2)<>WEEKNUM(A232,2),SUM(Y$7:Y231)-SUM(Z$6:Z230),\"\")","v":""}]
[null,null,{"$f":"IF(B232=0,\"\",VLOOKUP(B232,Etappen!$1:$65497,2,FALSE))","v":""},null,{"$f":"IF(D232=0,\"\",VLOOKUP(D232,Etappen!$1:$65497,2,FALSE))","v":""},null,{"$f":"IF(F232=0,\"\",VLOOKUP(F232,Etappen!$1:$65497,2,FALSE))","v":""},null,{"$f":"IF(H232=0,\"\",VLOOKUP(H232,Etappen!$1:$65497,2,FALSE))","v":""},null,{"$f":"IF(J232=0,\"\",VLOOKUP(J232,Etappen!$1:$65497,2,FALSE))","v":""},null,null,"A + B fehlt",null,{"$f":"IF(AND(O232=\"x\",Q232=\"x\"),\"wechsel\",IF(AND(O232=\"x\",Q232<>\"x\"),\"\",IF(AND(Q232=\"x\",O232<>\"x\"),\"M fehlt\",\"A + B fehlt\")))","v":"A + B fehlt"},null,{"$f":"IF(AND(Q232=\"x\",S232=\"x\"),\"wechsel\",IF(AND(Q232=\"x\",S232<>\"x\"),\"\",IF(AND(S232=\"x\",Q232<>\"x\"),\"M fehlt\",\"A + B fehlt\")))","v":"A + B fehlt"},null,null,null,null,null,null,null,{"$f":"IF(WEEKNUM(A232,2)<>WEEKNUM(A233,2),SUM(Y$7:Y232)-SUM(Z$6:Z231),\"\")","v":""}]
[null,null,{"$f":"IF(B233=0,\"\",VLOOKUP(B233,Etappen!$1:$65497,2,FALSE))","v":""},null,{"$f":"IF(D233=0,\"\",VLOOKUP(D233,Etappen!$1:$65497,2,FALSE))","v":""},null,{"$f":"IF(F233=0,\"\",VLOOKUP(F233,Etappen!$1:$65497,2,FALSE))","v":""},null,{"$f":"IF(H233=0,\"\",VLOOKUP(H233,Etappen!$1:$65497,2,FALSE))","v":""},null,{"$f":"IF(J233=0,\"\",VLOOKUP(J233,Etappen!$1:$65497,2,FALSE))","v":""},null,null,"A + B fehlt",null,{"$f":"IF(AND(O233=\"x\",Q233=\"x\"),\"wechsel\",IF(AND(O233=\"x\",Q233<>\"x\"),\"\",IF(AND(Q233=\"x\",O233<>\"x\"),\"M fehlt\",\"A + B fehlt\")))","v":"A + B fehlt"},null,{"$f":"IF(AND(Q233=\"x\",S233=\"x\"),\"wechsel\",IF(AND(Q233=\"x\",S233<>\"x\"),\"\",IF(AND(S233=\"x\",Q233<>\"x\"),\"M fehlt\",\"A + B fehlt\")))","v":"A + B fehlt"},null,null,null,null,null,null,null,{"$f":"IF(WEEKNUM(A233,2)<>WEEKNUM(A234,2),SUM(Y$7:Y233)-SUM(Z$6:Z232),\"\")","v":""}]
[null,null,{"$f":"IF(B234=0,\"\",VLOOKUP(B234,Etappen!$1:$65497,2,FALSE))","v":""},null,{"$f":"IF(D234=0,\"\",VLOOKUP(D234,Etappen!$1:$65497,2,FALSE))","v":""},null,{"$f":"IF(F234=0,\"\",VLOOKUP(F234,Etappen!$1:$65497,2,FALSE))","v":""},null,{"$f":"IF(H234=0,\"\",VLOOKUP(H234,Etappen!$1:$65497,2,FALSE))","v":""},null,{"$f":"IF(J234=0,\"\",VLOOKUP(J234,Etappen!$1:$65497,2,FALSE))","v":""},null,null,"A + B fehlt",null,{"$f":"IF(AND(O234=\"x\",Q234=\"x\"),\"wechsel\",IF(AND(O234=\"x\",Q234<>\"x\"),\"\",IF(AND(Q234=\"x\",O234<>\"x\"),\"M fehlt\",\"A + B fehlt\")))","v":"A + B fehlt"},null,{"$f":"IF(AND(Q234=\"x\",S234=\"x\"),\"wechsel\",IF(AND(Q234=\"x\",S234<>\"x\"),\"\",IF(AND(S234=\"x\",Q234<>\"x\"),\"M fehlt\",\"A + B fehlt\")))","v":"A + B fehlt"},null,null,null,null,null,null,null,{"$f":"IF(WEEKNUM(A234,2)<>WEEKNUM(A235,2),SUM(Y$7:Y234)-SUM(Z$6:Z233),\"\")","v":""}]
[null,null,{"$f":"IF(B235=0,\"\",VLOOKUP(B235,Etappen!$1:$65497,2,FALSE))","v":""},null,{"$f":"IF(D235=0,\"\",VLOOKUP(D235,Etappen!$1:$65497,2,FALSE))","v":""},null,{"$f":"IF(F235=0,\"\",VLOOKUP(F235,Etappen!$1:$65497,2,FALSE))","v":""},null,{"$f":"IF(H235=0,\"\",VLOOKUP(H235,Etappen!$1:$65497,2,FALSE))","v":""},null,{"$f":"IF(J235=0,\"\",VLOOKUP(J235,Etappen!$1:$65497,2,FALSE))","v":""},null,null,"A + B fehlt",null,{"$f":"IF(AND(O235=\"x\",Q235=\"x\"),\"wechsel\",IF(AND(O235=\"x\",Q235<>\"x\"),\"\",IF(AND(Q235=\"x\",O235<>\"x\"),\"M fehlt\",\"A + B fehlt\")))","v":"A + B fehlt"},null,{"$f":"IF(AND(Q235=\"x\",S235=\"x\"),\"wechsel\",IF(AND(Q235=\"x\",S235<>\"x\"),\"\",IF(AND(S235=\"x\",Q235<>\"x\"),\"M fehlt\",\"A + B fehlt\")))","v":"A + B fehlt"},null,null,null,null,null,null,null,{"$f":"IF(WEEKNUM(A235,2)<>WEEKNUM(A236,2),SUM(Y$7:Y235)-SUM(Z$6:Z234),\"\")","v":""}]
[null,null,{"$f":"IF(B236=0,\"\",VLOOKUP(B236,Etappen!$1:$65497,2,FALSE))","v":""},null,{"$f":"IF(D236=0,\"\",VLOOKUP(D236,Etappen!$1:$65497,2,FALSE))","v":""},null,{"$f":"IF(F236=0,\"\",VLOOKUP(F236,Etappen!$1:$65497,2,FALSE))","v":""},null,{"$f":"IF(H236=0,\"\",VLOOKUP(H236,Etappen!$1:$65497,2,FALSE))","v":""},null,{"$f":"IF(J236=0,\"\",VLOOKUP(J236,Etappen!$1:$65497,2,FALSE))","v":""},null,null,"A + B fehlt",null,{"$f":"IF(AND(O236=\"x\",Q236=\"x\"),\"wechsel\",IF(AND(O236=\"x\",Q236<>\"x\"),\"\",IF(AND(Q236=\"x\",O236<>\"x\"),\"M fehlt\",\"A + B fehlt\")))","v":"A + B fehlt"},null,{"$f":"IF(AND(Q236=\"x\",S236=\"x\"),\"wechsel\",IF(AND(Q236=\"x\",S236<>\"x\"),\"\",IF(AND(S236=\"x\",Q236<>\"x\"),\"M fehlt\",\"A + B fehlt\")))","v":"A + B fehlt"},null,null,null,null,null,null,null,{"$f":"IF(WEEKNUM(A236,2)<>WEEKNUM(A237,2),SUM(Y$7:Y236)-SUM(Z$6:Z235),\"\")","v":""}]
[null,null,{"$f":"IF(B237=0,\"\",VLOOKUP(B237,Etappen!$1:$65497,2,FALSE))","v":""},null,{"$f":"IF(D237=0,\"\",VLOOKUP(D237,Etappen!$1:$65497,2,FALSE))","v":""},null,{"$f":"IF(F237=0,\"\",VLOOKUP(F237,Etappen!$1:$65497,2,FALSE))","v":""},null,{"$f":"IF(H237=0,\"\",VLOOKUP(H237,Etappen!$1:$65497,2,FALSE))","v":""},null,{"$f":"IF(J237=0,\"\",VLOOKUP(J237,Etappen!$1:$65497,2,FALSE))","v":""},null,null,"A + B fehlt",null,{"$f":"IF(AND(O237=\"x\",Q237=\"x\"),\"wechsel\",IF(AND(O237=\"x\",Q237<>\"x\"),\"\",IF(AND(Q237=\"x\",O237<>\"x\"),\"M fehlt\",\"A + B fehlt\")))","v":"A + B fehlt"},null,{"$f":"IF(AND(Q237=\"x\",S237=\"x\"),\"wechsel\",IF(AND(Q237=\"x\",S237<>\"x\"),\"\",IF(AND(S237=\"x\",Q237<>\"x\"),\"M fehlt\",\"A + B fehlt\")))","v":"A + B fehlt"},null,null,null,null,null,null,null,{"$f":"IF(WEEKNUM(A237,2)<>WEEKNUM(A238,2),SUM(Y$7:Y237)-SUM(Z$6:Z236),\"\")","v":""}]
[null,null,{"$f":"IF(B238=0,\"\",VLOOKUP(B238,Etappen!$1:$65497,2,FALSE))","v":""},null,{"$f":"IF(D238=0,\"\",VLOOKUP(D238,Etappen!$1:$65497,2,FALSE))","v":""},null,{"$f":"IF(F238=0,\"\",VLOOKUP(F238,Etappen!$1:$65497,2,FALSE))","v":""},null,{"$f":"IF(H238=0,\"\",VLOOKUP(H238,Etappen!$1:$65497,2,FALSE))","v":""},null,{"$f":"IF(J238=0,\"\",VLOOKUP(J238,Etappen!$1:$65497,2,FALSE))","v":""},null,null,"A + B fehlt",null,{"$f":"IF(AND(O238=\"x\",Q238=\"x\"),\"wechsel\",IF(AND(O238=\"x\",Q238<>\"x\"),\"\",IF(AND(Q238=\"x\",O238<>\"x\"),\"M fehlt\",\"A + B fehlt\")))","v":"A + B fehlt"},null,{"$f":"IF(AND(Q238=\"x\",S238=\"x\"),\"wechsel\",IF(AND(Q238=\"x\",S238<>\"x\"),\"\",IF(AND(S238=\"x\",Q238<>\"x\"),\"M fehlt\",\"A + B fehlt\")))","v":"A + B fehlt"},null,null,null,null,null,null,null,{"$f":"IF(WEEKNUM(A238,2)<>WEEKNUM(A239,2),SUM(Y$7:Y238)-SUM(Z$6:Z237),\"\")","v":""}]
[null,null,{"$f":"IF(B239=0,\"\",VLOOKUP(B239,Etappen!$1:$65497,2,FALSE))","v":""},null,{"$f":"IF(D239=0,\"\",VLOOKUP(D239,Etappen!$1:$65497,2,FALSE))","v":""},null,{"$f":"IF(F239=0,\"\",VLOOKUP(F239,Etappen!$1:$65497,2,FALSE))","v":""},null,{"$f":"IF(H239=0,\"\",VLOOKUP(H239,Etappen!$1:$65497,2,FALSE))","v":""},null,{"$f":"IF(J239=0,\"\",VLOOKUP(J239,Etappen!$1:$65497,2,FALSE))","v":""},null,null,"A + B fehlt",null,{"$f":"IF(AND(O239=\"x\",Q239=\"x\"),\"wechsel\",IF(AND(O239=\"x\",Q239<>\"x\"),\"\",IF(AND(Q239=\"x\",O239<>\"x\"),\"M fehlt\",\"A + B fehlt\")))","v":"A + B fehlt"},null,{"$f":"IF(AND(Q239=\"x\",S239=\"x\"),\"wechsel\",IF(AND(Q239=\"x\",S239<>\"x\"),\"\",IF(AND(S239=\"x\",Q239<>\"x\"),\"M fehlt\",\"A + B fehlt\")))","v":"A + B fehlt"},null,null,null,null,null,null,null,{"$f":"IF(WEEKNUM(A239,2)<>WEEKNUM(A240,2),SUM(Y$7:Y239)-SUM(Z$6:Z238),\"\")","v":""}]
[null,null,{"$f":"IF(B240=0,\"\",VLOOKUP(B240,Etappen!$1:$65497,2,FALSE))","v":""},null,{"$f":"IF(D240=0,\"\",VLOOKUP(D240,Etappen!$1:$65497,2,FALSE))","v":""},null,{"$f":"IF(F240=0,\"\",VLOOKUP(F240,Etappen!$1:$65497,2,FALSE))","v":""},null,{"$f":"IF(H240=0,\"\",VLOOKUP(H240,Etappen!$1:$65497,2,FALSE))","v":""},null,{"$f":"IF(J240=0,\"\",VLOOKUP(J240,Etappen!$1:$65497,2,FALSE))","v":""},null,null,"A + B fehlt",null,{"$f":"IF(AND(O240=\"x\",Q240=\"x\"),\"wechsel\",IF(AND(O240=\"x\",Q240<>\"x\"),\"\",IF(AND(Q240=\"x\",O240<>\"x\"),\"M fehlt\",\"A + B fehlt\")))","v":"A + B fehlt"},null,{"$f":"IF(AND(Q240=\"x\",S240=\"x\"),\"wechsel\",IF(AND(Q240=\"x\",S240<>\"x\"),\"\",IF(AND(S240=\"x\",Q240<>\"x\"),\"M fehlt\",\"A + B fehlt\")))","v":"A + B fehlt"},null,null,null,null,null,null,null,{"$f":"IF(WEEKNUM(A240,2)<>WEEKNUM(A241,2),SUM(Y$7:Y240)-SUM(Z$6:Z239),\"\")","v":""}]
[null,null,{"$f":"IF(B241=0,\"\",VLOOKUP(B241,Etappen!$1:$65497,2,FALSE))","v":""},null,{"$f":"IF(D241=0,\"\",VLOOKUP(D241,Etappen!$1:$65497,2,FALSE))","v":""},null,{"$f":"IF(F241=0,\"\",VLOOKUP(F241,Etappen!$1:$65497,2,FALSE))","v":""},null,{"$f":"IF(H241=0,\"\",VLOOKUP(H241,Etappen!$1:$65497,2,FALSE))","v":""},null,{"$f":"IF(J241=0,\"\",VLOOKUP(J241,Etappen!$1:$65497,2,FALSE))","v":""},null,null,"A + B fehlt",null,{"$f":"IF(AND(O241=\"x\",Q241=\"x\"),\"wechsel\",IF(AND(O241=\"x\",Q241<>\"x\"),\"\",IF(AND(Q241=\"x\",O241<>\"x\"),\"M fehlt\",\"A + B fehlt\")))","v":"A + B fehlt"},null,{"$f":"IF(AND(Q241=\"x\",S241=\"x\"),\"wechsel\",IF(AND(Q241=\"x\",S241<>\"x\"),\"\",IF(AND(S241=\"x\",Q241<>\"x\"),\"M fehlt\",\"A + B fehlt\")))","v":"A + B fehlt"},null,null,null,null,null,null,null,{"$f":"IF(WEEKNUM(A241,2)<>WEEKNUM(A242,2),SUM(Y$7:Y241)-SUM(Z$6:Z240),\"\")","v":""}]
[null,null,{"$f":"IF(B242=0,\"\",VLOOKUP(B242,Etappen!$1:$65497,2,FALSE))","v":""},null,{"$f":"IF(D242=0,\"\",VLOOKUP(D242,Etappen!$1:$65497,2,FALSE))","v":""},null,{"$f":"IF(F242=0,\"\",VLOOKUP(F242,Etappen!$1:$65497,2,FALSE))","v":""},null,{"$f":"IF(H242=0,\"\",VLOOKUP(H242,Etappen!$1:$65497,2,FALSE))","v":""},null,{"$f":"IF(J242=0,\"\",VLOOKUP(J242,Etappen!$1:$65497,2,FALSE))","v":""},null,null,"A + B fehlt",null,{"$f":"IF(AND(O242=\"x\",Q242=\"x\"),\"wechsel\",IF(AND(O242=\"x\",Q242<>\"x\"),\"\",IF(AND(Q242=\"x\",O242<>\"x\"),\"M fehlt\",\"A + B fehlt\")))","v":"A + B fehlt"},null,{"$f":"IF(AND(Q242=\"x\",S242=\"x\"),\"wechsel\",IF(AND(Q242=\"x\",S242<>\"x\"),\"\",IF(AND(S242=\"x\",Q242<>\"x\"),\"M fehlt\",\"A + B fehlt\")))","v":"A + B fehlt"},null,null,null,null,null,null,null,{"$f":"IF(WEEKNUM(A242,2)<>WEEKNUM(A243,2),SUM(Y$7:Y242)-SUM(Z$6:Z241),\"\")","v":""}]
[null,null,{"$f":"IF(B243=0,\"\",VLOOKUP(B243,Etappen!$1:$65497,2,FALSE))","v":""},null,{"$f":"IF(D243=0,\"\",VLOOKUP(D243,Etappen!$1:$65497,2,FALSE))","v":""},null,{"$f":"IF(F243=0,\"\",VLOOKUP(F243,Etappen!$1:$65497,2,FALSE))","v":""},null,{"$f":"IF(H243=0,\"\",VLOOKUP(H243,Etappen!$1:$65497,2,FALSE))","v":""},null,{"$f":"IF(J243=0,\"\",VLOOKUP(J243,Etappen!$1:$65497,2,FALSE))","v":""},null,null,"A + B fehlt",null,{"$f":"IF(AND(O243=\"x\",Q243=\"x\"),\"wechsel\",IF(AND(O243=\"x\",Q243<>\"x\"),\"\",IF(AND(Q243=\"x\",O243<>\"x\"),\"M fehlt\",\"A + B fehlt\")))","v":"A + B fehlt"},null,{"$f":"IF(AND(Q243=\"x\",S243=\"x\"),\"wechsel\",IF(AND(Q243=\"x\",S243<>\"x\"),\"\",IF(AND(S243=\"x\",Q243<>\"x\"),\"M fehlt\",\"A + B fehlt\")))","v":"A + B fehlt"},null,null,null,null,null,null,null,{"$f":"IF(WEEKNUM(A243,2)<>WEEKNUM(A244,2),SUM(Y$7:Y243)-SUM(Z$6:Z242),\"\")","v":""}]
[null,null,{"$f":"IF(B244=0,\"\",VLOOKUP(B244,Etappen!$1:$65497,2,FALSE))","v":""},null,{"$f":"IF(D244=0,\"\",VLOOKUP(D244,Etappen!$1:$65497,2,FALSE))","v":""},null,{"$f":"IF(F244=0,\"\",VLOOKUP(F244,Etappen!$1:$65497,2,FALSE))","v":""},null,{"$f":"IF(H244=0,\"\",VLOOKUP(H244,Etappen!$1:$65497,2,FALSE))","v":""},null,{"$f":"IF(J244=0,\"\",VLOOKUP(J244,Etappen!$1:$65497,2,FALSE))","v":""},null,null,"A + B fehlt",null,{"$f":"IF(AND(O244=\"x\",Q244=\"x\"),\"wechsel\",IF(AND(O244=\"x\",Q244<>\"x\"),\"\",IF(AND(Q244=\"x\",O244<>\"x\"),\"M fehlt\",\"A + B fehlt\")))","v":"A + B fehlt"},null,{"$f":"IF(AND(Q244=\"x\",S244=\"x\"),\"wechsel\",IF(AND(Q244=\"x\",S244<>\"x\"),\"\",IF(AND(S244=\"x\",Q244<>\"x\"),\"M fehlt\",\"A + B fehlt\")))","v":"A + B fehlt"},null,null,null,null,null,null,null,{"$f":"IF(WEEKNUM(A244,2)<>WEEKNUM(A245,2),SUM(Y$7:Y244)-SUM(Z$6:Z243),\"\")","v":""}]
[null,null,{"$f":"IF(B245=0,\"\",VLOOKUP(B245,Etappen!$1:$65497,2,FALSE))","v":""},null,{"$f":"IF(D245=0,\"\",VLOOKUP(D245,Etappen!$1:$65497,2,FALSE))","v":""},null,{"$f":"IF(F245=0,\"\",VLOOKUP(F245,Etappen!$1:$65497,2,FALSE))","v":""},null,{"$f":"IF(H245=0,\"\",VLOOKUP(H245,Etappen!$1:$65497,2,FALSE))","v":""},null,{"$f":"IF(J245=0,\"\",VLOOKUP(J245,Etappen!$1:$65497,2,FALSE))","v":""},null,null,"A + B fehlt",null,{"$f":"IF(AND(O245=\"x\",Q245=\"x\"),\"wechsel\",IF(AND(O245=\"x\",Q245<>\"x\"),\"\",IF(AND(Q245=\"x\",O245<>\"x\"),\"M fehlt\",\"A + B fehlt\")))","v":"A + B fehlt"},null,{"$f":"IF(AND(Q245=\"x\",S245=\"x\"),\"wechsel\",IF(AND(Q245=\"x\",S245<>\"x\"),\"\",IF(AND(S245=\"x\",Q245<>\"x\"),\"M fehlt\",\"A + B fehlt\")))","v":"A + B fehlt"},null,null,null,null,null,null,null,{"$f":"IF(WEEKNUM(A245,2)<>WEEKNUM(A246,2),SUM(Y$7:Y245)-SUM(Z$6:Z244),\"\")","v":""}]
[null,null,{"$f":"IF(B246=0,\"\",VLOOKUP(B246,Etappen!$1:$65497,2,FALSE))","v":""},null,{"$f":"IF(D246=0,\"\",VLOOKUP(D246,Etappen!$1:$65497,2,FALSE))","v":""},null,{"$f":"IF(F246=0,\"\",VLOOKUP(F246,Etappen!$1:$65497,2,FALSE))","v":""},null,{"$f":"IF(H246=0,\"\",VLOOKUP(H246,Etappen!$1:$65497,2,FALSE))","v":""},null,{"$f":"IF(J246=0,\"\",VLOOKUP(J246,Etappen!$1:$65497,2,FALSE))","v":""},null,null,"A + B fehlt",null,{"$f":"IF(AND(O246=\"x\",Q246=\"x\"),\"wechsel\",IF(AND(O246=\"x\",Q246<>\"x\"),\"\",IF(AND(Q246=\"x\",O246<>\"x\"),\"M fehlt\",\"A + B fehlt\")))","v":"A + B fehlt"},null,{"$f":"IF(AND(Q246=\"x\",S246=\"x\"),\"wechsel\",IF(AND(Q246=\"x\",S246<>\"x\"),\"\",IF(AND(S246=\"x\",Q246<>\"x\"),\"M fehlt\",\"A + B fehlt\")))","v":"A + B fehlt"},null,null,null,null,null,null,null,{"$f":"IF(WEEKNUM(A246,2)<>WEEKNUM(A247,2),SUM(Y$7:Y246)-SUM(Z$6:Z245),\"\")","v":""}]
[null,null,{"$f":"IF(B247=0,\"\",VLOOKUP(B247,Etappen!$1:$65497,2,FALSE))","v":""},null,{"$f":"IF(D247=0,\"\",VLOOKUP(D247,Etappen!$1:$65497,2,FALSE))","v":""},null,{"$f":"IF(F247=0,\"\",VLOOKUP(F247,Etappen!$1:$65497,2,FALSE))","v":""},null,{"$f":"IF(H247=0,\"\",VLOOKUP(H247,Etappen!$1:$65497,2,FALSE))","v":""},null,{"$f":"IF(J247=0,\"\",VLOOKUP(J247,Etappen!$1:$65497,2,FALSE))","v":""},null,null,"A + B fehlt",null,{"$f":"IF(AND(O247=\"x\",Q247=\"x\"),\"wechsel\",IF(AND(O247=\"x\",Q247<>\"x\"),\"\",IF(AND(Q247=\"x\",O247<>\"x\"),\"M fehlt\",\"A + B fehlt\")))","v":"A + B fehlt"},null,{"$f":"IF(AND(Q247=\"x\",S247=\"x\"),\"wechsel\",IF(AND(Q247=\"x\",S247<>\"x\"),\"\",IF(AND(S247=\"x\",Q247<>\"x\"),\"M fehlt\",\"A + B fehlt\")))","v":"A + B fehlt"},null,null,null,null,null,null,null,{"$f":"IF(WEEKNUM(A247,2)<>WEEKNUM(A248,2),SUM(Y$7:Y247)-SUM(Z$6:Z246),\"\")","v":""}]
[null,null,{"$f":"IF(B248=0,\"\",VLOOKUP(B248,Etappen!$1:$65497,2,FALSE))","v":""},null,{"$f":"IF(D248=0,\"\",VLOOKUP(D248,Etappen!$1:$65497,2,FALSE))","v":""},null,{"$f":"IF(F248=0,\"\",VLOOKUP(F248,Etappen!$1:$65497,2,FALSE))","v":""},null,{"$f":"IF(H248=0,\"\",VLOOKUP(H248,Etappen!$1:$65497,2,FALSE))","v":""},null,{"$f":"IF(J248=0,\"\",VLOOKUP(J248,Etappen!$1:$65497,2,FALSE))","v":""},null,null,"A + B fehlt",null,{"$f":"IF(AND(O248=\"x\",Q248=\"x\"),\"wechsel\",IF(AND(O248=\"x\",Q248<>\"x\"),\"\",IF(AND(Q248=\"x\",O248<>\"x\"),\"M fehlt\",\"A + B fehlt\")))","v":"A + B fehlt"},null,{"$f":"IF(AND(Q248=\"x\",S248=\"x\"),\"wechsel\",IF(AND(Q248=\"x\",S248<>\"x\"),\"\",IF(AND(S248=\"x\",Q248<>\"x\"),\"M fehlt\",\"A + B fehlt\")))","v":"A + B fehlt"},null,null,null,null,null,null,null,{"$f":"IF(WEEKNUM(A248,2)<>WEEKNUM(A249,2),SUM(Y$7:Y248)-SUM(Z$6:Z247),\"\")","v":""}]
[null,null,{"$f":"IF(B249=0,\"\",VLOOKUP(B249,Etappen!$1:$65497,2,FALSE))","v":""},null,{"$f":"IF(D249=0,\"\",VLOOKUP(D249,Etappen!$1:$65497,2,FALSE))","v":""},null,{"$f":"IF(F249=0,\"\",VLOOKUP(F249,Etappen!$1:$65497,2,FALSE))","v":""},null,{"$f":"IF(H249=0,\"\",VLOOKUP(H249,Etappen!$1:$65497,2,FALSE))","v":""},null,{"$f":"IF(J249=0,\"\",VLOOKUP(J249,Etappen!$1:$65497,2,FALSE))","v":""},null,null,"A + B fehlt",null,{"$f":"IF(AND(O249=\"x\",Q249=\"x\"),\"wechsel\",IF(AND(O249=\"x\",Q249<>\"x\"),\"\",IF(AND(Q249=\"x\",O249<>\"x\"),\"M fehlt\",\"A + B fehlt\")))","v":"A + B fehlt"},null,{"$f":"IF(AND(Q249=\"x\",S249=\"x\"),\"wechsel\",IF(AND(Q249=\"x\",S249<>\"x\"),\"\",IF(AND(S249=\"x\",Q249<>\"x\"),\"M fehlt\",\"A + B fehlt\")))","v":"A + B fehlt"},null,null,null,null,null,null,null,{"$f":"IF(WEEKNUM(A249,2)<>WEEKNUM(A250,2),SUM(Y$7:Y249)-SUM(Z$6:Z248),\"\")","v":""}]
[null,null,{"$f":"IF(B250=0,\"\",VLOOKUP(B250,Etappen!$1:$65497,2,FALSE))","v":""},null,{"$f":"IF(D250=0,\"\",VLOOKUP(D250,Etappen!$1:$65497,2,FALSE))","v":""},null,{"$f":"IF(F250=0,\"\",VLOOKUP(F250,Etappen!$1:$65497,2,FALSE))","v":""},null,{"$f":"IF(H250=0,\"\",VLOOKUP(H250,Etappen!$1:$65497,2,FALSE))","v":""},null,{"$f":"IF(J250=0,\"\",VLOOKUP(J250,Etappen!$1:$65497,2,FALSE))","v":""},null,null,"A + B fehlt",null,{"$f":"IF(AND(O250=\"x\",Q250=\"x\"),\"wechsel\",IF(AND(O250=\"x\",Q250<>\"x\"),\"\",IF(AND(Q250=\"x\",O250<>\"x\"),\"M fehlt\",\"A + B fehlt\")))","v":"A + B fehlt"},null,{"$f":"IF(AND(Q250=\"x\",S250=\"x\"),\"wechsel\",IF(AND(Q250=\"x\",S250<>\"x\"),\"\",IF(AND(S250=\"x\",Q250<>\"x\"),\"M fehlt\",\"A + B fehlt\")))","v":"A + B fehlt"},null,null,null,null,null,null,null,{"$f":"IF(WEEKNUM(A250,2)<>WEEKNUM(A251,2),SUM(Y$7:Y250)-SUM(Z$6:Z249),\"\")","v":""}]
[null,null,{"$f":"IF(B251=0,\"\",VLOOKUP(B251,Etappen!$1:$65497,2,FALSE))","v":""},null,{"$f":"IF(D251=0,\"\",VLOOKUP(D251,Etappen!$1:$65497,2,FALSE))","v":""},null,{"$f":"IF(F251=0,\"\",VLOOKUP(F251,Etappen!$1:$65497,2,FALSE))","v":""},null,{"$f":"IF(H251=0,\"\",VLOOKUP(H251,Etappen!$1:$65497,2,FALSE))","v":""},null,{"$f":"IF(J251=0,\"\",VLOOKUP(J251,Etappen!$1:$65497,2,FALSE))","v":""},null,null,"A + B fehlt",null,{"$f":"IF(AND(O251=\"x\",Q251=\"x\"),\"wechsel\",IF(AND(O251=\"x\",Q251<>\"x\"),\"\",IF(AND(Q251=\"x\",O251<>\"x\"),\"M fehlt\",\"A + B fehlt\")))","v":"A + B fehlt"},null,{"$f":"IF(AND(Q251=\"x\",S251=\"x\"),\"wechsel\",IF(AND(Q251=\"x\",S251<>\"x\"),\"\",IF(AND(S251=\"x\",Q251<>\"x\"),\"M fehlt\",\"A + B fehlt\")))","v":"A + B fehlt"},null,null,null,null,null,null,null,{"$f":"IF(WEEKNUM(A251,2)<>WEEKNUM(A252,2),SUM(Y$7:Y251)-SUM(Z$6:Z250),\"\")","v":""}]
[null,null,{"$f":"IF(B252=0,\"\",VLOOKUP(B252,Etappen!$1:$65497,2,FALSE))","v":""},null,{"$f":"IF(D252=0,\"\",VLOOKUP(D252,Etappen!$1:$65497,2,FALSE))","v":""},null,{"$f":"IF(F252=0,\"\",VLOOKUP(F252,Etappen!$1:$65497,2,FALSE))","v":""},null,{"$f":"IF(H252=0,\"\",VLOOKUP(H252,Etappen!$1:$65497,2,FALSE))","v":""},null,{"$f":"IF(J252=0,\"\",VLOOKUP(J252,Etappen!$1:$65497,2,FALSE))","v":""},null,null,"A + B fehlt",null,{"$f":"IF(AND(O252=\"x\",Q252=\"x\"),\"wechsel\",IF(AND(O252=\"x\",Q252<>\"x\"),\"\",IF(AND(Q252=\"x\",O252<>\"x\"),\"M fehlt\",\"A + B fehlt\")))","v":"A + B fehlt"},null,{"$f":"IF(AND(Q252=\"x\",S252=\"x\"),\"wechsel\",IF(AND(Q252=\"x\",S252<>\"x\"),\"\",IF(AND(S252=\"x\",Q252<>\"x\"),\"M fehlt\",\"A + B fehlt\")))","v":"A + B fehlt"},null,null,null,null,null,null,null,{"$f":"IF(WEEKNUM(A252,2)<>WEEKNUM(A253,2),SUM(Y$7:Y252)-SUM(Z$6:Z251),\"\")","v":""}]
[null,null,{"$f":"IF(B253=0,\"\",VLOOKUP(B253,Etappen!$1:$65497,2,FALSE))","v":""},null,{"$f":"IF(D253=0,\"\",VLOOKUP(D253,Etappen!$1:$65497,2,FALSE))","v":""},null,{"$f":"IF(F253=0,\"\",VLOOKUP(F253,Etappen!$1:$65497,2,FALSE))","v":""},null,{"$f":"IF(H253=0,\"\",VLOOKUP(H253,Etappen!$1:$65497,2,FALSE))","v":""},null,{"$f":"IF(J253=0,\"\",VLOOKUP(J253,Etappen!$1:$65497,2,FALSE))","v":""},null,null,"A + B fehlt",null,{"$f":"IF(AND(O253=\"x\",Q253=\"x\"),\"wechsel\",IF(AND(O253=\"x\",Q253<>\"x\"),\"\",IF(AND(Q253=\"x\",O253<>\"x\"),\"M fehlt\",\"A + B fehlt\")))","v":"A + B fehlt"},null,{"$f":"IF(AND(Q253=\"x\",S253=\"x\"),\"wechsel\",IF(AND(Q253=\"x\",S253<>\"x\"),\"\",IF(AND(S253=\"x\",Q253<>\"x\"),\"M fehlt\",\"A + B fehlt\")))","v":"A + B fehlt"},null,null,null,null,null,null,null,{"$f":"IF(WEEKNUM(A253,2)<>WEEKNUM(A254,2),SUM(Y$7:Y253)-SUM(Z$6:Z252),\"\")","v":""}]
[null,null,{"$f":"IF(B254=0,\"\",VLOOKUP(B254,Etappen!$1:$65497,2,FALSE))","v":""},null,{"$f":"IF(D254=0,\"\",VLOOKUP(D254,Etappen!$1:$65497,2,FALSE))","v":""},null,{"$f":"IF(F254=0,\"\",VLOOKUP(F254,Etappen!$1:$65497,2,FALSE))","v":""},null,{"$f":"IF(H254=0,\"\",VLOOKUP(H254,Etappen!$1:$65497,2,FALSE))","v":""},null,{"$f":"IF(J254=0,\"\",VLOOKUP(J254,Etappen!$1:$65497,2,FALSE))","v":""},null,null,"A + B fehlt",null,{"$f":"IF(AND(O254=\"x\",Q254=\"x\"),\"wechsel\",IF(AND(O254=\"x\",Q254<>\"x\"),\"\",IF(AND(Q254=\"x\",O254<>\"x\"),\"M fehlt\",\"A + B fehlt\")))","v":"A + B fehlt"},null,{"$f":"IF(AND(Q254=\"x\",S254=\"x\"),\"wechsel\",IF(AND(Q254=\"x\",S254<>\"x\"),\"\",IF(AND(S254=\"x\",Q254<>\"x\"),\"M fehlt\",\"A + B fehlt\")))","v":"A + B fehlt"},null,null,null,null,null,null,null,{"$f":"IF(WEEKNUM(A254,2)<>WEEKNUM(A255,2),SUM(Y$7:Y254)-SUM(Z$6:Z253),\"\")","v":""}]
[null,null,{"$f":"IF(B255=0,\"\",VLOOKUP(B255,Etappen!$1:$65497,2,FALSE))","v":""},null,{"$f":"IF(D255=0,\"\",VLOOKUP(D255,Etappen!$1:$65497,2,FALSE))","v":""},null,{"$f":"IF(F255=0,\"\",VLOOKUP(F255,Etappen!$1:$65497,2,FALSE))","v":""},null,{"$f":"IF(H255=0,\"\",VLOOKUP(H255,Etappen!$1:$65497,2,FALSE))","v":""},null,{"$f":"IF(J255=0,\"\",VLOOKUP(J255,Etappen!$1:$65497,2,FALSE))","v":""},null,null,"A + B fehlt",null,{"$f":"IF(AND(O255=\"x\",Q255=\"x\"),\"wechsel\",IF(AND(O255=\"x\",Q255<>\"x\"),\"\",IF(AND(Q255=\"x\",O255<>\"x\"),\"M fehlt\",\"A + B fehlt\")))","v":"A + B fehlt"},null,{"$f":"IF(AND(Q255=\"x\",S255=\"x\"),\"wechsel\",IF(AND(Q255=\"x\",S255<>\"x\"),\"\",IF(AND(S255=\"x\",Q255<>\"x\"),\"M fehlt\",\"A + B fehlt\")))","v":"A + B fehlt"},null,null,null,null,null,null,null,{"$f":"IF(WEEKNUM(A255,2)<>WEEKNUM(A256,2),SUM(Y$7:Y255)-SUM(Z$6:Z254),\"\")","v":""}]
[null,null,{"$f":"IF(B256=0,\"\",VLOOKUP(B256,Etappen!$1:$65497,2,FALSE))","v":""},null,{"$f":"IF(D256=0,\"\",VLOOKUP(D256,Etappen!$1:$65497,2,FALSE))","v":""},null,{"$f":"IF(F256=0,\"\",VLOOKUP(F256,Etappen!$1:$65497,2,FALSE))","v":""},null,{"$f":"IF(H256=0,\"\",VLOOKUP(H256,Etappen!$1:$65497,2,FALSE))","v":""},null,{"$f":"IF(J256=0,\"\",VLOOKUP(J256,Etappen!$1:$65497,2,FALSE))","v":""},null,null,"A + B fehlt",null,{"$f":"IF(AND(O256=\"x\",Q256=\"x\"),\"wechsel\",IF(AND(O256=\"x\",Q256<>\"x\"),\"\",IF(AND(Q256=\"x\",O256<>\"x\"),\"M fehlt\",\"A + B fehlt\")))","v":"A + B fehlt"},null,{"$f":"IF(AND(Q256=\"x\",S256=\"x\"),\"wechsel\",IF(AND(Q256=\"x\",S256<>\"x\"),\"\",IF(AND(S256=\"x\",Q256<>\"x\"),\"M fehlt\",\"A + B fehlt\")))","v":"A + B fehlt"},null,null,null,null,null,null,null,{"$f":"IF(WEEKNUM(A256,2)<>WEEKNUM(A257,2),SUM(Y$7:Y256)-SUM(Z$6:Z255),\"\")","v":""}]
[null,null,{"$f":"IF(B257=0,\"\",VLOOKUP(B257,Etappen!$1:$65497,2,FALSE))","v":""},null,{"$f":"IF(D257=0,\"\",VLOOKUP(D257,Etappen!$1:$65497,2,FALSE))","v":""},null,{"$f":"IF(F257=0,\"\",VLOOKUP(F257,Etappen!$1:$65497,2,FALSE))","v":""},null,{"$f":"IF(H257=0,\"\",VLOOKUP(H257,Etappen!$1:$65497,2,FALSE))","v":""},null,{"$f":"IF(J257=0,\"\",VLOOKUP(J257,Etappen!$1:$65497,2,FALSE))","v":""},null,null,"A + B fehlt",null,{"$f":"IF(AND(O257=\"x\",Q257=\"x\"),\"wechsel\",IF(AND(O257=\"x\",Q257<>\"x\"),\"\",IF(AND(Q257=\"x\",O257<>\"x\"),\"M fehlt\",\"A + B fehlt\")))","v":"A + B fehlt"},null,{"$f":"IF(AND(Q257=\"x\",S257=\"x\"),\"wechsel\",IF(AND(Q257=\"x\",S257<>\"x\"),\"\",IF(AND(S257=\"x\",Q257<>\"x\"),\"M fehlt\",\"A + B fehlt\")))","v":"A + B fehlt"},null,null,null,null,null,null,null,{"$f":"IF(WEEKNUM(A257,2)<>WEEKNUM(A258,2),SUM(Y$7:Y257)-SUM(Z$6:Z256),\"\")","v":""}]
[null,null,{"$f":"IF(B258=0,\"\",VLOOKUP(B258,Etappen!$1:$65497,2,FALSE))","v":""},null,{"$f":"IF(D258=0,\"\",VLOOKUP(D258,Etappen!$1:$65497,2,FALSE))","v":""},null,{"$f":"IF(F258=0,\"\",VLOOKUP(F258,Etappen!$1:$65497,2,FALSE))","v":""},null,{"$f":"IF(H258=0,\"\",VLOOKUP(H258,Etappen!$1:$65497,2,FALSE))","v":""},null,{"$f":"IF(J258=0,\"\",VLOOKUP(J258,Etappen!$1:$65497,2,FALSE))","v":""},null,null,"A + B fehlt",null,{"$f":"IF(AND(O258=\"x\",Q258=\"x\"),\"wechsel\",IF(AND(O258=\"x\",Q258<>\"x\"),\"\",IF(AND(Q258=\"x\",O258<>\"x\"),\"M fehlt\",\"A + B fehlt\")))","v":"A + B fehlt"},null,{"$f":"IF(AND(Q258=\"x\",S258=\"x\"),\"wechsel\",IF(AND(Q258=\"x\",S258<>\"x\"),\"\",IF(AND(S258=\"x\",Q258<>\"x\"),\"M fehlt\",\"A + B fehlt\")))","v":"A + B fehlt"},null,null,null,null,null,null,null,{"$f":"IF(WEEKNUM(A258,2)<>WEEKNUM(A259,2),SUM(Y$7:Y258)-SUM(Z$6:Z257),\"\")","v":""}]
[null,null,{"$f":"IF(B259=0,\"\",VLOOKUP(B259,Etappen!$1:$65497,2,FALSE))","v":""},null,{"$f":"IF(D259=0,\"\",VLOOKUP(D259,Etappen!$1:$65497,2,FALSE))","v":""},null,{"$f":"IF(F259=0,\"\",VLOOKUP(F259,Etappen!$1:$65497,2,FALSE))","v":""},null,{"$f":"IF(H259=0,\"\",VLOOKUP(H259,Etappen!$1:$65497,2,FALSE))","v":""},null,{"$f":"IF(J259=0,\"\",VLOOKUP(J259,Etappen!$1:$65497,2,FALSE))","v":""},null,null,{"$f":"IF(AND(M259=\"x\",O259=\"x\"),\"wechsel\",IF(AND(M259=\"x\",O259<>\"x\"),\"\",IF(AND(O259=\"x\",M259<>\"x\"),\"M fehlt\",\"A + B fehlt\")))","v":"A + B fehlt"},null,{"$f":"IF(AND(O259=\"x\",Q259=\"x\"),\"wechsel\",IF(AND(O259=\"x\",Q259<>\"x\"),\"\",IF(AND(Q259=\"x\",O259<>\"x\"),\"M fehlt\",\"A + B fehlt\")))","v":"A + B fehlt"},null,{"$f":"IF(AND(Q259=\"x\",S259=\"x\"),\"wechsel\",IF(AND(Q259=\"x\",S259<>\"x\"),\"\",IF(AND(S259=\"x\",Q259<>\"x\"),\"M fehlt\",\"A + B fehlt\")))","v":"A + B fehlt"},null,null,null,null,null,null,null,{"$f":"IF(WEEKNUM(A259,2)<>WEEKNUM(A260,2),SUM(Y$7:Y259)-SUM(Z$6:Z258),\"\")","v":""}]
[null,null,{"$f":"IF(B260=0,\"\",VLOOKUP(B260,Etappen!$1:$65497,2,FALSE))","v":""},null,{"$f":"IF(D260=0,\"\",VLOOKUP(D260,Etappen!$1:$65497,2,FALSE))","v":""},null,{"$f":"IF(F260=0,\"\",VLOOKUP(F260,Etappen!$1:$65497,2,FALSE))","v":""},null,{"$f":"IF(H260=0,\"\",VLOOKUP(H260,Etappen!$1:$65497,2,FALSE))","v":""},null,{"$f":"IF(J260=0,\"\",VLOOKUP(J260,Etappen!$1:$65497,2,FALSE))","v":""},null,null,"A + B fehlt",null,{"$f":"IF(AND(O260=\"x\",Q260=\"x\"),\"wechsel\",IF(AND(O260=\"x\",Q260<>\"x\"),\"\",IF(AND(Q260=\"x\",O260<>\"x\"),\"M fehlt\",\"A + B fehlt\")))","v":"A + B fehlt"},null,{"$f":"IF(AND(Q260=\"x\",S260=\"x\"),\"wechsel\",IF(AND(Q260=\"x\",S260<>\"x\"),\"\",IF(AND(S260=\"x\",Q260<>\"x\"),\"M fehlt\",\"A + B fehlt\")))","v":"A + B fehlt"},null,null,null,null,null,null,null,{"$f":"IF(WEEKNUM(A260,2)<>WEEKNUM(A261,2),SUM(Y$7:Y260)-SUM(Z$6:Z259),\"\")","v":""}]
[null,null,{"$f":"IF(B261=0,\"\",VLOOKUP(B261,Etappen!$1:$65497,2,FALSE))","v":""},null,{"$f":"IF(D261=0,\"\",VLOOKUP(D261,Etappen!$1:$65497,2,FALSE))","v":""},null,{"$f":"IF(F261=0,\"\",VLOOKUP(F261,Etappen!$1:$65497,2,FALSE))","v":""},null,{"$f":"IF(H261=0,\"\",VLOOKUP(H261,Etappen!$1:$65497,2,FALSE))","v":""},null,{"$f":"IF(J261=0,\"\",VLOOKUP(J261,Etappen!$1:$65497,2,FALSE))","v":""},null,null,"A + B fehlt",null,{"$f":"IF(AND(O261=\"x\",Q261=\"x\"),\"wechsel\",IF(AND(O261=\"x\",Q261<>\"x\"),\"\",IF(AND(Q261=\"x\",O261<>\"x\"),\"M fehlt\",\"A + B fehlt\")))","v":"A + B fehlt"},null,{"$f":"IF(AND(Q261=\"x\",S261=\"x\"),\"wechsel\",IF(AND(Q261=\"x\",S261<>\"x\"),\"\",IF(AND(S261=\"x\",Q261<>\"x\"),\"M fehlt\",\"A + B fehlt\")))","v":"A + B fehlt"},null,null,null,null,null,null,null,{"$f":"IF(WEEKNUM(A261,2)<>WEEKNUM(A262,2),SUM(Y$7:Y261)-SUM(Z$6:Z260),\"\")","v":""}]
[null,null,{"$f":"IF(B262=0,\"\",VLOOKUP(B262,Etappen!$1:$65497,2,FALSE))","v":""},null,{"$f":"IF(D262=0,\"\",VLOOKUP(D262,Etappen!$1:$65497,2,FALSE))","v":""},null,{"$f":"IF(F262=0,\"\",VLOOKUP(F262,Etappen!$1:$65497,2,FALSE))","v":""},null,{"$f":"IF(H262=0,\"\",VLOOKUP(H262,Etappen!$1:$65497,2,FALSE))","v":""},null,{"$f":"IF(J262=0,\"\",VLOOKUP(J262,Etappen!$1:$65497,2,FALSE))","v":""},null,null,"A + B fehlt",null,{"$f":"IF(AND(O262=\"x\",Q262=\"x\"),\"wechsel\",IF(AND(O262=\"x\",Q262<>\"x\"),\"\",IF(AND(Q262=\"x\",O262<>\"x\"),\"M fehlt\",\"A + B fehlt\")))","v":"A + B fehlt"},null,{"$f":"IF(AND(Q262=\"x\",S262=\"x\"),\"wechsel\",IF(AND(Q262=\"x\",S262<>\"x\"),\"\",IF(AND(S262=\"x\",Q262<>\"x\"),\"M fehlt\",\"A + B fehlt\")))","v":"A + B fehlt"},null,null,null,null,null,null,null,{"$f":"IF(WEEKNUM(A262,2)<>WEEKNUM(A263,2),SUM(Y$7:Y262)-SUM(Z$6:Z261),\"\")","v":""}]
[null,null,{"$f":"IF(B263=0,\"\",VLOOKUP(B263,Etappen!$1:$65497,2,FALSE))","v":""},null,{"$f":"IF(D263=0,\"\",VLOOKUP(D263,Etappen!$1:$65497,2,FALSE))","v":""},null,{"$f":"IF(F263=0,\"\",VLOOKUP(F263,Etappen!$1:$65497,2,FALSE))","v":""},null,{"$f":"IF(H263=0,\"\",VLOOKUP(H263,Etappen!$1:$65497,2,FALSE))","v":""},null,{"$f":"IF(J263=0,\"\",VLOOKUP(J263,Etappen!$1:$65497,2,FALSE))","v":""},null,null,"A + B fehlt",null,{"$f":"IF(AND(O263=\"x\",Q263=\"x\"),\"wechsel\",IF(AND(O263=\"x\",Q263<>\"x\"),\"\",IF(AND(Q263=\"x\",O263<>\"x\"),\"M fehlt\",\"A + B fehlt\")))","v":"A + B fehlt"},null,{"$f":"IF(AND(Q263=\"x\",S263=\"x\"),\"wechsel\",IF(AND(Q263=\"x\",S263<>\"x\"),\"\",IF(AND(S263=\"x\",Q263<>\"x\"),\"M fehlt\",\"A + B fehlt\")))","v":"A + B fehlt"},null,null,null,null,null,null,null,{"$f":"IF(WEEKNUM(A263,2)<>WEEKNUM(A264,2),SUM(Y$7:Y263)-SUM(Z$6:Z262),\"\")","v":""}]
[null,null,{"$f":"IF(B264=0,\"\",VLOOKUP(B264,Etappen!$1:$65497,2,FALSE))","v":""},null,{"$f":"IF(D264=0,\"\",VLOOKUP(D264,Etappen!$1:$65497,2,FALSE))","v":""},null,{"$f":"IF(F264=0,\"\",VLOOKUP(F264,Etappen!$1:$65497,2,FALSE))","v":""},null,{"$f":"IF(H264=0,\"\",VLOOKUP(H264,Etappen!$1:$65497,2,FALSE))","v":""},null,{"$f":"IF(J264=0,\"\",VLOOKUP(J264,Etappen!$1:$65497,2,FALSE))","v":""},null,null,"A + B fehlt",null,{"$f":"IF(AND(O264=\"x\",Q264=\"x\"),\"wechsel\",IF(AND(O264=\"x\",Q264<>\"x\"),\"\",IF(AND(Q264=\"x\",O264<>\"x\"),\"M fehlt\",\"A + B fehlt\")))","v":"A + B fehlt"},null,{"$f":"IF(AND(Q264=\"x\",S264=\"x\"),\"wechsel\",IF(AND(Q264=\"x\",S264<>\"x\"),\"\",IF(AND(S264=\"x\",Q264<>\"x\"),\"M fehlt\",\"A + B fehlt\")))","v":"A + B fehlt"},null,null,null,null,null,null,null,{"$f":"IF(WEEKNUM(A264,2)<>WEEKNUM(A265,2),SUM(Y$7:Y264)-SUM(Z$6:Z263),\"\")","v":""}]
[null,null,{"$f":"IF(B265=0,\"\",VLOOKUP(B265,Etappen!$1:$65497,2,FALSE))","v":""},null,{"$f":"IF(D265=0,\"\",VLOOKUP(D265,Etappen!$1:$65497,2,FALSE))","v":""},null,{"$f":"IF(F265=0,\"\",VLOOKUP(F265,Etappen!$1:$65497,2,FALSE))","v":""},null,{"$f":"IF(H265=0,\"\",VLOOKUP(H265,Etappen!$1:$65497,2,FALSE))","v":""},null,{"$f":"IF(J265=0,\"\",VLOOKUP(J265,Etappen!$1:$65497,2,FALSE))","v":""},null,null,"A + B fehlt",null,{"$f":"IF(AND(O265=\"x\",Q265=\"x\"),\"wechsel\",IF(AND(O265=\"x\",Q265<>\"x\"),\"\",IF(AND(Q265=\"x\",O265<>\"x\"),\"M fehlt\",\"A + B fehlt\")))","v":"A + B fehlt"},null,{"$f":"IF(AND(Q265=\"x\",S265=\"x\"),\"wechsel\",IF(AND(Q265=\"x\",S265<>\"x\"),\"\",IF(AND(S265=\"x\",Q265<>\"x\"),\"M fehlt\",\"A + B fehlt\")))","v":"A + B fehlt"},null,null,null,null,null,null,null,{"$f":"IF(WEEKNUM(A265,2)<>WEEKNUM(A266,2),SUM(Y$7:Y265)-SUM(Z$6:Z264),\"\")","v":""}]
[null,null,{"$f":"IF(B266=0,\"\",VLOOKUP(B266,Etappen!$1:$65497,2,FALSE))","v":""},null,{"$f":"IF(D266=0,\"\",VLOOKUP(D266,Etappen!$1:$65497,2,FALSE))","v":""},null,{"$f":"IF(F266=0,\"\",VLOOKUP(F266,Etappen!$1:$65497,2,FALSE))","v":""},null,{"$f":"IF(H266=0,\"\",VLOOKUP(H266,Etappen!$1:$65497,2,FALSE))","v":""},null,{"$f":"IF(J266=0,\"\",VLOOKUP(J266,Etappen!$1:$65497,2,FALSE))","v":""},null,null,"A + B fehlt",null,{"$f":"IF(AND(O266=\"x\",Q266=\"x\"),\"wechsel\",IF(AND(O266=\"x\",Q266<>\"x\"),\"\",IF(AND(Q266=\"x\",O266<>\"x\"),\"M fehlt\",\"A + B fehlt\")))","v":"A + B fehlt"},null,{"$f":"IF(AND(Q266=\"x\",S266=\"x\"),\"wechsel\",IF(AND(Q266=\"x\",S266<>\"x\"),\"\",IF(AND(S266=\"x\",Q266<>\"x\"),\"M fehlt\",\"A + B fehlt\")))","v":"A + B fehlt"},null,null,null,null,null,null,null,{"$f":"IF(WEEKNUM(A266,2)<>WEEKNUM(A267,2),SUM(Y$7:Y266)-SUM(Z$6:Z265),\"\")","v":""}]
[null,null,{"$f":"IF(B267=0,\"\",VLOOKUP(B267,Etappen!$1:$65497,2,FALSE))","v":""},null,{"$f":"IF(D267=0,\"\",VLOOKUP(D267,Etappen!$1:$65497,2,FALSE))","v":""},null,{"$f":"IF(F267=0,\"\",VLOOKUP(F267,Etappen!$1:$65497,2,FALSE))","v":""},null,{"$f":"IF(H267=0,\"\",VLOOKUP(H267,Etappen!$1:$65497,2,FALSE))","v":""},null,{"$f":"IF(J267=0,\"\",VLOOKUP(J267,Etappen!$1:$65497,2,FALSE))","v":""},null,null,"A + B fehlt",null,{"$f":"IF(AND(O267=\"x\",Q267=\"x\"),\"wechsel\",IF(AND(O267=\"x\",Q267<>\"x\"),\"\",IF(AND(Q267=\"x\",O267<>\"x\"),\"M fehlt\",\"A + B fehlt\")))","v":"A + B fehlt"},null,{"$f":"IF(AND(Q267=\"x\",S267=\"x\"),\"wechsel\",IF(AND(Q267=\"x\",S267<>\"x\"),\"\",IF(AND(S267=\"x\",Q267<>\"x\"),\"M fehlt\",\"A + B fehlt\")))","v":"A + B fehlt"},null,null,null,null,null,null,null,{"$f":"IF(WEEKNUM(A267,2)<>WEEKNUM(A268,2),SUM(Y$7:Y267)-SUM(Z$6:Z266),\"\")","v":""}]
[null,null,{"$f":"IF(B268=0,\"\",VLOOKUP(B268,Etappen!$1:$65497,2,FALSE))","v":""},null,{"$f":"IF(D268=0,\"\",VLOOKUP(D268,Etappen!$1:$65497,2,FALSE))","v":""},null,{"$f":"IF(F268=0,\"\",VLOOKUP(F268,Etappen!$1:$65497,2,FALSE))","v":""},null,{"$f":"IF(H268=0,\"\",VLOOKUP(H268,Etappen!$1:$65497,2,FALSE))","v":""},null,{"$f":"IF(J268=0,\"\",VLOOKUP(J268,Etappen!$1:$65497,2,FALSE))","v":""},null,null,"A + B fehlt",null,{"$f":"IF(AND(O268=\"x\",Q268=\"x\"),\"wechsel\",IF(AND(O268=\"x\",Q268<>\"x\"),\"\",IF(AND(Q268=\"x\",O268<>\"x\"),\"M fehlt\",\"A + B fehlt\")))","v":"A + B fehlt"},null,{"$f":"IF(AND(Q268=\"x\",S268=\"x\"),\"wechsel\",IF(AND(Q268=\"x\",S268<>\"x\"),\"\",IF(AND(S268=\"x\",Q268<>\"x\"),\"M fehlt\",\"A + B fehlt\")))","v":"A + B fehlt"},null,null,null,null,null,null,null,{"$f":"IF(WEEKNUM(A268,2)<>WEEKNUM(A269,2),SUM(Y$7:Y268)-SUM(Z$6:Z267),\"\")","v":""}]
[null,null,{"$f":"IF(B269=0,\"\",VLOOKUP(B269,Etappen!$1:$65497,2,FALSE))","v":""},null,{"$f":"IF(D269=0,\"\",VLOOKUP(D269,Etappen!$1:$65497,2,FALSE))","v":""},null,{"$f":"IF(F269=0,\"\",VLOOKUP(F269,Etappen!$1:$65497,2,FALSE))","v":""},null,{"$f":"IF(H269=0,\"\",VLOOKUP(H269,Etappen!$1:$65497,2,FALSE))","v":""},null,{"$f":"IF(J269=0,\"\",VLOOKUP(J269,Etappen!$1:$65497,2,FALSE))","v":""},null,null,"A + B fehlt",null,{"$f":"IF(AND(O269=\"x\",Q269=\"x\"),\"wechsel\",IF(AND(O269=\"x\",Q269<>\"x\"),\"\",IF(AND(Q269=\"x\",O269<>\"x\"),\"M fehlt\",\"A + B fehlt\")))","v":"A + B fehlt"},null,{"$f":"IF(AND(Q269=\"x\",S269=\"x\"),\"wechsel\",IF(AND(Q269=\"x\",S269<>\"x\"),\"\",IF(AND(S269=\"x\",Q269<>\"x\"),\"M fehlt\",\"A + B fehlt\")))","v":"A + B fehlt"},null,null,null,null,null,null,null,{"$f":"IF(WEEKNUM(A269,2)<>WEEKNUM(A270,2),SUM(Y$7:Y269)-SUM(Z$6:Z268),\"\")","v":""}]
[null,null,{"$f":"IF(B270=0,\"\",VLOOKUP(B270,Etappen!$1:$65497,2,FALSE))","v":""},null,{"$f":"IF(D270=0,\"\",VLOOKUP(D270,Etappen!$1:$65497,2,FALSE))","v":""},null,{"$f":"IF(F270=0,\"\",VLOOKUP(F270,Etappen!$1:$65497,2,FALSE))","v":""},null,{"$f":"IF(H270=0,\"\",VLOOKUP(H270,Etappen!$1:$65497,2,FALSE))","v":""},null,{"$f":"IF(J270=0,\"\",VLOOKUP(J270,Etappen!$1:$65497,2,FALSE))","v":""},null,null,"A + B fehlt",null,{"$f":"IF(AND(O270=\"x\",Q270=\"x\"),\"wechsel\",IF(AND(O270=\"x\",Q270<>\"x\"),\"\",IF(AND(Q270=\"x\",O270<>\"x\"),\"M fehlt\",\"A + B fehlt\")))","v":"A + B fehlt"},null,{"$f":"IF(AND(Q270=\"x\",S270=\"x\"),\"wechsel\",IF(AND(Q270=\"x\",S270<>\"x\"),\"\",IF(AND(S270=\"x\",Q270<>\"x\"),\"M fehlt\",\"A + B fehlt\")))","v":"A + B fehlt"},null,null,null,null,null,null,null,{"$f":"IF(WEEKNUM(A270,2)<>WEEKNUM(A271,2),SUM(Y$7:Y270)-SUM(Z$6:Z269),\"\")","v":""}]
[null,null,{"$f":"IF(B271=0,\"\",VLOOKUP(B271,Etappen!$1:$65497,2,FALSE))","v":""},null,{"$f":"IF(D271=0,\"\",VLOOKUP(D271,Etappen!$1:$65497,2,FALSE))","v":""},null,{"$f":"IF(F271=0,\"\",VLOOKUP(F271,Etappen!$1:$65497,2,FALSE))","v":""},null,{"$f":"IF(H271=0,\"\",VLOOKUP(H271,Etappen!$1:$65497,2,FALSE))","v":""},null,{"$f":"IF(J271=0,\"\",VLOOKUP(J271,Etappen!$1:$65497,2,FALSE))","v":""},null,null,"A + B fehlt",null,{"$f":"IF(AND(O271=\"x\",Q271=\"x\"),\"wechsel\",IF(AND(O271=\"x\",Q271<>\"x\"),\"\",IF(AND(Q271=\"x\",O271<>\"x\"),\"M fehlt\",\"A + B fehlt\")))","v":"A + B fehlt"},null,{"$f":"IF(AND(Q271=\"x\",S271=\"x\"),\"wechsel\",IF(AND(Q271=\"x\",S271<>\"x\"),\"\",IF(AND(S271=\"x\",Q271<>\"x\"),\"M fehlt\",\"A + B fehlt\")))","v":"A + B fehlt"},null,null,null,null,null,null,null,{"$f":"IF(WEEKNUM(A271,2)<>WEEKNUM(A272,2),SUM(Y$7:Y271)-SUM(Z$6:Z270),\"\")","v":""}]
[null,null,{"$f":"IF(B272=0,\"\",VLOOKUP(B272,Etappen!$1:$65497,2,FALSE))","v":""},null,{"$f":"IF(D272=0,\"\",VLOOKUP(D272,Etappen!$1:$65497,2,FALSE))","v":""},null,{"$f":"IF(F272=0,\"\",VLOOKUP(F272,Etappen!$1:$65497,2,FALSE))","v":""},null,{"$f":"IF(H272=0,\"\",VLOOKUP(H272,Etappen!$1:$65497,2,FALSE))","v":""},null,{"$f":"IF(J272=0,\"\",VLOOKUP(J272,Etappen!$1:$65497,2,FALSE))","v":""},null,null,"A + B fehlt",null,{"$f":"IF(AND(O272=\"x\",Q272=\"x\"),\"wechsel\",IF(AND(O272=\"x\",Q272<>\"x\"),\"\",IF(AND(Q272=\"x\",O272<>\"x\"),\"M fehlt\",\"A + B fehlt\")))","v":"A + B fehlt"},null,{"$f":"IF(AND(Q272=\"x\",S272=\"x\"),\"wechsel\",IF(AND(Q272=\"x\",S272<>\"x\"),\"\",IF(AND(S272=\"x\",Q272<>\"x\"),\"M fehlt\",\"A + B fehlt\")))","v":"A + B fehlt"},null,null,null,null,null,null,null,{"$f":"IF(WEEKNUM(A272,2)<>WEEKNUM(A273,2),SUM(Y$7:Y272)-SUM(Z$6:Z271),\"\")","v":""}]
[null,null,{"$f":"IF(B273=0,\"\",VLOOKUP(B273,Etappen!$1:$65497,2,FALSE))","v":""},null,{"$f":"IF(D273=0,\"\",VLOOKUP(D273,Etappen!$1:$65497,2,FALSE))","v":""},null,{"$f":"IF(F273=0,\"\",VLOOKUP(F273,Etappen!$1:$65497,2,FALSE))","v":""},null,{"$f":"IF(H273=0,\"\",VLOOKUP(H273,Etappen!$1:$65497,2,FALSE))","v":""},null,{"$f":"IF(J273=0,\"\",VLOOKUP(J273,Etappen!$1:$65497,2,FALSE))","v":""},null,null,"A + B fehlt",null,{"$f":"IF(AND(O273=\"x\",Q273=\"x\"),\"wechsel\",IF(AND(O273=\"x\",Q273<>\"x\"),\"\",IF(AND(Q273=\"x\",O273<>\"x\"),\"M fehlt\",\"A + B fehlt\")))","v":"A + B fehlt"},null,{"$f":"IF(AND(Q273=\"x\",S273=\"x\"),\"wechsel\",IF(AND(Q273=\"x\",S273<>\"x\"),\"\",IF(AND(S273=\"x\",Q273<>\"x\"),\"M fehlt\",\"A + B fehlt\")))","v":"A + B fehlt"},null,null,null,null,null,null,null,{"$f":"IF(WEEKNUM(A273,2)<>WEEKNUM(A274,2),SUM(Y$7:Y273)-SUM(Z$6:Z272),\"\")","v":""}]
[null,null,{"$f":"IF(B274=0,\"\",VLOOKUP(B274,Etappen!$1:$65497,2,FALSE))","v":""},null,{"$f":"IF(D274=0,\"\",VLOOKUP(D274,Etappen!$1:$65497,2,FALSE))","v":""},null,{"$f":"IF(F274=0,\"\",VLOOKUP(F274,Etappen!$1:$65497,2,FALSE))","v":""},null,{"$f":"IF(H274=0,\"\",VLOOKUP(H274,Etappen!$1:$65497,2,FALSE))","v":""},null,{"$f":"IF(J274=0,\"\",VLOOKUP(J274,Etappen!$1:$65497,2,FALSE))","v":""},null,null,"A + B fehlt",null,{"$f":"IF(AND(O274=\"x\",Q274=\"x\"),\"wechsel\",IF(AND(O274=\"x\",Q274<>\"x\"),\"\",IF(AND(Q274=\"x\",O274<>\"x\"),\"M fehlt\",\"A + B fehlt\")))","v":"A + B fehlt"},null,{"$f":"IF(AND(Q274=\"x\",S274=\"x\"),\"wechsel\",IF(AND(Q274=\"x\",S274<>\"x\"),\"\",IF(AND(S274=\"x\",Q274<>\"x\"),\"M fehlt\",\"A + B fehlt\")))","v":"A + B fehlt"},null,null,null,null,null,null,null,{"$f":"IF(WEEKNUM(A274,2)<>WEEKNUM(A275,2),SUM(Y$7:Y274)-SUM(Z$6:Z273),\"\")","v":""}]
[null,null,{"$f":"IF(B275=0,\"\",VLOOKUP(B275,Etappen!$1:$65497,2,FALSE))","v":""},null,{"$f":"IF(D275=0,\"\",VLOOKUP(D275,Etappen!$1:$65497,2,FALSE))","v":""},null,{"$f":"IF(F275=0,\"\",VLOOKUP(F275,Etappen!$1:$65497,2,FALSE))","v":""},null,{"$f":"IF(H275=0,\"\",VLOOKUP(H275,Etappen!$1:$65497,2,FALSE))","v":""},null,{"$f":"IF(J275=0,\"\",VLOOKUP(J275,Etappen!$1:$65497,2,FALSE))","v":""},null,null,"A + B fehlt",null,{"$f":"IF(AND(O275=\"x\",Q275=\"x\"),\"wechsel\",IF(AND(O275=\"x\",Q275<>\"x\"),\"\",IF(AND(Q275=\"x\",O275<>\"x\"),\"M fehlt\",\"A + B fehlt\")))","v":"A + B fehlt"},null,{"$f":"IF(AND(Q275=\"x\",S275=\"x\"),\"wechsel\",IF(AND(Q275=\"x\",S275<>\"x\"),\"\",IF(AND(S275=\"x\",Q275<>\"x\"),\"M fehlt\",\"A + B fehlt\")))","v":"A + B fehlt"},null,null,null,null,null,null,null,{"$f":"IF(WEEKNUM(A275,2)<>WEEKNUM(A276,2),SUM(Y$7:Y275)-SUM(Z$6:Z274),\"\")","v":""}]
[null,null,{"$f":"IF(B276=0,\"\",VLOOKUP(B276,Etappen!$1:$65497,2,FALSE))","v":""},null,{"$f":"IF(D276=0,\"\",VLOOKUP(D276,Etappen!$1:$65497,2,FALSE))","v":""},null,{"$f":"IF(F276=0,\"\",VLOOKUP(F276,Etappen!$1:$65497,2,FALSE))","v":""},null,{"$f":"IF(H276=0,\"\",VLOOKUP(H276,Etappen!$1:$65497,2,FALSE))","v":""},null,{"$f":"IF(J276=0,\"\",VLOOKUP(J276,Etappen!$1:$65497,2,FALSE))","v":""},null,null,"A + B fehlt",null,{"$f":"IF(AND(O276=\"x\",Q276=\"x\"),\"wechsel\",IF(AND(O276=\"x\",Q276<>\"x\"),\"\",IF(AND(Q276=\"x\",O276<>\"x\"),\"M fehlt\",\"A + B fehlt\")))","v":"A + B fehlt"},null,{"$f":"IF(AND(Q276=\"x\",S276=\"x\"),\"wechsel\",IF(AND(Q276=\"x\",S276<>\"x\"),\"\",IF(AND(S276=\"x\",Q276<>\"x\"),\"M fehlt\",\"A + B fehlt\")))","v":"A + B fehlt"},null,null,null,null,null,null,null,{"$f":"IF(WEEKNUM(A276,2)<>WEEKNUM(A277,2),SUM(Y$7:Y276)-SUM(Z$6:Z275),\"\")","v":""}]
[null,null,{"$f":"IF(B277=0,\"\",VLOOKUP(B277,Etappen!$1:$65497,2,FALSE))","v":""},null,{"$f":"IF(D277=0,\"\",VLOOKUP(D277,Etappen!$1:$65497,2,FALSE))","v":""},null,{"$f":"IF(F277=0,\"\",VLOOKUP(F277,Etappen!$1:$65497,2,FALSE))","v":""},null,{"$f":"IF(H277=0,\"\",VLOOKUP(H277,Etappen!$1:$65497,2,FALSE))","v":""},null,{"$f":"IF(J277=0,\"\",VLOOKUP(J277,Etappen!$1:$65497,2,FALSE))","v":""},null,null,"A + B fehlt",null,{"$f":"IF(AND(O277=\"x\",Q277=\"x\"),\"wechsel\",IF(AND(O277=\"x\",Q277<>\"x\"),\"\",IF(AND(Q277=\"x\",O277<>\"x\"),\"M fehlt\",\"A + B fehlt\")))","v":"A + B fehlt"},null,{"$f":"IF(AND(Q277=\"x\",S277=\"x\"),\"wechsel\",IF(AND(Q277=\"x\",S277<>\"x\"),\"\",IF(AND(S277=\"x\",Q277<>\"x\"),\"M fehlt\",\"A + B fehlt\")))","v":"A + B fehlt"},null,null,null,null,null,null,null,{"$f":"IF(WEEKNUM(A277,2)<>WEEKNUM(A278,2),SUM(Y$7:Y277)-SUM(Z$6:Z276),\"\")","v":""}]
[null,null,{"$f":"IF(B278=0,\"\",VLOOKUP(B278,Etappen!$1:$65497,2,FALSE))","v":""},null,{"$f":"IF(D278=0,\"\",VLOOKUP(D278,Etappen!$1:$65497,2,FALSE))","v":""},null,{"$f":"IF(F278=0,\"\",VLOOKUP(F278,Etappen!$1:$65497,2,FALSE))","v":""},null,{"$f":"IF(H278=0,\"\",VLOOKUP(H278,Etappen!$1:$65497,2,FALSE))","v":""},null,{"$f":"IF(J278=0,\"\",VLOOKUP(J278,Etappen!$1:$65497,2,FALSE))","v":""},null,null,"A + B fehlt",null,{"$f":"IF(AND(O278=\"x\",Q278=\"x\"),\"wechsel\",IF(AND(O278=\"x\",Q278<>\"x\"),\"\",IF(AND(Q278=\"x\",O278<>\"x\"),\"M fehlt\",\"A + B fehlt\")))","v":"A + B fehlt"},null,{"$f":"IF(AND(Q278=\"x\",S278=\"x\"),\"wechsel\",IF(AND(Q278=\"x\",S278<>\"x\"),\"\",IF(AND(S278=\"x\",Q278<>\"x\"),\"M fehlt\",\"A + B fehlt\")))","v":"A + B fehlt"},null,null,null,null,null,null,null,{"$f":"IF(WEEKNUM(A278,2)<>WEEKNUM(A279,2),SUM(Y$7:Y278)-SUM(Z$6:Z277),\"\")","v":""}]
[null,null,{"$f":"IF(B279=0,\"\",VLOOKUP(B279,Etappen!$1:$65497,2,FALSE))","v":""},null,{"$f":"IF(D279=0,\"\",VLOOKUP(D279,Etappen!$1:$65497,2,FALSE))","v":""},null,{"$f":"IF(F279=0,\"\",VLOOKUP(F279,Etappen!$1:$65497,2,FALSE))","v":""},null,{"$f":"IF(H279=0,\"\",VLOOKUP(H279,Etappen!$1:$65497,2,FALSE))","v":""},null,{"$f":"IF(J279=0,\"\",VLOOKUP(J279,Etappen!$1:$65497,2,FALSE))","v":""},null,null,"A + B fehlt",null,{"$f":"IF(AND(O279=\"x\",Q279=\"x\"),\"wechsel\",IF(AND(O279=\"x\",Q279<>\"x\"),\"\",IF(AND(Q279=\"x\",O279<>\"x\"),\"M fehlt\",\"A + B fehlt\")))","v":"A + B fehlt"},null,{"$f":"IF(AND(Q279=\"x\",S279=\"x\"),\"wechsel\",IF(AND(Q279=\"x\",S279<>\"x\"),\"\",IF(AND(S279=\"x\",Q279<>\"x\"),\"M fehlt\",\"A + B fehlt\")))","v":"A + B fehlt"},null,null,null,null,null,null,null,{"$f":"IF(WEEKNUM(A279,2)<>WEEKNUM(A280,2),SUM(Y$7:Y279)-SUM(Z$6:Z278),\"\")","v":""}]
[null,null,{"$f":"IF(B280=0,\"\",VLOOKUP(B280,Etappen!$1:$65497,2,FALSE))","v":""},null,{"$f":"IF(D280=0,\"\",VLOOKUP(D280,Etappen!$1:$65497,2,FALSE))","v":""},null,{"$f":"IF(F280=0,\"\",VLOOKUP(F280,Etappen!$1:$65497,2,FALSE))","v":""},null,{"$f":"IF(H280=0,\"\",VLOOKUP(H280,Etappen!$1:$65497,2,FALSE))","v":""},null,{"$f":"IF(J280=0,\"\",VLOOKUP(J280,Etappen!$1:$65497,2,FALSE))","v":""},null,null,"A + B fehlt",null,{"$f":"IF(AND(O280=\"x\",Q280=\"x\"),\"wechsel\",IF(AND(O280=\"x\",Q280<>\"x\"),\"\",IF(AND(Q280=\"x\",O280<>\"x\"),\"M fehlt\",\"A + B fehlt\")))","v":"A + B fehlt"},null,{"$f":"IF(AND(Q280=\"x\",S280=\"x\"),\"wechsel\",IF(AND(Q280=\"x\",S280<>\"x\"),\"\",IF(AND(S280=\"x\",Q280<>\"x\"),\"M fehlt\",\"A + B fehlt\")))","v":"A + B fehlt"},null,null,null,null,null,null,null,{"$f":"IF(WEEKNUM(A280,2)<>WEEKNUM(A281,2),SUM(Y$7:Y280)-SUM(Z$6:Z279),\"\")","v":""}]
[null,null,{"$f":"IF(B281=0,\"\",VLOOKUP(B281,Etappen!$1:$65497,2,FALSE))","v":""},null,{"$f":"IF(D281=0,\"\",VLOOKUP(D281,Etappen!$1:$65497,2,FALSE))","v":""},null,{"$f":"IF(F281=0,\"\",VLOOKUP(F281,Etappen!$1:$65497,2,FALSE))","v":""},null,{"$f":"IF(H281=0,\"\",VLOOKUP(H281,Etappen!$1:$65497,2,FALSE))","v":""},null,{"$f":"IF(J281=0,\"\",VLOOKUP(J281,Etappen!$1:$65497,2,FALSE))","v":""},null,null,"A + B fehlt",null,{"$f":"IF(AND(O281=\"x\",Q281=\"x\"),\"wechsel\",IF(AND(O281=\"x\",Q281<>\"x\"),\"\",IF(AND(Q281=\"x\",O281<>\"x\"),\"M fehlt\",\"A + B fehlt\")))","v":"A + B fehlt"},null,{"$f":"IF(AND(Q281=\"x\",S281=\"x\"),\"wechsel\",IF(AND(Q281=\"x\",S281<>\"x\"),\"\",IF(AND(S281=\"x\",Q281<>\"x\"),\"M fehlt\",\"A + B fehlt\")))","v":"A + B fehlt"},null,null,null,null,null,null,null,{"$f":"IF(WEEKNUM(A281,2)<>WEEKNUM(A282,2),SUM(Y$7:Y281)-SUM(Z$6:Z280),\"\")","v":""}]
[null,null,{"$f":"IF(B282=0,\"\",VLOOKUP(B282,Etappen!$1:$65497,2,FALSE))","v":""},null,{"$f":"IF(D282=0,\"\",VLOOKUP(D282,Etappen!$1:$65497,2,FALSE))","v":""},null,{"$f":"IF(F282=0,\"\",VLOOKUP(F282,Etappen!$1:$65497,2,FALSE))","v":""},null,{"$f":"IF(H282=0,\"\",VLOOKUP(H282,Etappen!$1:$65497,2,FALSE))","v":""},null,{"$f":"IF(J282=0,\"\",VLOOKUP(J282,Etappen!$1:$65497,2,FALSE))","v":""},null,null,"A + B fehlt",null,{"$f":"IF(AND(O282=\"x\",Q282=\"x\"),\"wechsel\",IF(AND(O282=\"x\",Q282<>\"x\"),\"\",IF(AND(Q282=\"x\",O282<>\"x\"),\"M fehlt\",\"A + B fehlt\")))","v":"A + B fehlt"},null,{"$f":"IF(AND(Q282=\"x\",S282=\"x\"),\"wechsel\",IF(AND(Q282=\"x\",S282<>\"x\"),\"\",IF(AND(S282=\"x\",Q282<>\"x\"),\"M fehlt\",\"A + B fehlt\")))","v":"A + B fehlt"},null,null,null,null,null,null,null,{"$f":"IF(WEEKNUM(A282,2)<>WEEKNUM(A283,2),SUM(Y$7:Y282)-SUM(Z$6:Z281),\"\")","v":""}]
[null,null,{"$f":"IF(B283=0,\"\",VLOOKUP(B283,Etappen!$1:$65497,2,FALSE))","v":""},null,{"$f":"IF(D283=0,\"\",VLOOKUP(D283,Etappen!$1:$65497,2,FALSE))","v":""},null,{"$f":"IF(F283=0,\"\",VLOOKUP(F283,Etappen!$1:$65497,2,FALSE))","v":""},null,{"$f":"IF(H283=0,\"\",VLOOKUP(H283,Etappen!$1:$65497,2,FALSE))","v":""},null,{"$f":"IF(J283=0,\"\",VLOOKUP(J283,Etappen!$1:$65497,2,FALSE))","v":""},null,null,"A + B fehlt",null,{"$f":"IF(AND(O283=\"x\",Q283=\"x\"),\"wechsel\",IF(AND(O283=\"x\",Q283<>\"x\"),\"\",IF(AND(Q283=\"x\",O283<>\"x\"),\"M fehlt\",\"A + B fehlt\")))","v":"A + B fehlt"},null,{"$f":"IF(AND(Q283=\"x\",S283=\"x\"),\"wechsel\",IF(AND(Q283=\"x\",S283<>\"x\"),\"\",IF(AND(S283=\"x\",Q283<>\"x\"),\"M fehlt\",\"A + B fehlt\")))","v":"A + B fehlt"},null,null,null,null,null,null,null,{"$f":"IF(WEEKNUM(A283,2)<>WEEKNUM(A284,2),SUM(Y$7:Y283)-SUM(Z$6:Z282),\"\")","v":""}]
[null,null,{"$f":"IF(B284=0,\"\",VLOOKUP(B284,Etappen!$1:$65497,2,FALSE))","v":""},null,{"$f":"IF(D284=0,\"\",VLOOKUP(D284,Etappen!$1:$65497,2,FALSE))","v":""},null,{"$f":"IF(F284=0,\"\",VLOOKUP(F284,Etappen!$1:$65497,2,FALSE))","v":""},null,{"$f":"IF(H284=0,\"\",VLOOKUP(H284,Etappen!$1:$65497,2,FALSE))","v":""},null,{"$f":"IF(J284=0,\"\",VLOOKUP(J284,Etappen!$1:$65497,2,FALSE))","v":""},null,null,"A + B fehlt",null,{"$f":"IF(AND(O284=\"x\",Q284=\"x\"),\"wechsel\",IF(AND(O284=\"x\",Q284<>\"x\"),\"\",IF(AND(Q284=\"x\",O284<>\"x\"),\"M fehlt\",\"A + B fehlt\")))","v":"A + B fehlt"},null,{"$f":"IF(AND(Q284=\"x\",S284=\"x\"),\"wechsel\",IF(AND(Q284=\"x\",S284<>\"x\"),\"\",IF(AND(S284=\"x\",Q284<>\"x\"),\"M fehlt\",\"A + B fehlt\")))","v":"A + B fehlt"},null,null,null,null,null,null,null,{"$f":"IF(WEEKNUM(A284,2)<>WEEKNUM(A285,2),SUM(Y$7:Y284)-SUM(Z$6:Z283),\"\")","v":""}]
[null,null,{"$f":"IF(B285=0,\"\",VLOOKUP(B285,Etappen!$1:$65497,2,FALSE))","v":""},null,{"$f":"IF(D285=0,\"\",VLOOKUP(D285,Etappen!$1:$65497,2,FALSE))","v":""},null,{"$f":"IF(F285=0,\"\",VLOOKUP(F285,Etappen!$1:$65497,2,FALSE))","v":""},null,{"$f":"IF(H285=0,\"\",VLOOKUP(H285,Etappen!$1:$65497,2,FALSE))","v":""},null,{"$f":"IF(J285=0,\"\",VLOOKUP(J285,Etappen!$1:$65497,2,FALSE))","v":""},null,null,"A + B fehlt",null,{"$f":"IF(AND(O285=\"x\",Q285=\"x\"),\"wechsel\",IF(AND(O285=\"x\",Q285<>\"x\"),\"\",IF(AND(Q285=\"x\",O285<>\"x\"),\"M fehlt\",\"A + B fehlt\")))","v":"A + B fehlt"},null,{"$f":"IF(AND(Q285=\"x\",S285=\"x\"),\"wechsel\",IF(AND(Q285=\"x\",S285<>\"x\"),\"\",IF(AND(S285=\"x\",Q285<>\"x\"),\"M fehlt\",\"A + B fehlt\")))","v":"A + B fehlt"},null,null,null,null,null,null,null,{"$f":"IF(WEEKNUM(A285,2)<>WEEKNUM(A286,2),SUM(Y$7:Y285)-SUM(Z$6:Z284),\"\")","v":""}]
[null,null,{"$f":"IF(B286=0,\"\",VLOOKUP(B286,Etappen!$1:$65497,2,FALSE))","v":""},null,{"$f":"IF(D286=0,\"\",VLOOKUP(D286,Etappen!$1:$65497,2,FALSE))","v":""},null,{"$f":"IF(F286=0,\"\",VLOOKUP(F286,Etappen!$1:$65497,2,FALSE))","v":""},null,{"$f":"IF(H286=0,\"\",VLOOKUP(H286,Etappen!$1:$65497,2,FALSE))","v":""},null,{"$f":"IF(J286=0,\"\",VLOOKUP(J286,Etappen!$1:$65497,2,FALSE))","v":""},null,null,"A + B fehlt",null,{"$f":"IF(AND(O286=\"x\",Q286=\"x\"),\"wechsel\",IF(AND(O286=\"x\",Q286<>\"x\"),\"\",IF(AND(Q286=\"x\",O286<>\"x\"),\"M fehlt\",\"A + B fehlt\")))","v":"A + B fehlt"},null,{"$f":"IF(AND(Q286=\"x\",S286=\"x\"),\"wechsel\",IF(AND(Q286=\"x\",S286<>\"x\"),\"\",IF(AND(S286=\"x\",Q286<>\"x\"),\"M fehlt\",\"A + B fehlt\")))","v":"A + B fehlt"},null,null,null,null,null,null,null,{"$f":"IF(WEEKNUM(A286,2)<>WEEKNUM(A287,2),SUM(Y$7:Y286)-SUM(Z$6:Z285),\"\")","v":""}]
[null,null,{"$f":"IF(B287=0,\"\",VLOOKUP(B287,Etappen!$1:$65497,2,FALSE))","v":""},null,{"$f":"IF(D287=0,\"\",VLOOKUP(D287,Etappen!$1:$65497,2,FALSE))","v":""},null,{"$f":"IF(F287=0,\"\",VLOOKUP(F287,Etappen!$1:$65497,2,FALSE))","v":""},null,{"$f":"IF(H287=0,\"\",VLOOKUP(H287,Etappen!$1:$65497,2,FALSE))","v":""},null,{"$f":"IF(J287=0,\"\",VLOOKUP(J287,Etappen!$1:$65497,2,FALSE))","v":""},null,null,"A + B fehlt",null,{"$f":"IF(AND(O287=\"x\",Q287=\"x\"),\"wechsel\",IF(AND(O287=\"x\",Q287<>\"x\"),\"\",IF(AND(Q287=\"x\",O287<>\"x\"),\"M fehlt\",\"A + B fehlt\")))","v":"A + B fehlt"},null,{"$f":"IF(AND(Q287=\"x\",S287=\"x\"),\"wechsel\",IF(AND(Q287=\"x\",S287<>\"x\"),\"\",IF(AND(S287=\"x\",Q287<>\"x\"),\"M fehlt\",\"A + B fehlt\")))","v":"A + B fehlt"},null,null,null,null,null,null,null,{"$f":"IF(WEEKNUM(A287,2)<>WEEKNUM(A288,2),SUM(Y$7:Y287)-SUM(Z$6:Z286),\"\")","v":""}]
[null,null,{"$f":"IF(B288=0,\"\",VLOOKUP(B288,Etappen!$1:$65497,2,FALSE))","v":""},null,{"$f":"IF(D288=0,\"\",VLOOKUP(D288,Etappen!$1:$65497,2,FALSE))","v":""},null,{"$f":"IF(F288=0,\"\",VLOOKUP(F288,Etappen!$1:$65497,2,FALSE))","v":""},null,{"$f":"IF(H288=0,\"\",VLOOKUP(H288,Etappen!$1:$65497,2,FALSE))","v":""},null,{"$f":"IF(J288=0,\"\",VLOOKUP(J288,Etappen!$1:$65497,2,FALSE))","v":""},null,null,"A + B fehlt",null,{"$f":"IF(AND(O288=\"x\",Q288=\"x\"),\"wechsel\",IF(AND(O288=\"x\",Q288<>\"x\"),\"\",IF(AND(Q288=\"x\",O288<>\"x\"),\"M fehlt\",\"A + B fehlt\")))","v":"A + B fehlt"},null,{"$f":"IF(AND(Q288=\"x\",S288=\"x\"),\"wechsel\",IF(AND(Q288=\"x\",S288<>\"x\"),\"\",IF(AND(S288=\"x\",Q288<>\"x\"),\"M fehlt\",\"A + B fehlt\")))","v":"A + B fehlt"},null,null,null,null,null,null,null,{"$f":"IF(WEEKNUM(A288,2)<>WEEKNUM(A289,2),SUM(Y$7:Y288)-SUM(Z$6:Z287),\"\")","v":""}]
[null,null,{"$f":"IF(B289=0,\"\",VLOOKUP(B289,Etappen!$1:$65497,2,FALSE))","v":""},null,{"$f":"IF(D289=0,\"\",VLOOKUP(D289,Etappen!$1:$65497,2,FALSE))","v":""},null,{"$f":"IF(F289=0,\"\",VLOOKUP(F289,Etappen!$1:$65497,2,FALSE))","v":""},null,{"$f":"IF(H289=0,\"\",VLOOKUP(H289,Etappen!$1:$65497,2,FALSE))","v":""},null,{"$f":"IF(J289=0,\"\",VLOOKUP(J289,Etappen!$1:$65497,2,FALSE))","v":""},null,null,"A + B fehlt",null,{"$f":"IF(AND(O289=\"x\",Q289=\"x\"),\"wechsel\",IF(AND(O289=\"x\",Q289<>\"x\"),\"\",IF(AND(Q289=\"x\",O289<>\"x\"),\"M fehlt\",\"A + B fehlt\")))","v":"A + B fehlt"},null,{"$f":"IF(AND(Q289=\"x\",S289=\"x\"),\"wechsel\",IF(AND(Q289=\"x\",S289<>\"x\"),\"\",IF(AND(S289=\"x\",Q289<>\"x\"),\"M fehlt\",\"A + B fehlt\")))","v":"A + B fehlt"},null,null,null,null,null,null,null,{"$f":"IF(WEEKNUM(A289,2)<>WEEKNUM(A290,2),SUM(Y$7:Y289)-SUM(Z$6:Z288),\"\")","v":""}]
[null,null,{"$f":"IF(B290=0,\"\",VLOOKUP(B290,Etappen!$1:$65497,2,FALSE))","v":""},null,{"$f":"IF(D290=0,\"\",VLOOKUP(D290,Etappen!$1:$65497,2,FALSE))","v":""},null,{"$f":"IF(F290=0,\"\",VLOOKUP(F290,Etappen!$1:$65497,2,FALSE))","v":""},null,{"$f":"IF(H290=0,\"\",VLOOKUP(H290,Etappen!$1:$65497,2,FALSE))","v":""},null,{"$f":"IF(J290=0,\"\",VLOOKUP(J290,Etappen!$1:$65497,2,FALSE))","v":""},null,null,"A + B fehlt",null,{"$f":"IF(AND(O290=\"x\",Q290=\"x\"),\"wechsel\",IF(AND(O290=\"x\",Q290<>\"x\"),\"\",IF(AND(Q290=\"x\",O290<>\"x\"),\"M fehlt\",\"A + B fehlt\")))","v":"A + B fehlt"},null,{"$f":"IF(AND(Q290=\"x\",S290=\"x\"),\"wechsel\",IF(AND(Q290=\"x\",S290<>\"x\"),\"\",IF(AND(S290=\"x\",Q290<>\"x\"),\"M fehlt\",\"A + B fehlt\")))","v":"A + B fehlt"},null,null,null,null,null,null,null,{"$f":"IF(WEEKNUM(A290,2)<>WEEKNUM(A291,2),SUM(Y$7:Y290)-SUM(Z$6:Z289),\"\")","v":""}]
[null,null,{"$f":"IF(B291=0,\"\",VLOOKUP(B291,Etappen!$1:$65497,2,FALSE))","v":""},null,{"$f":"IF(D291=0,\"\",VLOOKUP(D291,Etappen!$1:$65497,2,FALSE))","v":""},null,{"$f":"IF(F291=0,\"\",VLOOKUP(F291,Etappen!$1:$65497,2,FALSE))","v":""},null,{"$f":"IF(H291=0,\"\",VLOOKUP(H291,Etappen!$1:$65497,2,FALSE))","v":""},null,{"$f":"IF(J291=0,\"\",VLOOKUP(J291,Etappen!$1:$65497,2,FALSE))","v":""},null,null,"A + B fehlt",null,{"$f":"IF(AND(O291=\"x\",Q291=\"x\"),\"wechsel\",IF(AND(O291=\"x\",Q291<>\"x\"),\"\",IF(AND(Q291=\"x\",O291<>\"x\"),\"M fehlt\",\"A + B fehlt\")))","v":"A + B fehlt"},null,{"$f":"IF(AND(Q291=\"x\",S291=\"x\"),\"wechsel\",IF(AND(Q291=\"x\",S291<>\"x\"),\"\",IF(AND(S291=\"x\",Q291<>\"x\"),\"M fehlt\",\"A + B fehlt\")))","v":"A + B fehlt"},null,null,null,null,null,null,null,{"$f":"IF(WEEKNUM(A291,2)<>WEEKNUM(A292,2),SUM(Y$7:Y291)-SUM(Z$6:Z290),\"\")","v":""}]
[null,null,{"$f":"IF(B292=0,\"\",VLOOKUP(B292,Etappen!$1:$65497,2,FALSE))","v":""},null,{"$f":"IF(D292=0,\"\",VLOOKUP(D292,Etappen!$1:$65497,2,FALSE))","v":""},null,{"$f":"IF(F292=0,\"\",VLOOKUP(F292,Etappen!$1:$65497,2,FALSE))","v":""},null,{"$f":"IF(H292=0,\"\",VLOOKUP(H292,Etappen!$1:$65497,2,FALSE))","v":""},null,{"$f":"IF(J292=0,\"\",VLOOKUP(J292,Etappen!$1:$65497,2,FALSE))","v":""},null,null,"A + B fehlt",null,{"$f":"IF(AND(O292=\"x\",Q292=\"x\"),\"wechsel\",IF(AND(O292=\"x\",Q292<>\"x\"),\"\",IF(AND(Q292=\"x\",O292<>\"x\"),\"M fehlt\",\"A + B fehlt\")))","v":"A + B fehlt"},null,{"$f":"IF(AND(Q292=\"x\",S292=\"x\"),\"wechsel\",IF(AND(Q292=\"x\",S292<>\"x\"),\"\",IF(AND(S292=\"x\",Q292<>\"x\"),\"M fehlt\",\"A + B fehlt\")))","v":"A + B fehlt"},null,null,null,null,null,null,null,{"$f":"IF(WEEKNUM(A292,2)<>WEEKNUM(A293,2),SUM(Y$7:Y292)-SUM(Z$6:Z291),\"\")","v":""}]
[null,null,{"$f":"IF(B293=0,\"\",VLOOKUP(B293,Etappen!$1:$65497,2,FALSE))","v":""},null,{"$f":"IF(D293=0,\"\",VLOOKUP(D293,Etappen!$1:$65497,2,FALSE))","v":""},null,{"$f":"IF(F293=0,\"\",VLOOKUP(F293,Etappen!$1:$65497,2,FALSE))","v":""},null,{"$f":"IF(H293=0,\"\",VLOOKUP(H293,Etappen!$1:$65497,2,FALSE))","v":""},null,{"$f":"IF(J293=0,\"\",VLOOKUP(J293,Etappen!$1:$65497,2,FALSE))","v":""},null,null,"A + B fehlt",null,{"$f":"IF(AND(O293=\"x\",Q293=\"x\"),\"wechsel\",IF(AND(O293=\"x\",Q293<>\"x\"),\"\",IF(AND(Q293=\"x\",O293<>\"x\"),\"M fehlt\",\"A + B fehlt\")))","v":"A + B fehlt"},null,{"$f":"IF(AND(Q293=\"x\",S293=\"x\"),\"wechsel\",IF(AND(Q293=\"x\",S293<>\"x\"),\"\",IF(AND(S293=\"x\",Q293<>\"x\"),\"M fehlt\",\"A + B fehlt\")))","v":"A + B fehlt"},null,null,null,null,null,null,null,{"$f":"IF(WEEKNUM(A293,2)<>WEEKNUM(A294,2),SUM(Y$7:Y293)-SUM(Z$6:Z292),\"\")","v":""}]
[null,null,{"$f":"IF(B294=0,\"\",VLOOKUP(B294,Etappen!$1:$65497,2,FALSE))","v":""},null,{"$f":"IF(D294=0,\"\",VLOOKUP(D294,Etappen!$1:$65497,2,FALSE))","v":""},null,{"$f":"IF(F294=0,\"\",VLOOKUP(F294,Etappen!$1:$65497,2,FALSE))","v":""},null,{"$f":"IF(H294=0,\"\",VLOOKUP(H294,Etappen!$1:$65497,2,FALSE))","v":""},null,{"$f":"IF(J294=0,\"\",VLOOKUP(J294,Etappen!$1:$65497,2,FALSE))","v":""},null,null,"A + B fehlt",null,{"$f":"IF(AND(O294=\"x\",Q294=\"x\"),\"wechsel\",IF(AND(O294=\"x\",Q294<>\"x\"),\"\",IF(AND(Q294=\"x\",O294<>\"x\"),\"M fehlt\",\"A + B fehlt\")))","v":"A + B fehlt"},null,{"$f":"IF(AND(Q294=\"x\",S294=\"x\"),\"wechsel\",IF(AND(Q294=\"x\",S294<>\"x\"),\"\",IF(AND(S294=\"x\",Q294<>\"x\"),\"M fehlt\",\"A + B fehlt\")))","v":"A + B fehlt"},null,null,null,null,null,null,null,{"$f":"IF(WEEKNUM(A294,2)<>WEEKNUM(A295,2),SUM(Y$7:Y294)-SUM(Z$6:Z293),\"\")","v":""}]
[null,null,{"$f":"IF(B295=0,\"\",VLOOKUP(B295,Etappen!$1:$65497,2,FALSE))","v":""},null,{"$f":"IF(D295=0,\"\",VLOOKUP(D295,Etappen!$1:$65497,2,FALSE))","v":""},null,{"$f":"IF(F295=0,\"\",VLOOKUP(F295,Etappen!$1:$65497,2,FALSE))","v":""},null,{"$f":"IF(H295=0,\"\",VLOOKUP(H295,Etappen!$1:$65497,2,FALSE))","v":""},null,{"$f":"IF(J295=0,\"\",VLOOKUP(J295,Etappen!$1:$65497,2,FALSE))","v":""},null,null,"A + B fehlt",null,{"$f":"IF(AND(O295=\"x\",Q295=\"x\"),\"wechsel\",IF(AND(O295=\"x\",Q295<>\"x\"),\"\",IF(AND(Q295=\"x\",O295<>\"x\"),\"M fehlt\",\"A + B fehlt\")))","v":"A + B fehlt"},null,{"$f":"IF(AND(Q295=\"x\",S295=\"x\"),\"wechsel\",IF(AND(Q295=\"x\",S295<>\"x\"),\"\",IF(AND(S295=\"x\",Q295<>\"x\"),\"M fehlt\",\"A + B fehlt\")))","v":"A + B fehlt"},null,null,null,null,null,null,null,{"$f":"IF(WEEKNUM(A295,2)<>WEEKNUM(A296,2),SUM(Y$7:Y295)-SUM(Z$6:Z294),\"\")","v":""}]
[null,null,{"$f":"IF(B296=0,\"\",VLOOKUP(B296,Etappen!$1:$65497,2,FALSE))","v":""},null,{"$f":"IF(D296=0,\"\",VLOOKUP(D296,Etappen!$1:$65497,2,FALSE))","v":""},null,{"$f":"IF(F296=0,\"\",VLOOKUP(F296,Etappen!$1:$65497,2,FALSE))","v":""},null,{"$f":"IF(H296=0,\"\",VLOOKUP(H296,Etappen!$1:$65497,2,FALSE))","v":""},null,{"$f":"IF(J296=0,\"\",VLOOKUP(J296,Etappen!$1:$65497,2,FALSE))","v":""},null,null,{"$f":"IF(AND(M296=\"x\",O296=\"x\"),\"wechsel\",IF(AND(M296=\"x\",O296<>\"x\"),\"\",IF(AND(O296=\"x\",M296<>\"x\"),\"M fehlt\",\"A + B fehlt\")))","v":"A + B fehlt"},null,{"$f":"IF(AND(O296=\"x\",Q296=\"x\"),\"wechsel\",IF(AND(O296=\"x\",Q296<>\"x\"),\"\",IF(AND(Q296=\"x\",O296<>\"x\"),\"M fehlt\",\"A + B fehlt\")))","v":"A + B fehlt"},null,{"$f":"IF(AND(Q296=\"x\",S296=\"x\"),\"wechsel\",IF(AND(Q296=\"x\",S296<>\"x\"),\"\",IF(AND(S296=\"x\",Q296<>\"x\"),\"M fehlt\",\"A + B fehlt\")))","v":"A + B fehlt"},null,null,null,null,null,null,null,{"$f":"IF(WEEKNUM(A296,2)<>WEEKNUM(A297,2),SUM(Y$7:Y296)-SUM(Z$6:Z295),\"\")","v":""}]
[null,null,{"$f":"IF(B297=0,\"\",VLOOKUP(B297,Etappen!$1:$65497,2,FALSE))","v":""},null,{"$f":"IF(D297=0,\"\",VLOOKUP(D297,Etappen!$1:$65497,2,FALSE))","v":""},null,{"$f":"IF(F297=0,\"\",VLOOKUP(F297,Etappen!$1:$65497,2,FALSE))","v":""},null,{"$f":"IF(H297=0,\"\",VLOOKUP(H297,Etappen!$1:$65497,2,FALSE))","v":""},null,{"$f":"IF(J297=0,\"\",VLOOKUP(J297,Etappen!$1:$65497,2,FALSE))","v":""},null,null,"A + B fehlt",null,"A + B fehlt",null,"A + B fehlt",null,null,null,null,null,null,null,{"$f":"IF(WEEKNUM(A297,2)<>WEEKNUM(A298,2),SUM(Y$7:Y297)-SUM(Z$6:Z296),\"\")","v":""}]
[null,null,{"$f":"IF(B298=0,\"\",VLOOKUP(B298,Etappen!$1:$65497,2,FALSE))","v":""},null,{"$f":"IF(D298=0,\"\",VLOOKUP(D298,Etappen!$1:$65497,2,FALSE))","v":""},null,{"$f":"IF(F298=0,\"\",VLOOKUP(F298,Etappen!$1:$65497,2,FALSE))","v":""},null,{"$f":"IF(H298=0,\"\",VLOOKUP(H298,Etappen!$1:$65497,2,FALSE))","v":""},null,{"$f":"IF(J298=0,\"\",VLOOKUP(J298,Etappen!$1:$65497,2,FALSE))","v":""},null,null,"A + B fehlt",null,"A + B fehlt",null,"A + B fehlt",null,null,null,null,null,null,null,{"$f":"IF(WEEKNUM(A298,2)<>WEEKNUM(A299,2),SUM(Y$7:Y298)-SUM(Z$6:Z297),\"\")","v":""}]
[null,null,{"$f":"IF(B299=0,\"\",VLOOKUP(B299,Etappen!$1:$65497,2,FALSE))","v":""},null,{"$f":"IF(D299=0,\"\",VLOOKUP(D299,Etappen!$1:$65497,2,FALSE))","v":""},null,{"$f":"IF(F299=0,\"\",VLOOKUP(F299,Etappen!$1:$65497,2,FALSE))","v":""},null,{"$f":"IF(H299=0,\"\",VLOOKUP(H299,Etappen!$1:$65497,2,FALSE))","v":""},null,{"$f":"IF(J299=0,\"\",VLOOKUP(J299,Etappen!$1:$65497,2,FALSE))","v":""},null,null,"A + B fehlt",null,"A + B fehlt",null,"A + B fehlt",null,null,null,null,null,null,null,{"$f":"IF(WEEKNUM(A299,2)<>WEEKNUM(A300,2),SUM(Y$7:Y299)-SUM(Z$6:Z298),\"\")","v":""}]
[null,null,{"$f":"IF(B300=0,\"\",VLOOKUP(B300,Etappen!$1:$65497,2,FALSE))","v":""},null,{"$f":"IF(D300=0,\"\",VLOOKUP(D300,Etappen!$1:$65497,2,FALSE))","v":""},null,{"$f":"IF(F300=0,\"\",VLOOKUP(F300,Etappen!$1:$65497,2,FALSE))","v":""},null,{"$f":"IF(H300=0,\"\",VLOOKUP(H300,Etappen!$1:$65497,2,FALSE))","v":""},null,{"$f":"IF(J300=0,\"\",VLOOKUP(J300,Etappen!$1:$65497,2,FALSE))","v":""},null,null,"A + B fehlt",null,"A + B fehlt",null,"A + B fehlt",null,null,null,null,null,null,null,{"$f":"IF(WEEKNUM(A300,2)<>WEEKNUM(A301,2),SUM(Y$7:Y300)-SUM(Z$6:Z299),\"\")","v":""}]

{"sheet":"Etappen","index":1,"n_rows":40,"n_cols":2,"rows_kept":40,"cut":false,"hidden":false,"merged":[]}
[1,"Zuhause"]
[2,"Aldi"]
[3,"Windsfeld"]
[4,"Dittenheim"]
[5,"Brommbachsee"]
[6,"Altmühlsee"]
[7,"Mörnsheim"]
[8,"Rundfahrt"]
[9,"Wassertrüdingen"]
[10,"Aufkirchen"]
[11,"Gerolfingen"]
[12,"Campingplatz"]
[13,"Laubental"]
[14,"Rehlingen"]
[15,"Auhausen"]
[16,"Wettelsheim"]
[17,"MC Donald WUG"]
[18,"Graben"]
[19,"Bubenheim"]
[20,"Lengenfeld"]
[21,"Pappenh. Schleusinger"]
[22,"Kaufland WUG"]
[23,"Edersfeld"]
[24,"Gunzenhausen"]
[25,"Hometrainer Tgkl. (Tagesklinik)"]
[26,"Krankenhaus WUG"]
[27,"Weißenburg"]
[28,"Nagelberg"]
[29,"Markt Berolzheim"]
[30]
[31]
[32]
[33]
[34]
[35]
[36,"sdf"]
[37]
[38]
[39]
[40]

{"sheet":"Tabelle3","index":2,"n_rows":0,"n_cols":0,"rows_kept":0,"cut":false,"hidden":false,"merged":[]}