{"text_format":"1","workbook":"xlsx","n_sheets":8,"sheets":["Datenbank","Übertrag","Obst","Druck 8 Felder","Druck 16 Felder","Druck 24 Felder","Druck 32 Felder","Druck2"],"not_rendered":{"charts":0,"images":0,"macros":1,"external_links":0,"defined_names":4,"comments":0,"pivot_tables":0},"unopened":[],"bounds":{"document_bytes":16777216,"sheet_cells":100000,"rows_first":2000,"rows_last":500,"rows_between":2000,"halvings":0,"cell_chars":16384,"cell_head_chars":4096},"cells_cut":0,"cells_raw":0,"read":"whole","date_system":"1900"}

{"sheet":"Datenbank","index":0,"n_rows":1008,"n_cols":12,"rows_kept":1008,"cut":false,"hidden":false,"merged":[[0,0,0,5]]}
["Preisänderung für morgen",null,null,null,null,null,null,null,null,null,{"$f":"L1-M1-N1","v":8},{"$f":"COUNTIF(G:G,TODAY())","v":8}]
["ID","Preis","EK","Aktion","Artikel","Sorte","LetzteAenderung","AenderungEK",null,{"$f":"IF(K1<9,\"1\",IF(AND(K1>8,K1<17),\"2\",IF(AND(K1>16,K1<25),\"3\",IF(AND(K1>24,K1<33),\"4\",\"\"))))","v":"1"}]
[58,0.69,0.53,"1","Grapefruit",null,"2025-07-12"]
[68,3.33,2.5,"1","Vorwiegend festkochend","Sorte:siehe  Etikett","2025-07-12"]
[92,0.33,0.22,"1","Limette","\"Tahiti\"","2025-07-12"]
[716,0.77,0.5,"1","Chinakohl","\"Pfalz\"","2025-07-15"]
[758,0.99,0.65,"1","Weißkraut","\"Pfalz\"","2025-07-12"]
[759,0.99,1.1000000000000001,"1","Rotkraut","\"Pfalz\"","2025-07-12"]
[1,1.19,0.65,null,"Trauben gepackt"]
[2,0.99,0.5,null,"Bergnektarinen gepackt"]
[3,1.19,0.65,null,"Trauben gepackt",null,"2025-07-15"]
[4,2.99,1.5,null,"Bergpfirsiche gepackt",null,"2025-07-15"]
[5]
[6]
[7,1.99,1.3,null,"Orangen Netz",null,"2025-06-06"]
[8,4.7699999999999996,4,null,"Rothaus","Classic oder Alkoholfrei","2025-05-03"]
[9,0]
[10,2.99,1.6,null,"trauben rose ziplook","Mini Eiertomaten","2025-03-12"]
[11,0.99,1,null,"Grapefruit gepackt","Sorte: Star Ruby"]
[12,0]
[13,0]
[14,0]
[15,0.99,0.6,null,null,null,"2024-08-12T20:58:18"]
[16,0]
[17,0]
[18,0,null,null,"Achtung!!!!",null,"2025-07-14"]
[19,21,null,null,"blubb"]
[20,0.69,0.42,null,"Kopfsalat",null,"2025-07-15"]
[21,0.99,0.52500000000000002,null,"Eisbergsalat",null,"2025-07-15"]
[22,0.99,0.67,null,"Endivien","\"Pfalz\"","2025-07-12"]
[23,1.59,1,null,"Kaki","Sorte: Persimon","2025-07-03"]
[24,0.99,0.35,null,"Krull",null,"2025-07-12"]
[25,1.99,1,null,"Romanasalat",null,"2025-04-09"]
[26,1.29,0.8,null,"Bund - Möhren","\"Pfalz\"","2025-07-01"]
[27,0.99,0.35,null,"Eichblatt",null,"2025-07-12"]
[28,9,null,null,"kiste kopfsalat",null,"2024-08-02T16:23:00"]
[29,1.79,1.25,null,"Paprika Mix","Sorte:Color","2025-06-30"]
[30,0.99,0.48,null,"Paprika Rot gepackt",null,"2025-05-22"]
[31,0]
[32,0]
[33,0]
[34,1.99,1.2,null,"E - Schlotten",null,"2025-05-14"]
[35,1.49,0.93,null,"Zwiebel gelb Netz",null,"2025-07-15"]
[36,4.99,4,null,"Zwiebel gelb Netz",null,"2025-06-05"]
[37,0.79,0.5,null,"Zwiebelschlotten","\"Pfalz\"","2025-07-15"]
[38,3.99,0.88,null,"Zuckererbsen"]
[39,0.69,0.5,null,"Feigen","Sorte:\"Brogiotto Nero\"","2025-06-12"]
[40,0.99,1,null,"Artischocken",null,"2025-03-04"]
[41,0]
[42,0]
[43,1.49,0.8,null,"Rettich weiß"," \"Pfalz\"","2025-06-21"]
[44,0.69,0.43,null,"Rettich Rot",null,"2025-05-09"]
[45,1.59,0.9,null,"Blumenkohl",null,"2025-07-16","2025-07-16"]
[46,0.59,0.3,null,"Kohlrabi","\"Pfalz\"","2025-07-10"]
[47,1.69,0.97499999999999998,null,"Knoblauch gepackt",null,"2025-05-15"]
[48,0.99,0.65,null,"Kokosnuss",null,"2024-10-24"]
[49,1.19,0.62,null,"Tomaten Schale",null,"2025-07-15"]
[50,0]
[51,1.99,1.5,null,"Karambole","Sorte: Sternenfrucht"]
[52,2.99,1.85,null,"Kartoffel fest","Sorte: Siehe Etikett","2025-07-15"]
[53,0,null,null,null,null,"2024-09-24"]
[54,3.99,3,null,"Papaya",null,"2025-07-09"]
[55,0]
[56,0.55000000000000004,0.3,null,"Kresse",null,"2025-06-21"]
[57,0.69,0.4,null,"Zitronen","Sorte: Limon Verna","2025-06-21"]
[59,1.59,0.8,null,"Clementine Netz","\"Clemenules\"","2025-05-05"]
[60,0.99,0.6,null,"Orangen Netz","Sorte:Navel","2025-06-11"]
[61,0.99,0.7,null,"Salatherzen",null,"2025-07-15"]
[62,1.99,1.45,null,"Kartoffel mehlig","Sorte: siehe Etikett","2025-07-12"]
[63,1.29,0.6,null,"Rucola",null,"2025-07-15"]
[64,2.99,1.7,null,"Clementinen Steige","Sorte: Clemenules","2025-01-17"]
[65,1.99,1,null,"Erdbeeren gepackt",null,"2025-04-23"]
[66,1.99,1.4,null,"Kartoffel vorwiegend","Sorte: siehe Etikett","2025-07-12"]
[67,0]
[69,2.4900000000000002,1.85,null,"Zuckermais",null,"2025-05-24"]
[70,0]
[71,0]
[72,1.99,1,null,"Sellerie mit Grün",null,"2025-07-11"]
[73,1.49,0.8,null,"Bleichsellerie","neue ernte \"Pfalz\"","2025-06-21"]
[74,0,null,null,null,null,"2025-04-23"]
[75,1,0.5,null,"Peterle Krauß",null,"2025-04-25"]
[76,2,0.97499999999999998,null,"Dill",null,"2025-04-26"]
[77,1.39,1,null,"Suppengrün"]
[78,1.2,0.7,null,"Schnittlauch",null,"2025-04-25"]
[79,0]
[80,0.28999999999999998,0.35,null,"Kiwi grün","Sorte: Hayward Green","2025-07-12"]
[81,1.59,1,null,"Mango","\"Palmer\"","2025-07-10"]
[82,1.99,1.25,null,"Honigmelone","Honig","2025-07-08"]
[83,1.99,1.25,null,"Cantaloup Melone","\"Carante\"","2025-07-08"]
[84,1.99,1.6,null,"Galia-Melone","Galia","2025-06-26"]
[85,3.99,2.5,null,"Ananas",null,"2025-06-21"]
[86,2.99,1.5,null,"Mini Wassermelone","kernarm","2025-07-03"]
[87,0.99,0.64,null,"Gurken",null,"2025-07-15","2025-07-16"]
[88,0.49,0.3,null,"Radieschen","\"Pfalz\"","2025-07-15"]
[89,2.99,3,null,"Zuckermelone",null,"2024-09-10"]
[90,0]
[91,4.49,3.4,null,"Grüne Sosse","Sorte: Echte Frankfurter","2025-04-10"]
[93,0]
[94,0]
[95,0]
[96,0]
[97,0]
[98,0]
[99,0]
[100,1.99,1.3939999999999999,null,"Bio Bananen","DE-ÖKO-006","2025-02-10"]
[101,2.99,1.7,null,"Spinat",null,"2025-06-12"]
[102,1.39,1,null,"Rosenkohl gepackt",null,"2024-11-22"]
[103,2.4900000000000002,1.4770000000000001,null,"Kiwi Grün Bio 4er","DE-ÖKO-006","2025-03-05"]
[104,1.59,1.0820000000000001,null,"Kiwi Gold Bio 3er"]
[105,3.49,2.0499999999999998,null,"Wildkräutersalat",null,"2025-04-08"]
[106,3.49,2.2000000000000002,null,"Babyleaf-Mix",null,"2025-02-06"]
[107,0]
[108,0]
[109,1.59,0.96,null,"Bio Gurke","DE-ÖKO-006","2025-03-17"]
[110,2.2200000000000002,1.2270000000000001,null,"Zucchini Bio","DE-ÖKO-006","2025-03-17"]
[111,1.99,1.3120000000000001,null,"Bio Karotten lose","DE-ÖKO-005","2025-06-11"]
[112,1.99,1.3120000000000001,null,"Karotte Bio",null,"2025-06-11"]
[113,1.99,1.2310000000000001,null,"Aubergine Bio"]
[114,1.49,0.96699999999999997,null,"Snack Karotte Bio"]
[115,0]
[116,0]
[117,0]
[118,0]
[119,0]
[120,2.99,1.5589999999999999,null,"Rispentomaten Mini Bio","DE-ÖKO-005","2025-03-17"]
[121,0]
[122,0]
[123,0.01,null,null,"Achtung Paprika Rot hat"]
[124,0,null,null,"Wer Bio Gala hat","bitte mit Santana Tauschen"]
[125,0,null,null,"Bio Mango"]
[126,0,null,null,"Bitte Feldsalat","mit Salatherzen tauschen"]
[127,0]
[128,0]
[129,0]
[130,2.4900000000000002,1.6080000000000001,null,"Bio Champignon","DE-ÖKO-005"]
[131,0.69,0.433,null,"Kresse mix Bio"]
[132,2.2200000000000002,1.4330000000000001,null,"Bio Snackpaprika",null,"2025-03-17"]
[133,6.99,5,null,"Paprika Rot Bio","DE-ÖKO-005"]
[134,1.29,0.80300000000000005,null,"Bio Chili Rot","ES-ECO-019-CT"]
[135,2.79,1.8540000000000001,null,"Paprika Spitz Bio","DE-ÖKO-006","2025-03-17"]
[136,3.69,2.4950000000000001,null,"Paprika Rot Bio",null,"2025-03-17"]
[137,1.49,0.96,null,"Chili Mix Bio",null,"2025-01-06"]
[138,0]
[139,0]
[140,0]
[141,1.99,1.2,null,"Kurkuma Bio","DE-ÖKO-006","2025-03-12"]
[142,0.79,0.46600000000000003,null,"Ingwer Bio","DE-ÖKO-006"]
[143,0]
[144,0]
[145,2.59,1.5349999999999999,null,"Aprikosen Bio","Sorte: siehe Etikett","2024-07-04T13:01:03"]
[146,2.99,1.9119999999999999,null,"Pfirsich Platt Bio"]
[147,0]
[148,0]
[149,0,null,null,null,null,"2024-12-11"]
[150,2.79,1.7729999999999999,null,"Orangen Bio",null,"2025-01-06"]
[151,3.79,2.0110000000000001,null,"Mandarinen Bio",null,"2025-01-06"]
[152,2.99,1.9279999999999999,null,"Spaghettikürbis Bio",null,"2024-09-13"]
[153,2.29,1.403,null,"Bio Butternutkürbis",null,"2025-03-17"]
[154,1.59,1,null,"Grapefruit Bio"]
[155,3.99,null,null,"Apfel Elstar Bio","DE-ÖKO-003"]
[156,3.29,2.036,null,"Apfel Gala Bio"]
[157,3.49,1.7649999999999999,null,"Apfel Santana Bio","DE-ÖKO-006","2024-09-13"]
[158,3.29,2.1749999999999998,null,"Cripps Pink Bio",null,"2024-07-04T13:01:18"]
[159,2.39,1.5669999999999999,null,"Granatapfel Bio"]
[160,2.29,1.419,null,"Salatherzen Bio","DE-ÖKO-034"]
[161,1.89,1.214,null,"Feldsalat Bio",null,"2025-03-17"]
[162,0]
[163,0]
[164,2.4900000000000002,1.6819999999999999,null,"Conference Birne Bio",null,"2025-03-17"]
[165,2.99,1.9279999999999999,null,"Bio Pflaume","Sorte: Siehe Etikett","2024-09-13"]
[166,2.29,1.4850000000000001,null,"Bio Birne","Sorte: Limonera","2024-11-12"]
[167,0]
[168,0]
[169,0]
[170,2.19,1.411,null,"Broccoli Bio",null,"2025-03-17"]
[171,2.29,1.411,null,"Pastinaken Bio",null,"2024-12-17"]
[172,1.69,1.0820000000000001,null,"Zwiebel Schalotte Bio"]
[173,0]
[174,0]
[175,3.49,2.1749999999999998,null,"Kartoffel Bio","festkochend","2025-03-17"]
[176,0]
[177,0]
[178,0]
[179,0]
[180,1.89,1.0900000000000001,null,"Zitrone Bio","ES-ECO-020-CV","2025-04-04"]
[181,0.69,0.40899999999999997,null,"Limette Bio","DE-ÖKO-006"]
[182,0.49,0.25,null,"Zitrone Bio",null,"2025-05-26"]
[183,0]
[184,0]
[185,1.99,1.288,null,"Mango Bio Faserarm",null,"2025-03-17"]
[186,0]
[187,0]
[188,0]
[189,0]
[190,3.99,2.5449999999999999,null,"Bio Hokkaido",null,"2025-03-17"]
[191,2.4900000000000002,1.5349999999999999,null,"Zuckermais Bio","DE-ÖKO-006","2024-10-08"]
[192,1.69,1.05,null,"Rote Bete gekocht Bio"]
[193,0]
[194,0]
[195,0]
[196,0]
[197,0]
[198,0]
[199,0]
[200,0]
[201,0]
[202,0]
[203,0]
[204,0]
[205,0]
[206,0]
[207,0]
[208,0]
[209,0]
[210,0]
[211,0]
[212,0]
[213,0]
[214,0]
[215,0]
[216,0]
[217,0]
[218,0]
[219,0]
[220,0]
[221,0]
[222,0]
[223,0]
[224,0]
[225,0]
[226,0]
[227,0]
[228,0]
[229,0]
[230,0]
[231,0]
[232,0]
[233,0]
[234,0]
[235,0]
[236,0]
[237,0]
[238,0]
[239,0]
[240,0]
[241,0]
[242,0]
[243,0]
[244,0]
[245,0]
[246,0]
[247,0]
[248,0]
[249,0]
[250,0]
[251,0]
[252,0]
[253,0]
[254,0]
[255,0]
[256,0]
[257,0]
[258,0]
[259,0]
[260,0]
[261,0]
[262,0]
[263,0]
[264,0]
[265,0]
[266,0]
[267,0]
[268,0]
[269,0]
[270,0]
[271,0.99,0.33300000000000002,null,"Lollo Rosso",null,"2025-07-12"]
[272,0.99,0.33,null,"Lollo Blondo",null,"2025-07-12"]
[273,0]
[274,0]
[275,0]
[276,0]
[277,0]
[278,0]
[279,0]
[280,0]
[281,0]
[282,0]
[283,0]
[284,0]
[285,0]
[286,0]
[287,0]
[288,0]
[289,0]
[290,0]
[291,0]
[292,0]
[293,0]
[294,0]
[295,0]
[296,0]
[297,0]
[298,0]
[299,0]
[300,0]
[301,0]
[302,0]
[303,0]
[304,0]
[305,0]
[306,0]
[307,0]
[308,0]
[309,0]
[310,0]
[311,0]
[312,0]
[313,0]
[314,0]
[315,0]
[316,0]
[317,0]
[318,0]
[319,0]
[320,0]
[321,0]
[322,0]
[323,0]
[324,0]
[325,0]
[326,3.99,3.5,null,"Freilandrosen","Gärtnerware","2025-05-26"]
[327,2.4900000000000002,1.5,null,"Pfingstrosen",null,"2025-06-05"]
[328,5.99,4,null,"Frühlingsstrauß",null,"2025-06-05"]
[329,2.99,1.5,null,"Sonnenblumenstrauß",null,"2025-06-11"]
[330,0]
[331,0]
[332,0]
[333,0]
[334,0]
[335,0]
[336,0]
[337,0]
[338,0]
[339,0]
[340,0]
[341,0]
[342,0]
[343,0]
[344,0]
[345,0]
[346,0]
[347,0]
[348,0]
[349,0]
[350,0]
[351,0]
[352,0]
[353,0]
[354,0]
[355,0]
[356,0]
[357,0]
[358,0]
[359,0]
[360,0]
[361,0]
[362,0]
[363,0]
[364,0]
[365,0]
[366,0]
[367,0]
[368,0]
[369,0]
[370,0]
[371,0]
[372,0]
[373,0]
[374,0]
[375,0]
[376,0]
[377,0]
[378,0]
[379,0]
[380,0]
[381,0]
[382,0]
[383,0]
[384,0]
[385,0]
[386,0]
[387,0]
[388,0]
[389,0]
[390,0]
[391,0]
[392,0]
[393,0]
[394,0]
[395,0]
[396,0]
[397,0]
[398,0]
[399,0]
[400,0]
[401,0]
[402,0]
[403,0]
[404,0]
[405,0]
[406,0]
[407,0]
[408,0]
[409,0]
[410,0]
[411,0]
[412,0]
[413,1.79,0.9,null,"Paprika Sivri",null,"2025-05-07"]
[414,2.4900000000000002,1.2,null,"Paprika Capia","\"Capia rot\"","2025-06-21"]
[415,1.99,1.2,null,"Paprika Carli",null,"2025-04-15"]
[416,1.49,null,null,"Paprika Dolma"]
[417,1.19,1.66,null,"Paprika weiss","Sorte:Spitz"]
[418,1.59,0.65,null,"orange paprika",null,"2024-12-10"]
[419,0]
[420,0]
[421,0]
[422,0]
[423,0]
[424,0]
[425,0]
[426,0]
[427,0]
[428,0]
[429,0]
[430,0]
[431,0]
[432,0]
[433,0]
[434,0]
[435,0]
[436,0]
[437,0]
[438,0]
[439,0]
[440,0]
[441,0]
[442,0]
[443,0.59,0.35,null,"Mairüben",null,"2025-06-13"]
[444,0]
[445,0]
[446,1.79,1.1499999999999999,null,"Eiszapfen",null,"2025-03-27"]
[447,0]
[448,0]
[449,0]
[450,0]
[451,0]
[452,0]
[453,0]
[454,0]
[455,0]
[456,0]
[457,0]
[458,0]
[459,0]
[460,0]
[461,0]
[462,0]
[463,0]
[464,0]
[465,0]
[466,0]
[467,0]
[468,0]
[469,0]
[470,0]
[471,3.49,1.95,null,"Knoblauch gepackt","Solo","2025-05-16"]
[472,0]
[473,0]
[474,0]
[475,0]
[476,0]
[477,0]
[478,0]
[479,0]
[480,0]
[481,0]
[482,0]
[483,0]
[484,0]
[485,0]
[486,0]
[487,0]
[488,0]
[489,0]
[490,0]
[491,2.4900000000000002,1.3,null,"Kirschtomaten/Dattel","Bitte wiegen","2025-07-14"]
[492,0]
[493,0]
[494,0]
[495,0]
[496,0]
[497,0]
[498,0]
[499,1.29,0.6,null,"Bergnektarinen","Sorte: siehe Etikett","2025-07-14"]
[500,0.99,0.5,null,"Frühlingszwiebel Tropea","Sorte: Tropea"]
[501,1.59,0.8,null,"Nektarinen gepackt","Sorte: siehe Verpackung"]
[502,2.99,1.8,null,"Aprikosen gepackt","Sorte: siehe Etikett","2025-07-03"]
[503,2.99,2,null,"Trauben Beutel","Sorte: Sweet Globe"]
[504,2.99,2,null,"Kokosnuss trinkfertig","Drink&eat","2025-06-06"]
[505,2.4900000000000002,1.5,null,"Heidelbeeren gepackt"]
[506,0.99,0.5,null,"Broccoli gepackt"]
[507,0.99,0.5,null,"Paprika rot gepackt"]
[508,1.99,1,null,"Susine rot gepackt","Sorte: siehe Etikett"]
[509,1.99,1,null,"Pfirsiche gepackt","Sorte: siehe Etikett"]
[510,1.59,0.8,null,"Bergpfirsich","Sorte: siehe Etikett"]
[511,2.99,1.5,null,"Kirschen im Beutel","Sorte: Frisco 28+"]
[512,0.69,0.3,null,"Brombeeren gepackt"]
[513,2.99,2.25,null,"Granatapfel",null,"2025-06-05"]
[514,0]
[515,0]
[516,0]
[517,0]
[518,0]
[519,0]
[520,0]
[521,0]
[522,0]
[523,0]
[524,0]
[525,0]
[526,0]
[527,0]
[528,0]
[529,0]
[530,0]
[531,0]
[532,0]
[533,0]
[534,0]
[535,0]
[536,0]
[537,0]
[538,0]
[539,5.99,4,null,"Snack Zitronen",null,"2025-04-28"]
[540,3.99,2.2000000000000002,null,"Pepino",null,"2025-02-28"]
[541,3.49,2.25,null,"Süßkartoffel","\"Bellevue\"","2025-05-20"]
[542,0.99,0.5,null,"Mangostane",null,"2025-05-01"]
[543,3.99,2.5,null,"Pitahaya","Sorte: Hylocereus undatus","2025-03-01"]
[544,5.99,4.45,null,"Flugmango","Sorte:Kent","2025-07-15"]
[545,0.99,1,null,"Kaktusfeige",null,"2025-04-24"]
[546,0.99,0.8,null,"Rambutan"]
[547,1.99,1.05,null,"Tamarillo",null,"2024-10-29"]
[548,1.99,1,null,"Maracuja",null,"2024-10-19"]
[549,1.99,1.2,null,"Salak","Schlangenfrucht"]
[550,5.99,3,null,"Kumato Tomaten",null,"2025-06-10"]
[551,0.99,0.6,null,"Kaktusfeigen",null,"2025-03-01"]
[552,1.49,null,null,"Kürbis","Sorte: Butternut"]
[553,1.99,0.95,null,"Spaghetti - Kürbis",null,"2024-10-23"]
[554,2.69,1.85,null,"Kürbis","Sorte: Hokkaido","2025-03-25"]
[555,10,7.5,null,"Apfelkiste","zzgl. 0,50€ Pfand","2024-11-16"]
[556,5.99,3.75,null,"Mini - Rispen","Sorte: Sweety","2025-07-15"]
[557,7.49,4.5,null,"Mini - Rispen","Sorte: Romantic","2025-07-04"]
[558,1.99,1.2,null,"Cherimoya",null,"2024-10-24"]
[559,3.99,1.5,null,"Kiwano",null,"2025-03-01"]
[560,2.4900000000000002,1.6,null,"Mini - Rispen","Sorte: Honigtomaten","2024-12-04"]
[561,1.59,0.75,null,"San Manzano Tomaten",null,"2025-07-04"]
[562,null,null,null,"Mangold"]
[563,4.99,2.7,null,"Strauchtomaten - Extra",null,"2025-06-27"]
[564,0.99,0.41,null,"Sunita","mehligkochend","2025-05-20"]
[565,5.99,4.2,null,"Tobinambur",null,"2025-01-18"]
[566,0.99,0.5,null,"Sunita","mehlig kochend","2025-07-08"]
[567,0.99,0.44,null,"\"Berber\"","vorwiegend festkochend","2025-07-12"]
[568,1.29,0.67,null,"Laura","vorwiegend festkochend"]
[569,1.99,1.5,null,"Melone Zucker",null,"2025-06-04"]
[570,0]
[571,1.59,1,null,"Zitronen Netz","Sorte:Limon Verna","2025-05-27"]
[572,0]
[573,1.99,1.5,null,"Amalfi Zitrone",null,"2025-05-08"]
[574,0]
[575,0]
[576,0]
[577,0]
[578,0]
[579,0]
[580,3.99,2.5,null,"Coeur-de-boeuf","Fleischtomate","2025-03-11"]
[581,0]
[582,0.99,0.5,null,"Pomelo",null,"2025-04-02"]
[583,0]
[584,0]
[585,2.99,null,null,"Romanesco"]
[586,0]
[587,0]
[588,0]
[589,0]
[590,0]
[591,0]
[592,0]
[593,0]
[594,0]
[595,0]
[596,0]
[597,0]
[598,0]
[599,0]
[600,0.69,0.5,null,"Suppentomaten",null,"2024-12-12"]
[601,1.99,1.5,null,"Blutorangen","Sorte: Tarocco","2025-03-22"]
[602,0]
[603,0]
[604,0]
[605,0]
[606,0]
[607,0]
[608,0]
[609,0]
[610,0]
[611,0]
[612,0]
[613,0]
[614,0]
[615,0]
[616,0]
[617,0]
[618,0]
[619,0]
[620,0]
[621,0]
[622,0]
[623,0]
[624,0]
[625,0]
[626,0]
[627,0]
[628,0]
[629,0]
[630,0]
[631,0]
[632,0]
[633,0]
[634,0]
[635,0]
[636,0]
[637,0]
[638,0]
[639,0]
[640,0]
[641,0]
[642,0]
[643,0]
[644,0]
[645,0]
[646,0]
[647,1.99,1.6,null,"Brombeeren","BITTE WIEGEN","2025-06-18"]
[648,1.99,0.84,null,"Heidelbeeren","BITTE WIEGEN","2025-06-21"]
[649,1.99,1.4,null,"Himbeeren","BITTE WIEGEN","2025-06-21"]
[650,0.99,0.56000000000000005,null,"Johannesbeeren","BITTE WIEGEN","2025-06-24"]
[651,4.99,2.8,null,"Erdbeeren lose",null,"2025-07-15","2025-07-16"]
[652,0.99,1.6,null,"Schwarze Johannesbeeren","Sorte:Karima\"","2025-06-24"]
[653,0.99,1.5,null,"Sauer Kirschen","Sorte: Schattenmorellen","2025-06-24"]
[654,0]
[655,0]
[656,0]
[657,0]
[658,1.99,1.8,null,"Stachelbeeren","BITTE WIEGEN","2025-06-21"]
[659,0]
[660,0]
[661,0]
[662,0]
[663,0]
[664,0]
[665,0]
[666,0]
[667,0]
[668,0]
[669,0]
[670,0]
[671,0]
[672,0]
[673,0]
[674,0]
[675,0]
[676,0]
[677,0]
[678,0]
[679,0]
[680,0]
[681,0]
[682,0]
[683,0]
[684,0]
[685,0]
[686,0]
[687,0]
[688,0]
[689,0]
[690,0]
[691,0]
[692,0]
[693,0]
[694,0]
[695,0]
[696,0]
[697,0]
[698,0]
[699,0]
[700,0.99,0.6,null,"Strauchtomaten",null,"2025-07-14"]
[701,0.49,0.3,null,"Tomaten",null,"2025-05-22"]
[702,1.59,0.66,null,"Fleisch Tomaten","Sorte:Rebellion","2025-07-04"]
[703,1.19,0.6,null,"Eier Tomaten",null,"2025-07-15"]
[704,1.59,0.6,null,"Strauchtomaten",null,"00:00:00","2025-07-16"]
[705,2.69,2,null,"Mini - Rispen","Sorte: Rote Perle","2025-07-16","2025-07-16"]
[706,3.99,2.4300000000000002,null,"Pinke-Tomate","Sorte: Schlesische Himbeere","2024-11-15"]
[707,1.69,0.85,null,"Lauch","Pfalz","2025-07-01","2025-07-16"]
[708,0]
[709,0]
[710,1.39,0.75,null,"Lose Möhren","\"Pfalz\"","2025-07-15"]
[711,0.39,0.33,null,"Erbsen","\"Pfalz\"","2025-07-15"]
[712,0.39,0.25,null,"Stangenbohnen","Sorte: Hilda","2025-07-12"]
[713,0]
[714,3.99,2,null,"Kenia Bohnen","Sorte: Buschbohne","2025-03-04"]
[715,1.99,1.3,null,"Bobby Bohnen","Sorte: Buschbohne","2025-03-04"]
[717,0]
[718,3.99,1.6,null,"Rharbarber","\"Pfalz\"","2025-06-27"]
[719,0]
[720,1.99,1.2,null,"Paprika grün",null,"2025-07-09"]
[721,0]
[722,0.55000000000000004,0.28000000000000003,null,"Kiwi Gold",null,"2025-07-16","2025-07-16"]
[723,3.99,1.5,null,"Paprika Rot",null,"2025-07-07"]
[724,1.99,2.5,null,"Paprika Gelb",null,"2025-07-15"]
[725,1.99,0.8,null,"Galantiner","Sorte: Sieglinde","2025-05-21"]
[726,2.4900000000000002,1.6,null,"Drillinge","Sorte:\"Delikatess\"","2025-06-12"]
[727,1.99,1.1000000000000001,null,"Spunta","vorwiegend festkochend","2025-07-04"]
[728,1.69,0.76,null,"Annabelle lose","festkochend","2025-06-11"]
[729,0.99,0.48,null,"Annabelle lose","\"Festkochend\"","2025-07-12"]
[730,3.49,1.8,null,"Gemüse Zwiebel",null,"2025-07-09"]
[731,1.49,0.95,null,"Zwiebel rot",null,"2025-07-15"]
[732,1.99,null,null,"Zwiebel gelb lose"]
[733,4.99,3,null,"Zwiebel weiß",null,"2024-06-19T15:40:08"]
[734,0.59,0.3,null,"Pastinaken",null,"2024-07-03T17:59:47"]
[735,1.99,1.1000000000000001,null,"Marabel","vorwiegend festkochend","2025-05-19"]
[736,3.99,2.2000000000000002,null,"Radiccio","\"Pfalz\"","2025-06-21"]
[737,0.99,1,null,"Moorsieglinde","festkochend"]
[738,3.49,2.2000000000000002,null,"Broccoli",null,"2025-06-28"]
[739,1.99,1.3,null,"Fenchel","\"Pfalz\"","2025-07-07"]
[740,0.99,0.3,null,"Auberginen",null,"2025-07-15"]
[741,0.99,0.55000000000000004,null,"Zucchini","Pfalz","2025-07-11"]
[742,2.69,1.45,null,"Seitlinge Pilze",null,"2025-06-18"]
[743,2.99,0.78,null,"Meerrettich"]
[744,0]
[745,0.39,0.27,null,"Champignon","\"Fein\"","2025-01-17"]
[746,0.49,0.27500000000000002,null,"Champignon","Riesen","2025-02-01"]
[747,2.79,1.5,null,"Pak Choi",null,"2025-06-13"]
[748,1.59,0.9,null,"Pfifferling","Sorte; Cantharellus","2025-07-16","2025-07-16"]
[749,1.99,1,null,"Rote Beete",null,"2025-06-07"]
[750,0.28999999999999998,0.13,null,"Chicoree",null,"2025-06-10"]
[751,0.59,0.25,null,"Petersilienwurzel",null,"2025-05-28"]
[752,0]
[753,1.49,0.7,null,"Spitzkohl","\"Pfalz\"","2025-06-21","2025-07-16"]
[754,0]
[755,0.99,0.375,null,"Feldsalat",null,"2025-03-31"]
[756,0]
[757,1.99,1.6,null,"Rosenkohl",null,"2024-12-04"]
[760,1.59,1.0660000000000001,null,"Wirsing","\"Pfalz\"","2025-06-27"]
[761,0.99,0.48,null,"Knoblauch","Sorte: \"Arno\"","2025-05-21"]
[762,0.79,0.44,null,"Ingwer",null,"2025-02-08"]
[763,0.49,0.2,null,"Hof Spargel II","\"Hohl oder Aufblüher\""]
[764,0]
[765,0]
[766,1.39,1.05,null,"Spargelköpfe  II","mind. 14mm dick","2025-06-12"]
[767,1.39,0.75,null,"Spargel viollet","mind. 14+mm dick","2025-06-18"]
[768,0]
[769,0.39,0.25,null,"Bruch Spargel",null,"2025-05-15"]
[770,1.59,1.05,null,"Spargel II","mind. 16mm dick","2025-06-18"]
[771,1.79,1,null,"Pepperoni","mild im Geschmack"]
[772,0]
[773,0]
[774,0]
[775,0]
[776,0]
[777,1.99,0.9,null,"Litschi",null,"2025-01-15"]
[778,0]
[779,2.99,null,null,"Schwarzwurzel"]
[780,0]
[781,0.55000000000000004,0.33,null,"Avocado","Sorte: Hass","2025-07-16","2025-07-16"]
[782,2.99,1.8,null,"Landgurken","Kücherer Heidelberg","2025-07-03"]
[783,2.99,2,null,"Einlegegurken","\"Vesper\"","2025-07-07"]
[784,0,92]
[785,0]
[786,0]
[787,0]
[788,1.29,0.7,null,"Knoblauch frisch",null,"2025-06-18"]
[789,0]
[790,0]
[791,1.79,1.198,null,"Avocado Bio","DE-ÖKO-006","2025-03-17"]
[792,0]
[793,0]
[794,0]
[795,0]
[796,0]
[797,0]
[798,0]
[799,1.99,1.47,null,"Chiquita Bananen",null,"2024-08-12T20:59:51"]
[800,1.39,1.2,null,"Bananen",null,"2025-07-15","2025-07-16"]
[801,1.99,1.3,null,"Delicious","Sorte: Golden Delicius","2025-07-14"]
[802,1.99,1.23,null,null,null,"2025-06-20"]
[803,1.99,1.3,null,"Chripps - Pink",null,"2024-07-02T14:49:26"]
[804,1.99,1.55,null,"Santana",null,"2024-09-25"]
[805,2.99,1.84,null,"Gala","Sorte: Rpyal Gala","2025-07-15"]
[806,1.99,1.05,null,"Mutzu/Greenstar",null,"2025-06-20"]
[807,2.99,1.78,null,"Breaburn",null,"2025-07-15"]
[808,0.99,0.57999999999999996,null,"Honey Crunch",null,"2025-07-02"]
[809,2.99,1.3,null,"Rubinette",null,"2025-02-12"]
[810,2.99,2.0499999999999998,null,"Fräulein","\"Bodensee\"","2025-06-23"]
[811,2.59,1.25,null,"Pinova",null,"2025-06-23"]
[812,1.99,1.3,null,"Physalis",null,"2025-04-09"]
[813,0.79,0.5,null,"Passionsfrucht",null,"2025-03-01"]
[814,3.99,2.2200000000000002,null,"Cox Orange","Holsteiner","2025-06-14"]
[815,1.99,1.1000000000000001,null,"Boskop",null,"2025-03-08"]
[816,1.99,1.1000000000000001,null,"Idared",null,"2025-03-12"]
[817,2.99,1.99,null,"Pink Lady",null,"2025-07-16","2025-07-16"]
[818,0]
[819,0]
[820,2.99,null,null,"Royal Gala","Sorte:Tenroy"]
[821,0]
[822,2.99,2,null,"Kanzi","Sorte :Nicoter","2025-07-15"]
[823,1.99,0.95,null,"Jona Gold",null,"2025-06-05"]
[824,1.99,1.6,null,"Wellant","Sorte:Elise+zuchtklon","2025-05-22"]
[825,2.99,1.78,null,"Futji",null,"2025-07-15"]
[826,2.99,1.45,null,"Granny Smith",null,"2024-06-26T15:10:24"]
[827,2.99,1.85,null,"Elstar",null,"2025-06-17"]
[828,0]
[829,3.99,2.65,null,"Jazz",null,"2025-05-26"]
[830,2.59,1.7,null,"Williams","\"Packhams\"","2025-06-06"]
[831,0]
[832,2.99,1.55,null,"Xenia Birne",null,"2025-05-31"]
[833,2.99,1.8,null,"Forelle Birne",null,"2025-07-11"]
[834,1.99,1.25,null,"Lucas Birne",null,"2025-02-01"]
[835,3.99,1.95,null,"Abate Birnen",null,"2025-06-27"]
[836,1.19,0.6,null,"Kirschen",null,"2025-07-03"]
[837,1.99,1,null,"Conference",null,"2025-01-17"]
[838,2.99,1.5,null,"Birne Goyot",null,"2024-09-21"]
[839,1.99,3,null,"Santa Maria",null,"2025-06-24"]
[840,0.99,0.5,null,"Kirschen","Sorte: \"Büttners Rote Knorpel\"","2025-07-15"]
[841,2.99,2.15,null,"Wassermelone","\"Kernarm\"","2025-04-15"]
[842,1.49,null,null,"Wassermelone","Mini Melone"]
[843,3.99,1.75,null,"Wassermelone geschitten","mit Kern","2025-04-11"]
[844,3.99,2.5,null,"Pflaumen gelb","Sorte:Santa Rosa","2025-06-26"]
[845,3.99,2.5,null,"Pflaumen Rot","Sorte:Angelo","2025-06-26"]
[846,0.59,0.3,null,"Champignon Braun","Egerlinge","2025-02-01"]
[847,1.99,1.5,null,"Shitake Pilze"]
[848,3.49,2.85,null,"Steinpilze",null,"2024-10-29"]
[849,0.99,0.5,null,"Austernpilze",null,"2025-01-21"]
[850,0.69,0.5,null,"Walnüsse","Sorte: Grenobler","2024-12-12"]
[851,0.99,0.55000000000000004,null,"Wassermelone","mit Kernen","2025-07-07"]
[852,3.99,1.1000000000000001,null,"Wassermelone geschnitten","in Scheiben geschnitten","2025-04-26"]
[853,2.99,2.2000000000000002,null,"Aprikosen","Sorte:\"Valenciano\"","2025-07-07"]
[854,5.99,3,null,"Aprikosen","Sorte \"Orangred\"","2025-07-15"]
[855,0,81,null,null,null,"2024-06-19T15:43:50"]
[856,1.99,1.1499999999999999,null,"Zucker Melonen","Sorte: Futura","2025-06-04"]
[857,null,null,null,null,null,"2025-06-04"]
[858,0.99,0.6,null,"Lahanakraut",null,"2024-11-29"]
[859,0]
[860,2.99,2,null,"Nektarinen",null,"2025-07-16","2025-07-16"]
[861,2.99,2,null,"Pfirsich",null,"2025-07-15","2025-07-16"]
[862,0.01,3,null,"Pfirsich Standard","Sorte: Astoria","2025-07-08"]
[863,0,651]
[864,0]
[865,2.99,1,null,"Nektarinen","Sorte:Diamantina","2025-07-15"]
[866,5.99,4.5,null,"Pfirsich weiß","Sun Royal","2025-07-15"]
[867,2.99,1.5,null,"Bergpfirsich","Sorte:Paraguayos","2025-07-16","2025-07-16"]
[868,0,860]
[869,5.99,3.3,null,"Nektarinen Weiß","Sorte:Sun Royal","2025-07-15"]
[870,1.99,1.25,null,"Zwetschgen","Sorte: Presenta","2024-09-28"]
[871,1.49,0.9,null,"Gurken Extra","Schlangengurken 500-600gr","2025-07-15"]
[872,2.99,1.5,null,"Zwetschgen","Sorte: Cacak´s","2025-07-14","2025-07-16"]
[873,1.99,null,null,"Grünkohl",null,"2024-07-03T16:34:49"]
[874,0.99,0.7,null,"Maroni lose",null,"2024-12-28"]
[875,0.79,0.49,null,"Mirabellen","Sorte: \"Reneklode\"","2024-08-28"]
[876,2.99,1.5,null,"Zwetschgen","Sorte: Hermann","2025-07-15","2025-07-16"]
[877,2.4900000000000002,null,null,"Zwetschgen","Sorte: Bühler"]
[878,1.99,0.9,null,"Zwetschgen","Sorte: Hanita","2024-08-08T12:02:43"]
[879,2.99,null,null,"Zwetschgen","Sorte: Stanley"]
[880,4.99,null,null,"Trauben Weiß mit Kern","Sorte: Regina"]
[881,2.99,1.6,null,"Trauben Weiß kernlos","Sorte:Sweet-Globe","2025-07-08"]
[882,6.99,4,null,"Trauben Weiß kernlos","Sorte: Thompson Seedles","2024-08-13T17:19:36"]
[883,6.99,4.75,null,"Trauben kernlos","Sorte:\"Sugareone\"","2025-07-08"]
[884,0,28,null,"Trauben Blau mit Kern","Sorte: Paglieri","2024-12-19"]
[885,null,3,null,"Trauben Rot kernlos","Sorte:Pink Muskat\"","2024-09-26"]
[886,2.99,1.8,null,"Trauben Weiß mit Kern","Sorte: Viktoria Standardt","2025-07-12"]
[887,4.99,3.05,null,"Trauben rot mit Kern","Sorte: Red Globe","2025-05-22"]
[888,3.79,1.8,null,"Trauben Weiß mit Kern","Sorte:Vittoria","2025-07-09"]
[889,5.99,3.6,null,"Trauben Rot mit Kern","Sorte: Lavallee","2024-10-26"]
[890,3.99,2.7,null,"Trauben Weiß mit Kern","Sorte: Italia Extra","2024-11-11"]
[891,5.99,4.1399999999999997,null,"Trauben weiß mit Kern","Sorte: Vittoria","2024-11-04"]
[892,4.99,3.7,null,"Trauben Weiß kernlos","Sorte: Sultana","2024-10-17"]
[893,5.99,3.6,null,"Trauben Rosé","Sorte: Black Magic","2025-07-15"]
[894,2.99,null,null,"Weintrauben","Sorte: Phönix"]
[895,0]
[896,1.19,0.65,null,"Trauben gepackt","Sorte: siehe Etikett","2025-07-14"]
[897,0]
[898,0]
[899,0]
[900,2.4900000000000002,1.45,null,"Kürbis","Sorte: Hokkaido","2025-03-13"]
[901,3.99,2.4,null,"Orangen","Sorte: Navel","2025-06-14"]
[902,0.99,0.5,null,"Saft Orangen","Sorte: Navelinas"]
[903,4.99,3.15,null,"Orangen","Sorte: Navelinas","2025-03-15"]
[904,3.49,2.5,null,"Orangen","Sorte:\"Navelinas\"","2025-02-13"]
[905,1.99,1,null,"Blutorangen","Sorte:Sanguinello","2025-04-02"]
[906,3.99,2.2000000000000002,null,"Clementinen","Sorte: Tangold","2024-09-09"]
[907,1.99,1,null,"Orange","Sorte: Schokoorange"]
[908,2.4900000000000002,1.2,null,"Clementinen","Nadorcott","2024-11-14"]
[909,4.49,4,null,"Clementinen","Sorte: Orri"]
[910,0.99,1,null,"Clementinen","Sorte: \"Clemenules\"","2024-12-07"]
[911,2.99,2.0110000000000001,null,"Orange Bio",null,"2024-07-26T10:45:30"]
[912,null,null,null,"Orangen","Sorte: Kara Kara-","2025-03-15"]
[913,2.79,1.8,null,"Blutorangen",null,"2025-03-27"]
[914,0]
[915,3.99,2.5,null,"Clementinen","Sorte: Ori","2025-02-27"]
[916,5.99,4,null,"Clementinen","Sorte: Orenules","2025-03-15"]
[917,3.99,2,null,"Satsumas","Sorte: Murcott","2025-04-24"]
[918,1.99,0.74,null,"Erdnüsse lose",null,"2024-10-15"]
[919,3.99,2.875,null,"Clementinen Blatt","Sorte:Tangold","2025-03-15"]
[920,0.39,0.15,null,"Kumquats",null,"2025-03-07"]
[921,0]
[922,0]
[923,0]
[924,0]
[925,0]
[926,0]
[927,0]
[928,0]
[929,0]
[930,0]
[931,0]
[932,0]
[933,0]
[934,0]
[935,0]
[936,0]
[937,0]
[938,0]
[939,0]
[940,0]
[941,0]
[942,0]
[943,0]
[944,0]
[945,0]
[946,0]
[947,0]
[948,0]
[949,0]
[950,0]
[951,0]
[952,0]
[953,0]
[954,0]
[955,0]
[956,0]
[957,0]
[958,0]
[959,0]
[960,0]
[961,0]
[962,0]
[963,0]
[964,0]
[965,0]
[966,0]
[967,0]
[968,0]
[969,0]
[970,0]
[971,0]
[972,0]
[973,0]
[974,0]
[975,0]
[976,0]
[977,0]
[978,0]
[979,0]
[980,0]
[981,0]
[982,0]
[983,0]
[984,0]
[985,0]
[986,0]
[987,0]
[988,0]
[989,0]
[990,5.99,4,null,"Maroni gekocht"]
[991,0]
[992,0]
[993,0]
[994,0]
[995,1.49,1,null,"Passionsfrucht"]
[996,2.4900000000000002,1.3,null,"Zwiebel Rot lose"]
[997,3.99,2.15,null,"Gemüse Zwiebel lose"]
[998,1.99,null,null,"Drillinge","Festkochend"]
[999,0.59,0.36,null,"Zitronengras",null,"2024-06-25T21:56:04"]
[7070,5.99,5.25,null,"Spargel-grün",null,"2025-06-12"]
[7305,1,0.65,null,"Minze"]
[7451,1,0.5,null,"Waldmeister"]
[7474,2.4900000000000002,1.3,null,"Bärlauch",null,"2025-04-12"]
[7511,1.2,null,null,"Peterle Glatt"]
[7512,2.99,2.2200000000000002,null,"Beifuß",null,"2024-12-20"]
[41231,3.99,0,null,"Von Winning","trocken"]

{"sheet":"Übertrag","index":1,"n_rows":9,"n_cols":6,"rows_kept":9,"cut":false,"hidden":true,"merged":[]}
[]
[45,1.59,0.9,null,"Blumenkohl"]
[705,2.69,2,null,"Mini - Rispen","Sorte: Rote Perle"]
[722,0.55000000000000004,0.28000000000000003,null,"Kiwi Gold"]
[748,1.59,0.9,null,"Pfifferling","Sorte; Cantharellus"]
[781,0.55000000000000004,0.33,null,"Avocado","Sorte: Hass"]
[817,2.99,1.99,null,"Pink Lady"]
[860,2.99,2,null,"Nektarinen"]
[867,2.99,1.5,null,"Bergpfirsich","Sorte:Paraguayos"]

{"sheet":"Obst","index":2,"n_rows":1007,"n_cols":17,"rows_kept":1007,"cut":false,"hidden":true,"merged":[]}
["ID","Artikel","Herkunft","Klasse","Sorte","Beschreibung","PLU Wiege","PLU Stück","Gewicht","Einheit","Preis","Verpackung","Neue Ernte","Behandelt","Aktion","Spalte1","Spalte2"]
[1,"Trauben gepackt",null,null,null,null,null,null,500,"g",1.19,"Schale"]
[2,"Bergnektarinen gepackt",null,null,null,null,null,null,500,"g",0.99]
[3,"Trauben gepackt",null,null,null,null,null,null,null,"10",1.19]
[4,"Bergpfirsiche gepackt",null,null,null,null,null,null,1000,"g",2.99,"Schale"]
[5,null,null,null,null,null,null,null,1,"16"]
[6,null,null,null,null,null,null,null,null,"5"]
[7,"Orangen Netz",null,null,null,null,null,null,null,"20",1.99]
[8,"Rothaus","Tannenzäplfe",null,"Classic oder Alkoholfrei","Bester Aromahopfen aus Tettnang und der Hallertau ebenso wie heimisches Malz aus Sommergerste und reinstes Quellwasser aus dem Hochschwarzwald verleihen dem Rothaus Tannenzäpfle seinen einzigartig würzigen und frischen Geschmack.",null,null,1.9,"L",4.7699999999999996,"Packung","6x0,33l"]
[9,null,null,null,null,null,null,null,null,null,0]
[10,"trauben rose ziplook",null,null,"Mini Eiertomaten",null,80,null,500,"g",2.99,"Packung"]
[11,"Grapefruit gepackt","\"Spanien\"","Kl. II","Sorte: Star Ruby","Grapefruits schmecken sehr saftig und säuerlich bis süß-säuerlich, je nach Sorte auch leicht bis deutlich bitter. Übrigens: Je dünner und glatter die Schale, desto lieblicher schmeckt die sogenannte Citrus paradisi.",null,null,1.5,"kg",0.99,"Netz",null,"Schale behandelt"]
[12,null,null,null,null,null,null,null,null,null,0]
[13,null,null,null,null,null,null,null,null,null,0]
[14,null,null,null,null,null,null,null,null,null,0]
[15,null,"Zum Testen ob es geht",null,null,null,null,null,null,null,0.99]
[16,null,null,null,null,null,null,null,null,null,0]
[17,null,null,null,null,null,null,null,null,null,0]
[18,"Achtung!!!!","Bitte text lesen!!!!!",null,null,"Bitte die 700 Nehmen für die Strauchtomaten im Aufbau!!!!!!",null,null,null,null,0]
[19,"blubb",null,null,null,null,null,null,null,null,21]
[20,"Kopfsalat","\"Deutschland\"","Kl. II",null,"Kopfsalat enthält unter anderem Zitronen- und andere Säuren. Das sorgt für frischen Geschmack.  Daneben kommen Vitamin C, Folsäure und Beta-Carotin, das Provitamin A, in ihm vor. Der Körper kann es in Vitamin A umwandeln.",null,20,null,null,0.69,"Stück"]
[21,"Eisbergsalat","\"Deutschland\"","Kl. II",null,"Eisbergsalat besteht hauptsächlich aus Wasser, deshalb schmeckt er frisch und knackig. Er ist auch bekannt als \"Krachsalat\". Eisbergsalat enthält nur 13 Kilokalorien pro 100 Gramm. An Vitaminen kommt unter anderem Folsäure in ihm vor.",null,21,null,null,0.99,"Stück","Pfalz"]
[22,"Endivien","\"Deutschland\"","Kl. II","\"Pfalz\"","Endivien sind Blattsalate aus der Verwandtschaft von Zichorie, Chicorée und Radicchio. Es gibt glattblättrige Sorten, die als Eskariol bezeichnet werden, und krausblättrige Sorten, die man Frisée oder Petticoat-Salate nennt.",null,22,null,null,0.99,"Stück","neue Ernte"]
[23,"Kaki","\"South-Afrika\"",null,"Sorte: Persimon","Kakis sind orangefarbene, etwa tomatengroße Früchte, die ursprünglich aus Asien kommen. Sie haben in Deutschland hauptsächlich im Winter Saison – meist sind sie in der Zeit von Oktober bis Dezember erhältlich.",null,23,null,null,1.59,"Stück"]
[24,"Krull","\"Deutschland\"","Kl. II",null,"Frisch, mild, mit einem leicht nussartigen Geschmack und meist ohne Bitterstoffe, so kommt der Krull daher. Er ist Bestandteil vieler Mix-Salate im Handel. Entstanden ist der Krauskopf aus einer Kreuzung zwischen Kopfsalat und Eichblattsalat.",null,24,null,null,0.99,"Stück","neue Ernte"]
[25,"Romanasalat"," \"Spanien\"","Kl. II",null,"Romana-Salat, auch Römischer Salat und Bindesalat genannt, besteht hauptsächlich aus Wasser und hat relativ wenig Kalorien. Er enthält aber Vitamin C, Folsäure sowie Kalium und Kalzium.",null,25,null,null,1.99,"Stück"]
[26,"Bund - Möhren","\"Deutschland\"","Kl. II","\"Pfalz\"","Die Bundmöhren stellen dabei eine besondere Angebotsform dar, denn hierbei wird die Wurzel zusammen mit dem Laub vermarktet. Das grüne Laub ist ein untrügliches Zeichen für Frische.",null,26,null,null,1.29,"Stück","Neue Ernte"]
[27,"Eichblatt","\"Deutschland\"","Kl. II",null,"Der rote Eichblattsalat ist reichhaltig an Beta-Carotin, Vitamin B1, Vitamin B2, Vitamin B6 sowie Vitamin C. Außerdem enthält der Salat Kalium, Phosphor und blutbildendes Eisen.",null,27,null,null,0.99,"Stück","neue Ernte"]
[28,"kiste kopfsalat","deutsch 12 köpfe",null,null,"kiste +3,86 pfand",null,28,null,null,9,null,"plu 28"]
[29,"Paprika Mix","\"Spanien\"","Kl. II","Sorte:Color","Der Paprika Mix mit einer roten, einer gelben und einer orangenen Paprika ist ein Klassiker in der Küche. Ob gegart oder knackig frisch für einen Salat, sie ist vielseitig einsetzbar.",null,29,400,"g",1.79,"Packung"]
[30,"Paprika Rot gepackt","\"Spanien\"","Kl. II",null,"Die Antwort lautet: sehr gesund. Denn Paprika enthalten wertvolle Nährstoffe und sind wahre Vitaminbomben. Schon 100 g, also eine mittelgroße Paprika, liefern den gesamten Tagesbedarf an Vitamin C und damit das dreifache von",null,29,500,"g",0.99,"Packung"]
[31,null,null,null,null,null,null,null,null,null,0]
[32,null,null,null,null,null,null,null,null,null,0]
[33,null,null,null,null,null,null,null,null,null,0]
[34,"E - Schlotten","\"Frankreich\"",null,null,"Schalotten haben ein feineres, weniger scharfes, eher süßliches und würzigeres Aroma als die meisten Speisezwiebelsorten. Zum scharfen Anbraten eignen sie sich nur bedingt, weil sie dadurch bitter und schal werden.",null,34,100,"g",1.99,"Packung","Neu Ernte"]
[35,"Zwiebel gelb Netz","\"Deutschland\"","Kl. II",null,"Die Herkunft der Zwiebel ist schwer zu bestimmen, da sie eine alte und sehr weit verbreitete Kulturpflanze ist. Man geht davon aus, dass sie aus Zentralasien stammt. Schon im alten Ägypten wurde die Zwiebel als Kulturpflanze erwähnt.",null,35,null,"kg",1.49,"Netz","Neue Ernte"]
[36,"Zwiebel gelb Netz","\"Italien\"","Kl. II",null,"Die Herkunft der Zwiebel ist schwer zu bestimmen, da sie eine alte und sehr weit verbreitete Kulturpflanze ist. Man geht davon aus, dass sie aus Zentralasien stammt. Schon im alten Ägypten wurde die Zwiebel als Kulturpflanze erwähnt.",null,36,4,"kg",4.99,"Netz","Neue Ernte"]
[37,"Zwiebelschlotten","\"Deutschland\"",null,"\"Pfalz\"","Neben der Verwendung als Würze für Fleischgerichte, Suppen und Eintöpfe gibt es auch Klassiker unter den Zwiebelrezepten, wie die französische Zwiebelsuppe oder den deftigen Zwiebelkuchen.",null,37,null,null,0.79,"Stück","neue Ernte"]
[38,"Zuckererbsen","siehe Verpackung","Kl. II",null,"Rohe Zuckerschoten sind extrem lecker und knackig. Sie können sofort verzehrt oder als Garnierung zu Salaten oder Suppen gegeben werden. Dazu müssen die Schoten nur gewaschen und gereinigt werden.",null,38,250,"g",3.99,"Packung"]
[39,"Feigen","\"Italien\"","Kl. II","Sorte:\"Brogiotto Nero\"","Feigen haben einen köstlichen Geschmack und ein Aroma, das dem von Rosinen ähnelt, aber man kann den Unterschied erkennen, da man den Geschmack und das Aroma von Feigen nicht nachahmen kann.",null,39,null,null,0.69,"Stück"]
[40,"Artischocken","\"Türkei\"","Kl. II",null,"Der Geschmack der Artischocke ist feinherb und zartbitter, aber auch nussig. Deswegen lässt sich das Gemüse auch sehr vielfältig in der Küche verwenden. Der essbare Blütenkopf besteht aus dem Artischockenherz.",null,40,null,null,0.99,"Stück"]
[41,null,null,null,null,null,null,null,null,null,0]
[42,null,null,null,null,null,null,null,null,null,0]
[43,"Rettich weiß","\"Deutschland\"","Kl. II"," \"Pfalz\"","Der Rettich ist weiß, dessen vorteilhafte Eigenschaften und Kontraindikationen leicht nachprüfbar sind, und weist eine ausgewogene chemische Zusammensetzung auf.",null,43,null,null,1.49,"Stück","Neue Ernte"]
[44,"Rettich Rot","\"Deutschland\"","Kl. II",null,"Die rote Farbe des Rettichs hat keinen Einfluss auf den Geschmack, die Inhaltsstoffe sind vergleichbar mit denen anderer Rettichsorten. Ebenso wie die anderen Rettichsorten schmeckt der rote Rettich herzhaft-würzig.",null,44,null,null,0.69,"Stück"]
[45,"Blumenkohl","\"Deutschland\"","Kl. II",null,"Blumenkohl, auch Karfiol oder Minarett-Kohl genannt, verdankt seinen Namen einer botanischen Besonderheit: Der Kohlkopf ist der noch nicht geschossene Blütenstand der Pflanze.",null,45,null,null,1.59,"Stück","Neue Ernte"]
[46,"Kohlrabi","\"Deutschland\"","Kl. II","\"Pfalz\"","Kohlrabi gilt als typisch deutsches Gemüse und in vielerlei Hinsicht als gesund. In der heimischen Küche findet die Knolle daher oft und in zahlreichen Varianten Verwendung.",null,46,null,null,0.59,"Stück","neu Ernte"]
[47,"Knoblauch gepackt","\"China\"","Kl. II",null,"Knoblauch ist eine ausdauernde, frostharte und krautige Pflanze aus der Familie der Amaryllisgewächse (Amaryllidaceae), wird allerdings nur einjährig überwinternd kultiviert.",null,47,250,"g",1.69,"Packung"]
[48,"Kokosnuss","Afrika","Kl. II",null,"Das weiße Fleisch der Kokosnuss schmeckt nussähnlich. Das im Inneren steckende Kokoswasser hingegen hat einen süßlichen und zugleich leicht säuerlichen Geschmack. Tatsächlich schmeckt das Fruchtfleisch bitter und ist ungenießbar.",null,48,null,null,0.99,"Stück"]
[49,"Tomaten Schale","Herkunft: siehe Etikett","Kl. II",null,"Die winzigen Cherrytomaten werden oftmals irrtümlicherweise auch als Cocktailtomaten bezeichnet. Obwohl diese beiden Tomatensorten sich auf den ersten Blick äußerst ähnlich sind, gibt es dennoch Unterschiede",null,49,250,"g",1.19,"Packung"]
[50,null,"\"Spanien\"",null,null,null,null,null,null,null,0]
[51,"Karambole","Asien","Kl. II","Sorte: Sternenfrucht","Sternfrüchte haben sehr wenig Fett. Je nach natürlicher Zusammensetzung unter 0,3 g Fett je 100 g Frucht und das bei ebenfalls sehr niedrigen 31 Kalorien. Auch der Anteil an Kohlenhydraten liegt unter 7-8 g pro 100 g.",null,51,null,null,1.99,"Stück"]
[52,"Kartoffel fest","\"Deutschland\"",null,"Sorte: Siehe Etikett","Annabelle ist eine frühreife, festkochende Kartoffelsorte mit langovalen Knollen. Sie entstand aus der Kreuzung Nicola x Monalisa. Die aus den Niederlanden stammende Kartoffel wurde 2002 zugelassen",null,52,2,"kg",2.99,"Netz"]
[53,null,null,null,null,null,null,null,null,null,0]
[54,"Papaya","\"Brasilien\"","Kl. II",null,"Diese tropische Offenbarung mit ihrem süss-saftigen, orangefarbenen bis kirschroten Fruchtfleisch und den kleinen schwarzen, pfeffrigen Kernen ist auch in Europa das ganze Jahr über erhältlich.",26158,54,null,null,3.99,"Stück"]
[55,null,null,null,null,null,null,null,null,null,0]
[56,"Kresse","\"Deutschland\"","Kl. II",null,"Gartenkresse ist jenes würzig schmeckende Grünzeug, das meist zur Dekoration über kalte Platten gestreut wird. Kein Mensch denkt bei Kresse an ein Heilmittel. Genau das aber ist die Gartenkresse",null,56,null,null,0.55000000000000004,"Stück"]
[57,"Zitronen","Spanien","Kl. II","Sorte: Limon Verna","Zitronen sind Lebensmittel und Heilmittel zugleich. Nutzen Sie am besten die ganze Frucht, also nicht nur den Zitronensaft, sondern auch die Schale. Beides passt hervorragend in die Feinschmeckerküche.",null,57,null,null,0.69,"Stück","Neue Ernte","Schale behandelt"]
[58,"Grapefruit","\"Südafrika\"","Kl. II",null,"Grapefruits schmecken sehr saftig und säuerlich bis süß-säuerlich, je nach Sorte auch leicht bis deutlich bitter. Übrigens: Je dünner und glatter die Schale, desto lieblicher schmeckt die sogenannte Citrus paradisi.",null,58,null,null,0.69,"Stück",null,"Schale behandelt","1"]
[59,"Clementine Netz","Spanien","Kl. II","\"Clemenules\"","Clemenules-Mandarinen zeichnen sich durch einen hohen Vitamin-C-Gehalt, ein intensives Aroma und ihre leuchtende orange Farbe aus. Die Früchte sind etwas abgeflacht, mittelgroß, wiegen zwischen 80 und 100 g und sind einfach zu schälen.",null,59,1000,"g",1.59,"Netz",null,"Schale behandelt"]
[60,"Orangen Netz","\"Spanien\"","Kl. II","Sorte:Navel","Die Orange ist die beliebteste unter den Zitrusfrüchten, ein wichtiger Lieferant für Vitamin C und ein Duftstoff in der Kosmetik. Wichtige Inhaltsstoffe sitzen nicht nur im Fruchtfleisch, sondern auch in den weißen Häutchen und der Schale.",null,60,1,"kg",0.99,"Netz",null,"Schale behandelt"]
[61,"Salatherzen","\"Deutschland\"","Kl. II",null,"Als Salatherzen werden die inneren Blätter eines Salatkopfes, zum Beispiel von Kopf- oder Romanasalat bezeichnet. Die feinen innen liegenden Blätter sind meistens zarter und knackiger als die äußeren Blätter.",null,61,2,null,0.99,"Stück"]
[62,"Kartoffel mehlig","\"Deutschland\"",null,"Sorte: siehe Etikett","Melody ist eine mittelfrühe Kartoffel-Speisesorte, die sich gut eignet als mehligkochende Premiumsorte: gleichmäßige, ziemlich grobfallende Sortierung, schöne gleichmäßige, ovale Form, schöne, helle Schale und eine gute Speisequalität.",null,62,2.5,"kg",1.99,"Netz","Neue Ernte"]
[63,"Rucola","\"Deutschland\"","Kl. II",null,"Egal ob auf Pizza, im Pesto oder als Salat – Rucola erfreut sich großer Beliebtheit. Der dunkelgrüne Blattsalat mit dem würzigen Geschmack ist aber nicht nur markanter Bestandteil vieler Rezepte, sondern auch gesund.",null,63,125,"g",1.29,"Packung","neue Ernte"]
[64,"Clementinen Steige","\"Italien\"","Kl. II","Sorte: Clemenules","Clemenules-Mandarinen zeichnen sich durch einen hohen Vitamin-C-Gehalt, ein intensives Aroma und ihre leuchtende orange Farbe aus. Sie sind das Ergebnis einer spontanen Mutation der feinen Clementine, die zum ersten Mal in Nules, Castellón de la Plana",null,64,2,"kg",2.99,"Stück",null,"Schale behandelt"]
[65,"Erdbeeren gepackt","\"Spanien\"","Kl. II",null,"Die aromatischen Früchte sind mit etwa 32 Kilokalorien pro hundert Gramm gut für die schlanke Linie. Hervorzuheben ist ihr hoher Gehalt an Ballaststoffen (Pektinen und Zellulose), welche die Verdauung fördern.",null,65,800,"g",1.99,"Packung"]
[66,"Kartoffel vorwiegend","\"Deutschland\"",null,"Sorte: siehe Etikett","Die Sorte \"Marabel\" ist seit 1990 eine der beliebtesten Speisekartoffeln in Deutschland. Marabel ist eine Frühkartoffel. Die Kartoffel besitzt eine gelbe und sehr glatte Schale sowie eine ovale Form und festes, gelbfleischiges Fruchtfleisch.",null,66,2.5,"kg",1.99,"Netz","Neue Ernte"]
[67,null,null,null,null,null,null,null,null,null,0]
[68,"Vorwiegend festkochend","\"Deutschland\"",null,"Sorte:siehe  Etikett","Die Sorte \"Marabel\" ist seit 1990 eine der beliebtesten Speisekartoffeln in Deutschland. Marabel ist eine Frühkartoffel. Die Kartoffel besitzt eine gelbe und sehr glatte Schale sowie eine ovale Form und festes, gelbfleischiges Fruchtfleisch.",null,68,4,"kg",3.33,"Netz","Neue Ernte",null,"1"]
[69,"Zuckermais","\"Marocco\"","Kl. II",null,"Zuckermais oder Süßmais (Zea mays Saccharata-Gruppe) ist eine Maissorte, die bei der Reife erst sehr spät ihren süßen Geschmack verliert und keinen ausgeprägten mehligen Geschmacksanteil zeigt. Eine bekannte Maissorte ist Golden Bantam.",null,69,500,"g",2.4900000000000002,null,"Neue Ernte"]
[70,null,null,null,null,null,null,null,null,null,0]
[71,null,null,null,null,null,null,null,null,null,0]
[72,"Sellerie mit Grün","\"Deutschland\"","Kl. II",null,"Rund ist gesund - bei Knollensellerie trifft das definitiv und uneingeschränkt zu. Wer ihn nur als Suppengemüse kennt, hat übrigens was verpasst, denn Knollensellerie kann kulinarisch durchaus für angenehme Überraschungen sorgen!",null,72,null,null,1.99,"Stück","achtung allergiger"]
[73,"Bleichsellerie","\"Deutschland\"","Kl. II","neue ernte \"Pfalz\"","Staudensellerie kommt gebleicht und ungebleicht auf den Markt. Die meist aus England oder den USA stammenden Bleichselleriesorten sind so genannte selbstbleichende Sorten.",null,73,null,null,1.49,"Stück","Achtung Allergiker"]
[74,null,null,null,null,null,null,null,null,null,0,null,"758"]
[75,"Peterle Krauß","Deutschland","Kl. II",null,"Die beliebte Krause Petersilie stammt ursprünglich aus dem Mittelmeergebiet. Dort wächst sie wild auf trockenen, steinigen Standorten. Mauern oder Schuttplätze sind in diesem Umfeld die Lebensgrundlage(bot.) Petroselinum crispum var. crispum.",null,75,null,null,1,"Stück"]
[76,"Dill","Deutschland","Kl. II",null,"Um die Gewürzpflanze Dill ranken sich viele Mythen: So soll ein Bündel Dill unter dem Kopfkissen gegen Albträume helfen, während das an der Tür angebrachte Kraut böse Hexen fernhalten soll.",null,76,null,null,2,"Stück"]
[77,"Suppengrün","Deutschland","Kl. II",null,"Suppengrün, auch Suppengemüse, Kochgemüse, Wurzelwerk oder Wurzelzeug genannt, ist eine Mischung aus verschiedenen Gemüsearten zur Herstellung einer Brühe.",null,77,null,null,1.39,"Stück"]
[78,"Schnittlauch","Deutschland","Kl. II",null,"Schnittlauch kennen wir alle als Gewürzkraut. Weniger bekannt sind seine Eigenschaften als Heilpflanze. Es handelt sich um eine Lauchart (Allium), also um einen Verwandten von Knoblauch, Bärlauch oder Zierlauch.",null,78,null,null,1.2,"Stück"]
[79,null,null,null,null,null,null,null,null,null,0,null,"88"]
[80,"Kiwi grün","\"Italien\"","Kl. II","Sorte: Hayward Green","Von Hobbygärtnern und auch von den gewerblichen Obstbauern ist der Kiwibaum (Actinidia deliciosa) erst recht spät entdeckt worden. In seiner angestammten Heimat wird dieser Beerenstrauch hingegen bereits seit gut tausend Jahren kultiviert.",null,80,null,null,0.28999999999999998,"Stück"]
[81,"Mango","\"Brasilien\"","Kl. II","\"Palmer\"","Die Mango ist eine tropische Frucht, die in verschiedenen Teilen der Welt angebaut wird und für ihren süßen und unverwechselbaren Geschmack bekannt ist. Die Schale der Frucht, deren Farbe von dunkelgrün bis orange variieren kann, ist ziemlich hart.",null,81,null,null,1.59,"Stück"]
[82,"Honigmelone","\"Spanien\"","Kl. II","Honig","Ob Honigmelone, Wassermelone, Cantaloupe-Melone oder Galiamelone – die Auswahl an verschiedenen Melonenarten im Supermarkt ist groß. Die Honigmelone ist leicht an ihrer knallgelben Farbe zu erkennen.",null,82,null,null,1.99,"Stück"]
[83,"Cantaloup Melone","\"Spanien\"","Kl. II","\"Carante\"","Cantaloupe Melone ist eine süße und saftige Zuckermelone mit orangefarbenem Fruchtfleisch und grünlicher Schale.Sie stammt ursprünglich aus dem Ort Cantalupo bei Rom, wo sie im 18. Jahrhundert von den Päpsten angebaut wurde.",null,83,null,null,1.99,"Stück"]
[84,"Galia-Melone","\"Spanien\"","Kl. II","Galia","Die Galiamelone zählt zu den sogenannten Netzmelonen und findet sich besonders im Sommer immer wieder gerne in der Obstschale – dabei ist sie gar kein Obst, sondern ein Gemüse!",null,84,null,null,1.99,"Stück"]
[85,"Ananas","Costa-Rica","Kl. II",null,"Nährstoffwunder Ananas: In kaum einer anderen Frucht stecken mehr Vitalstoffe als in der gelben Tropenfrucht. Hier erfährst du alles über die gesunde Wirkung, die richtige Zubereitung und vielfältige Verwendung von Ananas.",null,85,null,null,3.99,"Stück"]
[86,"Mini Wassermelone","\"Spanien\"","Kl. II","kernarm","Die Wassermelone ist eine niederliegende bis kletternde, einjährige, krautige Pflanze. Die Sprossachsen sind dünn, kantig, gefurcht und abstehend steif behaart.",null,86,null,null,2.99,"Stück"]
[87,"Gurken","\"Belgien\"","Kl. II",null,"Gurken sind vor allem im Sommer eine willkommene Erfrischung, denn durch ihren hohen Wassergehalt versorgen sie unseren Körper mit viel Flüssigkeit. Dieser Wassergehalt sorgt auch dafür, dass Gurken nur wenige Kalorien haben.",null,87,null,null,0.99,"Stück","500-600gramm"]
[88,"Radieschen","\"Deutschland\"","Kl. II","\"Pfalz\"","Ein Radieschen ist ein gesundes Wurzelgemüse, das zu den Kreuzblütengewächsen gehört. Sein botanische Name lautet Raphanus sativus, teilweise wird das Gemüse aber auch einfach „Radies“ genannt.",null,88,null,null,0.49,"Stück","neue Ernte"]
[89,"Zuckermelone","Türkei","Kl. II",null,"Zuckermelonen haben eine vergleichsweise dicke Schale, die durch grüne Flecken und eine netzartige Struktur gekennzeichnet ist. Zuckermelone Geschmack: fruchtig, autromatisch, süß",null,89,null,null,2.99,"Stück"]
[90,null,null,null,null,null,null,null,null,null,0]
[91,"Grüne Sosse","\"Deutschland\"",null,"Sorte: Echte Frankfurter",null,null,null,null,null,4.49]
[92,"Limette","\"Brasilien\"","Kl. II","\"Tahiti\"","Als Limette bezeichnet man mehrere Arten von Zitrusfrüchten. Limetten sind grün bis gelb, rundlich mit einem Durchmesser von drei bis sechs Zentimetern. Ihr Fruchtfleisch ist essbar und schmeckt sehr sauer, vergleichbar mit Zitronen.",null,92,null,null,0.33,"Stück",null,"Schale behandelt","1"]
[93,null,null,null,null,null,null,null,null,null,0]
[94,null,null,null,null,null,null,null,null,null,0]
[95,null,null,null,null,null,null,null,null,null,0]
[96,null,null,null,null,null,null,null,null,null,0]
[97,null,null,null,null,null,null,null,null,null,0]
[98,null,null,null,null,null,null,null,null,null,0]
[99,null,null,null,null,null,null,null,null,null,0]
[100,"Bio Bananen",null,null,"DE-ÖKO-006","Die Bio-Banane ist eine imposante Blattschmuckstaude, die dank ihrer winterharten Natur auch ausgepflanzt im Garten gedeiht. Aus langen, steifen Blattstielen bildet die Banane ausladende Blattwedel, die jedem Standort ein exotisches Flair verleihen.",100,7708685,null,"kg",1.99,"lose"]
[101,"Spinat","\"Italien\"","Kl. II",null,"Frischer Spinat hat den Vorteil, dass er oft aromatischer und knackiger ist als Tiefkühlspinat. Da er jedoch schnell verdirbt, solltest du ihn möglichst zügig verarbeiten, idealerweise innerhalb von ein bis zwei Tagen.",null,101,250,"g",2.99,"Packung"]
[102,"Rosenkohl gepackt","Niederlande","Kl. II",null,"Rosenkohl schmeckt als Salat und gekocht als Gemüse und lässt sich hervorragend einfrieren. Als schonende Zubereitung eignet sich das Dampfgaren. Rosenkohl enthält viele Mineral- und Ballaststoffe sowie Vitamin A, Riboflavin (Vitamin B2) und Ascorbinsäure",null,102,500,"g",1.39,"Packung"]
[103,"Kiwi Grün Bio 4er","siehe Etikett","Kl. II","DE-ÖKO-006","Von Hobbygärtnern und auch von den gewerblichen Obstbauern ist der Kiwibaum (Actinidia deliciosa) erst recht spät entdeckt worden. In seiner angestammten Heimat wird dieser Beerenstrauch hingegen bereits seit gut tausend Jahren kultiviert.",null,273968,4,null,2.4900000000000002,"Stück"]
[104,"Kiwi Gold Bio 3er","siehe Etikett","Kl. II",null,"Zespri SunGold Kiwis enthalten von Natur aus viel Vitamin C, ein Nährstoff dessen Eigenschaften zur Gesundheit der Haut beiträgt.Zespri SunGold Kiwis enthalten mehr Vitamin C als eine Orange/100 g",null,9057438,3,null,1.59,"Stück"]
[105,"Wildkräutersalat","Herkunft: siehe Etikett","Kl. II",null,"Wildkräuter müssen laut Definition zwei Dinge erfüllen: Erstens sind es krautige (nicht verholzende) Pflanzen, die zum Verzehr geeignet sind. Zweitens sind sie Kraut, das nicht züchterisch bearbeitet wurde.",null,105,250,"g",3.49,"Packung"]
[106,"Babyleaf-Mix","\"Italien\"","Kl. II",null,"Im Handel werden viele Mischungen angeboten, die neben den Sorten des Gartensalats auch Endivie Mangold und Rote Beete Pak Choi und Chinakohl Spinat oder Senf enthalten können.",null,106,250,"g",3.49,"Packung"]
[107,null,null,null,null,null,null,null,null,null,0]
[108,null,null,null,null,null,null,null,null,null,0]
[109,"Bio Gurke","siehe Etikett","Kl. II","DE-ÖKO-006","Gurken sind vor allem im Sommer eine willkommene Erfrischung, denn durch ihren hohen Wassergehalt versorgen sie unseren Körper mit viel Flüssigkeit. Dieser Wassergehalt sorgt auch dafür, dass Gurken nur wenige Kalorien haben.",null,2493357,null,null,1.59,"Stück"]
[110,"Zucchini Bio","siehe Etikett","Kl. II","DE-ÖKO-006","Ihr mildes, leicht nussiges Aroma macht Zucchini zum kulinarischen Alleskönner, der auf unzählige Arten zubereitet werden kann. Erfahren Sie jetzt alles Wissenswerte rund um das beliebte mediterrane Gemüse!",null,8181276,500,"g",2.2200000000000002,"Packung"]
[111,"Bio Karotten lose","Deutschland","Kl. II","DE-ÖKO-005","Möhren gehören zu den enorm kalorienarmen Gemüsesorten und sollten in der Küche nach Möglichkeit nicht fehlen. Außerdem sind sie besonders reich an Carotin, einer Vorstufe von Vitamin A.",111,7763778,null,"kg",1.99,"Lose"]
[112,"Karotte Bio","Herkunft: siehe Etikett","Kl. II",null,"Möhren gehören zu den enorm kalorienarmen Gemüsesorten und sollten in der Küche nach Möglichkeit nicht fehlen. Außerdem sind sie besonders reich an Carotin, einer Vorstufe von Vitamin A.",null,7763778,1,"kg",1.99,"Packung"]
[113,"Aubergine Bio","siehe Etikett","Kl. II",null,"Auberginen sind nicht nur leckere Gemüse, sondern auch gesund und vielseitig. Sie haben viele Vorteile für die Verdauung, das Herz und die Haut.Auberginen sollten immer gegart werden, da sie roh Solanin enthalten, einen schwach giftigen Stoff.",null,8263652,null,null,1.99,"Stück"]
[114,"Snack Karotte Bio","siehe Etikett","Kl. II",null,null,null,9049727,200,"g",1.49,"Packung"]
[115,null,null,null,null,null,null,null,null,null,0]
[116,null,null,null,null,null,null,null,null,null,0]
[117,null,null,null,null,null,null,null,null,null,0]
[118,null,null,null,null,null,null,null,null,null,0]
[119,null,null,null,null,null,null,null,null,null,0]
[120,"Rispentomaten Mini Bio","siehe Etikett","Kl. II","DE-ÖKO-005","Die Rote Perle Tomate ist eine kleine und sehr dunklerote Mini-Strauchtomate. Sie ist Platzfest, hat einen aromatischen würzigen Geschmack, ist sehr ertragreich und gut haltbar.",null,2355991,300,"g",2.99,"Packung"]
[121,null,null,null,null,null,null,null,null,null,0]
[122,null,null,null,null,null,null,null,null,null,0]
[123,"Achtung Paprika Rot hat","neue verpackungsgrös",null,null,null,null,null,null,null,0.01]
[124,"Wer Bio Gala hat",null,null,"bitte mit Santana Tauschen","Danke! Gala gibt es aktuell nicht! Und in Waage anlegen. Danke!!!",null,null,null,null,0]
[125,"Bio Mango",null,null,null,"Bitte neuen Artikel raussuchen und bitte Herrn Niebler schicken für ein Schild. Danke!",null,null,null,null,0]
[126,"Bitte Feldsalat",null,null,"mit Salatherzen tauschen","Salatherzen gibt es aktuell keine. Danke",null,null,null,null,0]
[127,null,null,null,null,null,null,null,null,null,0]
[128,null,null,null,null,null,null,null,null,null,0]
[129,null,null,null,null,null,null,null,null,null,0]
[130,"Bio Champignon","siehe Etikett","Kl. II","DE-ÖKO-005","Egerlinge sind besonders aufgrund ihres intensiven und leicht nussigen Geschmacks in der Küche sehr geschätzt. Zudem gibt es beim Verzehr keine Einschränkungen zu beachten, daher kann man sie sowohl in rohem, aber auch in gekochtem Zustand genießen.",null,7171289,250,"g",2.4900000000000002,"Packung"]
[131,"Kresse mix Bio","Deutschland","Kl. II",null,"Gartenkresse ist jenes würzig schmeckende Grünzeug, das meist zur Dekoration über kalte Platten gestreut wird. Kein Mensch denkt bei Kresse an ein Heilmittel. Genau das aber ist die Gartenkresse",null,8278255,null,null,0.69,"Stück"]
[132,"Bio Snackpaprika","siehe Etikett","Kl. II",null,"Die sehr beliebte rote Snackpaprika ist eine kleine und ausgesprochen süße Form der Spitzpaprika. Sie enthält nur wenig Kerne und kann deshalb direkt von der Pflanze weg verzehrt werden. Daher ist sie bei Kindern ein beliebtes Naschgemüse.",null,2331708,150,"g",2.2200000000000002,"Packung"]
[133,"Paprika Rot Bio","siehe Etikett","Kl. II","DE-ÖKO-005","Die Antwort lautet: sehr gesund. Denn Paprika enthalten wertvolle Nährstoffe und sind wahre Vitaminbomben. Schon 100 g, also eine mittelgroße Paprika, liefern den gesamten Tagesbedarf an Vitamin C und damit das dreifache von Zitrusfrüchten.",133,2247066,null,"kg",6.99,"Lose"]
[134,"Bio Chili Rot","siehe Etikett",null,"ES-ECO-019-CT","Wenn du die Schärfe von Chili, Paprika und Peperoni auf der Zunge schmeckst, handelt es sich um eine Schmerzreaktion, verursacht durch das Capsaicin. Die Unterschiede liegen aber nicht nur in Art und Form, sondern auch im Gehalt von Capsaicin.",null,8968584,80,"g",1.29,"Packung"]
[135,"Paprika Spitz Bio","siehe Etikett","Kl. II","DE-ÖKO-006","Capia-Paprikaschoten, die häufig als geröstet und frisch konsumiert werden, gehören zu den Aromen, die in vielen Rezepten gesucht werden.",null,3933679,180,"g",2.79,"Packung"]
[136,"Paprika Rot Bio","siehe Etikett","Kl. II",null,"Die Antwort lautet: sehr gesund. Denn Paprika enthalten wertvolle Nährstoffe und sind wahre Vitaminbomben. Schon 100 g, also eine mittelgroße Paprika, liefern den gesamten Tagesbedarf an Vitamin C und damit das dreifache von Zitrusfrüchten.",null,1056856,400,"g",3.69,"Packung"]
[137,"Chili Mix Bio","Herkunft: siehe Etikett","Kl. II",null,"Wenn du die Schärfe von Chili, Paprika und Peperoni auf der Zunge schmeckst, handelt es sich um eine Schmerzreaktion, verursacht durch das Capsaicin. Die Unterschiede liegen aber nicht nur in Art und Form, sondern auch im Gehalt von Capsaicin.",null,7720169,80,"g",1.49,"Packung"]
[138,null,null,null,null,null,null,null,null,null,0]
[139,null,null,null,null,null,null,null,null,null,0]
[140,null,null,null,null,null,null,null,null,null,0]
[141,"Kurkuma Bio","China","Kl. II","DE-ÖKO-006","Im Gegensatz zum scharf schmeckenden Ingwer, weist Kurkuma sparsam dosiert, einen milderen würzigen Geschmack auf. Am besten schmeckt Kurkuma, wenn man es etwas in heißem Öl anwärmt.",141,8087379,100,"g",1.99,"Lose"]
[142,"Ingwer Bio","Peru",null,"DE-ÖKO-006","Der Geschmack des Ingwers ist scharf und hat ein charakteristisches süßes Aroma. Das Aroma des frischen Ingwers ähnelt auch einer Zitrone. Der Geschmack wird durch das Vorhandensein von ätherischem Öl und scharfen Harzen intensiv.",142,1218793,100,"g",0.79,"Lose"]
[143,null,null,null,null,null,null,null,null,null,0]
[144,null,null,null,null,null,null,null,null,null,0]
[145,"Aprikosen Bio","Herkunft: siehe Etikett","Kl. II","Sorte: siehe Etikett","Der hohe Ballaststoffanteil sorgt für eine verdauungsfördernde Wirkung und der geringe Säureanteil macht die Aprikose leicht bekömmlich. Aprikosen sind oft geschwefelt erhältlich.",null,2478116,400,"g",2.59,"Packung"]
[146,"Pfirsich Platt Bio","siehe Etikett","Kl. II",null,"Unter dem Namen Weinbergpfirsich kennen wir die flachen, hellrosa-orange-gelben Pfirsichfrüchte. Ihr Geschmack ist sehr süß und hoch aromatisch. Sie sind das neue Trendobst und als Weinbergpfirsich in aller Munde.",null,7015307,500,"g",2.99,"Packung"]
[147,null,null,null,null,null,null,null,null,null,0]
[148,null,null,null,null,null,null,null,null,null,0]
[149,null,null,null,null,null,null,null,null,null,0]
[150,"Orangen Bio","siehe Etikett","Kl. II",null,"Orangen schmecken süß, sind saftig und stecken voller Vitamine. Aber nicht nur das: Orangen sind auch vielseitig. Egal ob pur, als Saft oder Marmelade, in Desserts oder Smoothies.",null,284208,null,"kg",2.79,"Netz"]
[151,"Mandarinen Bio","siehe Etikett","Kl. II",null,"Sie kann sowohl süß, als auch herb oder bitter schmecken. Bei der Clementine ist dies nicht der Fall. Sie kommt deutlich weniger intensiv daher, ist aber – aufgrund des höheren Zuckergehalts – süßer als Mandarinen.",null,1450537,750,"g",3.79,"Packung"]
[152,"Spaghettikürbis Bio","Deutschland","Kl. II",null,"Spaghettikürbis schmeckt mild. Er hat einen ähnlichen Geschmack wie Zucchini. Manche mögen ihn sogar als fade empfinden. Manche mögen den Geschmack als leicht süßlich empfinden.",152,1433397,null,"kg",2.99,"Lose"]
[153,"Bio Butternutkürbis","siehe Etikett","Kl. II",null,"Seinem Namen macht der Butternutkürbis alle Ehre, wie seine Fans längst wissen. Sein zartes hellorangefarbenes Fruchtfleisch betört mit buttrigem Aroma. Auch die Kürbiskerne des Birnenkürbis sind essbar und schmecken angenehm nach Nuss.",153,null,null,"kg",2.29,"Lose"]
[154,"Grapefruit Bio","Herkunft: Siehe Etikett","Kl. II",null,"Grapefruits schmecken sehr saftig und säuerlich bis süß-säuerlich, je nach Sorte auch leicht bis deutlich bitter. Übrigens: Je dünner und glatter die Schale, desto lieblicher schmeckt die sogenannte Citrus paradisi.",null,1252425,null,null,1.59,"Stück"]
[155,"Apfel Elstar Bio","Deutschland","Kl. II","DE-ÖKO-003","Elstar ist eine der beliebtesten Apfelsorten im Norden. Sein saftiges, weiß-gelbliches Fruchtfleisch hat einen intensiven, fein säuerlichen Geschmack. Bei guter Lagerung schmeckt er bis in den Mai.",155,488959,1,"kg",3.99,"Lose"]
[156,"Apfel Gala Bio","siehe Etikett","Kl. II",null,"Es ist ein mittelstark wachsender Baum. Seine Früchte besitzen eine hell rote glatte Schale. Ihr Geschmack ist süß, saftig, aromatisch mit festem Fruchtfleisch.",null,8676599,550,"g",3.29,"Packung"]
[157,"Apfel Santana Bio","Deutschland","Kl. II","DE-ÖKO-006","Wenn ab April der Apfel Santana anfängt zu blühen,kann man sich schon auf die großen, roten Früchte freuen. Von September an ist es dann so weit und es kann geerntet werden. Der süße Geschmak der saftigen, feinen Früchte ist einfach unverwechselbar.",157,8847098,550,"g",3.49,"Packung"]
[158,"Cripps Pink Bio","Herkunft: siehe Etikett","Kl. II",null,"Cripps Pink ist eine kleinfrüchtige Apfelsorte. Sie entstand 1973 aus einer Kreuzung von Lady Williams und Golden Delicious. Der Cripps Pink stammt ursprünglich aus Australien. Er gilt vom Geschmack als süß und ist mittelmäßig saftig.",null,8448206,550,"g",3.29,"Packung"]
[159,"Granatapfel Bio","Herkunft: Siehe Etikett","Kl. II",null,"Der Granatapfel ist eine kugelförmige, bis zu 500 g schwere Frucht, die einen Durchmesser von bis zu 10 cm erreichen kann. Die Frucht besitzt eine glatte, lederartige Schale, die anfangs gelbgrün und später ins orangerote übergeht.",null,1457147,null,null,2.39,"Stück"]
[160,"Salatherzen Bio","siehe Etikett","Kl. II","DE-ÖKO-034","Als Salatherzen werden die inneren Blätter eines Salatkopfes, zum Beispiel von Kopf- oder Romanasalat bezeichnet. Die feinen innen liegenden Blätter sind meistens zarter und knackiger als die äußeren Blätter.",null,504997,null,null,2.29,"Stück"]
[161,"Feldsalat Bio","siehe Etikett",null,null,"Die zarten Blätter des Feldsalats werden schnell matschig. Umso wichtiger ist die richtige Lagerung des Salats. Sie sollten den Feldsalat kühl lagern, Kondenswasser jedoch vermeiden, da dieses an der Verpackung den Salat schnell verderben lässt.",null,2876337,100,"g",1.89,"Packung"]
[162,null,null,null,null,null,null,null,null,null,0]
[163,null,null,null,null,null,null,null,null,null,0]
[164,"Conference Birne Bio","siehe Etikett","Kl. II",null,"onference ist mittelgroß bis groß und besitzt eine längliche, kegelartige Form. Die teils großflächige Berostung auf der grüngelben Deckfarbe der Schale ist sortentypisch. Der Geschmack ist süß und zeigt eine leichte Würze.",null,8256207,500,"g",2.4900000000000002,"Packung"]
[165,"Bio Pflaume","Herkunft: siehe Etikett","Kl. II","Sorte: Siehe Etikett","Pflaumen schmecken frisch von der Hand in den Mund am besten, für Kuchen oder Kompott eignen sie sich weniger. Sie sind naturgemäß von einer dünnen, wachsartigen Schicht überzogen.",null,81957,500,"g",2.99,"Packung"]
[166,"Bio Birne","Herkunft: siehe Etikett","Kl. II","Sorte: Limonera","Alles, was eine Birne braucht, vereint die Limonera: Sie ist groß, mildsäuerlich, mäßig süß und vor allem saftig. Die Sommerbirne tankt in Spanien viel Sonne und ist bereits im August genussreif. Dann heißt es: ab in den Obstkorb und zu euch ins Büro.",null,9951320,550,"g",2.29,"Packung"]
[167,null,null,null,null,null,null,null,null,null,0]
[168,null,null,null,null,null,null,null,null,null,0]
[169,null,null,null,null,null,null,null,null,null,0]
[170,"Broccoli Bio","siehe Etikett","Kl. II",null,"Er ist reich an Vitaminen, Mineralstoffen und sekundären Pflanzenstoffen, die das Immunsystem stärken, Entzündungen hemmen und vor Krebs schützen können. Brokkoli lässt sich vielseitig zubereiten, zum Beispiel als Salat,",null,726105,400,"g",2.19,"Packung"]
[171,"Pastinaken Bio","siehe Etikett","Kl. II",null,"Werden die Pastinaken erst nach dem Frost geerntet, dann entwickeln sie ein leicht süßliches und intensiv würziges Aroma. Dieses Aroma erinnert im weitesten Sinne an den Geschmack von Sellerie und Liebstöckel.",null,8397672,300,"g",2.29,"Packung"]
[172,"Zwiebel Schalotte Bio","Herkunft: Siehe Etikett","Kl. II",null,"Schalotten haben ein feineres, weniger scharfes, eher süßliches und würzigeres Aroma als die meisten Speisezwiebelsorten. Zum scharfen Anbraten eignen sie sich nur bedingt, weil sie dadurch bitter und schal werden.",null,6697038,200,"g",1.69,"Netz"]
[173,null,null,null,null,null,null,null,null,null,0]
[174,null,null,null,null,null,null,null,null,null,0]
[175,"Kartoffel Bio","siehe Etikett","Kl. II","festkochend","Festkochende Kartoffeln zeichnen sich im Vergleich zu mehligen Kartoffeln durch deutlich unterschiedliche Kocheigenschaften aus: Sie sind im gekochten Zustand schnittfest, feinkörnig und feucht.",null,3335283,1.5,"kg",3.49,"Netz"]
[176,null,null,null,null,null,null,null,null,null,0]
[177,null,null,null,null,null,null,null,null,null,0]
[178,null,null,null,null,null,null,null,null,null,0]
[179,null,null,null,null,null,null,null,null,null,0]
[180,"Zitrone Bio","siehe Etikett","Kl. II","ES-ECO-020-CV","Zitronen sind Lebensmittel und Heilmittel zugleich. Nutzen Sie am besten die ganze Frucht, also nicht nur den Zitronensaft, sondern auch die Schale. Beides passt hervorragend in die Feinschmeckerküche.",null,180,500,"g",1.89,"Packung"]
[181,"Limette Bio","Niederlande","Kl. II","DE-ÖKO-006","Limetten sind grün bis gelb, rundlich mit einem Durchmesser von drei bis sechs Zentimetern. Ihr Fruchtfleisch ist essbar und schmeckt sehr sauer, vergleichbar mit Zitronen, aber meist mit einer intensiveren, würzigeren Note.",null,8290497,null,null,0.69,"Stück"]
[182,"Zitrone Bio","\"Spanien\"","Kl. II",null,"Zitronen sind Lebensmittel und Heilmittel zugleich. Nutzen Sie am besten die ganze Frucht, also nicht nur den Zitronensaft, sondern auch die Schale. Beides passt hervorragend in die Feinschmeckerküche.",null,182,null,null,0.49,"Stück"]
[183,null,null,null,null,null,null,null,null,null,0]
[184,null,null,null,null,null,null,null,null,null,0]
[185,"Mango Bio Faserarm","Brasilien","Kl. II",null,"Die Mango ist eine tropische Frucht, die in verschiedenen Teilen der Welt angebaut wird und für ihren süßen und unverwechselbaren Geschmack bekannt ist. Die Schale der Frucht, deren Farbe von dunkelgrün bis orange variieren kann, ist ziemlich hart.",null,1022075,null,null,1.99,"Stück"]
[186,null,null,null,null,null,null,null,null,null,0]
[187,null,null,null,null,null,null,null,null,null,0]
[188,null,null,null,null,null,null,null,null,null,0]
[189,null,null,null,null,null,null,null,null,null,0]
[190,"Bio Hokkaido","Spanien",null,null,"Seinen Namen verdankt der Hokkaido-Kürbis seiner ursprünglichen Heimat – einer gleichnamigen Insel in Japan. Hokkaido-Kürbis begeistert viele mit einem leicht nussigen, etwas an Esskastanien erinnernden Aroma und seinem saftigen, faserarmen Fruchtfleisch.",190,2891678,null,"kg",3.99,"Lose"]
[191,"Zuckermais Bio","siehe Etikett","Kl. II","DE-ÖKO-006","Zuckermais oder Süßmais (Zea mays Saccharata-Gruppe) ist eine Maissorte, die bei der Reife erst sehr spät ihren süßen Geschmack verliert und keinen ausgeprägten mehligen Geschmacksanteil zeigt. Eine bekannte Maissorte ist Golden Bantam.",null,2138770,400,"g",2.4900000000000002,"Packung"]
[192,"Rote Bete gekocht Bio","siehe Etikett","Kl. II",null,"Rote Bete schmeckt bitter und hat einen leicht erdigen Beigeschmack. Der erdige Geschmack in der Roten Bete ist auf eine Verbindung namens Geosmin zurückzuführen. Rote Bete hat auch einen leicht süßen Geschmack, weshalb sie sich für Süßspeisen eignet.",null,1256869,500,"g",1.69,"Packung"]
[193,null,null,null,null,null,null,null,null,null,0]
[194,null,null,null,null,null,null,null,null,null,0]
[195,null,null,null,null,null,null,null,null,null,0]
[196,null,null,null,null,null,null,null,null,null,0]
[197,null,null,null,null,null,null,null,null,null,0]
[198,null,null,null,null,null,null,null,null,null,0]
[199,null,null,null,null,null,null,null,null,null,0]
[200,null,null,null,null,null,null,null,null,null,0]
[201,null,null,null,null,null,null,null,null,null,0]
[202,null,null,null,null,null,null,null,null,null,0]
[203,null,null,null,null,null,null,null,null,null,0]
[204,null,null,null,null,null,null,null,null,null,0]
[205,null,null,null,null,null,null,null,null,null,0]
[206,null,null,null,null,null,null,null,null,null,0]
[207,null,null,null,null,null,null,null,null,null,0]
[208,null,null,null,null,null,null,null,null,null,0]
[209,null,null,null,null,null,null,null,null,null,0]
[210,null,null,null,null,null,null,null,null,null,0]
[211,null,null,null,null,null,null,null,null,null,0]
[212,null,null,null,null,null,null,null,null,null,0]
[213,null,null,null,null,null,null,null,null,null,0]
[214,null,null,null,null,null,null,null,null,null,0]
[215,null,null,null,null,null,null,null,null,null,0]
[216,null,null,null,null,null,null,null,null,null,0]
[217,null,null,null,null,null,null,null,null,null,0]
[218,null,null,null,null,null,null,null,null,null,0]
[219,null,null,null,null,null,null,null,null,null,0]
[220,null,null,null,null,null,null,null,null,null,0]
[221,null,null,null,null,null,null,null,null,null,0]
[222,null,null,null,null,null,null,null,null,null,0]
[223,null,null,null,null,null,null,null,null,null,0]
[224,null,null,null,null,null,null,null,null,null,0]
[225,null,null,null,null,null,null,null,null,null,0]
[226,null,null,null,null,null,null,null,null,null,0]
[227,null,null,null,null,null,null,null,null,null,0]
[228,null,null,null,null,null,null,null,null,null,0]
[229,null,null,null,null,null,null,null,null,null,0]
[230,null,null,null,null,null,null,null,null,null,0]
[231,null,null,null,null,null,null,null,null,null,0]
[232,null,null,null,null,null,null,null,null,null,0]
[233,null,null,null,null,null,null,null,null,null,0]
[234,null,null,null,null,null,null,null,null,null,0]
[235,null,null,null,null,null,null,null,null,null,0]
[236,null,null,null,null,null,null,null,null,null,0]
[237,null,null,null,null,null,null,null,null,null,0]
[238,null,null,null,null,null,null,null,null,null,0]
[239,null,null,null,null,null,null,null,null,null,0]
[240,null,null,null,null,null,null,null,null,null,0]
[241,null,null,null,null,null,null,null,null,null,0]
[242,null,null,null,null,null,null,null,null,null,0]
[243,null,null,null,null,null,null,null,null,null,0]
[244,null,null,null,null,null,null,null,null,null,0]
[245,null,null,null,null,null,null,null,null,null,0]
[246,null,null,null,null,null,null,null,null,null,0]
[247,null,null,null,null,null,null,null,null,null,0]
[248,null,null,null,null,null,null,null,null,null,0]
[249,null,null,null,null,null,null,null,null,null,0]
[250,null,null,null,null,null,null,null,null,null,0]
[251,null,null,null,null,null,null,null,null,null,0]
[252,null,null,null,null,null,null,null,null,null,0]
[253,null,null,null,null,null,null,null,null,null,0]
[254,null,null,null,null,null,null,null,null,null,0]
[255,null,null,null,null,null,null,null,null,null,0]
[256,null,null,null,null,null,null,null,null,null,0]
[257,null,null,null,null,null,null,null,null,null,0]
[258,null,null,null,null,null,null,null,null,null,0]
[259,null,null,null,null,null,null,null,null,null,0]
[260,null,null,null,null,null,null,null,null,null,0]
[261,null,null,null,null,null,null,null,null,null,0]
[262,null,null,null,null,null,null,null,null,null,0]
[263,null,null,null,null,null,null,null,null,null,0]
[264,null,null,null,null,null,null,null,null,null,0]
[265,null,null,null,null,null,null,null,null,null,0]
[266,null,null,null,null,null,null,null,null,null,0]
[267,null,null,null,null,null,null,null,null,null,0]
[268,null,null,null,null,null,null,null,null,null,0]
[269,null,null,null,null,null,null,null,null,null,0]
[270,null,null,null,null,null,null,null,null,null,0]
[271,"Lollo Rosso","\"Deutschland\"","Kl. II",null,"Der Lollo Rossa Schnittsalat unterscheidet sich von Kopfsalaten. Er bildet nämlich keine Köpfe, sondern nach jeder Ernte neue Triebe. Es gibt auch Pflücksalat, der Mitte bis Ende März im Freien ausgesät und nach 5 bis 7 Wochen geerntet wird.",null,271,null,null,0.99,"Stück","neue Ernte"]
[272,"Lollo Blondo","\"Deutschland\"","Kl. II",null,"Der Lollo Biondo besitzt hellgrüne, krause Blätter und hält sich im Vergleich zu einfachem Kopfsalat ganz gut ein paar Tage im Kühlschrank ... besonders wenn du ihn vor dem Austrocknen schützt,",null,272,null,null,0.99,"Stück","neue Ernte"]
[273,null,null,null,null,null,null,null,null,null,0]
[274,null,null,null,null,null,null,null,null,null,0]
[275,null,null,null,null,null,null,null,null,null,0]
[276,null,null,null,null,null,null,null,null,null,0]
[277,null,null,null,null,null,null,null,null,null,0]
[278,null,null,null,null,null,null,null,null,null,0]
[279,null,null,null,null,null,null,null,null,null,0]
[280,null,null,null,null,null,null,null,null,null,0]
[281,null,null,null,null,null,null,null,null,null,0]
[282,null,null,null,null,null,null,null,null,null,0]
[283,null,null,null,null,null,null,null,null,null,0]
[284,null,null,null,null,null,null,null,null,null,0]
[285,null,null,null,null,null,null,null,null,null,0]
[286,null,null,null,null,null,null,null,null,null,0]
[287,null,null,null,null,null,null,null,null,null,0]
[288,null,null,null,null,null,null,null,null,null,0]
[289,null,null,null,null,null,null,null,null,null,0]
[290,null,null,null,null,null,null,null,null,null,0]
[291,null,null,null,null,null,null,null,null,null,0]
[292,null,null,null,null,null,null,null,null,null,0]
[293,null,null,null,null,null,null,null,null,null,0]
[294,null,null,null,null,null,null,null,null,null,0]
[295,null,null,null,null,null,null,null,null,null,0]
[296,null,null,null,null,null,null,null,null,null,0]
[297,null,null,null,null,null,null,null,null,null,0]
[298,null,null,null,null,null,null,null,null,null,0]
[299,null,null,null,null,null,null,null,null,null,0]
[300,null,null,null,null,null,null,null,null,null,0]
[301,null,null,null,null,null,null,null,null,null,0]
[302,null,null,null,null,null,null,null,null,null,0]
[303,null,null,null,null,null,null,null,null,null,0]
[304,null,null,null,null,null,null,null,null,null,0]
[305,null,null,null,null,null,null,null,null,null,0]
[306,null,null,null,null,null,null,null,null,null,0]
[307,null,null,null,null,null,null,null,null,null,0]
[308,null,null,null,null,null,null,null,null,null,0]
[309,null,null,null,null,null,null,null,null,null,0]
[310,null,null,null,null,null,null,null,null,null,0]
[311,null,null,null,null,null,null,null,null,null,0]
[312,null,null,null,null,null,null,null,null,null,0]
[313,null,null,null,null,null,null,null,null,null,0]
[314,null,null,null,null,null,null,null,null,null,0]
[315,null,null,null,null,null,null,null,null,null,0]
[316,null,null,null,null,null,null,null,null,null,0]
[317,null,null,null,null,null,null,null,null,null,0]
[318,null,null,null,null,null,null,null,null,null,0]
[319,null,null,null,null,null,null,null,null,null,0]
[320,null,null,null,null,null,null,null,null,null,0]
[321,null,null,null,null,null,null,null,null,null,0]
[322,null,null,null,null,null,null,null,null,null,0]
[323,null,null,null,null,null,null,null,null,null,0]
[324,null,null,null,null,null,null,null,null,null,0]
[325,null,null,null,null,null,null,null,null,null,0]
[326,"Freilandrosen","Deutschland",null,"Gärtnerware","Unter der mannigfaltigen Auswahl von Rosen für den Garten, gibt es etliche Sorten, die auch gut für den Vasenschnitt geeignet sind. Der Rosenfreund spricht von Freilandschnittrosen.",null,null,null,null,3.99,"Stück"]
[327,"Pfingstrosen","Deutschland",null,null," Leuchtende Blüten mitten im Winter: Christrosen benötigen wenig Pflege und sind winterhart. Wer bestimmte Sorten kombiniert, hat ab November an der Staude viel Freude. Sie gedeiht auch im Topf.",null,null,null,null,2.4900000000000002,"Stück"]
[328,"Frühlingsstrauß","\"Deutschland\"",null,null,"Gestaltet imposante Blumenarrangements aus Tulpen, Ranunkeln, Narzissen. kombiniert mit Zweigen von Eukalyptus, Birke oder Apfel entstehen kleine Blumenkunstwerke.",null,null,null,null,5.99,"Stück"]
[329,"Sonnenblumenstrauß","Gärtnerware",null,null,"Sonnenblumen sind bekannt für ihre hohen Stängel und großen, leuchtend gelben Blüten. Es gibt verschiedene Sorten, die in vier Haupttypen unterteilt werden können, darunter Öltypen mit vielen Röhrenblüten",null,null,null,null,2.99,"Stück"]
[330,null,null,null,null,null,null,null,null,null,0]
[331,null,null,null,null,null,null,null,null,null,0]
[332,null,null,null,null,null,null,null,null,null,0]
[333,null,null,null,null,null,null,null,null,null,0]
[334,null,null,null,null,null,null,null,null,null,0]
[335,null,null,null,null,null,null,null,null,null,0]
[336,null,null,null,null,null,null,null,null,null,0]
[337,null,null,null,null,null,null,null,null,null,0]
[338,null,null,null,null,null,null,null,null,null,0]
[339,null,null,null,null,null,null,null,null,null,0]
[340,null,null,null,null,null,null,null,null,null,0]
[341,null,null,null,null,null,null,null,null,null,0]
[342,null,null,null,null,null,null,null,null,null,0]
[343,null,null,null,null,null,null,null,null,null,0]
[344,null,null,null,null,null,null,null,null,null,0]
[345,null,null,null,null,null,null,null,null,null,0]
[346,null,null,null,null,null,null,null,null,null,0]
[347,null,null,null,null,null,null,null,null,null,0]
[348,null,null,null,null,null,null,null,null,null,0]
[349,null,null,null,null,null,null,null,null,null,0]
[350,null,null,null,null,null,null,null,null,null,0]
[351,null,null,null,null,null,null,null,null,null,0]
[352,null,null,null,null,null,null,null,null,null,0]
[353,null,null,null,null,null,null,null,null,null,0]
[354,null,null,null,null,null,null,null,null,null,0]
[355,null,null,null,null,null,null,null,null,null,0]
[356,null,null,null,null,null,null,null,null,null,0]
[357,null,null,null,null,null,null,null,null,null,0]
[358,null,null,null,null,null,null,null,null,null,0]
[359,null,null,null,null,null,null,null,null,null,0]
[360,null,null,null,null,null,null,null,null,null,0]
[361,null,null,null,null,null,null,null,null,null,0]
[362,null,null,null,null,null,null,null,null,null,0]
[363,null,null,null,null,null,null,null,null,null,0]
[364,null,null,null,null,null,null,null,null,null,0]
[365,null,null,null,null,null,null,null,null,null,0]
[366,null,null,null,null,null,null,null,null,null,0]
[367,null,null,null,null,null,null,null,null,null,0]
[368,null,null,null,null,null,null,null,null,null,0]
[369,null,null,null,null,null,null,null,null,null,0]
[370,null,null,null,null,null,null,null,null,null,0]
[371,null,null,null,null,null,null,null,null,null,0]
[372,null,null,null,null,null,null,null,null,null,0]
[373,null,null,null,null,null,null,null,null,null,0]
[374,null,null,null,null,null,null,null,null,null,0]
[375,null,null,null,null,null,null,null,null,null,0]
[376,null,null,null,null,null,null,null,null,null,0]
[377,null,null,null,null,null,null,null,null,null,0]
[378,null,null,null,null,null,null,null,null,null,0]
[379,null,null,null,null,null,null,null,null,null,0]
[380,null,null,null,null,null,null,null,null,null,0]
[381,null,null,null,null,null,null,null,null,null,0]
[382,null,null,null,null,null,null,null,null,null,0]
[383,null,null,null,null,null,null,null,null,null,0]
[384,null,null,null,null,null,null,null,null,null,0]
[385,null,null,null,null,null,null,null,null,null,0]
[386,null,null,null,null,null,null,null,null,null,0]
[387,null,null,null,null,null,null,null,null,null,0]
[388,null,null,null,null,null,null,null,null,null,0]
[389,null,null,null,null,null,null,null,null,null,0]
[390,null,null,null,null,null,null,null,null,null,0]
[391,null,null,null,null,null,null,null,null,null,0]
[392,null,null,null,null,null,null,null,null,null,0]
[393,null,null,null,null,null,null,null,null,null,0]
[394,null,null,null,null,null,null,null,null,null,0]
[395,null,null,null,null,null,null,null,null,null,0]
[396,null,null,null,null,null,null,null,null,null,0]
[397,null,null,null,null,null,null,null,null,null,0]
[398,null,null,null,null,null,null,null,null,null,0]
[399,null,null,null,null,null,null,null,null,null,0]
[400,null,null,null,null,null,null,null,null,null,0]
[401,null,null,null,null,null,null,null,null,null,0]
[402,null,null,null,null,null,null,null,null,null,0]
[403,null,null,null,null,null,null,null,null,null,0]
[404,null,null,null,null,null,null,null,null,null,0]
[405,null,null,null,null,null,null,null,null,null,0]
[406,null,null,null,null,null,null,null,null,null,0]
[407,null,null,null,null,null,null,null,null,null,0]
[408,null,null,null,null,null,null,null,null,null,0]
[409,null,null,null,null,null,null,null,null,null,0]
[410,null,null,null,null,null,null,null,null,null,0]
[411,null,null,null,null,null,null,null,null,null,0]
[412,null,null,null,null,null,null,null,null,null,0]
[413,"Paprika Sivri","Türkei","Kl. II",null,"Bei der Sivri-Paprika handelt es sich um eine dunkelgrüne, besonders lange und dünnwandige Paprika bzw. Peperoni mit hohem Schärfegrad. Wir empfehlen eine trockene Lagerung bei mindestens 8°C.",null,413,400,"g",1.79,"Packung"]
[414,"Paprika Capia","\"Türkei\"","Kl. II","\"Capia rot\"","Capia-Paprikaschoten, die häufig als geröstet und frisch konsumiert werden, gehören zu den Aromen, die in vielen Rezepten gesucht werden.",null,414,400,"g",2.4900000000000002,"Packung"]
[415,"Paprika Carli","Türkei","Kl. II",null,"Die Carli-Paprika ist eine hellgrüne, lange, spitze Gemüsepaprika mit dickem, festen Fruchtfleisch, deren Haut sich besonders gut nach dem Garen oder Grillen abziehen lässt.",null,415,400,"g",1.99,"Packung"]
[416,"Paprika Dolma","Türkei","Kl. II",null,"Die Dolma-Paprika ist eine spitze, dünnwandige Gemüsepaprika aus der Türkei. Sie zeichnet sich durch ihren besonders zarten, weichen Geschmack aus und nimmt bei der Zubereitung schnell die Aromen ihrer Füllung auf.",null,416,400,"g",1.49,"Packung"]
[417,"Paprika weiss","Türkei","Kl. II","Sorte:Spitz","Die Weiße Spitzpaprika ist eine Paprika mit einem leichten Biss und leicht bitterem Geschmack. Diese Paprika ist zum Beispiel in einem Salat sehr schmackhaft. Der Spitzpaprika ist in der Ungarischen und Türkischen Küche weit verbreitet.",null,417,400,"g",1.19,"Packung"]
[418,"orange paprika","Spanien","Kl. II",null,"Grüne Peperoni haben einen milderen Geschmack im Vergleich zu ihren reifen, roten Gegenstücken. Die Schärfe der grünen Schoten ist noch nicht vollständig entwickelt.",null,418,125,"g",1.59,"Packung"]
[419,null,null,null,null,null,null,null,null,null,0]
[420,null,null,null,null,null,null,null,null,null,0]
[421,null,null,null,null,null,null,null,null,null,0]
[422,null,null,null,null,null,null,null,null,null,0]
[423,null,null,null,null,null,null,null,null,null,0]
[424,null,null,null,null,null,null,null,null,null,0]
[425,null,null,null,null,null,null,null,null,null,0]
[426,null,null,null,null,null,null,null,null,null,0]
[427,null,null,null,null,null,null,null,null,null,0]
[428,null,null,null,null,null,null,null,null,null,0]
[429,null,null,null,null,null,null,null,null,null,0]
[430,null,null,null,null,null,null,null,null,null,0]
[431,null,null,null,null,null,null,null,null,null,0]
[432,null,null,null,null,null,null,null,null,null,0]
[433,null,null,null,null,null,null,null,null,null,0]
[434,null,null,null,null,null,null,null,null,null,0]
[435,null,null,null,null,null,null,null,null,null,0]
[436,null,null,null,null,null,null,null,null,null,0]
[437,null,null,null,null,null,null,null,null,null,0]
[438,null,null,null,null,null,null,null,null,null,0]
[439,null,null,null,null,null,null,null,null,null,0]
[440,null,null,null,null,null,null,null,null,null,0]
[441,null,null,null,null,null,null,null,null,null,0]
[442,null,null,null,null,null,null,null,null,null,0]
[443,"Mairüben","\"Deutschland\"","Kl. II",null,"Die Mairübe ist reich an verschiedenen Vitaminen, Mineralstoffen und Eiweiß. Die Schale enthält einen relativ hohen Anteil an Senfölen. Wird die Mairübe roh verzehrt, sollte sie gut gewaschen werden, die Schale darf dran bleiben.",null,443,null,null,0.59,"Stück"]
[444,null,null,null,null,null,null,null,null,null,0]
[445,null,null,null,null,null,null,null,null,null,0]
[446,"Eiszapfen","\"Deutschland\"","Kl. II",null,"Eiszapfen sehen zwar aus wie junge, weiße Rettiche, gehören aber zu den Radieschen-Sorten. Das 10 bis 15 Zentimeter lange Wurzelgemüse erinnert auch im Geschmack an Rettich, ist jedoch saftiger und weniger scharf.",null,446,null,null,1.79,"Stück"]
[447,null,null,null,null,null,null,null,null,null,0]
[448,null,null,null,null,null,null,null,null,null,0]
[449,null,null,null,null,null,null,null,null,null,0]
[450,null,null,null,null,null,null,null,null,null,0]
[451,null,null,null,null,null,null,null,null,null,0]
[452,null,null,null,null,null,null,null,null,null,0]
[453,null,null,null,null,null,null,null,null,null,0]
[454,null,null,null,null,null,null,null,null,null,0]
[455,null,null,null,null,null,null,null,null,null,0]
[456,null,null,null,null,null,null,null,null,null,0]
[457,null,null,null,null,null,null,null,null,null,0]
[458,null,null,null,null,null,null,null,null,null,0]
[459,null,null,null,null,null,null,null,null,null,0]
[460,null,null,null,null,null,null,null,null,null,0]
[461,null,null,null,null,null,null,null,null,null,0]
[462,null,null,null,null,null,0,null,null,null,0]
[463,null,null,null,null,null,null,null,null,null,0]
[464,null,null,null,null,null,null,null,null,null,0]
[465,null,null,null,null,null,null,null,null,null,0]
[466,null,null,null,null,null,null,null,null,null,0]
[467,null,null,null,null,null,null,null,null,null,0]
[468,null,null,null,null,null,null,null,null,null,0]
[469,null,null,null,null,null,null,null,null,null,0]
[470,null,null,null,null,null,null,null,null,null,0]
[471,"Knoblauch gepackt","China","Kl. II","Solo","Soloknoblauch ist die Handelsbezeichnung für Knoblauch, der aus einer einzigen Knolle ohne einzelne Zehen besteht.Als besondere Unterschiede zu dem in Europa weiter verbreiteten mehrzehigen Knoblauch gelten: milder im Geschmack.",null,471,250,"g",3.49,"Packung"]
[472,null,null,null,null,null,null,null,null,null,0]
[473,null,null,null,null,null,null,null,null,null,0]
[474,null,null,null,null,null,null,null,null,null,0]
[475,null,null,null,null,null,null,null,null,null,0]
[476,null,null,null,null,null,null,null,null,null,0]
[477,null,null,null,null,null,null,null,null,null,0]
[478,null,null,null,null,null,null,null,null,null,0]
[479,null,null,null,null,null,null,null,null,null,0]
[480,null,null,null,null,null,null,null,null,null,0]
[481,null,null,null,null,null,null,null,null,null,0]
[482,null,null,null,null,null,null,null,null,null,0]
[483,null,null,null,null,null,null,null,null,null,0]
[484,null,null,null,null,null,null,null,null,null,0]
[485,null,null,null,null,null,null,null,null,null,0]
[486,null,null,null,null,null,null,null,null,null,0]
[487,null,null,null,null,null,null,null,null,null,0]
[488,null,null,null,null,null,null,null,null,null,0]
[489,null,null,null,null,null,null,null,null,null,0]
[490,null,null,null,null,null,null,null,null,null,0]
[491,"Kirschtomaten/Dattel","Deutschland \"Heidelberg\"","Kl. II","Bitte wiegen","Sie zeichnen sich durch einen süß-würzigen Geschmack aus. Die saftigen Kirschtomaten gibt es in Rot, Orange und Gelb bis hin zu einem schokoladenfarbenen, violetten oder schwarzen Farbton.",491,null,250,"g",2.4900000000000002,"Packung","Endpreis auf Ware!"]
[492,null,null,null,null,null,null,null,null,null,0]
[493,null,null,null,null,null,null,null,null,null,0]
[494,null,null,null,null,null,null,null,null,null,0]
[495,null,null,null,null,null,null,null,null,null,0]
[496,null,null,null,null,null,null,null,null,null,0]
[497,null,null,null,null,null,null,null,null,null,0]
[498,null,null,null,null,null,null,null,null,null,0]
[499,"Bergnektarinen","Herkunft: siehe Etikett","Kl. II","Sorte: siehe Etikett","Es gibt sie mit weißem oder gelbem Fruchtfleisch. Geschmacklich ist sie fein süß und etwas aromatischer als ihre runden Verwandten, die Nektarinen. Plattnektarinen sollten am besten kühl, aber nicht kalt gelagert werden.",null,null,500,"g",1.29,"Packung"]
[500,"Frühlingszwiebel Tropea","\"Italien\"","Kl. II","Sorte: Tropea","Eine der lokalen Spezialitäten Kalabriens ist die rote Zwiebel aus Tropea. Ihr süßlicher Geschmack macht sie zu einer kulinarischen Besonderheit. Die feine italienische Speisezwiebel ist von milder Schärfe und sehr bekömmlich.",null,null,null,null,0.99,"Stück"]
[501,"Nektarinen gepackt","Herkunft: siehe Verpackun","Kl. II","Sorte: siehe Verpackung","Das Fruchtfleisch einer voll ausgereiften Nektarine überzeugt mit sehr saftiger Konsistenz und süß-fruchtigem Geschmack. Unreif geerntete Nektarinen schmecken deutlich säuerlicher und haben weniger Aroma.",null,null,1,"kg",1.59,"Packung"]
[502,"Aprikosen gepackt","\"Spanien\"","Kl. II","Sorte: siehe Etikett","Der hohe Ballaststoffanteil sorgt für eine verdauungsfördernde Wirkung und der geringe Säureanteil macht die Aprikose leicht bekömmlich. Aprikosen sind oft geschwefelt erhältlich.",null,null,null,"kg",2.99,"Packung"]
[503,"Trauben Beutel","Peru","Kl. II","Sorte: Sweet Globe","Feste kernlose Beeren. Mit einem sanften Muskat-Geschmack. Züchten Sie die leckeren Früchte der Traube 'Cetennial Seedless' (Vitis vinifera) im eigenen Boden. Der winterfeste Obststrauch blüht im Sommer mit unauffälligen Blumenrispen.",null,null,null,null,2.99,"Stück"]
[504,"Kokosnuss trinkfertig","\"Virtnam\"","Kl. II","Drink&eat","Kokosnusswasser ist ein köstliches, erfrischendes Getränk, reich an Kalium und anderen Mineralien wie Magnesium, Kalzium, Natrium und Phosphor, die zur normalen Flüssigkeitsbalance beitragen.",null,null,null,null,2.99,"Stück"]
[505,"Heidelbeeren gepackt","\"Deutschland\"","Kl. II",null,"Heidelbeeren sind von Juli bis September in der Saison, obwohl man sie das ganze Jahr über als Importware bekommt. Die Beeren werden im Laufe des Sommers dunkler und verfärben sich in ein auffallendes Pink.",null,null,200,"g",2.4900000000000002,"Packung"]
[506,"Broccoli gepackt","Herkunft: siehe Etikett","Kl. II",null,"Er ist reich an Vitaminen, Mineralstoffen und sekundären Pflanzenstoffen, die das Immunsystem stärken, Entzündungen hemmen und vor Krebs schützen können. Brokkoli lässt sich vielseitig zubereiten, zum Beispiel als Salat,",null,null,500,"g",0.99,"Packung"]
[507,"Paprika rot gepackt","Herkunft: siehe Etikett","Kl. II",null,"Die Antwort lautet: sehr gesund. Denn Paprika enthalten wertvolle Nährstoffe und sind wahre Vitaminbomben. Schon 100 g, also eine mittelgroße Paprika, liefern den gesamten Tagesbedarf an Vitamin C und damit das dreifache von Zitrusfrüchten.",null,null,500,"g",0.99,"Packung"]
[508,"Susine rot gepackt","Herkunft: siehe Etikett","Kl. II","Sorte: siehe Etikett","Pflaumen schmecken frisch von der Hand in den Mund am besten, für Kuchen oder Kompott eignen sie sich weniger. Sie sind naturgemäß von einer dünnen, wachsartigen Schicht überzogen.",null,null,null,"kg",1.99,"Packung"]
[509,"Pfirsiche gepackt","Herkunft: siehe Etikett","Kl. II","Sorte: siehe Etikett","Pfirsiche schmecken saftig und süß, aber nur, wenn sie auch wirklich reif sind. Wenn sie zu früh geerntet werden, schmecken sie eher säuerlich und sind oft auch viel zu hart.",null,null,1,"kg",1.99,"Packung"]
[510,"Bergpfirsich","Herkunft: siehe Etikett","Kl. II","Sorte: siehe Etikett","Unter dem Namen Weinbergpfirsich kennen wir die flachen, hellrosa-orange-gelben Pfirsichfrüchte. Ihr Geschmack ist sehr süß und hoch aromatisch. Sie sind das neue Trendobst und als Weinbergpfirsich in aller Munde.",null,null,500,"g",1.59,"Packung"]
[511,"Kirschen im Beutel","Moldawien","Kl. II","Sorte: Frisco 28+","Kirschen schmecken fantastisch und versüssen uns den Sommer. Sie sind besonders reich an sekundären Pflanzenstoffen, wirken gegen freie Radikale und Entzündungen und können bei Leiden wie Bluthochdruck, Gicht und Demenz hilfreich sein.",null,null,null,null,2.99,"Stück"]
[512,"Brombeeren gepackt","Herkunft: siehe Etikett","Kl. II",null,"Die Früchte sind saftig und wohlschmeckend. Brombeer-Früchte eignen sich zum Frischverzehr, als Kuchenbelag und um Konfitüre, Gelee, Sorbet, Saft, Wein und Likör zu bereiten. Die frischen Früchte können außerdem durch Tiefkühlen konserviert werden.",null,null,125,"g",0.69,"Packung"]
[513,"Granatapfel","\"South-Afrika\"",null,null,"Der Granatapfel ist eine kugelförmige, bis zu 500 g schwere Frucht, die einen Durchmesser von bis zu 10 cm erreichen kann. Die Frucht besitzt eine glatte, lederartige Schale, die anfangs gelbgrün und später ins orangerote übergeht.",null,513,null,null,2.99,"Stück"]
[514,null,null,null,null,null,null,null,null,null,0]
[515,null,null,null,null,null,null,null,null,null,0]
[516,null,null,null,null,null,null,null,null,null,0]
[517,null,null,null,null,null,null,null,null,null,0]
[518,null,null,null,null,null,null,null,null,null,0]
[519,null,null,null,null,null,null,null,null,null,0]
[520,null,null,null,null,null,null,null,null,null,0]
[521,null,null,null,null,null,null,null,null,null,0]
[522,null,null,null,null,null,null,null,null,null,0]
[523,null,null,null,null,null,null,null,null,null,0]
[524,null,null,null,null,null,null,null,null,null,0]
[525,null,null,null,null,null,null,null,null,null,0]
[526,null,null,null,null,null,null,null,null,null,0]
[527,null,null,null,null,null,null,null,null,null,0]
[528,null,null,null,null,null,null,null,null,null,0]
[529,null,null,null,null,null,null,null,null,null,0]
[530,null,null,null,null,null,null,null,null,null,0]
[531,null,null,null,null,null,null,null,null,null,0]
[532,null,null,null,null,null,null,null,null,null,0]
[533,null,null,null,null,null,null,null,null,null,0]
[534,null,null,null,null,null,null,null,null,null,0]
[535,null,null,null,null,null,null,null,null,null,0]
[536,null,null,null,null,null,null,null,null,null,0]
[537,null,null,null,null,null,null,null,null,null,0]
[538,null,null,null,null,null,null,null,null,null,0]
[539,"Snack Zitronen","Herkunft: siehe Etikett","Kl. II",null,"Klein, aber oho: Snack-Zitronen zeichnen sich durch ihren süß-säuerlichen Geschmack aus. Ihre dünne Schale enthält aromatische ätherische Öle mit intensivem Limettenaroma, während das Fruchtfleisch eine kräftige Säure aufweist.",null,539,250,"g",5.99,"Packung"]
[540,"Pepino","Südamerika","Kl. II",null,"Die Melonenbirne, auch bekannt als Pepino, ist eine exotische Frucht mit erfrischendem Geschmack. Dieser Artikel beleuchtet alle wichtigen Aspekte rund um die Melonenbirne, von der Bestimmung des Reifegrads über die vielseitigen Verwendungsmöglichkeiten.",null,540,null,null,3.99,"Stück"]
[541,"Süßkartoffel","\"Deutschland\"",null,"\"Bellevue\"","Wegen des hohen Stärkegehalts hat die Yamswurzel eine mehlige Konsistenz und schmeckt je nach Sorte angenehm süß bis leicht bitter. Sie können mäßig süß sein, nehmen aber in erster Linie die Aromen der Zutaten auf, die in der Mahlzeit verwendet werden.",541,null,null,"kg",3.49,"Lose"]
[542,"Mangostane","Malaysia","Kl. II",null,"Reife Mangostane sind sehr saftig und süß, mit einem Stich ins Säuerliche. Ihr Geschmack ähnelt einer Mischung aus sehr süßen Weintrauben, Pfirsichen und Grapefruit, am ehesten ist er mit dem einer Litschi vergleichbar.",null,542,null,null,0.99,"Stück"]
[543,"Pitahaya","\"Türkei\"","Kl. II","Sorte: Hylocereus undatus","Drachenfrüchte kann man sich geschmacklich wie eine sehr fade Kiwi vorstellen. Die Betonung liegt hier aber wirklich auf „fade“, denn Drachenfrüchte haben wenig Geschmack und dieser ist sehr wässrig.",null,543,null,null,3.99,"Stück"]
[544,"Flugmango","\"Brasilien\"","Kl. II","Sorte:Kent","Eine im Allgemeinen als Flugmango bezeichnete Mango wird statt mit dem Schiff mit dem Flugzeug aus dem Erzeugerland importiert. Durch die kurze Transportzeit muss die Mango nicht unreif geerntet werden.",null,544,null,null,5.99,"Stück"]
[545,"Kaktusfeige","Italien","Kl. II",null,"Das Fruchtfleisch der Kaktusfeige ist saftig und schmeckt süß-säuerlich. Ein wenig vergleichbar mit einer Melone oder auch einer Feige. Die saftigen Früchte sind eine gute Erfrischungsquelle.",null,545,null,null,0.99,"Stück"]
[546,"Rambutan","Indien","Kl. II",null," Die Früchte ähneln sich optisch und im Geschmack der Litschi. Beide haben perlmuttweißes saftiges Fleisch, das süß-säuerlich in Richtung Weintrauben schmeckt und optisch an ein gekochtes Ei erinnert.",null,546,null,null,0.99,"Stück"]
[547,"Tamarillo","Peru","Kl. II",null,"Die bis zu 9 cm große ovale Beerenfrucht glänzt mit ihrer glatten und meist gestreiften roten Haut – manchmal ist sie auch orange oder violett. Geschmacklich hat die Frucht ein herb-süßliches Aroma mit einer leicht bitteren und säuerlichen Note.",null,547,null,null,1.99,"Stück"]
[548,"Maracuja","Hawei","Kl. II",null,"Maracujas haben einen einzigartigen, typischen und sehr aromatischen Geschmack. Die meisten Maracujafans lieben an der Frucht außerdem die erfrischende Säure.",null,548,null,null,1.99,"Stück"]
[549,"Salak","Thailand","Kl. II","Schlangenfrucht","Wegen ihrer rötlich-braunen, schuppigen Schale wird sie Schlangenfrucht genannt. Während die Konsistenz fest wie ein Apfel sein kann, ist der Geschmack süßlich mit einem leichten Erdbeeraroma.",null,549,null,null,1.99,"Stück"]
[550,"Kumato Tomaten","Belgien","Kl. II",null,"Ihre Früchte sind braungrün bis rotbraun gefärbt und besitzen feste Haut und festes Fruchtfleisch. Ganz typisch ist der starke Glanz der Früchte. Ihr Geschmack lässt sich am besten mit intensiv, aromatisch und süß-würzig beschreiben.",550,null,null,"kg",5.99,"Lose"]
[551,"Kaktusfeigen","Italien","Kl. II",null,"Das Fruchtfleisch der Kaktusfeige ist saftig und schmeckt süß-säuerlich. Ein wenig vergleichbar mit einer Melone oder auch einer Feige. Die saftigen Früchte sind eine gute Erfrischungsquelle.",null,551,null,null,0.99,"Stück"]
[552,"Kürbis","Deutschland","Kl. II","Sorte: Butternut","Seinem Namen macht der Butternutkürbis alle Ehre, wie seine Fans längst wissen. Sein zartes hellorangefarbenes Fruchtfleisch betört mit buttrigem Aroma.Auch die Kürbiskerne des Birnenkürbis sind essbar und schmecken angenehm nach Nuss.",null,552,null,null,1.49,"Stück"]
[553,"Spaghetti - Kürbis","\"Deutschland\"","Kl II",null,"Der Spaghettikürbis wird auch aufgrund seiner einfachen Zubereitung geschätzt: Er kann als Ganzes oder halbiert gekocht, gedämpft oder gebacken werden. Danach lässt sich das Fruchtfleisch in spaghetti-ähnliche Fäden zerzupfen.",null,553,null,null,1.99,"Stück"]
[554,"Kürbis","\"South Afrika\"","Kl. II","Sorte: Hokkaido","Der Hokkaido-Kürbis gehört zu den beliebtesten Gemüsesorten im Früh- und Spätherbst. Hokkaido-Kürbis begeistert viele mit einem leicht nussigen, etwas an Esskastanien erinnernden Aroma und seinem saftigen, faserarmen Fruchtfleisch.",null,554,null,null,2.69,"Stück"]
[555,"Apfelkiste","Deutschland","Kl. II","zzgl. 0,50€ Pfand","Der Apfel gehört in Deutschland zu den beliebtesten Obstsorten und es werden immer öfter neue Apfelsorten im Handel angeboten, doch von vielen kennt man meist den Geschmack nicht.",null,555,10,"kg",10,"Steige","1"]
[556,"Mini - Rispen","\"Holland\"","Kl. II","Sorte: Sweety","Die kleinen Tomaten an der Rispe sind aromatisch-süß, schön saftig und angenehm knackig. Aufgrund der Rispe behalten sie über einen längeren Zeitraum ihr kräftiges Tomatenaroma. Am besten schmecken die kleinen Rispentomaten als Fingerfood.",556,null,null,"kg",5.99,"Lose"]
[557,"Mini - Rispen","\"Belgien\"","Kl. II","Sorte: Romantic","Die romantischen Mini-Zwetschgentomaten von RedStar haben einen wunderbar aromatischen Geschmack. Die RedStar Romantic Aroma Tomaten haben eine schöne, tiefrote Farbe und einen reinen, süß-sauren Geschmack.",557,null,null,"kg",7.49,"Lose"]
[558,"Cherimoya","Brasilien","Kl. II",null,"Die Cherimoya-Frucht hat einen süßen, tropischen Geschmack, der oft mit einer Kombination aus Ananas, Papaya und Banane beschrieben wird. Sie hat auch eine kräftige, cremige Textur und einen leichten, säuerlichen Unterton.",null,558,null,null,1.99,"Stück"]
[559,"Kiwano","Brasilien","Kl. II",null,"Mit zunehmender Reife wird ihr Fruchtfleisch süßer, sodass der Geschmack von Kiwanos, die schon einige Zeit gelagert wurden und eine eher gelb-orange Schale haben, als eine Mischung zwischen Melone, Banane und Limone beschrieben wird.",null,559,null,null,3.99,"Stück"]
[560,"Mini - Rispen","\"Holland\"","Kl. II","Sorte: Honigtomaten","Am festen Biss können Sie feststellen, wie frisch eine Looye Honigtomate ist. Und dann beginnt die Sinfonie der Geschmackskomponenten in Ihrem Mund: zuerst die herrliche Frische, gefolgt von der subtilen Honigsüße.",560,null,100,"g",2.4900000000000002,"Lose","Endpreis auf Ware"]
[561,"San Manzano Tomaten","\"Belgien\"","Kl. II",null,"Die Flaschentomaten ‚San Marzano‘ haben ein festes, aber dennoch saftiges Fruchtfleisch mit überwiegend süßem, fruchtigem Geschmack und wenig Säure.Somit lässt sich die Sorte sehr gut auch als Salattomate sowie für den Frischverzehr verwenden.",561,null,null,"kg",1.59,"Lose"]
[562,"Mangold","Italien","Kl. II",null,"Mangold ist verwandt mit Futter- und Zuckerrüben. Vom Geschmack her erinnert Mangold an Spinat, wobei er intensiver und etwas herber schmeckt. Außerhalb der Mangold-Saison kann das Gemüse in vielen Rezepten entsprechend durch Spinat ersetzt werden.",562,null,null,"kg",null,"Lose"]
[563,"Strauchtomaten - Extra","\"Holland\"","Kl. II",null,"Geerntete Tomaten kann man gleich frisch verzehren oder verarbeiten. Sie sind in der Küche je nach Form, Größe, Geschmack und Konsistenz äußerst vielseitig zu verwenden.",563,null,null,"kg",4.99,"Lose","Neue Ernte"]
[564,"Sunita","Deutschland",null,"mehligkochend","Die Farbe der Schale der Kartoffel ist ocker und die Färbung des Fleisches der Kartoffelknollen ist gelb. Die Knollenform ist lang. Der Geschmack der Kartoffelsorte Agria ist gut und der Ertrag ist hoch bis sehr hoch.",564,null,null,"kg",0.99,"Lose"]
[565,"Tobinambur","\"Frankreich\"",null,null,"Topinambur schmeckt einzigartig und ist nicht mit vielen anderen Gemüsesorten zu vergleichen. Die Knolle hat eine süßliche, nussige Note, die an Artischocke und Sellerie erinnert. Der Geschmack ist fein und mild, zugleich aber auch reich und vollmundig.",565,null,null,"kg",5.99,"Lose"]
[566,"Sunita","Deutschland",null,"mehlig kochend","Sunita ist eine frühe, vorwiegend festkochende bis mehligkochende Kartoffelsorte mit einem angenehm cremigen Geschmack. Sunita hat eine rund-ovale Knollenform mit gelber Schale und tiefgelber Fleischfarbe.",566,null,null,"kg",0.99,"Lose","Neue Ernte"]
[567,"\"Berber\"","\"Deutschland\"",null,"vorwiegend festkochend","Die Kartoffelsorte Berber ist für ihren leicht würzigen Geschmack bekannt. Diese Geschmacksnuance macht sie zu einer attraktiven Wahl für Gerichte, bei denen ein subtil würziges Kartoffelaroma gewünscht wird.",567,null,null,"kg",0.99,"Lose","Neue Ernte"]
[568,"Laura","Deutschland",null,"vorwiegend festkochend","Die Kartoffelsorte Laura, botanisch Solanum tuberosum ‚Laura‘, wurde 1998 in Österreich und Deutschland zugelassen. 1. vorwiegend festkochend 2. leicht mehliger und cremiger Geschmack",568,null,null,"kg",1.29,"Lose"]
[569,"Melone Zucker","Spanien","Kl. II",null,"Zuckermelonen haben eine vergleichsweise dicke Schale, die durch grüne Flecken und eine netzartige Struktur gekennzeichnet ist. Zuckermelone Geschmack: fruchtig, autromatisch, süß",null,569,null,null,1.99,"Stück"]
[570,null,null,null,null,null,null,null,null,null,0]
[571,"Zitronen Netz","Spanien","Kl. II","Sorte:Limon Verna","Zitronen sind Lebensmittel und Heilmittel zugleich. Nutzen Sie am besten die ganze Frucht, also nicht nur den Zitronensaft, sondern auch die Schale. Beides passt hervorragend in die Feinschmeckerküche.",null,571,500,"g",1.59,"Netz",null,"Schale behandelt"]
[572,null,null,null,null,null,null,null,null,null,0]
[573,"Amalfi Zitrone","\"Italien\"","Kl. II",null,"Die Schale ist etwas dicker aber dafür essbar. Das weiße an der Schale ist nicht wie bitter, sondern voller Aroma. Sie ist purer Saft mit einer süßlichen Note. Die Schale ist sehr porig und uneben.",null,573,null,null,1.99,"Stück"]
[574,null,null,null,null,null,null,null,null,null,0]
[575,null,null,null,null,null,null,null,null,null,0]
[576,null,null,null,null,null,null,null,null,null,0]
[577,null,null,null,null,null,null,null,null,null,0]
[578,null,null,null,null,null,null,null,null,null,0]
[579,null,null,null,null,null,null,null,null,null,0]
[580,"Coeur-de-boeuf","\"Spanien\"","Kl. II","Fleischtomate","Die Ochsenherz Tomate ist eine weit verbreitete, aber im deutschen Raum relativ wenig gehandelte Fleischtomatensorte. Sie  schmecken intensiv fruchtig süss.",580,null,null,"kg",3.99,"Lose"]
[581,null,null,null,null,null,null,null,null,null,0]
[582,"Pomelo","China","Kl. II",null,"Pomelo hat einen etwas süßeren Geschmack als Grapefruits und einen spritzigeren Geschmack als Orangen. Vielleicht entdeckst du ja eine Frucht, die sowohl lecker als auch erfrischend ist. Deshalb ist die Pomelo auch ein toller Snack für zwischendurch.",null,582,null,null,0.99,"Stück",null,"Schale behandelt"]
[583,null,null,null,null,null,null,null,null,null,0]
[584,null,null,null,null,null,null,null,null,null,0]
[585,"Romanesco","Italien","Kl. II",null,null,585,null,null,"St",2.99]
[586,null,null,null,null,null,null,null,null,null,0]
[587,null,null,null,null,null,null,null,null,null,0]
[588,null,null,null,null,null,null,null,null,null,0]
[589,null,null,null,null,null,null,null,null,null,0]
[590,null,null,null,null,null,null,null,null,null,0]
[591,null,null,null,null,null,null,null,null,null,0]
[592,null,null,null,null,null,null,null,null,null,0]
[593,null,null,null,null,null,null,null,null,null,0]
[594,null,null,null,null,null,null,null,null,null,0]
[595,null,null,null,null,null,null,null,null,null,0]
[596,null,null,null,null,null,null,null,null,null,0]
[597,null,null,null,null,null,null,null,null,null,0]
[598,null,null,null,null,null,null,null,null,null,0]
[599,null,null,null,null,null,null,null,null,null,0]
[600,"Suppentomaten","Spanien/Belgien","Kl. II",null,"Tomaten gibt es in den unterschiedlichsten Formen und Farben.  Ihr Geschmack kommt besonders gut zur Geltung, wenn sie direkt nach der Ernte genascht werden.",600,null,null,"kg",0.69,"Lose"]
[601,"Blutorangen","Italien","Kl. II","Sorte: Tarocco","Die Blutorange enthält sehr viel Vitamin C, das bekannt für seine antioxidative Wirkung ist. Dadurch wird der Körper vor aggressiven freien Radikalen geschützt, das sind chemisch hochgradig reaktive Sauerstoffverbindungen.",null,601,1.5,"kg",1.99,"Netz",null,"Schale behandelt"]
[602,null,null,null,null,null,null,null,null,null,0]
[603,null,null,null,null,null,null,null,null,null,0]
[604,null,null,null,null,null,null,null,null,null,0]
[605,null,null,null,null,null,null,null,null,null,0]
[606,null,null,null,null,null,null,null,null,null,0]
[607,null,null,null,null,null,null,null,null,null,0]
[608,null,null,null,null,null,null,null,null,null,0]
[609,null,null,null,null,null,null,null,null,null,0]
[610,null,null,null,null,null,null,null,null,null,0]
[611,null,null,null,null,null,null,null,null,null,0]
[612,null,null,null,null,null,null,null,null,null,0]
[613,null,null,null,null,null,null,null,null,null,0]
[614,null,null,null,null,null,null,null,null,null,0]
[615,null,null,null,null,null,null,null,null,null,0]
[616,null,null,null,null,null,null,null,null,null,0]
[617,null,null,null,null,null,null,null,null,null,0]
[618,null,null,null,null,null,null,null,null,null,0]
[619,null,null,null,null,null,null,null,null,null,0]
[620,null,null,null,null,null,null,null,null,null,0]
[621,null,null,null,null,null,null,null,null,null,0]
[622,null,null,null,null,null,null,null,null,null,0]
[623,null,null,null,null,null,null,null,null,null,0]
[624,null,null,null,null,null,null,null,null,null,0]
[625,null,null,null,null,null,null,null,null,null,0]
[626,null,null,null,null,null,null,null,null,null,0]
[627,null,null,null,null,null,null,null,null,null,0]
[628,null,null,null,null,null,null,null,null,null,0]
[629,null,null,null,null,null,null,null,null,null,0]
[630,null,null,null,null,null,null,null,null,null,0]
[631,null,null,null,null,null,null,null,null,null,0]
[632,null,null,null,null,null,null,null,null,null,0]
[633,null,null,null,null,null,null,null,null,null,0]
[634,null,null,null,null,null,null,null,null,null,0]
[635,null,null,null,null,null,null,null,null,null,0]
[636,null,null,null,null,null,null,null,null,null,0]
[637,null,null,null,null,null,null,null,null,null,0]
[638,null,null,null,null,null,null,null,null,null,0]
[639,null,null,null,null,null,null,null,null,null,0]
[640,null,null,null,null,null,null,null,null,null,0]
[641,null,null,null,null,null,null,null,null,null,0]
[642,null,null,null,null,null,null,null,null,null,0]
[643,null,null,null,null,null,null,null,null,null,0]
[644,null,null,null,null,null,null,null,null,null,0]
[645,null,null,null,null,null,null,null,null,null,0]
[646,null,null,null,null,null,null,null,null,null,0]
[647,"Brombeeren","\"Deutschland\"","Kl. II","BITTE WIEGEN","Die Früchte sind saftig und wohlschmeckend. Brombeer-Früchte eignen sich zum Frischverzehr, als Kuchenbelag und um Konfitüre, Gelee, Sorbet, Saft, Wein und Likör zu bereiten. Die frischen Früchte können außerdem durch Tiefkühlen konserviert werden.",647,null,100,"g",1.99,"Lose"]
[648,"Heidelbeeren","\"Deutschland\"","Kl. II","BITTE WIEGEN","Heidelbeeren sind von Juli bis September in der Saison, obwohl man sie das ganze Jahr über als Importware bekommt. Die Beeren werden im Laufe des Sommers dunkler und verfärben sich in ein auffallendes Pink.",648,null,100,"g",1.99,"Lose","\"Bodensee\""]
[649,"Himbeeren","\"Deutschland\"","Kl. II","BITTE WIEGEN","Himbeeren haben einen süß-aromatischen Geschmack1. Der Geschmack ist fruchtig-aromatisch mit einem ausgewogenen Verhältnis von Zucker und Säure2.",649,null,100,"g",1.99,"Lose","\"Bodensee\""]
[650,"Johannesbeeren","\"Deutschland\"","Kl. II","BITTE WIEGEN","Johannisbeeren gibt es in drei Varianten: rote, schwarze und weiße. Rote Johannisbeeren schmecken säuerlich bis sauer, während schwarze Johannisbeeren weniger Säure haben und stattdessen durch ein ziemlich herbes und leicht bitteres Aroma auffallen1.",650,null,100,"g",0.99,"Lose","\"Bodensee\""]
[651,"Erdbeeren lose","\"Holland\"","Kl. II",null,"Die alten Sorten dagegen sind nach Ansicht Ulrichs dunkelrot und weich im Fleisch. Ihr Aroma ist kräftig und süß. Diese Sorten verderben aber schneller und werden deshalb in Supermärkten und bei Discountern kaum noch angeboten.",651,null,500,"g",4.99,"Lose"]
[652,"Schwarze Johannesbeeren","\"Deutschland\"","Kl. II","Sorte:Karima\"","Schwarze Johannisbeeren zeichnen sich durch eine milde Obstsäure aus und unterscheiden sich in ihrem mehr herb aromatischen Geschmack von den klassischen, Roten Johannisbeeren.",652,null,100,"g",0.99,"Lose","\"Schwarzwald\""]
[653,"Sauer Kirschen","\"Deutschland\"","Kl. II","Sorte: Schattenmorellen","Sauerkirschen haben viele Geschmacksrichtungen. Sie sind von säuerlich bis süß. Sie haben viele Vitamine (A, B1, B2, C und E). Außerdem enthalten sie viel Kalium und Folsäure. Sie sind auch reich an Anthozyanen 1 und 2.",653,null,100,"g",0.99,"Lose","\"Bodensee\""]
[654,null,null,null,null,null,null,null,null,null,0]
[655,null,null,null,null,null,null,null,null,null,0]
[656,null,null,null,null,null,null,null,null,null,0]
[657,null,null,null,null,null,null,null,null,null,0]
[658,"Stachelbeeren","\"Deutschland\"","Kl. II","BITTE WIEGEN","So sauer, wie man ihnen immer wieder nachsagt, sind Stachelbeeren übrigens gar nicht. Im Gegenteil: Je reifer die Stachelbeeren, desto süßer schmecken sie.Weltweit gibt es rund 500 Sorten, von denen die meisten in Großbritannien angebaut werden.",658,null,100,"g",1.99,"Lose","\"Bodensee\""]
[659,null,null,null,null,null,null,null,null,null,0]
[660,null,null,null,null,null,null,null,null,null,0]
[661,null,null,null,null,null,null,null,null,null,0]
[662,null,null,null,null,null,null,null,null,null,0]
[663,null,null,null,null,null,null,null,null,null,0]
[664,null,null,null,null,null,null,null,null,null,0]
[665,null,null,null,null,null,null,null,null,null,0]
[666,null,null,null,null,null,null,null,null,null,0]
[667,null,null,null,null,null,null,null,null,null,0]
[668,null,null,null,null,null,null,null,null,null,0]
[669,null,null,null,null,null,null,null,null,null,0]
[670,null,null,null,null,null,null,null,null,null,0]
[671,null,null,null,null,null,null,null,null,null,0]
[672,null,null,null,null,null,null,null,null,null,0]
[673,null,null,null,null,null,null,null,null,null,0]
[674,null,null,null,null,null,null,null,null,null,0]
[675,null,null,null,null,null,null,null,null,null,0]
[676,null,null,null,null,null,null,null,null,null,0]
[677,null,null,null,null,null,null,null,null,null,0]
[678,null,null,null,null,null,null,null,null,null,0]
[679,null,null,null,null,null,null,null,null,null,0]
[680,null,null,null,null,null,null,null,null,null,0]
[681,null,null,null,null,null,null,null,null,null,0]
[682,null,null,null,null,null,null,null,null,null,0]
[683,null,null,null,null,null,null,null,null,null,0]
[684,null,null,null,null,null,null,null,null,null,0]
[685,null,null,null,null,null,null,null,null,null,0]
[686,null,null,null,null,null,null,null,null,null,0]
[687,null,null,null,null,null,null,null,null,null,0]
[688,null,null,null,null,null,null,null,null,null,0]
[689,null,null,null,null,null,null,null,null,null,0]
[690,null,null,null,null,null,null,null,null,null,0]
[691,null,null,null,null,null,null,null,null,null,0]
[692,null,null,null,null,null,null,null,null,null,0]
[693,null,null,null,null,null,null,null,null,null,0]
[694,null,null,null,null,null,null,null,null,null,0]
[695,null,null,null,null,null,null,null,null,null,0]
[696,null,null,null,null,null,null,null,null,null,0]
[697,null,null,null,null,null,null,null,null,null,0]
[698,null,null,null,null,null,null,null,null,null,0]
[699,null,null,null,null,null,null,null,null,null,0,null,"65"]
[700,"Strauchtomaten","\"Belgien\"","Kl. II",null,"Festes Fleisch, kräftig süß, leicht sauer – die Tomate ist kein wäss­riges Einheits­gemüse mehr. Den guten Geschmack mussten sich die Verbraucher durch ihr Einkaufs­verhalten erst erkämpfen.",700,null,null,"kg",0.99,"Lose"]
[701,"Tomaten","\"Canaren\"","Kl. II",null,"Festes Fleisch, kräftig süß, leicht sauer – die Tomate ist kein wäss­riges Einheits­gemüse mehr. Den guten Geschmack mussten sich die Verbraucher durch ihr Einkaufs­verhalten erst erkämpfen.",701,null,null,"kg",0.49,"Lose"]
[702,"Fleisch Tomaten","\"Belgien\"","Kl. II","Sorte:Rebellion","In der Küche sind die dickfleischigen Paradeiser vielseitig einsetzbar. Ob klein geschnitten im Salat, gebacken, gefüllt, geschmort, gedämpft oder püriert – sonnengereifte Fleischtomaten bringen den Sommer auf den Tisch.",702,null,null,"kg",1.59,"Lose"]
[703,"Eier Tomaten","\"Deutschland\"","Kl. II",null,"Geschmack: sehr aromatisch, leicht süße Note Fruchtfleisch: fest Tipp: Die platzfesten Früchte schmecken besonders gut, wenn sie frisch verzehrt werden. Sie eignen sich jedoch auch hervorragend für Salate, Soßen und Suppen.",703,null,null,"kg",1.19,"Lose"]
[704,"Strauchtomaten","\"Belgien\"","Kl. II",null,"Geerntete Tomaten kann man gleich frisch verzehren oder verarbeiten. Sie sind in der Küche je nach Form, Größe, Geschmack und Konsistenz äußerst vielseitig zu verwenden.",704,null,null,"kg",1.59,"Lose"]
[705,"Mini - Rispen","\"Belgien\"","Kl. II","Sorte: Rote Perle","Die Rote Perle Tomate ist eine kleine und sehr dunklerote Mini-Strauchtomate. Sie ist Platzfest, hat einen aromatischen würzigen Geschmack, ist sehr ertragreich und gut haltbar.",705,null,null,"kg",2.69,"Lose"]
[706,"Pinke-Tomate","\"Polen\"","Kl. II","Sorte: Schlesische Himbeere","Die Sorte 'Schlesische Himbeere' wird als würzig, fruchtig und aromatisch beschrieben. Sie gilt als eine Gourmettomate und hat einen süß-säuerlichen Geschmack.",706,null,null,"kg",3.99,"Lose"]
[707,"Lauch","\"Deutschland\"","Kl. II","Pfalz","Gekocht, gedünstet, geschmort, blanchiert oder kurz angebraten: Es gibt viele Möglichkeiten, Lauch in der Küche zuzubereiten. Ob als Gemüsebeilage, in Suppen, Quiches, Eintöpfen oder auch in Aufläufen – das Gemüse ist vielseitig einsetzbar.",707,null,null,"kg",1.69,"Lose"]
[708,null,null,null,null,null,null,null,null,null,0]
[709,null,null,null,null,null,null,null,null,null,0]
[710,"Lose Möhren","Deutschland","Kl. II","\"Pfalz\"","Möhren gehören zu den enorm kalorienarmen Gemüsesorten und sollten in der Küche nach Möglichkeit nicht fehlen. Außerdem sind sie besonders reich an Carotin, einer Vorstufe von Vitamin A.",710,null,null,"kg",1.39,"Lose","neue Ernte"]
[711,"Erbsen","\"Deutschland\"","Kl. II","\"Pfalz\"","Die frostverträgliche Erbsenart wird überwiegend als Trockenerbse verwendet. Ihre Hülsen weisen eine Innenhaut auf. Geschmacklich tendiert sie in eine herbe Richtung aufgrund des hohen Stärkegehalts.",711,null,100,"g",0.39,"Lose","neue Ernte"]
[712,"Stangenbohnen","\"Deutschland\"","Kl. II","Sorte: Hilda","Hilda ist eine reichtragende, breithülsige Schwertbohne mit bis zu 30cm langen, schmackhaften Hülsen. Sehr vielseitig verwendbar, für Bohnengemüse, Salate, zum Einmachen und Einfrieren. Enthält die Vitamine A, B und C und wertvolle Mineralien.",712,null,null,"kg",0.39,"Lose"]
[713,null,null,null,null,null,null,null,null,null,0]
[714,"Kenia Bohnen","Herkunft: siehe Etikett","Kl. II","Sorte: Buschbohne","Keniabohnen sind nicht nur lecker, sondern auch kalorienarm. Außerdem enthalten sie viele wertvolle Inhaltsstoffe. In Keniabohnen stecken zum Beispiel viel Magnesium, Calcium, Kalium und Eisen so wie gesunde Ballaststoffe.",null,714,200,"g",3.99,"Packung"]
[715,"Bobby Bohnen","\"Deutschland\"","Kl. II","Sorte: Buschbohne","Am besten schmecken Bobbby Bohnen, wenn man sie ca. 8-10 Minuten kocht und dann in Eiswasser (kaltem Wasser) abschreckt. So bleiben sie knackig und sind als Beilage oder Salat optimal geeignet.",715,null,null,"kg",1.99,"Lose","Neue Ernte"]
[716,"Chinakohl","\"Deutschland\"","Kl. II","\"Pfalz\"","Auch Kohlmuffel können sich für Chinakohl erwärmen, denn die großen, zarten und strunkfreien Blätter schmecken kaum kohlartig, sondern eher dezent und angenehm frisch.",716,null,null,"kg",0.77,"Lose","neue Ernte",null,"1"]
[717,null,null,null,null,null,null,null,null,null,0]
[718,"Rharbarber","\"Deutschland\"","Kl. II","\"Pfalz\"","Die verschiedenen Rhabarbersorten sind im Geschmack sehr unterschiedlich. Die Nuancen reichen von extrem sauer über herb bis mild, sehr zur Freude der Genießer.",718,null,null,"kg",3.99,"Lose","neue Ernte"]
[719,null,null,null,null,null,null,null,null,null,0]
[720,"Paprika grün","\"Holland\"","Kl. II",null,"die grüne Paprika eher herb, teilweise etwas bitter schmeckt. Tatsächlich handelt es sich bei der grünen Paprika nicht um eine bestimmte Sorte, sondern um unreife Paprikaschoten.",720,null,null,"kg",1.99,"Lose"]
[721,null,null,null,null,null,null,null,null,null,0]
[722,"Kiwi Gold","\"Neuseeland\"","Kl. II",null,"Zespri SunGold Kiwis enthalten von Natur aus viel Vitamin C, ein Nährstoff dessen Eigenschaften zur Gesundheit der Haut beiträgt.Zespri SunGold Kiwis enthalten mehr Vitamin C als eine Orange/100 g",null,722,null,null,0.55000000000000004,"Stück"]
[723,"Paprika Rot","\"Holland\"","Kl. II",null,"Die Antwort lautet: sehr gesund. Denn Paprika enthalten wertvolle Nährstoffe und sind wahre Vitaminbomben. Schon 100 g, also eine mittelgroße Paprika, liefern den gesamten Tagesbedarf an Vitamin C und damit das dreifache von Zitrusfrüchten.",723,null,null,"kg",3.99,"Lose"]
[724,"Paprika Gelb","\"Holland\"","Kl. II",null,"Die Antwort lautet: sehr gesund. Denn Paprika enthalten wertvolle Nährstoffe und sind wahre Vitaminbomben. Schon 100 g, also eine mittelgroße Paprika, liefern den gesamten Tagesbedarf an Vitamin C und damit das dreifache von Zitrusfrüchten.",724,null,null,"kg",1.99,"Lose"]
[725,"Galantiner","Italien",null,"Sorte: Sieglinde","Die Kartoffelsorte Sieglinde hat einen würzigen Geschmack, ist lang-oval und eher flach. Die festkochende Frühkartoffel besitzt feine Schale. Sie ist eher mittelgroß und ist gelbfleischig. Ideal für Kartoffelsalat oder Pellkartoffeln.",725,null,null,"kg",1.99,"Lose","Neue Ernte"]
[726,"Drillinge","\"Frankreich\"",null,"Sorte:\"Delikatess\"","Sie sind meist festkochend und schmecken mit Schale gekocht, gebraten oder im Ofen zubereitet. Rosmarin, Kräutersalz und Pfeffer sind beliebte Gewürze, die den Geschmack der Drillinge unterstreichen.",726,null,null,"kg",2.4900000000000002,"Lose","neue ernte"]
[727,"Spunta","Italien",null,"vorwiegend festkochend","Spunta ist eine alte Sorte, die sich besonders in warmen Ländern seit langer Zeit bewährt hat. So ist Spunta beispielsweise in Italien sowie auf Zypern eine der gefragtesten Kartoffelsorten.",727,null,null,"kg",1.99,"Lose","neue Ernte"]
[728,"Annabelle lose","\"Zypern\"",null,"festkochend","Annabelle festkochende Salatkartoffelsorte. Sie entstand aus einer Kreuzung zweier Kartoffelsorten (Nicola und Monalisa). Sie zeigt langovale Knollen. Eine der beliebtesten Frühkartoffelsorten in Supermärkten sowie auch auf Wochenmärkten.",728,null,null,"kg",1.69,"Lose","Neue Ernte"]
[729,"Annabelle lose","\"Deutschland\"",null,"\"Festkochend\"","Annabelle festkochende Salatkartoffelsorte. Sie entstand aus einer Kreuzung zweier Kartoffelsorten (Nicola und Monalisa). Sie zeigt langovale Knollen. Eine der beliebtesten Frühkartoffelsorten in Supermärkten sowie auch auf Wochenmärkten.",729,null,null,"kg",0.99,"lose","neue Ernte"]
[730,"Gemüse Zwiebel","\"Chile\"","Kl. II",null,"Verwendet wird der Zwiebellauch oder die eigentliche Zwiebel meist fein gehackt oder in Ringe geschnitten. Sie wird roh oder geröstet gegessen oder beim Garen anderer Speisen (so etwa im Gemüse) mitgedünstet.",null,730,1000,"g",3.49,"Packung","Neue Ernte"]
[731,"Zwiebel rot","\"Neuseeland\"","Kl. II",null,"Rote Zwiebeln haben eine milde Schärfe. Wegen ihres süßlichen Geschmacks sind sie besonders beliebt in Salaten, Suppen und Soßen.",null,731,null,"kg",1.49,"Netz","nue ernte"]
[732,"Zwiebel gelb lose","Deutschland","Kl. II",null,"Die Herkunft der Zwiebel ist schwer zu bestimmen, da sie eine alte und sehr weit verbreitete Kulturpflanze ist. Man geht davon aus, dass sie aus Zentralasien stammt. Schon im alten Ägypten wurde die Zwiebel als Kulturpflanze erwähnt.",732,null,null,"kg",1.99,"Lose","Neue Ernte"]
[733,"Zwiebel weiß","Italien","Kl. II",null,"Weiße Zwiebeln kommen in der deutschen Küche nicht ganz so häufig zum Einsatz.Im Geschmack sind weiße Zwiebeln deutlich milder als die gelbe Variante.Weiße Zwiebeln kommen zum Beispiel in hellen Soßen zum Einsatz.",733,null,null,"kg",4.99,"Lose","Neue Ernte"]
[734,"Pastinaken","Deutschland","Kl. II",null,"Werden die Pastinaken erst nach dem Frost geerntet, dann entwickeln sie ein leicht süßliches und intensiv würziges Aroma. Dieses Aroma erinnert im weitesten Sinne an den Geschmack von Sellerie und Liebstöckel.",734,null,100,"g",0.59,"Lose","neue ernte"]
[735,"Marabel","\"Deutschland\"",null,"vorwiegend festkochend","Die Sorte \"Marabel\" ist seit 1990 eine der beliebtesten Speisekartoffeln in Deutschland. Sie stammt aus der Kartoffelzucht Böhm. Marabel ist eine Frühkartoffel.",735,null,null,"kg",1.99,"Lose","Neue Ernte"]
[736,"Radiccio","\"Deutschland\"","Kl. II","\"Pfalz\"","Der Radicchio gehört zu den Lattichgewächsen und zur Familie der Korbblütler. Er ist verwandt mit Chicorée und der Endivie.Radicchio wird etwa so groß wie Orangen und hat ein Gewicht zwischen 100 und 300 Gramm.",736,null,null,"kg",3.99,"Lose","neue Ernte"]
[737,"Moorsieglinde","Deutschland",null,"festkochend","Moor-Sieglinde ist eine besonders festkochende Kartoffel. Besonders für Salat-, Pell- und Bratkartoffel geeignet. Durch ihr besonderes Wachstum im Moor bekommt sie gleichmässig Feuchtigkeit und Nährstoffe.",737,null,null,"kg",0.99,"Lose","Ausverkauf"]
[738,"Broccoli","\"Deutschland\"","Kl. II",null,"Er ist reich an Vitaminen, Mineralstoffen und sekundären Pflanzenstoffen, die das Immunsystem stärken, Entzündungen hemmen und vor Krebs schützen können. Brokkoli lässt sich vielseitig zubereiten, zum Beispiel als Salat,",738,null,null,"kg",3.49,"Lose","Neue Ernte"]
[739,"Fenchel","\"Deutschland\"","Kl. II","\"Pfalz\"","Fenchel ist sehr kalorienarm und enthält eine Reihe an wichtigen Nährstoffen. So stecken in der Fenchelknolle z. B. die Mineralstoffe Kalzium, Kalium, Magnesium und Eisen. Doch auch die Vitamine A, C und die für Frauen mit Kinderwunsch enthaltene Folsäure",739,null,1000,"g",1.99,"Lose","neue Ernte"]
[740,"Auberginen","\"Belgien\"","Kl. II",null,"Auberginen sind nicht nur leckere Gemüse, sondern auch gesund und vielseitig. Sie haben viele Vorteile für die Verdauung, das Herz und die Haut.Auberginen sollten immer gegart werden, da sie roh Solanin enthalten, einen schwach giftigen Stoff.",740,null,null,"kg",0.99,"Lose"]
[741,"Zucchini","\"Deutschland\"","Kl. II","Pfalz","Ihr mildes, leicht nussiges Aroma macht Zucchini zum kulinarischen Alleskönner, der auf unzählige Arten zubereitet werden kann. Erfahren Sie jetzt alles Wissenswerte rund um das beliebte mediterrane Gemüse!",741,null,null,"kg",0.99,"Lose"]
[742,"Seitlinge Pilze","\"Deutschland\"","Kl. II",null,"Der Geschmack der Kräuterseitlinge ist zugleich angenehm nussig und würzig mit leichtem Pilzaroma. Unsere liebsten Rezepte mit Kräuterseitlingen Vegetarisch für Genießer Selbstgemachte Spätzle mit Pilzragout",742,null,100,"g",2.69,"Lose"]
[743,"Meerrettich","Deutschland","Kl. II",null,"Meerrettich Geschmack: würzig, aromatisch Das Lebensmittel Meerrettich beschreibt eine Wurzel mit einem intensiv scharfen Geschmack, welches hierzulande als beliebtes Aroma in Kombination mit herzhaften Speisen dient.",743,null,null,"kg",2.99]
[744,null,null,null,null,null,null,null,null,null,0]
[745,"Champignon","Polen","Kl. II","\"Fein\"","Champignons schmecken nicht nur köstlich, sie sind auch gesund. Lebenswichtiges Vitamin K, das für die Blutgerinnung eine Rolle spielt, ist reichlich enthalten in dem Speisepilz, außerdem Biotin (auch als Vitamin H bekannt)",745,null,100,"g",0.39,"Lose"]
[746,"Champignon","Polen","Kl. II","Riesen","Der anisartige Geruch des Riesenchampignons ist ein wichtiges Merkmal der Art. Der Geschmack fällt angenehm pilzig aus. Speisewert Der Riesenchampignon ist ein guter, ergiebiger Speisepilz und zudem eine der wenigen Champignon-Arten.",746,null,100,"g",0.49,"Lose"]
[747,"Pak Choi","\"Deutschland\"",null,null,"Pak Choi schmeckt wie Senfgras. Manche Menschen finden auch, dass Pak Choi wie eine Mischung aus Rucola und Mangold schmeckt. Pak Choi hat einen scharfen Geschmack, wenn auch nicht so stark wie Meerrettich.",747,null,null,"kg",2.79,"Lose","aus der Pfalz"]
[748,"Pfifferling","\"Litauen\"","Kl. II","Sorte; Cantharellus","Bei den Pfifferlingen handelt es sich im Allgemeinen um mittelgroße Pilze, deren Fruchtkörper mehr oder weniger deutlich in Hut und Stiel gegliedert sind. Der Hut ist mit einem Durchmesser von etwa 2 bis 9 cm meist etwas trichterförmig.",748,null,100,"g",1.59,"Lose"]
[749,"Rote Beete","Deutschland","Kl. II",null,"Rote Bete schmeckt bitter und hat einen leicht erdigen Beigeschmack. Der erdige Geschmack in der Roten Bete ist auf eine Verbindung namens Geosmin zurückzuführen.",749,null,null,"kg",1.99,"Lose"]
[750,"Chicoree","\"Belgien\"","Kl. II",null,"Wenn es um Chicorée geht, scheiden sich die Geister: Den einen ist das Gemüse zu bitter, die anderen lieben es gerade für seinen herben Geschmack. In jedem Fall lohnt es sich, dem hellen Gemüse eine Chance zu geben.",750,null,100,"g",0.28999999999999998,"Lose"]
[751,"Petersilienwurzel","\"Niederlande\"","Kl. II",null,"Wer es aufgrund des Namens schon vermutet hat, liegt richtig: Petersilienwurzel schmeckt stark nach Petersilie und hat ein sehr würziges Aroma. Ihr intensiv würziges Aroma stammt übrigens von ätherischen Ölen, die das Gemüse.",751,null,100,"g",0.59,"Lose"]
[752,null,null,null,null,null,null,null,null,null,0]
[753,"Spitzkohl","\"Deutschland\"","Kl. II","\"Pfalz\"","Spitzkohl ist eine mit dem Weißkohl verwandte Sorte des Gemüsekohls mit zarten, gelblich- bis bläulichgrünen, großen Blättern und kegeligem Wuchs. Sein Geschmack ist dezenter und feiner als der von Weißkohl.",753,null,null,"kg",1.49,"Lose","neue Ernte"]
[754,null,null,null,null,null,null,null,null,null,0]
[755,"Feldsalat","\"Belgien\"",null,null,"Die zarten Blätter des Feldsalats werden schnell matschig. Umso wichtiger ist die richtige Lagerung des Salats. Sie sollten den Feldsalat kühl lagern, Kondenswasser jedoch vermeiden, da dieses an der Verpackung den Salat schnell verderben lässt.",755,null,100,"g",0.99,"Lose"]
[756,null,null,null,null,null,null,null,null,null,0]
[757,"Rosenkohl","\"Deutsch\"","Kl. II",null,"Rosenkohl schmeckt als Salat und gekocht als Gemüse und lässt sich hervorragend einfrieren. Als schonende Zubereitung eignet sich das Dampfgaren. Rosenkohl enthält viele Mineral- und Ballaststoffe sowie Vitamin A, Riboflavin (Vitamin B2) und Ascorbinsäure",757,null,null,"kg",1.99,"Lose"]
[758,"Weißkraut","\"Deutschland\"","Kl. II","\"Pfalz\"","Die darin enthaltenen schwefelhaltigen ätherischen Öle sorgen für das deftige und typische Kohlaroma von Weißkohl, das durch eine ganz leichte Süße abgerundet wird.",758,null,null,"kg",0.99,"Lose","Neue Ernte",null,"1"]
[759,"Rotkraut","\"Deutschland\"","Kl. II","\"Pfalz\"","Mehrere Vitamine und Nährstoffe finden sich im Rotkohl. Besonders der hohe Vitamin C-Gehalt mach das Blaukraut zu einem perfekten Begleiter durch den Winter. Die Abwehrkräfte und das Immunsystem werden beim Verzehr ausreichend gestärkt,",759,null,null,"kg",0.99,"Lose","neue Ernte",null,"1"]
[760,"Wirsing","\"Deutschland\"","Kl. II","\"Pfalz\"","Wirsing enthält genau so viel Vitamin C wie eine Zitrone. Das Vitamin ist unter anderem für den Aufbau des Bindegewebes wichtig. Daneben liefert Wirsing Folsäure und Ballaststoffe.",760,null,null,"kg",1.59,"Lose","neue Erte"]
[761,"Knoblauch","\"Spanien\"","Kl. II","Sorte: \"Arno\"","Knoblauch riecht recht scharf und durchdringend, leicht schwefelartig. Er schmeckt etwas brennend mit einem leicht süßlich Geschmack. Der Knoblauchduft wird von den ätherischen Ölen verursacht.",761,null,100,"g",0.99,"Lose"]
[762,"Ingwer","Peru",null,null,"Der Ingwer Geschmack steckt jedoch vor allem in seiner Wurzel und in dem Stamm der Pflanze. Botanisch zählt es zwar zu den Gemüsesorten, jedoch kann man die Wurzel, aufgrund des intensiven Geschmacks, nicht wie Kohlrabi.",762,null,100,"g",0.79,"Lose"]
[763,"Hof Spargel II","\"Deutschland\"","Kl. II","\"Hohl oder Aufblüher\"","Die Stangen müssen nicht nach Dicke sortiert sein. Außerdem ist bei weißem Spargel eine grünliche Verfärbung der Köpfe erlaubt, was Ursache für einen intensiveren oder leicht herben Geschmack sein kann.",763,null,100,"g",0.49,"lose"]
[764,null,null,null,null,null,null,null,null,null,0]
[765,null,null,null,null,null,null,null,null,null,0]
[766,"Spargelköpfe  II","\"Deutschland\"","Kl. II","mind. 14mm dick","Spargel der Klasse II hat leicht geöffnete Köpfe und damit möglicherweise etwas Sand hinter den Schuppenblättern. Er kann leicht gebogen sein und Flecken auf der Schale aufweisen. Die Stangen müssen nicht nach Dicke sortiert sein.",766,null,100,"g",1.39,"Lose","\"Bruchsal\""]
[767,"Spargel viollet","\"Deutschland \"",null,"mind. 14+mm dick","Probieren Sie seine violetten Stangen direkt vom Beet gleich roh als Salat, auf mediterrane Art kurz in Öl gebraten oder klassisch gekocht. Sie werden überrascht sein vom feinen, nussigen Aroma.",767,null,100,"g",1.39,"Lose","\"Lampertheim\""]
[768,null,null,null,null,null,null,null,null,null,0]
[769,"Bruch Spargel","\"Deutschland\"",null,null,"Die Qualität bleibt gleich, lediglich der Schälaufwand ist etwas höher. Bruchspargel eignet sich hervorragend für Salate, Pfannengerichte oder Cremesuppen. Wer Spargel als Bruch kauft, kann Geld sparen.",769,null,100,"g",0.39,"Lose","\"Lampertheim\""]
[770,"Spargel II","\"Deutschland\"",null,"mind. 16mm dick","Spargel der Klasse II hat leicht geöffnete Köpfe und damit möglicherweise etwas Sand hinter den Schuppenblättern. Er kann leicht gebogen sein und Flecken auf der Schale aufweisen. Die Stangen müssen nicht nach Dicke sortiert sein.",770,null,100,"g",1.59,"Lose","\"Lampertheim\""]
[771,"Pepperoni","Holland","Kl. II","mild im Geschmack","Durch das Capsaicin hat die rote Pfefferschote gefäßerweiternde Eigenschaften, die wichtig sind für die Einstellung des Blutdrucks und des Cholesterinspiegels,während die antioxidierenden Eigenschaften von Vitamin C eine Schutzfunktion bieten.",771,null,100,"g",1.79,"Lose"]
[772,null,null,null,null,null,null,null,null,null,0]
[773,null,null,null,null,null,null,null,null,null,0]
[774,null,null,null,null,null,null,null,null,null,0]
[775,null,null,null,null,null,null,null,null,null,0]
[776,null,null,null,null,null,null,null,null,null,0]
[777,"Litschi","Madagasca",null,null,"Litschi hat einen süßen und aromatischen Geschmack, der mit einem leicht säuerlichen Geschmack ausgeglichen wird. Es schmeckt ein wenig wie eine Traube, hat aber auch einen zitrusartigen, herben oder säuerlichen Unterton.",777,null,100,"g",1.99,"Lose"]
[778,null,null,null,null,null,null,null,null,null,0]
[779,"Schwarzwurzel","Belgien","Kl. II",null,"Schwarzwurzel schmeckt ähnlich wie Spargel, hat jedoch einen erdigeren, nussigeren Geschmack, der oft als herzhafter und intensiver beschrieben wird. Der Geschmack der Schwarzwurzel ist einzigartig und unterscheidet sich von anderen Wurzelgemüsen.",779,null,null,"kg",2.99,"Lose"]
[780,null,null,null,null,null,null,null,null,null,0]
[781,"Avocado","South Afrika","Kl. II","Sorte: Hass","Das gelbe bis orangefarbene zarte Fruchtfleisch hat einen sehr aromatischen, nussigen Geschmack. Avocados werden roh verzehrt, da ihr Fruchtfleisch beim Erhitzen bitter wird. Harte Avocados reifen bei Zimmertemperatur nach.",null,781,null,null,0.55000000000000004,"Stück"]
[782,"Landgurken","\"Deutschland\"","Kl. II","Kücherer Heidelberg","Die Landgurke hat ein intensiveres Aroma als die normale Salatgurke und ist fester in der Schale. Vielseitig zu verwenden sind Landgurken im Salat. Gurken lassen sich mit fast allen anderen Salaten und Gemüsesorten kombinieren.",782,null,null,"kg",2.99,"Lose"]
[783,"Einlegegurken","\"Polen\"",null,"\"Vesper\"","Gurken sind vor allem im Sommer eine willkommene Erfrischung, denn durch ihren hohen Wassergehalt versorgen sie unseren Körper mit viel Flüssigkeit. Dieser Wassergehalt sorgt auch dafür, dass Gurken nur wenige Kalorien haben.",783,null,null,"kg",2.99,"Lose","neue Ernte"]
[784,null,null,null,null,null,null,null,null,null,0]
[785,null,null,null,null,null,null,null,null,null,0]
[786,null,null,null,null,null,null,null,null,null,0]
[787,null,null,null,null,null,null,null,null,null,0]
[788,"Knoblauch frisch","\"Deutschland\"","Kl. II",null,"Beim sogenannten frischen Knoblauch handelt es sich um jungen Knoblauch, dessen Zehen noch nicht voll ausgereift sind. Deshalb hat die Pflanze auch noch nicht ihr volles Aroma ausgebildet und schmeckt entsprechend milder.",788,null,100,"g",1.29,"Lose","neue Ernte"]
[789,null,null,null,null,null,null,null,null,null,0]
[790,null,null,null,null,null,null,null,null,null,0]
[791,"Avocado Bio","Dominikanische Rep.","Kl. II","DE-ÖKO-006","Das gelbe bis orangefarbene zarte Fruchtfleisch hat einen sehr aromatischen, nussigen Geschmack. Avocados werden roh verzehrt, da ihr Fruchtfleisch beim Erhitzen bitter wird. Harte Avocados reifen bei Zimmertemperatur nach.",null,3738213,null,null,1.79,"Stück"]
[792,null,null,null,null,null,null,null,null,null,0]
[793,null,null,null,null,null,null,null,null,null,0]
[794,null,null,null,null,null,null,null,null,null,0]
[795,null,null,null,null,null,null,null,null,null,0]
[796,null,null,null,null,null,null,null,null,null,0]
[797,null,null,null,null,null,null,null,null,null,0]
[798,null,null,null,null,null,null,null,null,null,0]
[799,"Chiquita Bananen","Paraguay",null,null,"Abhängig von ihrer Reife enthalten sie unterschiedliche Mengen an Nährstoffen. Sie sind zwar immer reich an Kohlenhydraten, jedoch variiert die Zusammensetzung: Je reifer eine Banane ist, desto weniger Stärke und desto mehr Zucker enthält sie.",799,4728971,null,"kg",1.99,"Lose"]
[800,"Bananen",null,null,null,"Bananen gehören zu den beliebtesten Obstsorten – wir essen sie roh, gekocht, gebacken oder gegrillt und trinken sie sogar als Nektar, in Smoothies oder Milchshakes.",800,null,null,"kg",1.39,"Lose"]
[801,"Delicious","\"Deutschland\"","Kl. II","Sorte: Golden Delicius","Im reifen Zustand schmeckt der Apfel süß, sodass nur wenig Säure sich im Apfel befindet. Ein leichtes Anis- und Zimtaroma lassen sich herausschmecken, sowie ein honig- und birnenartiges Aroma.",801,null,null,"kg",1.99,"Lose","Bodensee"]
[802,null,"Frankreich","Kl. II",null,"Der Geschmack kombiniert Süße und saure Noten. Manche halten es für ein wenig langweilig. Das Fruchtfleisch ist fest und nicht sehr saftig. Die Farbe ist creme. Ausgeprägtes und angenehmes Sortenaroma.",802,null,null,"kg",1.99,"Lose"]
[803,"Chripps - Pink","\"Chile\"","Kl. II",null,"Cripps Pink ist eine kleinfrüchtige Apfelsorte. Sie entstand 1973 aus einer Kreuzung von Lady Williams und Golden Delicious. Der Cripps Pink stammt ursprünglich aus Australien. Er gilt vom Geschmack als süß und ist mittelmäßig saftig.",803,null,null,"kg",1.99,"Lose"]
[804,"Santana","Deutschland","Kl. II",null,"Wenn ab April der Apfel Santana anfängt zu blühen,kann man sich schon auf die großen, roten Früchte freuen. Von September an ist es dann so weit und es kann geerntet werden. Der süße Geschmak der saftigen, feinen Früchte ist einfach unverwechselbar.",804,null,null,"kg",1.99,"Lose","Alergiker geeignet"]
[805,"Gala","\"Brasilien\"","Kl. II","Sorte: Rpyal Gala","Es ist ein mittelstark wachsender Baum. Seine Früchte besitzen eine hell rote glatte Schale. Ihr Geschmack ist süß, saftig, aromatisch mit festem Fruchtfleisch.",805,null,null,"kg",2.99,"Lose","Neue ernte"]
[806,"Mutzu/Greenstar","\"Deutschland\"","Kl. II",null,"Der Mutsu' bildet grüngelbe, große Früchte. Sie haben einen süß-säuerlichen, saftigen Geschmack. Für eine ertragreiche Ernte ab September schaffen durchlässiger,",806,null,null,"kg",1.99,"Lose"]
[807,"Breaburn","\"Neuseeland\"","Kl. II",null,"Der Braeburn ist ein besonders knackiger und saftiger Apfel. Sein Geschmack ist dabei süß und gleichzeitig erfrischend und aromatisch. Aus diesem Grund ist er gerade bei den Europäern sehr beliebt.",807,null,null,"kg",2.99,"Lose","Neue Ernte"]
[808,"Honey Crunch","\"Chile\"","Kl. II",null,"Ein kugelrunder zweifarbiger Apfel, welcher bei voller Reife durch seine rote Deck- und cremefarbene Grundfarbe besticht.Durch ihre hervorragende Lagerfähigkeit kann sie von der Ernte im September bis im April gegessen werden.",808,null,null,"kg",0.99,"Lose"]
[809,"Rubinette","Deutschland","Kl. II",null,"Der Geschmack der knackigen Äpfel ist feinsäuerlich. Sein Aroma erinnert an seine Elternsorte 'Cox Orange'. Wenige Apfelsorte weisen ein so fein ausbalanciertes Verhältnis von Zucker und Säure mit einem gleichzeitig würzigen und fruchtigen Aroma auf.",809,null,null,"kg",2.99,"Lose","Bruchsal"]
[810,"Fräulein","\"Deutschland\"","Kl. II","\"Bodensee\"","Fräulein ist ein besonders saftiger Apfel. Seine Süße harmoniert mit einer frischen Säure. Und dann ist da dieser Biss. Manche sagen: knackig-krisp.",810,null,null,"kg",2.99,"Lose"]
[811,"Pinova","Deutschland","Kl. II",null,"Das Fruchtfleisch hat saftige, feste und recht grobe Zellen. Er hat einen süß-säuerlichen, aromatischen und würzigen Geschmack.",811,null,null,"kg",2.59,"Lose","\"Bodensee\""]
[812,"Physalis","\"Süd Amerika\"","Kl. II",null,"Physalis sind kleine, orangefarbene Früchte, die sehr aromatisch süß-säuerlich schmecken. Ihr Geschmack erinnert an Ananas, Maracuja, Stachelbeere oder süße Tomaten. Das feste Fruchtfleisch ist saftig und knackt beim Zubeißen.",null,812,100,"g",1.99,"Packung"]
[813,"Passionsfrucht","\"Vietnam\"",null,null,"Passionsfrucht schmeckt süß und gleichzeitig leicht säuerlich, eine Kombination, die sie sehr erfrischend macht. Ihr Aroma ist intensiv und tropisch, manchmal sogar mit einer leichten Note von Honig.",null,813,null,null,0.79,"Stück"]
[814,"Cox Orange","\"Neuseeland\"","Kl. II","Holsteiner","Sie schmecken wunderbar süß und aromatisch! Ihr gelbes Fruchtfleisch ist angenehm saftig, knackig. Den Früchten voraus gehen im April hellrosafarbene Blüten.",814,null,null,"kg",3.99,"Lose","Neue Ernte"]
[815,"Boskop","Deutschland","Kl. II",null,"Die Grundfarbe des Boskop Apfels lädt definitiv zum Anbeißen ein. Grundsätzlich verfügt der Apfel über eine gelbe Farbe. Jedoch wird er auf der Sonnenseite dunkelrot.",815,null,null,"kg",1.99,"Lose","Schriesheim"]
[816,"Idared","Deutschland","Kl. II",null,"gelblichgrün bis weißlichgelb zeigt sich diese Sorte bis zur Reife. Dann nimmt sie eine intensiv rötliche Farbe an. Geschmack: fein säuerlich Textur: saftiges, festes Fruchtfleisch. Verwendung: geeignet für Saft, Kuchen und Apfelmus.",816,null,null,"kg",1.99,"Lose"]
[817,"Pink Lady","Chile","Kl. II",null,"Durch die rote und saftige Farbe kann man sich die Besonderheit dieses Apfels schon vorstellen. Leichte Aromen von Waldbeere, Vanille und Lyche schmeckt man heraus. Aus diesem Grund wird der Apfel auch Paradiesapfel genannt.",817,null,null,"kg",2.99,"Lose","Neue Ernte"]
[818,null,null,null,null,null,null,null,null,null,0]
[819,null,null,null,null,null,null,null,null,null,0]
[820,"Royal Gala","Neuseeland","Kl. II","Sorte:Tenroy","Royal Gala Äpfel sind sehr fest und süß im Geschmack. Sie ist eine Kreuzung aus Kidds Orange und Golden Delicious.Die Äpfel sind rund-konisch und einzelne Früchte unterscheiden sich in der Form nur wenig voneinander.",820,null,null,"kg",2.99,"Lose","Neue Ernte"]
[821,null,null,null,null,null,null,null,null,null,0]
[822,"Kanzi","\"Deutschland\"","Kl. II","Sorte :Nicoter","Der Kanzi Apfel zieht durch sein Aussehen sofort jede Aufmerksamkeit auf sich. Dazu schmeckt er süß-säuerlich und ist sehr knackig. Das macht ihn zu einem sehr beliebten Apfel. Diese Sorteist eine Kreuzung der Apfelsorten Gala und Braeburn.",822,null,null,"kg",2.99,"Lose","\"Bodensee\""]
[823,"Jona Gold","\"Deutschland\"","Kl. II",null,"Aromatisch, saftig, süß. Mit seinem gelblich weichem Fruchtfleisch und kraftvollen und ausgewogenen süßfruchtig-feinsäuerlichen Geschmack erfreut sich der Jonagold Apfel großer Beliebtheit.",823,null,null,"kg",1.99,"Lose","Bodensee"]
[824,"Wellant","Deutschland","Kl. II","Sorte:Elise+zuchtklon","Die Apfelsorte Wellant ist unter anderem als Fresco-Apfel bekannt und eine Sorte des Kulturapfels. Laut seinem Aussehen soll er an eine alte Apfelsorte erinnern. Er wirkt rustikal und wird somit als Clubsorte vertrieben.",824,null,null,"kg",1.99,"Lose"]
[825,"Futji","\"Neuseeland\"","Kl. II",null,"Der Fuji Apfel hat nur einen geringen Säuregehalt, weswegen er eher süßlich schmeckt. Er hat auch etwas Aromatisches an sich, weswegen ihn viele mögen. Diese Apfelart ist knackig und saftig.",825,null,null,"kg",2.99,"Lose","Neue ernte"]
[826,"Granny Smith","\"Deutschland\"","Kl. II",null,"Der Granny Smith gehört zu den eher säuerlichen Äpfeln, er enthält eine hohe Menge an Fruchtsäuren. Das Aroma des Granny Smith erinnert ein wenig an rote Beeren und lässt Zitrusfrüchte sowie eine leichte Note von Marzipan oder Mandel erahnen.",826,null,null,"kg",2.99,"Lose"]
[827,"Elstar","\"Holland\"","Kl. II",null,"Die Apfelsorte Elstar ist in Deutschland mit die beliebteste Sorte unter den Äpfeln. Er hat ein süß-säuerliches Aroma, schmeckt fruchtig-würzig und ist sehr erfrischend. Durch die leicht berostete Schale wird auf der Zunge eine leichte Reibung erzeugt.",827,null,null,"kg",2.99,"Lose","Salem-Frucht"]
[828,null,null,null,null,null,null,null,null,null,0]
[829,"Jazz","\"Neuseeland\"","Kl. II",null,"Der leckere Apfel kombiniert die Sorten Gala und Braeburn, daher ist er knackig, weil er fester ist als andere Apfelsorten. Er schmeckt saftig und spritzig-süß, außerdem.",829,null,null,null,3.99,"Lose","neue Ernte"]
[830,"Williams","\"Südafrika\"","Kl. II","\"Packhams\"","Die Williamsbirne schmeckt unverkennbar mild und gleichzeitig fruchtig, dabei bleibt ihr Aroma subtil und vielschichtig genug, um die Nase beim Verkosten herauszufordern.",830,null,null,"kg",2.59,"Lose"]
[831,null,null,null,null,null,null,null,null,null,0]
[832,"Xenia Birne","\"Holland\"","Kl. II",null,"Wann ist die Xenia am leckersten? Um es kurz zu machen: immer! Sie kann knackig wie ein Apfel, mit noch grüner Schale verzehrt werden und für Freunde zartschmelzender Birnen ist sie etwas reifer mit gelblicher Färbung genau richtig.",832,null,null,"kg",2.99,"Lose"]
[833,"Forelle Birne","\"Südafrika\"","Kl. II",null,"Der Geschmack ist süß, feinsäuerlich und bei warmem Standort angenehm aromatisch. Die Früchte reifen Anfang Oktober und können von Ende Oktober bis Ende November verzehrt werden.",833,null,null,"kg",2.99,"Lose"]
[834,"Lucas Birne","Deutschland","Kl. II",null,"Die Sorte ‘Alexander Lucas’ ist eine Kulturbirne (Pyrus communis) und besticht durch ihre saftig süße Frucht mit einem angenehmen Aroma. Geschmack: saftig, süß, mild-aromatisch.",834,null,null,"kg",1.99,"Lose"]
[835,"Abate Birnen","\"South Afrika\"","Kl. II",null,"Die Sorte Abate Fetel sieht folgendermaßen aus: Flaschenförmig, lang gestreckt, grüngelbe Schalenfarbe und netzartig verteile Berostung. Vorwiegend angebaut in Italien, Australien und Neuseeland. Sehr fruchtig mit schmelzend-mildem Aroma.",835,null,null,"kg",3.99,"Lose"]
[836,"Kirschen","\"Belgien\"","Kl. II",null,"Kirschen schmecken fantastisch und versüssen uns den Sommer. Sie sind besonders reich an sekundären Pflanzenstoffen, wirken gegen freie Radikale und Entzündungen und können bei Leiden wie Bluthochdruck, Gicht und Demenz hilfreich sein.",836,null,100,"g",1.19,"Lose","Extra"]
[837,"Conference","Belgien","Kl. II",null,"Die Früchte der -Birne sind mittelgroß, haben eine schlanke und langgezogene Form und weisen eine leichte braune Berostung auf. Die Früchte sind grün gefärbt und werden zur Vollreife gelb.",837,null,null,"kg",1.99,"Lose"]
[838,"Birne Goyot","Frankreich","Kl. II",null,"Die mittelgroße bis große Birnensorte Jules Guyot zählt zu den großfrüchtigen Birnen. Ihre Abstammung ist unbekannt, sie wurde nach dem Winzer Jules Guyot aus Frankreich benannt. Die Sorte schmeckt würzig und süß-säuerlich.",838,null,null,"kg",2.99,"Lose"]
[839,"Santa Maria","\"Türkey\"","Kl. II",null,"Die Santa Maria Birne ist eine mittelgroße, glockenförmige Sorte von klassischer Birnenform, mit glatter, leicht bucklig-höckeriger oder beuliger Oberfläche sowie eingesenktem, oft schief angesetztem Stiel.",839,null,null,"kg",1.99,"Lose"]
[840,"Kirschen","\"Deutschland\"","Kl. II","Sorte: \"Büttners Rote Knorpel\"","Kirschen schmecken fantastisch und versüssen uns den Sommer. Sie sind besonders reich an sekundären Pflanzenstoffen, wirken gegen freie Radikale und Entzündungen und können bei Leiden wie Bluthochdruck, Gicht und Demenz hilfreich sein.",840,null,100,"g",0.99,"Lose"]
[841,"Wassermelone","\"Griechenland\"","Kl. II","\"Kernarm\"","Die Wassermelone ist eine niederliegende bis kletternde, einjährige, krautige Pflanze. Die Sprossachsen sind dünn, kantig, gefurcht und abstehend steif behaart.",841,null,null,"kg",2.99,"Lose"]
[842,"Wassermelone","Spanien","Kl. II","Mini Melone","Ein hoher Wassergehalt und fruchtiger Geschmack machen Wassermelonen zur gesunden Erfrischung fast ohne Kalorien. Am liebsten wird diese Melonensorte frisch und roh verspeist. Hinzu kommen ein Eisen-Anteil sowie Magnesium, Phosphat und Kalzium.",null,842,null,null,1.49,"Stück"]
[843,"Wassermelone geschitten","Spanien","Kl. II","mit Kern","Ein hoher Wassergehalt und fruchtiger Geschmack machen Wassermelonen zur gesunden Erfrischung fast ohne Kalorien. Am liebsten wird diese Melonensorte frisch und roh verspeist. Hinzu kommen ein Eisen-Anteil sowie Magnesium, Phosphat und Kalzium.",null,null,null,"kg",3.99,"Lose","kerne"]
[844,"Pflaumen gelb","\"Italien\"","Kl. II","Sorte:Santa Rosa","Diese Pflaume zeichnet sich durch ihre herzförmige Form aus. Sie hat eine intensiv rote Haut und ist innen bernsteinfarben oder karminrot. Darüber hinaus ist ihr Fruchtfleisch saftig und hat einen erdbeerähnlichen Geschmack.",844,null,null,"kg",3.99,"Lose","Neue Ernte"]
[845,"Pflaumen Rot","\"Italien\"","Kl. II","Sorte:Angelo","Pflaumen schmecken frisch von der Hand in den Mund am besten, für Kuchen oder Kompott eignen sie sich weniger. Sie sind naturgemäß von einer dünnen, wachsartigen Schicht überzogen.",845,null,null,"kg",3.99,"Lose","Neue Ernte"]
[846,"Champignon Braun","Polen","Kl. II","Egerlinge","Egerlinge sind geschätzte Pilze wegen ihres ausgezeichneten Geschmacks und ihrer Vielseitigkeit bei der Zubereitung vieler gesunder Gerichte. Sie werden auch wegen ihres hohen Protein- und Mineralstoffgehalts geliebt.",846,null,100,"g",0.59,"Lose"]
[847,"Shitake Pilze","Polen","Kl. II",null,"hiitake-Pilze geben einen charakteristischen Pilz-Geschmack und peppen diverse Gerichte hervorragend auf. Sie besitzen die Geschmacksqualität umami (Umami-Geschmack). Umami ist neben süss, salzig, bitter und sauer eine weitere Geschmacksrichtung.",847,null,100,"g",1.99,"Lose"]
[848,"Steinpilze","Deutschland","Kl. II",null,"Steinpilze schmecken sehr aromatisch und leicht nussig. Sie enthaltenGlutaminsäure,die wie ein natürlicher Geschmacksverstärker wirkt. Steinpilze gehören daher zu den Lebensmitteln mit der Geschmackseigenschaft„umami“.",848,null,100,"g",3.49,"Lose"]
[849,"Austernpilze","Polen","Kl. II",null,"Der dezente, feine Geschmack von Austernpilzen erinnert ein bisschen an Kalbfleisch. Im Aussehen haben Austernpilze mit ihrer Hutform und ihren Lamellen eine gewisse Ähnlichkeit mit Pfifferlingen.",849,null,100,"g",0.99,"Lose"]
[850,"Walnüsse","\"Ungarn\"","Kl. II","Sorte: Grenobler","Walnüsse schmecken typisch nussig, leicht süßlich und gleichzeitig etwas bitter. Schon seit Jahrtausenden isst man sie pur ebenso wie als Bestandteil von Kuchen und Keksen sowie der warmen und kalten Küche.",850,null,100,"g",0.69,"Lose"]
[851,"Wassermelone","\"Grieschenland\"","Kl. II","mit Kernen","Ein hoher Wassergehalt und fruchtiger Geschmack machen Wassermelonen zur gesunden Erfrischung fast ohne Kalorien. Am liebsten wird diese Melonensorte frisch und roh verspeist. Hinzu kommen ein Eisen-Anteil sowie Magnesium, Phosphat und Kalzium.",851,null,null,"kg",0.99,"Lose"]
[852,"Wassermelone geschnitten","\"Spanien\"","Kl. II","in Scheiben geschnitten","Die Wassermelone ist eine niederliegende bis kletternde, einjährige, krautige Pflanze. Die Sprossachsen sind dünn, kantig, gefurcht und abstehend steif behaart.",852,null,null,"kg",3.99,"Lose"]
[853,"Aprikosen","\"Frankreich\"","Kl. II","Sorte:\"Valenciano\"","Der hohe Ballaststoffanteil sorgt für eine verdauungsfördernde Wirkung und der geringe Säureanteil macht die Aprikose leicht bekömmlich. Aprikosen sind oft geschwefelt erhältlich.",853,null,null,"kg",2.99,"Lose","Standard"]
[854,"Aprikosen","\"Deutschland\"","Kl. II","Sorte \"Orangred\"","Bei der Aprikose kommt es auf die optimale Reife besonders an: Stimmt der Erntezeitpunkt, haben Aprikosen einen hinreißend aromatischen, leicht mandelartigen und süßen Geschmack.",854,null,null,"kg",5.99,"Lose","Extra"]
[855,null,null,null,null,null,null,null,null,null,0]
[856,"Zucker Melonen","\"Türkei\"","Kl. II","Sorte: Futura","Die Galiamelone zählt zu den sogenannten Netzmelonen und findet sich besonders im Sommer immer wieder gerne in der Obstschale – dabei ist sie gar kein Obst, sondern ein Gemüse!",856,null,null,"kg",1.99,"Lose","Bitte Wiegen !!"]
[857]
[858,"Lahanakraut","Deutschland","Kl. II",null,"Er sieht aus wie ein flachgedrückter Weißkohl – und ist im Prinzip genau das, nämlich der Urtyp des Weißkohls. Obwohl er eine äußerst alte Züchtung ist und viele Vorteile gegenüber anderen Kohlsorten hat, kennen nur wenige Menschen Jaromakohl – noch!",858,null,null,"kg",0.99,"Lose"]
[859,null,null,null,null,null,null,null,null,null,0]
[860,"Nektarinen","\"Griechenland\"","Kl. II",null,"Sie ist nicht nur ein leckerer Bestandteil von sommerlichen Obstsalaten und eine echte Alternative für Menschen, die das pelzige Gefühl von Pfirsichen nicht mögen – die Nektarine ist auch unheimlich gesund.",860,null,null,"kg",2.99,"Lose","Extra"]
[861,"Pfirsich","\"Spanien\"","Kl. II",null,"Pfirsiche schmecken saftig und süß, aber nur, wenn sie auch wirklich reif sind. Wenn sie zu früh geerntet werden, schmecken sie eher säuerlich und sind oft auch viel zu hart.",861,null,null,"kg",2.99,"Lose","Extra"]
[862,"Pfirsich Standard","\"Spanien\"","Kl. II","Sorte: Astoria","Manche behaupten, die gelbfleischigen Pfirsiche seien die besten, da sie im Regelfall süßer und fester als Ihre weißfleischigen Kollegen sind. Somit besonders gut zum Einmachen und Weiterverarbeiten geeignet sind.",862,null,null,"kg",0.01,"Lose"]
[863,null,null,null,null,null,null,null,null,null,0]
[864,null,null,null,null,null,null,null,null,null,0]
[865,"Nektarinen","\"Spanien\"","Kl. II","Sorte:Diamantina","Das Fruchtfleisch einer voll ausgereiften Nektarine überzeugt mit sehr saftiger Konsistenz und süß-fruchtigem Geschmack. Unreif geerntete Nektarinen schmecken deutlich säuerlicher und haben weniger Aroma.",865,null,null,"kg",2.99,"Lose","Standard"]
[866,"Pfirsich weiß","\"Spanien\"","Kl. II","Sun Royal","ihren knackig-süßen Geschmack aber auch Dekorativ haben sie einen hohen Wert, denn sie sind fast reinweiß mit einem leicht gelben Hauch, weißem Fruchtfleisch und samtiger Haut.",866,null,null,"kg",5.99,"Lose"]
[867,"Bergpfirsich","Spanien","Kl. II","Sorte:Paraguayos","Unter dem Namen Weinbergpfirsich kennen wir die flachen, hellrosa-orange-gelben Pfirsichfrüchte. Ihr Geschmack ist sehr süß und hoch aromatisch. Sie sind das neue Trendobst und als Weinbergpfirsich in aller Munde.",867,null,null,"kg",2.99,"Lose"]
[868,null,null,null,null,null,null,null,null,null,0]
[869,"Nektarinen Weiß","\"Spanien\"","Kl. II","Sorte:Sun Royal","Nektarine mit einem Gewicht von bis zu 150 g und einer burgunderfarbenen Hautfarbe. Das Fruchtfleisch ist weiß mit einem süßen Geschmack. Der Knochen löst sich nicht.",869,null,null,"kg",5.99,"Lose"]
[870,"Zwetschgen","Deutschland","Kl. II","Sorte: Presenta","Die Alte Haus-Zwetschke der Feinbrennerei Prinz aus Hörbranz präsentiert sich herrlich mild im Geschmack, mit einer angenehmen Süße und einer sagenhaften Fruchtintensive und beweist damit, dass ein Pflaumenschnaps ein besonderes Facettenreichtum aufweist.",870,null,null,"kg",1.99,"Lose"]
[871,"Gurken Extra","\"Deutschland\"","Kl. II","Schlangengurken 500-600gr","Gurken schmecken leicht säuerlich und sind aufgrund ihres hohen Wassergehalts sehr erfrischend1. Ursprünglich waren Gurken bitter, was durch die sogenannten Cucurbitacine verursacht wurde.",null,871,null,null,1.49,"Stück","Insel Reichenau"]
[872,"Zwetschgen","\"Bosnien\"","Kl. II","Sorte: Cacak´s","In Deutschland wird die Zwetschge von Juli bis Oktober geerntet.Die reife Zwetschge ist saftig, süß und sehr aromatisch.Die Zwetschge eignet sich zum Frischverzehr, zum Einkochen von Zwetschgenmus und zum Einmachen von Kompott bis Rumtopf.",872,null,null,"kg",2.99,"Lose","Neue Ernte"]
[873,"Grünkohl","Deutschland",null,null,"Grünkohl hat einen pfeffrigen und süßen Geschmack, da er nach dem ersten Frost geerntet wird, wenn die Kälte einen Teil der Stärke im Grünkohl in Zucker verwandelt.",873,null,null,"kg",1.99,"Lose"]
[874,"Maroni lose","Italien\"","Kl. II",null,"Unter der harten Schale verbirgt sich bei Maronen ein ausgesprochen nahrhaftes Fruchtfleisch.Roh kann man Maronen übrigens ebenfalls essen, allerdings schmecken sie längst nicht so gut wie geröstet.",874,null,100,"g",0.99,"Lose"]
[875,"Mirabellen","Deutschland","Kl. II","Sorte: \"Reneklode\"","Mirabellen sind schon pur ein Genuss, aber der lässt sich natürlich noch steigern! Einfach köstlich schmecken vor allem Kompott, Saft, Konfitüre oder Marmeladenzubereitung aus Mirabellen.",875,null,100,"g",0.79,"Lose","Neue Ernte"]
[876,"Zwetschgen","\"Deutschland\"","Kl. II","Sorte: Hermann","Das grüngelbe bis hellgelbe Fruchtfleisch ist vom Geschmack her einzigartig: erfrischend saftig mit fester Struktur, angenehm süss (65 bis 75 °Oe) und mit einem kaum wahrnehmbaren Hauch (6,5 ‰) an Fruchtsäure.",876,null,null,"kg",2.99,"Lose","Schwarzwaldfrucht"]
[877,"Zwetschgen","Deutschland","Kl. II","Sorte: Bühler","Das Fruchtfleisch ist angenehm im Biss. Der Geschmack ist im frühen Stadium süßsäuerlich mit säuerlichem Abgang; im späten Reifestadium süß, ihren leicht säuerlichen Abgang behält sie bei.",877,null,null,"kg",2.4900000000000002,"Lose"]
[878,"Zwetschgen","\"Deutschland\"","Kl. II","Sorte: Hanita","Die Früchte haben ein sehr gutes Aroma und eine feine Süße. Sie eignen sich hervorragend zum Frischverzehr und auch zum Backen oder für Konfitüre. Die Sorte Hanita ist scharkatolerant und auch für etwas kühlere Standorte gut geeignet.",878,null,null,"kg",1.99,"Lose"]
[879,"Zwetschgen","Moldavien","Kl. II","Sorte: Stanley","Die dunkelblauen Früchte haben einen süßen, aromatischen Geschmack und sind zum Verzehr geeignet. Erntezeit ab September. Ein warmer Herbst sorgt für einen besonders aromatischen Genuss. Sie können die Früchte gut lagern und vielseitig verwenden.",879,null,null,"kg",2.99,"Lose"]
[880,"Trauben Weiß mit Kern","Italien","Kl. II","Sorte: Regina","Die großen, goldgelben, etwas hartschaligen und damit knackigen Beeren haben einen leichten Muskat-Geschmack.Die Rebe treibt ca. eine Woche nach dem Gutedel aus. Die spätreifende Sorte kann frühestens vier Wochen nach dem Gutedel geerntet werden.",880,null,null,"kg",4.99,"Lose"]
[881,"Trauben Weiß kernlos","Südafrika","Kl. II","Sorte:Sweet-Globe","Die Farbe ist in der Regel blassgelb-grün, kann aber je nach Reife von grün bis strohfarben variieren. Die Haut ist dünn und es gibt sehr wenig Widerstand gegen den Biss, obwohl er manchmal leicht zäh, aber nicht bitter sein kann.",881,null,null,"kg",2.99,"Lose","Standard"]
[882,"Trauben Weiß kernlos","Griechenland","Kl. II","Sorte: Thompson Seedles","Die Tafeltraube 'Thompson Seedless' (Vitis vinifera) bildet grüngelbe, kernlose Früchte. Sie sind oval und haben einen süß-säuerlichen, aromatischen Geschmack.Auch ihre gelb-grünen, leicht duftenden Blüten sind eine schöne Erscheinung.",882,null,null,"kg",6.99,"Lose","Marke: Dimis"]
[883,"Trauben kernlos","\"Italien\"","Kl. II","Sorte:\"Sugareone\"","Feste kernlose Beeren. Mit einem sanften Muskat-Geschmack. Züchten Sie die leckeren Früchte der Traube 'Cetennial Seedless' (Vitis vinifera) im eigenen Boden. Der winterfeste Obststrauch blüht im Sommer mit unauffälligen Blumenrispen.",883,null,null,"kg",6.99,"Lose","Extra"]
[884,"Trauben Blau mit Kern","\"Italien\"","Kl. II","Sorte: Paglieri","Die großen Trauben tragen mittelgroße , ovale Beeren . Ihre roten bis violett farbigen Beeren mit kerne, besitzen eine dünne und dennoch, knackige Schalemit festem Fruchtfleisch und feinfruchtigem Aroma.",884,null,null,"kg",0,"Lose"]
[885,"Trauben Rot kernlos","\"Südafrika\"","Kl. II","Sorte:Pink Muskat\"","Die großen Trauben tragen mittelgroße , ovale Beeren . Ihre roten bis violett farbigen Beeren sind kernlos, besitzen eine dünne und dennoch, knackige Schalemit festem Fruchtfleisch und feinfruchtigem Aroma.",885,null,null,"kg",null,"Lose","Neue Ernte"]
[886,"Trauben Weiß mit Kern","\"Italien\"","Kl. II","Sorte: Viktoria Standardt","Ihr Gewicht beträgt 6-8 g. Die Haut der Trauben ist dünn. Das Fruchtfleisch ist saftig und fleischig. Die Beeren der Sorte Victoria sind sehr duftend, haben einen Muskatgeschmack und sind süß.",886,null,null,"kg",2.99,"Lose","Neue Ernte"]
[887,"Trauben rot mit Kern","Peru","Kl. II","Sorte: Red Globe","Bekannteste rote Rebsorte\r\nRot-violettblaue Traube. Sehr große, kugelförmige Trauben\r\nIntensiv-fruchtiger Geschmack. Einer der vielen Vertreter der amerikanischen Selektion ist die Red Globe-Traube, was \"Red Ball\" (Globe) bedeutet.",887,null,null,"kg",4.99,"Lose"]
[888,"Trauben Weiß mit Kern","Italien","Kl. II","Sorte:Vittoria","An diese Trauben werden ganz andere Anforderungen gestellt als an solche, die der Weinherstellung dienen. Denn wir, die Kunden, wollen diese Weintrauben schön und groß, saftig, mit möglichst wenig Kernen und dünner Schale.",888,null,null,"kg",3.79,"Lose","Standard"]
[889,"Trauben Rot mit Kern","Frankreich","Kl. II","Sorte: Lavallee","Diese Rebsorte bringt voluminöse und schöne dunkelblaue Trauben hervor. Sie ist eine Neuzüchtung zwischen den Rebsorten Kharistvala Kolkhuri x Muscat Hamburg. Der Geschmack ist schwach aromatisch.",889,null,null,"kg",5.99,"Lose"]
[890,"Trauben Weiß mit Kern","Italien","Kl. II","Sorte: Italia Extra","Der Geschmack hat bei dieser Sorte höchste Priorität. Der Muskatgeschmack muss intensiv sein und der Zuckergehalt \r\ndarf die Anforderung von mindestens 17 Brix nicht unterschreiten.Die Beeren müssen sauber, einheitlich gelb und prall sein.",890,null,null,"kg",3.99,"Lose"]
[891,"Trauben weiß mit Kern","Italien","Kl. II","Sorte: Vittoria","Vitoria-Trauben sind eine spezielle Sorte von Tafeltrauben, die für ihre einzigartige Farbe, Form und Geschmack bekannt sind. Diese Trauben werden auch als Black Corinth-Trauben oder Zante-Currant-Trauben bezeichnet.",891,null,null,"kg",5.99,"Lose","Extra"]
[892,"Trauben Weiß kernlos","Türkei","Kl. II","Sorte: Sultana","Die Sultana Traube ist eine weiße Rebsorte, die am häufigsten als Traube zur Herstellung von Rosinen verwendet wird, die wiederum als süße Snacks, Extras beim Backen, Kuchen und Dessert.",892,null,null,"kg",4.99,"Lose"]
[893,"Trauben Rosé","\"Italien\"","Kl. II","Sorte: Black Magic","Die Tafeltraube 'Crimson Seedless' (Vitis vinifera) bildet dunkelrote, kernlose Früchte. Sie sind oval und haben einen süß-säuerlichen, süßen Geschmack.",893,null,null,"kg",5.99,"Lose"]
[894,"Weintrauben","Deutschland","Kl. II","Sorte: Phönix","Eine der Topsorten für Kenner, für die Weinbereitung und als zierende Fassadenbegrünung, säuerlich-süße Beeren ab Anfang September mit wenigen Kernen.",894,null,null,"kg",2.99,"Lose"]
[895,null,null,null,null,null,null,null,null,null,0]
[896,"Trauben gepackt","Herkunft: siehe Etikett","Kl. II","Sorte: siehe Etikett","Die Tafeltraube 'Thompson Seedless' (Vitis vinifera) bildet grüngelbe, kernlose Früchte. Sie sind oval und haben einen süß-säuerlichen, aromatischen Geschmack.",null,896,500,"g",1.19,"Packung"]
[897,null,null,null,null,null,null,null,null,null,0]
[898,null,null,null,null,null,null,null,null,null,0]
[899,null,null,null,null,null,null,null,null,null,0]
[900,"Kürbis","\"Deutschland\"","Kl. II","Sorte: Hokkaido","Der Hokkaido-Kürbis gehört zu den beliebtesten Gemüsesorten im Früh- und Spätherbst. Hokkaido-Kürbis begeistert viele mit einem leicht nussigen, etwas an Esskastanien erinnernden Aroma und seinem saftigen, faserarmen Fruchtfleisch.",null,554,null,null,2.4900000000000002,"Stück"]
[901,"Orangen","\"Spanien\"","Kl. II","Sorte: Navel","Orangen schmecken süß, sind saftig und stecken voller Vitamine. Aber nicht nur das: Orangen sind auch vielseitig. Egal ob pur, als Saft oder Marmelade, in Desserts oder Smoothies.",901,null,null,"kg",3.99,"Lose","Standard","Schale behandelt"]
[902,"Saft Orangen","\"Europa\"","Kl. II","Sorte: Navelinas","Der Geschmack kombiniert Süße und saure Noten. Manche halten es für ein wenig langweilig. Das Fruchtfleisch ist fest und nicht sehr saftig. Die Farbe ist creme. Ausgeprägtes und angenehmes Sortenaroma.",902,null,null,"kg",0.99,"Lose",null,"Schale behandelt"]
[903,"Orangen","Spanien","Kl. II","Sorte: Navelinas","SanLucar Orangen schmecken intensiv, sonnensüß und saftig, was vor allem an der liebevollen Pflege unserer Meisteranbauer wie Jorge und Javier Llusar liegt. Gegen schädliche Insekten werden zum Beispiel natürliche Methoden eingesetzt.",903,null,null,"kg",4.99,"Lose","Sun Lucar","Schale behandelt"]
[904,"Orangen","Spanien","Kl. II","Sorte:\"Navelinas\"","Die meisten Orangen sind süß und saftig. Sie sind perfekt zum Essen als Snack oder zum Pressen von frischem Orangensaft. Orangen sind nicht nur lecker, sondern auch gesund. Orangen sind eine ausgezeichnete Quelle für Vitamin C.",904,null,null,"kg",3.49,"Lose","Extra","Schale behandelt"]
[905,"Blutorangen","Spanien","Kl. II","Sorte:Sanguinello","Die Blutorange enthält sehr viel Vitamin C, das bekannt für seine antioxidative Wirkung ist. Dadurch wird der Körper vor aggressiven freien Radikalen geschützt, das sind chemisch hochgradig reaktive Sauerstoffverbindungen.",905,null,null,"kg",1.99,"Lose",null,"Schale behandelt"]
[906,"Clementinen","Südafrika","Kl. II","Sorte: Tangold","Clementinen sind etwas süßer und nährstoffreicher als Mandarinen. Besonders in den kalten Wintermonaten stärken die saftigen Zitrusfrüchte das Immunsystem mit einem kleinen Vitamincocktail.",906,null,null,"kg",3.99,"Lose","Extra Süß","Schale behandelt"]
[907,"Orange","Spanien","Kl. II","Sorte: Schokoorange","Die Schoko-Orange deutlich süßer als normale Orangen und auch weniger sauer. So erreicht der Zuckergehalt einen Brixwert von bis zu 12. Sie gilt damit zu einer der süßesten Navel-Sorten überhaupt.",907,null,null,"kg",1.99,"Lose",null,"Schale behandelt"]
[908,"Clementinen","Spanien","Kl. II","Nadorcott","Queen ist eine intensiv orange, einen reichen süssen Geschmack mit einem angenehmen Aroma. Sie unterscheidet sich weiterhin dadurch, dass sie beinahe kerlos ist, trotz des suess/leichsaurem Geschmack einen Brixwert von 11 hat.",908,null,null,"kg",2.4900000000000002,"Lose",null,"Schale behandelt"]
[909,"Clementinen","Spanien","Kl. II","Sorte: Orri","Dieser äußerst begehrte Clementinensorte zeichnet sich durch ihren herausragenden Geschmack. Die leicht zu schälende Orri Clementinen sind kernarm, sehr saftig und sehr aromatisch, und haben einen niedrigen Säuregehalt.",909,null,null,"kg",4.49,"Lose",null,"Schale behandelt"]
[910,"Clementinen","\"Spanien\"","Kl. II","Sorte: \"Clemenules\"","Die Clementine ist eine relativ kleine, kältetolerante, Zitrusfrucht mit süßlich-aromatischem Geschmack und nur geringem Säuregehalt. Im Gegensatz zu den ähnlich aussehenden Mandarinen sind Clementinen nahezu kernlos.",910,null,null,"kg",0.99,"Lose","Standard","Schale behandelt"]
[911,"Orange Bio","Spanien","Kl. II",null,"Orangen schmecken süß, sind saftig und stecken voller Vitamine. Aber nicht nur das: Orangen sind auch vielseitig. Egal ob pur, als Saft oder Marmelade, in Desserts oder Smoothies.",911,290217,null,"kg",2.99,"Lose"]
[912,"Orangen","\"Italien\"","Kl. II","Sorte: Kara Kara-","Es handelt sich um eine Sorte, die von der Hacienda de Cara Cara in Valencia, Venezuela, stammt. Diese Orangen haben eine tief orangefarbene Schale und ein rosafarbenes Fruchtfleisch, das der Farbe einer Himbeere entspricht.",912,null,null,"kg",null,"Lose",null,"Schale behandelt"]
[913,"Blutorangen","Spanien","Kl. II",null,"Die Blutorange enthält sehr viel Vitamin C, das bekannt für seine antioxidative Wirkung ist. Dadurch wird der Körper vor aggressiven freien Radikalen geschützt, das sind chemisch hochgradig reaktive Sauerstoffverbindungen.",913,null,null,"kg",2.79,"Lose"]
[914,null,null,null,null,null,null,null,null,null,0]
[915,"Clementinen","South-Afrika","Kl. II","Sorte: Ori","Diese Clementinensorte gehört zur Gruppe der Kreuzungen. Sie ist groß, hat die Form einer Plattkugel, mit leicht rauher, fester Schale und tief-rötlicher Farbe. Ihr Furchtfleisch ist sehr saftig und sehr süß.",915,null,null,"kg",3.99,"Lose",null,"Schale behandelt"]
[916,"Clementinen","Spanien","Kl. II","Sorte: Orenules","Aromatisch zart und mit extra viel Vitamin C hellt der Klassiker unter den Clementinen graue Tage auf und schmeckt jedem gut. Dank ihres ausgewogenen Süße-Säure-Verhältnis ist ihr Geschmack besonders fruchtig.",916,null,null,"kg",5.99,"Lose","Sun Lucar","Schale behandelt"]
[917,"Satsumas","Türkei","Kl. II","Sorte: Murcott","Satsumas haben einen ähnlichen Geschmack wie Mandarinen, sind jedoch größer als ihre Schwestern. Am saftigsten und aromatischsten sind die schweren Früchte. Satsuma punktet mit einem hohen Vitamin-C-Gehalt.",917,null,null,"kg",3.99,"Lose",null,"Schale behandelt"]
[918,"Erdnüsse lose","Deutschland","Kl. II",null,"Trotz ihres Namens gehören sie nicht zu den echten Nüssen, sondern sind enger mit Bohnen und Erbsen verwandt.Erdnüsse sind ernährungstechnisch aufgrund ihres hohen Protein- und Nährstoffgehalts wertvoll und vielseitig einsetzbar.",918,null,100,"g",1.99,"Lose"]
[919,"Clementinen Blatt","Spanien\"","Kl. II","Sorte:Tangold","Clementinen schmecken süß-säuerlich und erfrischend fruchtig. Das Aroma ist etwas weniger intensiv, dafür aber meist süßer als bei Mandarinen. Der hohe Vitamin-C-Gehalt in Clementinen stärkt außerdem das Immunsystem.",919,null,null,"kg",3.99,"Lose",null,"Schale behandelt"]
[920,"Kumquats","Süd Afrika","Kl. II",null,"Während die Schale eher herbsüßlich schmeckt, hat das Fruchtfleisch einen sauren Geschmack mit leicht bitterer Note. So schmeckt die Kumquat in ihrer Gesamtkomposition etwas bitterer als die normale Orange.",920,null,100,"g",0.39,"Lose"]
[921,null,null,null,null,null,null,null,null,null,0]
[922,null,null,null,null,null,null,null,null,null,0]
[923,null,null,null,null,null,null,null,null,null,0]
[924,null,null,null,null,null,null,null,null,null,0]
[925,null,null,null,null,null,null,null,null,null,0]
[926,null,null,null,null,null,null,null,null,null,0]
[927,null,null,null,null,null,null,null,null,null,0]
[928,null,null,null,null,null,null,null,null,null,0]
[929,null,null,null,null,null,null,null,null,null,0]
[930,null,null,null,null,null,null,null,null,null,0]
[931,null,null,null,null,null,null,null,null,null,0]
[932,null,null,null,null,null,null,null,null,null,0]
[933,null,null,null,null,null,null,null,null,null,0]
[934,null,null,null,null,null,null,null,null,null,0]
[935,null,null,null,null,null,null,null,null,null,0]
[936,null,null,null,null,null,null,null,null,null,0]
[937,null,null,null,null,null,null,null,null,null,0]
[938,null,null,null,null,null,null,null,null,null,0]
[939,null,null,null,null,null,null,null,null,null,0]
[940,null,null,null,null,null,null,null,null,null,0]
[941,null,null,null,null,null,null,null,null,null,0]
[942,null,null,null,null,null,null,null,null,null,0]
[943,null,null,null,null,null,null,null,null,null,0]
[944,null,null,null,null,null,null,null,null,null,0]
[945,null,null,null,null,null,null,null,null,null,0]
[946,null,null,null,null,null,null,null,null,null,0]
[947,null,null,null,null,null,null,null,null,null,0]
[948,null,null,null,null,null,null,null,null,null,0]
[949,null,null,null,null,null,null,null,null,null,0]
[950,null,null,null,null,null,null,null,null,null,0]
[951,null,null,null,null,null,null,null,null,null,0]
[952,null,null,null,null,null,null,null,null,null,0]
[953,null,null,null,null,null,null,null,null,null,0]
[954,null,null,null,null,null,null,null,null,null,0]
[955,null,null,null,null,null,null,null,null,null,0]
[956,null,null,null,null,null,null,null,null,null,0]
[957,null,null,null,null,null,null,null,null,null,0]
[958,null,null,null,null,null,null,null,null,null,0]
[959,null,null,null,null,null,null,null,null,null,0]
[960,null,null,null,null,null,null,null,null,null,0]
[961,null,null,null,null,null,null,null,null,null,0]
[962,null,null,null,null,null,null,null,null,null,0]
[963,null,null,null,null,null,null,null,null,null,0]
[964,null,null,null,null,null,null,null,null,null,0]
[965,null,null,null,null,null,null,null,null,null,0]
[966,null,null,null,null,null,null,null,null,null,0]
[967,null,null,null,null,null,null,null,null,null,0]
[968,null,null,null,null,null,null,null,null,null,0]
[969,null,null,null,null,null,null,null,null,null,0]
[970,null,null,null,null,null,null,null,null,null,0]
[971,null,null,null,null,null,null,null,null,null,0]
[972,null,null,null,null,null,null,null,null,null,0]
[973,null,null,null,null,null,null,null,null,null,0]
[974,null,null,null,null,null,null,null,null,null,0]
[975,null,null,null,null,null,null,null,null,null,0]
[976,null,null,null,null,null,null,null,null,null,0]
[977,null,null,null,null,null,null,null,null,null,0]
[978,null,null,null,null,null,null,null,null,null,0]
[979,null,null,null,null,null,null,null,null,null,0]
[980,null,null,null,null,null,null,null,null,null,0]
[981,null,null,null,null,null,null,null,null,null,0]
[982,null,null,null,null,null,null,null,null,null,0]
[983,null,null,null,null,null,null,null,null,null,0]
[984,null,null,null,null,null,null,null,null,null,0]
[985,null,null,null,null,null,null,null,null,null,0]
[986,null,null,null,null,null,null,null,null,null,0]
[987,null,null,null,null,null,null,null,null,null,0]
[988,null,null,null,null,null,null,null,null,null,0]
[989,null,null,null,null,null,null,null,null,null,0]
[990,"Maroni gekocht","Frankreich","Kl. II",null,"Sie sind eine sehr gute Quelle für Antioxidantien, auch nachdem sie geröstet wurden. Sie sind reich an Gallussäure und Ellagsäure. Die Konzentration dieser beiden Antioxidantien nimmt nach dem Rösten zu.",null,null,400,"g",5.99,"Packung"]
[991,null,null,null,null,null,null,null,null,null,0]
[992,null,null,null,null,null,null,null,null,null,0]
[993,null,null,null,null,null,null,null,null,null,0]
[994,null,null,null,null,null,null,null,null,null,0]
[995,"Passionsfrucht","Vietman","Kl. II",null,"Passionsfrucht schmeckt süß und gleichzeitig leicht säuerlich, eine Kombination, die sie sehr erfrischend macht. Ihr Aroma ist intensiv und tropisch, manchmal sogar mit einer leichten Note von Honig.",null,813,null,null,1.49,"Stück"]
[996,"Zwiebel Rot lose","Deutschland","Kl. II",null,"Rote Zwiebeln haben eine milde Schörfe. Wegen ihres süßlichen Geschmacks sind sie besonders beliebt in Salaten, Suppen und Soßen.",731,null,null,"kg",2.4900000000000002,"Lose"]
[997,"Gemüse Zwiebel lose","Spanien","Kl. II",null,"Verwendet wird der Zwiebellauch oder die eigentliche Zwiebel meist fein gehackt oder in Ringe geschnitten. Sie wird roh oder geröstet gegessen oder beim Garen anderer Speisen (so etwa im Gemüse) mitgedünstet.",730,null,null,"kg",3.99,"Lose","Neue Ernte"]
[998,"Drillinge","Frankreich",null,"Festkochend","Sie sind meist festkochend und schmecken mit Schale gekocht, gebraten oder im Ofen zubereitet. Rosmarin, Kräutersalz und Pfeffer sind beliebte Gewürze, die den Geschmack der Drillinge unterstreichen.",null,null,1,"kg",1.99,"Packung"]
[999,"Zitronengras","Deutschland","Kl. II",null,null,null,999,null,"1",0.59,"Stück"]
[7070,"Spargel-grün","\"Deutschalnd\"","Kl. II",null,"Grünspargel herzhafter und kräftiger als der weiße Spargel, darüber hinaus hat er mehr Vitamine – besonders Vitamin C und B-Vitamine. Grüner Spargel muss nur am unteren Ende geschält werden, wodurch er auch weniger Abfall produziert.",null,7070,450,"g",5.99,"Packung"]
[7305,"Minze","Deutschland","Kl. II",null,"Minze riecht erfrischend, wirkt heilend und schmeckt lecker. Sie gehört zu den beliebtesten Kräutern. Vor rund 300 Jahren wurde die Pflanze mit dem bläulichen Stängel und den dunkelgrünen, leicht haarigen Blättern in England gezüchtet.",null,7305,null,null,1,"Stück"]
[7451,"Waldmeister","Deutschland","Kl. II",null,"Waldmeister hat einen ganz speziellen, süßlich-würzigen Geschmack, der fast ein wenig künstlich wirkt. Sie werden diesen immer sofort herausschmecken, wenn Sie ihn einmal probiert haben. Egal ob Kuchen, Dessert, Eis, Joghurt, Fleischgerichte oder Salate.",null,745,null,null,1,"Stück"]
[7474,"Bärlauch","Deutschland","Kl. II",null,"Bärlauch ist bekannt für sein kräftiges Knoblaucharoma. Und er hat einen großen Vorteil: Nach dem Verzehr von Bärlauch riecht man nicht so stark, wie es bei Knoblauch leider der Fall ist. Der Bärlauch gehört zu den bekanntesten heimischen Wildkräutern.",null,7474,null,null,2.4900000000000002,"Packung"]
[7511,"Peterle Glatt","Deutschland","Kl. II",null,"Die Blätter der glatten Petersilie sind glänzend grün und tief eingeschnitten. Anders als die eher mild schmeckende krause Variante haben die glatten Petersilienblätter einen sehr intensiven und würzigen Geschmack.",null,751,null,null,1.2,"Stück"]
[7512,"Beifuß","Deutschland","Kl. II",null,"Beifuß hat einen bitteren und leicht herben Geschmack. Der Geruch des Krauts erinnert an Minze oder Wacholder, es riecht also etwas blumig und nach Menthol.",null,741,20,"g",2.99,"Packung"]
[41231,"Von Winning","Riesling",null,"trocken","Von Winnings trockener Riesling WinWin ist einer der besten deutschen Rieslinge in der hart umkämpften 12-Euro-Klasse. Junge Reben in Weinbergen, die als Große Gewächse klassifiziert sind, bilden den Grundstoff des WinWin",0,0,0.7,"l",3.99,"Liter"]

{"sheet":"Druck 8 Felder","index":3,"n_rows":230,"n_cols":45,"rows_kept":230,"cut":false,"hidden":true,"merged":[[161,24,171,46],[172,24,172,46],[218,0,228,22],[229,0,229,22],[218,24,228,46],[229,24,1048575,46],[47,0,57,22],[58,0,58,22],[47,24,57,46],[58,24,58,46],[104,0,114,22],[115,0,115,22],[104,24,114,46],[115,24,115,46],[161,0,171,22],[211,10,213,10],[211,1,213,9],[211,25,213,33],[211,24,213,24],[211,0,213,0],[211,34,213,34],[185,0,188,18],[185,19,188,22],[185,24,188,42],[185,43,188,46],[189,0,210,10],[189,11,192,18],[189,19,192,22],[189,24,210,34],[189,35,192,42],[189,43,192,46],[193,11,210,22],[193,35,210,46],[180,23,229,23],[211,37,213,39],[211,40,213,42],[211,43,213,43],[211,44,213,46],[214,0,217,22],[214,24,217,46],[211,13,213,15],[211,16,213,18],[211,19,213,19],[211,20,213,22],[211,35,213,36],[211,11,213,12],[173,0,179,46],[180,0,184,18],[180,19,184,22],[180,24,184,42],[180,43,184,46],[154,35,156,36],[154,37,156,39],[154,40,156,42],[154,43,156,43],[154,44,156,46],[123,23,172,23],[132,35,135,42],[132,43,135,46],[136,11,153,22],[136,35,153,46],[154,11,156,12],[154,13,156,15],[157,0,160,22],[157,24,160,46],[132,0,153,10],[132,11,135,18],[132,19,135,22],[132,24,153,34],[172,0,172,22],[100,24,103,46],[97,19,99,19],[97,20,99,22],[97,35,99,36],[97,37,99,39],[97,40,99,42],[97,10,99,10],[97,1,99,9],[97,0,99,0],[97,34,99,34],[97,25,99,33],[97,24,99,24],[59,0,65,46],[66,0,70,18],[66,19,70,22],[66,24,70,42],[66,43,70,46],[71,0,74,18],[71,19,74,22],[97,11,99,12],[97,13,99,15],[97,16,99,18],[71,24,74,42],[71,43,74,46],[66,23,115,23],[75,0,96,10],[75,11,78,18],[75,19,78,22],[75,24,96,34],[75,35,78,42],[75,43,78,46],[79,11,96,22],[79,35,96,46],[97,43,99,43],[97,44,99,46],[100,0,103,22],[116,0,122,46],[123,0,127,18],[123,19,127,22],[123,24,127,42],[123,43,127,46],[154,16,156,18],[154,19,156,19],[154,20,156,22],[128,0,131,18],[128,19,131,22],[128,24,131,42],[128,43,131,46],[154,10,156,10],[154,1,156,9],[154,0,156,0],[154,24,156,24],[154,25,156,33],[154,34,156,34],[43,24,46,46],[40,1,42,9],[40,0,42,0],[40,10,42,10],[40,34,42,34],[40,35,42,36],[40,37,42,39],[40,40,42,42],[40,43,42,43],[40,44,42,46],[40,16,42,18],[40,19,42,19],[40,20,42,22],[40,24,42,24],[40,25,42,33],[9,23,58,23],[9,24,13,42],[9,43,13,46],[14,24,17,42],[14,43,17,46],[18,24,39,34],[18,35,21,42],[18,43,21,46],[43,0,46,22],[22,35,39,46],[9,19,13,22],[14,19,17,22],[18,11,21,18],[18,19,21,22],[22,11,39,22],[40,11,42,12],[40,13,42,15],[9,0,13,18],[14,0,17,18],[18,0,39,10]]}
[]
[]
[]
[]
[]
[]
[]
[]
[]
[{"$f":"IF(Übertrag!A2>0,VLOOKUP(Übertrag!A2,Obst[],2,FALSE),\"\")","v":"Blumenkohl"},null,null,null,null,null,null,null,null,null,null,null,null,null,null,null,null,null,null,{"$f":"IF(Übertrag!A2>0,VLOOKUP(Übertrag!A2,Obst[],7,FALSE),\"\")","v":0},null,null,null,null,{"$f":"IF(Übertrag!A3>0,VLOOKUP(Übertrag!A3,Obst[],2,FALSE),\"\")","v":"Mini - Rispen"},null,null,null,null,null,null,null,null,null,null,null,null,null,null,null,null,null,null,{"$f":"IF(Übertrag!A3>0,VLOOKUP(Übertrag!A3,Obst[],7,FALSE),\"\")","v":705}]
[]
[]
[]
[]
[{"$f":"IF(Übertrag!A2>0,VLOOKUP(Übertrag!A2,Obst[],3,FALSE),\"\")","v":"\"Deutschland\""},null,null,null,null,null,null,null,null,null,null,null,null,null,null,null,null,null,null,{"$f":"IF(Übertrag!A2>0,VLOOKUP(Übertrag!A2,Obst[],8,FALSE),\"\")","v":45},null,null,null,null,{"$f":"IF(Übertrag!A3>0,VLOOKUP(Übertrag!A3,Obst[],3,FALSE),\"\")","v":"\"Belgien\""},null,null,null,null,null,null,null,null,null,null,null,null,null,null,null,null,null,null,{"$f":"IF(Übertrag!A3>0,VLOOKUP(Übertrag!A3,Obst[],8,FALSE),\"\")","v":0}]
[]
[]
[]
[{"$f":"_xlfn.IFS(Übertrag!A2=\"\",\"\",K41=\"1\",VLOOKUP(Übertrag!A2,Obst[],17,FALSE),Übertrag!A2>0,VLOOKUP(Übertrag!A2,Obst[],16,FALSE))","v":0},null,null,null,null,null,null,null,null,null,null,{"$f":"IF(Übertrag!A2>0,VLOOKUP(Übertrag!A2,Obst[],13,FALSE),\"\")","v":"Neue Ernte"},null,null,null,null,null,null,null,{"$f":"IF(Übertrag!A2>0,VLOOKUP(Übertrag!A2,Obst[],4,FALSE),\"\")","v":"Kl. II"},null,null,null,null,{"$f":"_xlfn.IFS(Übertrag!A3=\"\",\"\",AI41=\"1\",VLOOKUP(Übertrag!A3,Obst[],17,FALSE),Übertrag!A3>0,VLOOKUP(Übertrag!A3,Obst[],16,FALSE))","v":0},null,null,null,null,null,null,null,null,null,null,{"$f":"IF(Übertrag!A3>0,VLOOKUP(Übertrag!A3,Obst[],13,FALSE),\"\")","v":0},null,null,null,null,null,null,null,{"$f":"IF(Übertrag!A3>0,VLOOKUP(Übertrag!A3,Obst[],4,FALSE),\"\")","v":"Kl. II"}]
[]
[]
[]
[null,null,null,null,null,null,null,null,null,null,null,{"$f":"IF(Übertrag!A2>0,VLOOKUP(Übertrag!A2,Obst[],11,FALSE),\"\")","v":1.59},null,null,null,null,null,null,null,null,null,null,null,null,null,null,null,null,null,null,null,null,null,null,null,{"$f":"IF(Übertrag!A3>0,VLOOKUP(Übertrag!A3,Obst[],11,FALSE),\"\")","v":2.69}]
[]
[]
[]
[]
[]
[]
[]
[]
[]
[]
[]
[]
[]
[]
[]
[]
[]
[null,{"$f":"IF(Übertrag!A2>0,VLOOKUP(Übertrag!A2,Obst[],14,FALSE),\"\")","v":0},null,null,null,null,null,null,null,null,{"$f":"IF(Übertrag!A2>0,VLOOKUP(Übertrag!A2,Obst[],15,FALSE),\"\")","v":0},{"$f":"IF(N41=\"\",\"\",\"1kg=\")","v":""},null,{"$f":"IF(Q41=0,\"\",IF(T41=\"kg\",SUM(L23/Q41),IF(T41=\"g\",SUM(L23/Q41*1000),IF(T41=\"gr\",SUM(L23/Q41*1000),\"\"))))","v":""},null,null,{"$f":"IF(Übertrag!A2>0,VLOOKUP(Übertrag!A2,Obst[],9,FALSE),\"\")","v":0},null,null,{"$f":"IF(Übertrag!A2>0,VLOOKUP(Übertrag!A2,Obst[],10,FALSE),\"\")","v":0},{"$f":"IF(Übertrag!A2>0,VLOOKUP(Übertrag!A2,Obst[],12,FALSE),\"\")","v":"Stück"},null,null,null,null,{"$f":"IF(Übertrag!A3>0,VLOOKUP(Übertrag!A3,Obst[],14,FALSE),\"\")","v":0},null,null,null,null,null,null,null,null,{"$f":"IF(Übertrag!A3>0,VLOOKUP(Übertrag!A3,Obst[],15,FALSE),\"\")","v":0},{"$f":"IF(AL41=\"\",\"\",\"1kg=\")","v":""},null,{"$f":"IF(AO41=0,\"\",IF(AR41=\"kg\",SUM(AJ23/AO41),IF(AR41=\"g\",SUM(AJ23/AO41*1000),IF(AR41=\"gr\",SUM(AJ23/AO41*1000),\"\"))))","v":""},null,null,{"$f":"IF(Übertrag!A3>0,VLOOKUP(Übertrag!A3,Obst[],9,FALSE),\"\")","v":0},null,null,{"$f":"IF(Übertrag!A3>0,VLOOKUP(Übertrag!A3,Obst[],10,FALSE),\"\")","v":"kg"},{"$f":"IF(Übertrag!A3>0,VLOOKUP(Übertrag!A3,Obst[],12,FALSE),\"\")","v":"Lose"}]
[]
[]
[{"$f":"IF(Übertrag!A2>0,VLOOKUP(Übertrag!A2,Obst[],5,FALSE),\"\")","v":0},null,null,null,null,null,null,null,null,null,null,null,null,null,null,null,null,null,null,null,null,null,null,null,{"$f":"IF(Übertrag!A3>0,VLOOKUP(Übertrag!A3,Obst[],5,FALSE),\"\")","v":"Sorte: Rote Perle"}]
[]
[]
[]
[{"$f":"IF(Übertrag!A2>0,VLOOKUP(Übertrag!A2,Obst[],6,FALSE),\"\")","v":"Blumenkohl, auch Karfiol oder Minarett-Kohl genannt, verdankt seinen Namen einer botanischen Besonderheit: Der Kohlkopf ist der noch nicht geschossene Blütenstand der Pflanze."},null,null,null,null,null,null,null,null,null,null,null,null,null,null,null,null,null,null,null,null,null,null,null,{"$f":"IF(Übertrag!A3>0,VLOOKUP(Übertrag!A3,Obst[],6,FALSE),\"\")","v":"Die Rote Perle Tomate ist eine kleine und sehr dunklerote Mini-Strauchtomate. Sie ist Platzfest, hat einen aromatischen würzigen Geschmack, ist sehr ertragreich und gut haltbar."}]
[]
[]
[]
[]
[]
[]
[]
[]
[]
[]
[{"$f":"IF(Übertrag!A2>0,VLOOKUP(Übertrag!A2,Datenbank[],7,FALSE),\"\")","v":"2025-07-16"},null,null,null,null,null,null,null,null,null,null,null,null,null,null,null,null,null,null,null,null,null,null,null,{"$f":"IF(Übertrag!A3>0,VLOOKUP(Übertrag!A3,Datenbank[],7,FALSE),\"\")","v":"2025-07-16"}]
[]
[]
[]
[]
[]
[]
[]
[{"$f":"IF(Übertrag!A4>0,VLOOKUP(Übertrag!A4,Obst[],2,FALSE),\"\")","v":"Kiwi Gold"},null,null,null,null,null,null,null,null,null,null,null,null,null,null,null,null,null,null,{"$f":"IF(Übertrag!A4>0,VLOOKUP(Übertrag!A4,Obst[],7,FALSE),\"\")","v":0},null,null,null,null,{"$f":"IF(Übertrag!A5>0,VLOOKUP(Übertrag!A5,Obst[],2,FALSE),\"\")","v":"Pfifferling"},null,null,null,null,null,null,null,null,null,null,null,null,null,null,null,null,null,null,{"$f":"IF(Übertrag!A5>0,VLOOKUP(Übertrag!A5,Obst[],7,FALSE),\"\")","v":748}]
[]
[]
[]
[]
[{"$f":"IF(Übertrag!A4>0,VLOOKUP(Übertrag!A4,Obst[],3,FALSE),\"\")","v":"\"Neuseeland\""},null,null,null,null,null,null,null,null,null,null,null,null,null,null,null,null,null,null,{"$f":"IF(Übertrag!A4>0,VLOOKUP(Übertrag!A4,Obst[],8,FALSE),\"\")","v":722},null,null,null,null,{"$f":"IF(Übertrag!A5>0,VLOOKUP(Übertrag!A5,Obst[],3,FALSE),\"\")","v":"\"Litauen\""},null,null,null,null,null,null,null,null,null,null,null,null,null,null,null,null,null,null,{"$f":"IF(Übertrag!A5>0,VLOOKUP(Übertrag!A5,Obst[],8,FALSE),\"\")","v":0}]
[]
[]
[]
[{"$f":"_xlfn.IFS(Übertrag!A4=\"\",\"\",K98=\"1\",VLOOKUP(Übertrag!A4,Obst[],17,FALSE),Übertrag!A4>0,VLOOKUP(Übertrag!A4,Obst[],16,FALSE))","v":0},null,null,null,null,null,null,null,null,null,null,{"$f":"IF(Übertrag!A4>0,VLOOKUP(Übertrag!A4,Obst[],13,FALSE),\"\")","v":0},null,null,null,null,null,null,null,{"$f":"IF(Übertrag!A4>0,VLOOKUP(Übertrag!A4,Obst[],4,FALSE),\"\")","v":"Kl. II"},null,null,null,null,{"$f":"_xlfn.IFS(Übertrag!A5=\"\",\"\",AI98=\"1\",VLOOKUP(Übertrag!A5,Obst[],17,FALSE),Übertrag!A5>0,VLOOKUP(Übertrag!A5,Obst[],16,FALSE))","v":0},null,null,null,null,null,null,null,null,null,null,{"$f":"IF(Übertrag!A5>0,VLOOKUP(Übertrag!A5,Obst[],13,FALSE),\"\")","v":0},null,null,null,null,null,null,null,{"$f":"IF(Übertrag!A5>0,VLOOKUP(Übertrag!A5,Obst[],4,FALSE),\"\")","v":"Kl. II"}]
[]
[]
[]
[null,null,null,null,null,null,null,null,null,null,null,{"$f":"IF(Übertrag!A4>0,VLOOKUP(Übertrag!A4,Obst[],11,FALSE),\"\")","v":0.55000000000000004},null,null,null,null,null,null,null,null,null,null,null,null,null,null,null,null,null,null,null,null,null,null,null,{"$f":"IF(Übertrag!A5>0,VLOOKUP(Übertrag!A5,Obst[],11,FALSE),\"\")","v":1.59}]
[]
[]
[]
[]
[]
[]
[]
[]
[]
[]
[]
[]
[]
[]
[]
[]
[]
[null,{"$f":"IF(Übertrag!A4>0,VLOOKUP(Übertrag!A4,Obst[],14,FALSE),\"\")","v":0},null,null,null,null,null,null,null,null,{"$f":"IF(Übertrag!A4>0,VLOOKUP(Übertrag!A4,Obst[],15,FALSE),\"\")","v":0},{"$f":"IF(N98=\"\",\"\",\"1kg=\")","v":""},null,{"$f":"IF(Q98=0,\"\",IF(T98=\"kg\",SUM(L80/Q98),IF(T98=\"g\",SUM(L80/Q98*1000),IF(T98=\"gr\",SUM(L80/Q98*1000),\"\"))))","v":""},null,null,{"$f":"IF(Übertrag!A4>0,VLOOKUP(Übertrag!A4,Obst[],9,FALSE),\"\")","v":0},null,null,{"$f":"IF(Übertrag!A4>0,VLOOKUP(Übertrag!A4,Obst[],10,FALSE),\"\")","v":0},{"$f":"IF(Übertrag!A4>0,VLOOKUP(Übertrag!A4,Obst[],12,FALSE),\"\")","v":"Stück"},null,null,null,null,{"$f":"IF(Übertrag!A5>0,VLOOKUP(Übertrag!A5,Obst[],14,FALSE),\"\")","v":0},null,null,null,null,null,null,null,null,{"$f":"IF(Übertrag!A5>0,VLOOKUP(Übertrag!A5,Obst[],15,FALSE),\"\")","v":0},{"$f":"IF(AL98=\"\",\"\",\"1kg=\")","v":"1kg="},null,{"$f":"IF(AO98=0,\"\",IF(AR98=\"kg\",SUM(AJ80/AO98),IF(AR98=\"g\",SUM(AJ80/AO98*1000),IF(AR98=\"gr\",SUM(AJ80/AO98*1000),\"\"))))","v":15.9},null,null,{"$f":"IF(Übertrag!A5>0,VLOOKUP(Übertrag!A5,Obst[],9,FALSE),\"\")","v":100},null,null,{"$f":"IF(Übertrag!A5>0,VLOOKUP(Übertrag!A5,Obst[],10,FALSE),\"\")","v":"g"},{"$f":"IF(Übertrag!A5>0,VLOOKUP(Übertrag!A5,Obst[],12,FALSE),\"\")","v":"Lose"}]
[]
[]
[{"$f":"IF(Übertrag!A4>0,VLOOKUP(Übertrag!A4,Obst[],5,FALSE),\"\")","v":0},null,null,null,null,null,null,null,null,null,null,null,null,null,null,null,null,null,null,null,null,null,null,null,{"$f":"IF(Übertrag!A5>0,VLOOKUP(Übertrag!A5,Obst[],5,FALSE),\"\")","v":"Sorte; Cantharellus"}]
[]
[]
[]
[{"$f":"IF(Übertrag!A4>0,VLOOKUP(Übertrag!A4,Obst[],6,FALSE),\"\")","v":"Zespri SunGold Kiwis enthalten von Natur aus viel Vitamin C, ein Nährstoff dessen Eigenschaften zur Gesundheit der Haut beiträgt.Zespri SunGold Kiwis enthalten mehr Vitamin C als eine Orange/100 g"},null,null,null,null,null,null,null,null,null,null,null,null,null,null,null,null,null,null,null,null,null,null,null,{"$f":"IF(Übertrag!A5>0,VLOOKUP(Übertrag!A5,Obst[],6,FALSE),\"\")","v":"Bei den Pfifferlingen handelt es sich im Allgemeinen um mittelgroße Pilze, deren Fruchtkörper mehr oder weniger deutlich in Hut und Stiel gegliedert sind. Der Hut ist mit einem Durchmesser von etwa 2 bis 9 cm meist etwas trichterförmig."}]
[]
[]
[]
[]
[]
[]
[]
[]
[]
[]
[{"$f":"IF(Übertrag!A4>0,VLOOKUP(Übertrag!A4,Datenbank[],7,FALSE),\"\")","v":"2025-07-16"},null,null,null,null,null,null,null,null,null,null,null,null,null,null,null,null,null,null,null,null,null,null,null,{"$f":"IF(Übertrag!A5>0,VLOOKUP(Übertrag!A5,Datenbank[],7,FALSE),\"\")","v":"2025-07-16"}]
[]
[]
[]
[]
[]
[]
[]
[{"$f":"IF(Übertrag!A6>0,VLOOKUP(Übertrag!A6,Obst[],2,FALSE),\"\")","v":"Avocado"},null,null,null,null,null,null,null,null,null,null,null,null,null,null,null,null,null,null,{"$f":"IF(Übertrag!A6>0,VLOOKUP(Übertrag!A6,Obst[],7,FALSE),\"\")","v":0},null,null,null,null,{"$f":"IF(Übertrag!A7>0,VLOOKUP(Übertrag!A7,Obst[],2,FALSE),\"\")","v":"Pink Lady"},null,null,null,null,null,null,null,null,null,null,null,null,null,null,null,null,null,null,{"$f":"IF(Übertrag!A7>0,VLOOKUP(Übertrag!A7,Obst[],7,FALSE),\"\")","v":817}]
[]
[]
[]
[]
[{"$f":"IF(Übertrag!A6>0,VLOOKUP(Übertrag!A6,Obst[],3,FALSE),\"\")","v":"South Afrika"},null,null,null,null,null,null,null,null,null,null,null,null,null,null,null,null,null,null,{"$f":"IF(Übertrag!A6>0,VLOOKUP(Übertrag!A6,Obst[],8,FALSE),\"\")","v":781},null,null,null,null,{"$f":"IF(Übertrag!A7>0,VLOOKUP(Übertrag!A7,Obst[],3,FALSE),\"\")","v":"Chile"},null,null,null,null,null,null,null,null,null,null,null,null,null,null,null,null,null,null,{"$f":"IF(Übertrag!A7>0,VLOOKUP(Übertrag!A7,Obst[],8,FALSE),\"\")","v":0}]
[]
[]
[]
[{"$f":"_xlfn.IFS(Übertrag!A6=\"\",\"\",K155=\"1\",VLOOKUP(Übertrag!A6,Obst[],17,FALSE),Übertrag!A6>0,VLOOKUP(Übertrag!A6,Obst[],16,FALSE))","v":0},null,null,null,null,null,null,null,null,null,null,{"$f":"IF(Übertrag!A6>0,VLOOKUP(Übertrag!A6,Obst[],13,FALSE),\"\")","v":0},null,null,null,null,null,null,null,{"$f":"IF(Übertrag!A6>0,VLOOKUP(Übertrag!A6,Obst[],4,FALSE),\"\")","v":"Kl. II"},null,null,null,null,{"$f":"_xlfn.IFS(Übertrag!A7=\"\",\"\",AI155=\"1\",VLOOKUP(Übertrag!A7,Obst[],17,FALSE),Übertrag!A7>0,VLOOKUP(Übertrag!A7,Obst[],16,FALSE))","v":0},null,null,null,null,null,null,null,null,null,null,{"$f":"IF(Übertrag!A7>0,VLOOKUP(Übertrag!A7,Obst[],13,FALSE),\"\")","v":"Neue Ernte"},null,null,null,null,null,null,null,{"$f":"IF(Übertrag!A7>0,VLOOKUP(Übertrag!A7,Obst[],4,FALSE),\"\")","v":"Kl. II"}]
[]
[]
[]
[null,null,null,null,null,null,null,null,null,null,null,{"$f":"IF(Übertrag!A6>0,VLOOKUP(Übertrag!A6,Obst[],11,FALSE),\"\")","v":0.55000000000000004},null,null,null,null,null,null,null,null,null,null,null,null,null,null,null,null,null,null,null,null,null,null,null,{"$f":"IF(Übertrag!A7>0,VLOOKUP(Übertrag!A7,Obst[],11,FALSE),\"\")","v":2.99}]
[]
[]
[]
[]
[]
[]
[]
[]
[]
[]
[]
[]
[]
[]
[]
[]
[]
[null,{"$f":"IF(Übertrag!A6>0,VLOOKUP(Übertrag!A6,Obst[],14,FALSE),\"\")","v":0},null,null,null,null,null,null,null,null,{"$f":"IF(Übertrag!A6>0,VLOOKUP(Übertrag!A6,Obst[],15,FALSE),\"\")","v":0},{"$f":"IF(N155=\"\",\"\",\"1kg=\")","v":""},null,{"$f":"IF(Q155=0,\"\",IF(T155=\"kg\",SUM(L137/Q155),IF(T155=\"g\",SUM(L137/Q155*1000),IF(T155=\"gr\",SUM(L137/Q155*1000),\"\"))))","v":""},null,null,{"$f":"IF(Übertrag!A6>0,VLOOKUP(Übertrag!A6,Obst[],9,FALSE),\"\")","v":0},null,null,{"$f":"IF(Übertrag!A6>0,VLOOKUP(Übertrag!A6,Obst[],10,FALSE),\"\")","v":0},{"$f":"IF(Übertrag!A6>0,VLOOKUP(Übertrag!A6,Obst[],12,FALSE),\"\")","v":"Stück"},null,null,null,null,{"$f":"IF(Übertrag!A7>0,VLOOKUP(Übertrag!A7,Obst[],14,FALSE),\"\")","v":0},null,null,null,null,null,null,null,null,{"$f":"IF(Übertrag!A7>0,VLOOKUP(Übertrag!A7,Obst[],15,FALSE),\"\")","v":0},{"$f":"IF(AL155=\"\",\"\",\"1kg=\")","v":""},null,{"$f":"IF(AO155=0,\"\",IF(AR155=\"kg\",SUM(AJ137/AO155),IF(AR155=\"g\",SUM(AJ137/AO155*1000),IF(AR155=\"gr\",SUM(AJ137/AO155*1000),\"\"))))","v":""},null,null,{"$f":"IF(Übertrag!A7>0,VLOOKUP(Übertrag!A7,Obst[],9,FALSE),\"\")","v":0},null,null,{"$f":"IF(Übertrag!A7>0,VLOOKUP(Übertrag!A7,Obst[],10,FALSE),\"\")","v":"kg"},{"$f":"IF(Übertrag!A7>0,VLOOKUP(Übertrag!A7,Obst[],12,FALSE),\"\")","v":"Lose"}]
[]
[]
[{"$f":"IF(Übertrag!A6>0,VLOOKUP(Übertrag!A6,Obst[],5,FALSE),\"\")","v":"Sorte: Hass"},null,null,null,null,null,null,null,null,null,null,null,null,null,null,null,null,null,null,null,null,null,null,null,{"$f":"IF(Übertrag!A7>0,VLOOKUP(Übertrag!A7,Obst[],5,FALSE),\"\")","v":0}]
[]
[]
[]
[{"$f":"IF(Übertrag!A6>0,VLOOKUP(Übertrag!A6,Obst[],6,FALSE),\"\")","v":"Das gelbe bis orangefarbene zarte Fruchtfleisch hat einen sehr aromatischen, nussigen Geschmack. Avocados werden roh verzehrt, da ihr Fruchtfleisch beim Erhitzen bitter wird. Harte Avocados reifen bei Zimmertemperatur nach."},null,null,null,null,null,null,null,null,null,null,null,null,null,null,null,null,null,null,null,null,null,null,null,{"$f":"IF(Übertrag!A7>0,VLOOKUP(Übertrag!A7,Obst[],6,FALSE),\"\")","v":"Durch die rote und saftige Farbe kann man sich die Besonderheit dieses Apfels schon vorstellen. Leichte Aromen von Waldbeere, Vanille und Lyche schmeckt man heraus. Aus diesem Grund wird der Apfel auch Paradiesapfel genannt."}]
[]
[]
[]
[]
[]
[]
[]
[]
[]
[]
[{"$f":"IF(Übertrag!A6>0,VLOOKUP(Übertrag!A6,Datenbank[],7,FALSE),\"\")","v":"2025-07-16"},null,null,null,null,null,null,null,null,null,null,null,null,null,null,null,null,null,null,null,null,null,null,null,{"$f":"IF(Übertrag!A7>0,VLOOKUP(Übertrag!A7,Datenbank[],7,FALSE),\"\")","v":"2025-07-16"}]
[]
[]
[]
[]
[]
[]
[]
[{"$f":"IF(Übertrag!A8>0,VLOOKUP(Übertrag!A8,Obst[],2,FALSE),\"\")","v":"Nektarinen"},null,null,null,null,null,null,null,null,null,null,null,null,null,null,null,null,null,null,{"$f":"IF(Übertrag!A8>0,VLOOKUP(Übertrag!A8,Obst[],7,FALSE),\"\")","v":860},null,null,null,null,{"$f":"IF(Übertrag!A9>0,VLOOKUP(Übertrag!A9,Obst[],2,FALSE),\"\")","v":"Bergpfirsich"},null,null,null,null,null,null,null,null,null,null,null,null,null,null,null,null,null,null,{"$f":"IF(Übertrag!A9>0,VLOOKUP(Übertrag!A9,Obst[],7,FALSE),\"\")","v":867}]
[]
[]
[]
[]
[{"$f":"IF(Übertrag!A8>0,VLOOKUP(Übertrag!A8,Obst[],3,FALSE),\"\")","v":"\"Griechenland\""},null,null,null,null,null,null,null,null,null,null,null,null,null,null,null,null,null,null,{"$f":"IF(Übertrag!A8>0,VLOOKUP(Übertrag!A8,Obst[],8,FALSE),\"\")","v":0},null,null,null,null,{"$f":"IF(Übertrag!A9>0,VLOOKUP(Übertrag!A9,Obst[],3,FALSE),\"\")","v":"Spanien"},null,null,null,null,null,null,null,null,null,null,null,null,null,null,null,null,null,null,{"$f":"IF(Übertrag!A9>0,VLOOKUP(Übertrag!A9,Obst[],8,FALSE),\"\")","v":0}]
[]
[]
[]
[{"$f":"_xlfn.IFS(Übertrag!A8=\"\",\"\",K212=\"1\",VLOOKUP(Übertrag!A8,Obst[],17,FALSE),Übertrag!A8>0,VLOOKUP(Übertrag!A8,Obst[],16,FALSE))","v":0},null,null,null,null,null,null,null,null,null,null,{"$f":"IF(Übertrag!A8>0,VLOOKUP(Übertrag!A8,Obst[],13,FALSE),\"\")","v":"Extra"},null,null,null,null,null,null,null,{"$f":"IF(Übertrag!A8>0,VLOOKUP(Übertrag!A8,Obst[],4,FALSE),\"\")","v":"Kl. II"},null,null,null,null,{"$f":"_xlfn.IFS(Übertrag!A9=\"\",\"\",AI212=\"1\",VLOOKUP(Übertrag!A9,Obst[],17,FALSE),Übertrag!A9>0,VLOOKUP(Übertrag!A9,Obst[],16,FALSE))","v":0},null,null,null,null,null,null,null,null,null,null,{"$f":"IF(Übertrag!A9>0,VLOOKUP(Übertrag!A9,Obst[],13,FALSE),\"\")","v":0},null,null,null,null,null,null,null,{"$f":"IF(Übertrag!A9>0,VLOOKUP(Übertrag!A9,Obst[],4,FALSE),\"\")","v":"Kl. II"}]
[]
[]
[]
[null,null,null,null,null,null,null,null,null,null,null,{"$f":"IF(Übertrag!A8>0,VLOOKUP(Übertrag!A8,Obst[],11,FALSE),\"\")","v":2.99},null,null,null,null,null,null,null,null,null,null,null,null,null,null,null,null,null,null,null,null,null,null,null,{"$f":"IF(Übertrag!A9>0,VLOOKUP(Übertrag!A9,Obst[],11,FALSE),\"\")","v":2.99}]
[]
[]
[]
[]
[]
[]
[]
[]
[]
[]
[]
[]
[]
[]
[]
[]
[]
[null,{"$f":"IF(Übertrag!A8>0,VLOOKUP(Übertrag!A8,Obst[],14,FALSE),\"\")","v":0},null,null,null,null,null,null,null,null,{"$f":"IF(Übertrag!A8>0,VLOOKUP(Übertrag!A8,Obst[],15,FALSE),\"\")","v":0},{"$f":"IF(N212=\"\",\"\",\"1kg=\")","v":""},null,{"$f":"IF(Q212=0,\"\",IF(T212=\"kg\",SUM(L194/Q212),IF(T212=\"g\",SUM(L194/Q212*1000),IF(T212=\"gr\",SUM(L194/Q212*1000),\"\"))))","v":""},null,null,{"$f":"IF(Übertrag!A8>0,VLOOKUP(Übertrag!A8,Obst[],9,FALSE),\"\")","v":0},null,null,{"$f":"IF(Übertrag!A8>0,VLOOKUP(Übertrag!A8,Obst[],10,FALSE),\"\")","v":"kg"},{"$f":"IF(Übertrag!A8>0,VLOOKUP(Übertrag!A8,Obst[],12,FALSE),\"\")","v":"Lose"},null,null,null,null,{"$f":"IF(Übertrag!A9>0,VLOOKUP(Übertrag!A9,Obst[],14,FALSE),\"\")","v":0},null,null,null,null,null,null,null,null,{"$f":"IF(Übertrag!A9>0,VLOOKUP(Übertrag!A9,Obst[],15,FALSE),\"\")","v":0},{"$f":"IF(AL212=\"\",\"\",\"1kg=\")","v":""},null,{"$f":"IF(AO212=0,\"\",IF(AR212=\"kg\",SUM(AJ194/AO212),IF(AR212=\"g\",SUM(AJ194/AO212*1000),IF(AR212=\"gr\",SUM(AJ194/AO212*1000),\"\"))))","v":""},null,null,{"$f":"IF(Übertrag!A9>0,VLOOKUP(Übertrag!A9,Obst[],9,FALSE),\"\")","v":0},null,null,{"$f":"IF(Übertrag!A9>0,VLOOKUP(Übertrag!A9,Obst[],10,FALSE),\"\")","v":"kg"},{"$f":"IF(Übertrag!A9>0,VLOOKUP(Übertrag!A9,Obst[],12,FALSE),\"\")","v":"Lose"}]
[]
[]
[{"$f":"IF(Übertrag!A8>0,VLOOKUP(Übertrag!A8,Obst[],5,FALSE),\"\")","v":0},null,null,null,null,null,null,null,null,null,null,null,null,null,null,null,null,null,null,null,null,null,null,null,{"$f":"IF(Übertrag!A9>0,VLOOKUP(Übertrag!A9,Obst[],5,FALSE),\"\")","v":"Sorte:Paraguayos"}]
[]
[]
[]
[{"$f":"IF(Übertrag!A8>0,VLOOKUP(Übertrag!A8,Obst[],6,FALSE),\"\")","v":"Sie ist nicht nur ein leckerer Bestandteil von sommerlichen Obstsalaten und eine echte Alternative für Menschen, die das pelzige Gefühl von Pfirsichen nicht mögen – die Nektarine ist auch unheimlich gesund."},null,null,null,null,null,null,null,null,null,null,null,null,null,null,null,null,null,null,null,null,null,null,null,{"$f":"IF(Übertrag!A9>0,VLOOKUP(Übertrag!A9,Obst[],6,FALSE),\"\")","v":"Unter dem Namen Weinbergpfirsich kennen wir die flachen, hellrosa-orange-gelben Pfirsichfrüchte. Ihr Geschmack ist sehr süß und hoch aromatisch. Sie sind das neue Trendobst und als Weinbergpfirsich in aller Munde."}]
[]
[]
[]
[]
[]
[]
[]
[]
[]
[]
[{"$f":"IF(Übertrag!A8>0,VLOOKUP(Übertrag!A8,Datenbank[],7,FALSE),\"\")","v":"2025-07-16"},null,null,null,null,null,null,null,null,null,null,null,null,null,null,null,null,null,null,null,null,null,null,null,{"$f":"IF(Übertrag!A9>0,VLOOKUP(Übertrag!A9,Datenbank[],7,FALSE),\"\")","v":"2025-07-16"}]

{"sheet":"Druck 16 Felder","index":4,"n_rows":451,"n_cols":45,"rows_kept":451,"cut":false,"hidden":true,"merged":[[382,0,392,22],[382,24,392,46],[337,0,343,46],[344,0,348,18],[344,19,348,22],[344,23,393,23],[344,24,348,42],[344,43,348,46],[349,0,352,18],[349,19,352,22],[375,16,377,18],[349,24,352,42],[349,43,352,46],[353,0,374,10],[353,11,356,18],[353,19,356,22],[353,24,374,34],[353,35,356,42],[353,43,356,46],[357,11,374,22],[357,35,374,46],[180,0,184,18],[268,0,278,22],[279,0,279,22],[268,24,278,46],[279,24,279,46],[325,0,335,22],[336,0,336,22],[325,24,335,46],[336,24,336,46],[321,0,324,22],[321,24,324,46],[318,19,320,19],[318,20,320,22],[318,24,320,24],[318,25,320,33],[318,34,320,34],[318,35,320,36],[318,0,320,0],[318,1,320,9],[318,10,320,10],[318,11,320,12],[318,13,320,15],[318,16,320,18],[280,0,286,46],[432,43,434,43],[172,24,172,46],[218,0,228,22],[229,0,229,22],[218,24,228,46],[229,24,229,46],[47,0,57,22],[58,0,58,22],[47,24,57,46],[58,24,58,46],[104,0,114,22],[115,0,115,22],[104,24,114,46],[115,24,115,46],[161,0,171,22],[214,0,217,22],[214,24,217,46],[211,19,213,19],[211,20,213,22],[211,24,213,24],[211,25,213,33],[211,34,213,34],[211,35,213,36],[173,0,179,46],[432,40,434,42],[432,0,434,0],[432,1,434,9],[432,10,434,10],[432,11,434,12],[432,13,434,15],[432,16,434,18],[432,19,434,19],[432,20,434,22],[439,0,449,22],[450,0,450,22],[439,24,449,46],[450,24,1048575,46],[406,0,409,18],[406,19,409,22],[406,24,409,42],[406,43,409,46],[410,0,431,10],[410,11,413,18],[410,19,413,22],[410,24,431,34],[410,35,413,42],[410,43,413,46],[414,11,431,22],[414,35,431,46],[432,44,434,46],[435,0,438,22],[435,24,438,46],[432,24,434,24],[432,25,434,33],[432,34,434,34],[432,35,434,36],[432,37,434,39],[394,0,400,46],[401,0,405,18],[401,19,405,22],[401,24,405,42],[401,43,405,46],[375,37,377,39],[375,40,377,42],[375,43,377,43],[375,44,377,46],[378,0,381,22],[378,24,381,46],[375,19,377,19],[375,20,377,22],[375,24,377,24],[375,25,377,33],[375,34,377,34],[375,35,377,36],[375,0,377,0],[375,1,377,9],[375,10,377,10],[375,11,377,12],[375,13,377,15],[393,0,393,22],[393,24,393,46],[287,0,291,18],[287,19,291,22],[287,23,336,23],[287,24,291,42],[287,43,291,46],[292,0,295,18],[292,19,295,22],[292,24,295,42],[292,43,295,46],[296,0,317,10],[296,11,299,18],[296,19,299,22],[296,24,317,34],[296,35,299,42],[296,43,299,46],[300,11,317,22],[300,35,317,46],[318,37,320,39],[318,40,320,42],[318,43,320,43],[318,44,320,46],[261,44,263,46],[264,0,267,22],[264,24,267,46],[261,19,263,19],[261,20,263,22],[261,24,263,24],[261,25,263,33],[261,34,263,34],[261,35,263,36],[261,0,263,0],[261,1,263,9],[261,10,263,10],[261,11,263,12],[261,13,263,15],[261,16,263,18],[211,0,213,0],[211,1,213,9],[211,10,213,10],[211,11,213,12],[230,0,234,18],[230,19,234,22],[230,23,279,23],[230,24,234,42],[230,43,234,46],[235,0,238,18],[235,19,238,22],[235,24,238,42],[235,43,238,46],[239,0,260,10],[239,11,242,18],[239,19,242,22],[239,24,260,34],[239,35,242,42],[239,43,242,46],[243,11,260,22],[243,35,260,46],[261,37,263,39],[261,40,263,42],[261,43,263,43],[154,10,156,10],[154,11,156,12],[154,13,156,15],[154,16,156,18],[180,19,184,22],[180,23,229,23],[180,24,184,42],[180,43,184,46],[185,0,188,18],[185,19,188,22],[185,24,188,42],[185,43,188,46],[189,0,210,10],[189,11,192,18],[189,19,192,22],[189,24,210,34],[189,35,192,42],[189,43,192,46],[193,11,210,22],[193,35,210,46],[211,37,213,39],[211,40,213,42],[211,43,213,43],[211,44,213,46],[211,13,213,15],[211,16,213,18],[116,0,122,46],[123,0,127,18],[123,19,127,22],[123,23,172,23],[123,24,127,42],[123,43,127,46],[128,0,131,18],[128,19,131,22],[128,24,131,42],[128,43,131,46],[132,0,153,10],[132,11,135,18],[132,19,135,22],[132,24,153,34],[132,35,135,42],[132,43,135,46],[136,11,153,22],[136,35,153,46],[154,37,156,39],[154,40,156,42],[154,43,156,43],[154,44,156,46],[172,0,172,22],[161,24,171,46],[97,19,99,19],[97,20,99,22],[97,24,99,24],[97,25,99,33],[97,34,99,34],[97,35,99,36],[97,0,99,0],[97,1,99,9],[97,10,99,10],[97,11,99,12],[97,13,99,15],[97,16,99,18],[157,0,160,22],[157,24,160,46],[154,19,156,19],[154,20,156,22],[154,24,156,24],[154,25,156,33],[154,34,156,34],[154,35,156,36],[154,0,156,0],[154,1,156,9],[59,0,65,46],[66,0,70,18],[66,19,70,22],[66,23,115,23],[66,24,70,42],[66,43,70,46],[71,0,74,18],[71,19,74,22],[71,24,74,42],[71,43,74,46],[75,0,96,10],[75,11,78,18],[75,19,78,22],[75,24,96,34],[75,35,78,42],[75,43,78,46],[79,11,96,22],[79,35,96,46],[97,37,99,39],[97,40,99,42],[97,43,99,43],[97,44,99,46],[100,0,103,22],[100,24,103,46],[40,20,42,22],[40,24,42,24],[40,25,42,33],[40,34,42,34],[40,35,42,36],[40,0,42,0],[40,1,42,9],[40,10,42,10],[40,11,42,12],[40,13,42,15],[40,16,42,18],[18,11,21,18],[18,19,21,22],[18,24,39,34],[18,35,21,42],[18,43,21,46],[22,11,39,22],[22,35,39,46],[9,0,13,18],[9,19,13,22],[9,23,58,23],[9,24,13,42],[9,43,13,46],[14,0,17,18],[14,19,17,22],[14,24,17,42],[14,43,17,46],[18,0,39,10],[40,37,42,39],[40,40,42,42],[40,43,42,43],[40,44,42,46],[43,0,46,22],[43,24,46,46],[40,19,42,19]]}
[]
[]
[]
[]
[]
[]
[]
[]
[]
[{"$f":"IF(Übertrag!A2>0,VLOOKUP(Übertrag!A2,#REF!,2,FALSE),\"\")","v":{"$error":"#REF!"}},null,null,null,null,null,null,null,null,null,null,null,null,null,null,null,null,null,null,{"$f":"IF(Übertrag!A2>0,VLOOKUP(Übertrag!A2,#REF!,7,FALSE),\"\")","v":{"$error":"#REF!"}},null,null,null,null,{"$f":"IF(Übertrag!A3>0,VLOOKUP(Übertrag!A3,#REF!,2,FALSE),\"\")","v":{"$error":"#REF!"}},null,null,null,null,null,null,null,null,null,null,null,null,null,null,null,null,null,null,{"$f":"IF(Übertrag!A3>0,VLOOKUP(Übertrag!A3,#REF!,7,FALSE),\"\")","v":{"$error":"#REF!"}}]
[]
[]
[]
[]
[{"$f":"IF(Übertrag!A2>0,VLOOKUP(Übertrag!A2,#REF!,3,FALSE),\"\")","v":{"$error":"#REF!"}},null,null,null,null,null,null,null,null,null,null,null,null,null,null,null,null,null,null,{"$f":"IF(Übertrag!A2>0,VLOOKUP(Übertrag!A2,#REF!,8,FALSE),\"\")","v":{"$error":"#REF!"}},null,null,null,null,{"$f":"IF(Übertrag!A3>0,VLOOKUP(Übertrag!A3,#REF!,3,FALSE),\"\")","v":{"$error":"#REF!"}},null,null,null,null,null,null,null,null,null,null,null,null,null,null,null,null,null,null,{"$f":"IF(Übertrag!A3>0,VLOOKUP(Übertrag!A3,#REF!,8,FALSE),\"\")","v":{"$error":"#REF!"}}]
[]
[]
[]
[{"$f":"_xlfn.IFS(Übertrag!A2=\"\",\"\",K41=\"1\",VLOOKUP(Übertrag!A2,#REF!,17,FALSE),Übertrag!A2>0,VLOOKUP(Übertrag!A2,#REF!,16,FALSE))","v":{"$error":"#REF!"}},null,null,null,null,null,null,null,null,null,null,{"$f":"IF(Übertrag!A2>0,VLOOKUP(Übertrag!A2,#REF!,13,FALSE),\"\")","v":{"$error":"#REF!"}},null,null,null,null,null,null,null,{"$f":"IF(Übertrag!A2>0,VLOOKUP(Übertrag!A2,#REF!,4,FALSE),\"\")","v":{"$error":"#REF!"}},null,null,null,null,{"$f":"_xlfn.IFS(Übertrag!A3=\"\",\"\",AI41=\"1\",VLOOKUP(Übertrag!A3,#REF!,17,FALSE),Übertrag!A3>0,VLOOKUP(Übertrag!A3,#REF!,16,FALSE))","v":{"$error":"#REF!"}},null,null,null,null,null,null,null,null,null,null,{"$f":"IF(Übertrag!A3>0,VLOOKUP(Übertrag!A3,#REF!,13,FALSE),\"\")","v":{"$error":"#REF!"}},null,null,null,null,null,null,null,{"$f":"IF(Übertrag!A3>0,VLOOKUP(Übertrag!A3,#REF!,4,FALSE),\"\")","v":{"$error":"#REF!"}}]
[]
[]
[]
[null,null,null,null,null,null,null,null,null,null,null,{"$f":"IF(Übertrag!A2>0,VLOOKUP(Übertrag!A2,#REF!,11,FALSE),\"\")","v":{"$error":"#REF!"}},null,null,null,null,null,null,null,null,null,null,null,null,null,null,null,null,null,null,null,null,null,null,null,{"$f":"IF(Übertrag!A3>0,VLOOKUP(Übertrag!A3,#REF!,11,FALSE),\"\")","v":{"$error":"#REF!"}}]
[]
[]
[]
[]
[]
[]
[]
[]
[]
[]
[]
[]
[]
[]
[]
[]
[]
[null,{"$f":"IF(Übertrag!A2>0,VLOOKUP(Übertrag!A2,#REF!,14,FALSE),\"\")","v":{"$error":"#REF!"}},null,null,null,null,null,null,null,null,{"$f":"IF(Übertrag!A2>0,VLOOKUP(Übertrag!A2,#REF!,15,FALSE),\"\")","v":{"$error":"#REF!"}},{"$f":"IF(N41=\"\",\"\",\"1kg=\")","v":{"$error":"#REF!"}},null,{"$f":"IF(Q41=0,\"\",IF(T41=\"kg\",SUM(L23/Q41),IF(T41=\"g\",SUM(L23/Q41*1000),IF(T41=\"gr\",SUM(L23/Q41*1000),\"\"))))","v":{"$error":"#REF!"}},null,null,{"$f":"IF(Übertrag!A2>0,VLOOKUP(Übertrag!A2,#REF!,9,FALSE),\"\")","v":{"$error":"#REF!"}},null,null,{"$f":"IF(Übertrag!A2>0,VLOOKUP(Übertrag!A2,#REF!,10,FALSE),\"\")","v":{"$error":"#REF!"}},{"$f":"IF(Übertrag!A2>0,VLOOKUP(Übertrag!A2,#REF!,12,FALSE),\"\")","v":{"$error":"#REF!"}},null,null,null,null,{"$f":"IF(Übertrag!A3>0,VLOOKUP(Übertrag!A3,#REF!,14,FALSE),\"\")","v":{"$error":"#REF!"}},null,null,null,null,null,null,null,null,{"$f":"IF(Übertrag!A3>0,VLOOKUP(Übertrag!A3,#REF!,15,FALSE),\"\")","v":{"$error":"#REF!"}},{"$f":"IF(AL41=\"\",\"\",\"1kg=\")","v":{"$error":"#REF!"}},null,{"$f":"IF(AO41=0,\"\",IF(AR41=\"kg\",SUM(AJ23/AO41),IF(AR41=\"g\",SUM(AJ23/AO41*1000),IF(AR41=\"gr\",SUM(AJ23/AO41*1000),\"\"))))","v":{"$error":"#REF!"}},null,null,{"$f":"IF(Übertrag!A3>0,VLOOKUP(Übertrag!A3,#REF!,9,FALSE),\"\")","v":{"$error":"#REF!"}},null,null,{"$f":"IF(Übertrag!A3>0,VLOOKUP(Übertrag!A3,#REF!,10,FALSE),\"\")","v":{"$error":"#REF!"}},{"$f":"IF(Übertrag!A3>0,VLOOKUP(Übertrag!A3,#REF!,12,FALSE),\"\")","v":{"$error":"#REF!"}}]
[]
[]
[{"$f":"IF(Übertrag!A2>0,VLOOKUP(Übertrag!A2,#REF!,5,FALSE),\"\")","v":{"$error":"#REF!"}},null,null,null,null,null,null,null,null,null,null,null,null,null,null,null,null,null,null,null,null,null,null,null,{"$f":"IF(Übertrag!A3>0,VLOOKUP(Übertrag!A3,#REF!,5,FALSE),\"\")","v":{"$error":"#REF!"}}]
[]
[]
[]
[{"$f":"IF(Übertrag!A2>0,VLOOKUP(Übertrag!A2,#REF!,6,FALSE),\"\")","v":{"$error":"#REF!"}},null,null,null,null,null,null,null,null,null,null,null,null,null,null,null,null,null,null,null,null,null,null,null,{"$f":"IF(Übertrag!A3>0,VLOOKUP(Übertrag!A3,#REF!,6,FALSE),\"\")","v":{"$error":"#REF!"}}]
[]
[]
[]
[]
[]
[]
[]
[]
[]
[]
[{"$f":"IF(Übertrag!A2>0,VLOOKUP(Übertrag!A2,Datenbank[],7,FALSE),\"\")","v":"2025-07-16"},null,null,null,null,null,null,null,null,null,null,null,null,null,null,null,null,null,null,null,null,null,null,null,{"$f":"IF(Übertrag!A3>0,VLOOKUP(Übertrag!A3,Datenbank[],7,FALSE),\"\")","v":"2025-07-16"}]
[]
[]
[]
[]
[]
[]
[]
[{"$f":"IF(Übertrag!A4>0,VLOOKUP(Übertrag!A4,#REF!,2,FALSE),\"\")","v":{"$error":"#REF!"}},null,null,null,null,null,null,null,null,null,null,null,null,null,null,null,null,null,null,{"$f":"IF(Übertrag!A4>0,VLOOKUP(Übertrag!A4,#REF!,7,FALSE),\"\")","v":{"$error":"#REF!"}},null,null,null,null,{"$f":"IF(Übertrag!A5>0,VLOOKUP(Übertrag!A5,#REF!,2,FALSE),\"\")","v":{"$error":"#REF!"}},null,null,null,null,null,null,null,null,null,null,null,null,null,null,null,null,null,null,{"$f":"IF(Übertrag!A5>0,VLOOKUP(Übertrag!A5,#REF!,7,FALSE),\"\")","v":{"$error":"#REF!"}}]
[]
[]
[]
[]
[{"$f":"IF(Übertrag!A4>0,VLOOKUP(Übertrag!A4,#REF!,3,FALSE),\"\")","v":{"$error":"#REF!"}},null,null,null,null,null,null,null,null,null,null,null,null,null,null,null,null,null,null,{"$f":"IF(Übertrag!A4>0,VLOOKUP(Übertrag!A4,#REF!,8,FALSE),\"\")","v":{"$error":"#REF!"}},null,null,null,null,{"$f":"IF(Übertrag!A5>0,VLOOKUP(Übertrag!A5,#REF!,3,FALSE),\"\")","v":{"$error":"#REF!"}},null,null,null,null,null,null,null,null,null,null,null,null,null,null,null,null,null,null,{"$f":"IF(Übertrag!A5>0,VLOOKUP(Übertrag!A5,#REF!,8,FALSE),\"\")","v":{"$error":"#REF!"}}]
[]
[]
[]
[{"$f":"_xlfn.IFS(Übertrag!A4=\"\",\"\",K98=\"1\",VLOOKUP(Übertrag!A4,#REF!,17,FALSE),Übertrag!A4>0,VLOOKUP(Übertrag!A4,#REF!,16,FALSE))","v":{"$error":"#REF!"}},null,null,null,null,null,null,null,null,null,null,{"$f":"IF(Übertrag!A4>0,VLOOKUP(Übertrag!A4,#REF!,13,FALSE),\"\")","v":{"$error":"#REF!"}},null,null,null,null,null,null,null,{"$f":"IF(Übertrag!A4>0,VLOOKUP(Übertrag!A4,#REF!,4,FALSE),\"\")","v":{"$error":"#REF!"}},null,null,null,null,{"$f":"_xlfn.IFS(Übertrag!A5=\"\",\"\",AI98=\"1\",VLOOKUP(Übertrag!A5,#REF!,17,FALSE),Übertrag!A5>0,VLOOKUP(Übertrag!A5,#REF!,16,FALSE))","v":{"$error":"#REF!"}},null,null,null,null,null,null,null,null,null,null,{"$f":"IF(Übertrag!A5>0,VLOOKUP(Übertrag!A5,#REF!,13,FALSE),\"\")","v":{"$error":"#REF!"}},null,null,null,null,null,null,null,{"$f":"IF(Übertrag!A5>0,VLOOKUP(Übertrag!A5,#REF!,4,FALSE),\"\")","v":{"$error":"#REF!"}}]
[]
[]
[]
[null,null,null,null,null,null,null,null,null,null,null,{"$f":"IF(Übertrag!A4>0,VLOOKUP(Übertrag!A4,#REF!,11,FALSE),\"\")","v":{"$error":"#REF!"}},null,null,null,null,null,null,null,null,null,null,null,null,null,null,null,null,null,null,null,null,null,null,null,{"$f":"IF(Übertrag!A5>0,VLOOKUP(Übertrag!A5,#REF!,11,FALSE),\"\")","v":{"$error":"#REF!"}}]
[]
[]
[]
[]
[]
[]
[]
[]
[]
[]
[]
[]
[]
[]
[]
[]
[]
[null,{"$f":"IF(Übertrag!A4>0,VLOOKUP(Übertrag!A4,#REF!,14,FALSE),\"\")","v":{"$error":"#REF!"}},null,null,null,null,null,null,null,null,{"$f":"IF(Übertrag!A4>0,VLOOKUP(Übertrag!A4,#REF!,15,FALSE),\"\")","v":{"$error":"#REF!"}},{"$f":"IF(N98=\"\",\"\",\"1kg=\")","v":{"$error":"#REF!"}},null,{"$f":"IF(Q98=0,\"\",IF(T98=\"kg\",SUM(L80/Q98),IF(T98=\"g\",SUM(L80/Q98*1000),IF(T98=\"gr\",SUM(L80/Q98*1000),\"\"))))","v":{"$error":"#REF!"}},null,null,{"$f":"IF(Übertrag!A4>0,VLOOKUP(Übertrag!A4,#REF!,9,FALSE),\"\")","v":{"$error":"#REF!"}},null,null,{"$f":"IF(Übertrag!A4>0,VLOOKUP(Übertrag!A4,#REF!,10,FALSE),\"\")","v":{"$error":"#REF!"}},{"$f":"IF(Übertrag!A4>0,VLOOKUP(Übertrag!A4,#REF!,12,FALSE),\"\")","v":{"$error":"#REF!"}},null,null,null,null,{"$f":"IF(Übertrag!A5>0,VLOOKUP(Übertrag!A5,#REF!,14,FALSE),\"\")","v":{"$error":"#REF!"}},null,null,null,null,null,null,null,null,{"$f":"IF(Übertrag!A5>0,VLOOKUP(Übertrag!A5,#REF!,15,FALSE),\"\")","v":{"$error":"#REF!"}},{"$f":"IF(AL98=\"\",\"\",\"1kg=\")","v":{"$error":"#REF!"}},null,{"$f":"IF(AO98=0,\"\",IF(AR98=\"kg\",SUM(AJ80/AO98),IF(AR98=\"g\",SUM(AJ80/AO98*1000),IF(AR98=\"gr\",SUM(AJ80/AO98*1000),\"\"))))","v":{"$error":"#REF!"}},null,null,{"$f":"IF(Übertrag!A5>0,VLOOKUP(Übertrag!A5,#REF!,9,FALSE),\"\")","v":{"$error":"#REF!"}},null,null,{"$f":"IF(Übertrag!A5>0,VLOOKUP(Übertrag!A5,#REF!,10,FALSE),\"\")","v":{"$error":"#REF!"}},{"$f":"IF(Übertrag!A5>0,VLOOKUP(Übertrag!A5,#REF!,12,FALSE),\"\")","v":{"$error":"#REF!"}}]
[]
[]
[{"$f":"IF(Übertrag!A4>0,VLOOKUP(Übertrag!A4,#REF!,5,FALSE),\"\")","v":{"$error":"#REF!"}},null,null,null,null,null,null,null,null,null,null,null,null,null,null,null,null,null,null,null,null,null,null,null,{"$f":"IF(Übertrag!A5>0,VLOOKUP(Übertrag!A5,#REF!,5,FALSE),\"\")","v":{"$error":"#REF!"}}]
[]
[]
[]
[{"$f":"IF(Übertrag!A4>0,VLOOKUP(Übertrag!A4,#REF!,6,FALSE),\"\")","v":{"$error":"#REF!"}},null,null,null,null,null,null,null,null,null,null,null,null,null,null,null,null,null,null,null,null,null,null,null,{"$f":"IF(Übertrag!A5>0,VLOOKUP(Übertrag!A5,#REF!,6,FALSE),\"\")","v":{"$error":"#REF!"}}]
[]
[]
[]
[]
[]
[]
[]
[]
[]
[]
[{"$f":"IF(Übertrag!A4>0,VLOOKUP(Übertrag!A4,Datenbank[],7,FALSE),\"\")","v":"2025-07-16"},null,null,null,null,null,null,null,null,null,null,null,null,null,null,null,null,null,null,null,null,null,null,null,{"$f":"IF(Übertrag!A5>0,VLOOKUP(Übertrag!A5,Datenbank[],7,FALSE),\"\")","v":"2025-07-16"}]
[]
[]
[]
[]
[]
[]
[]
[{"$f":"IF(Übertrag!A6>0,VLOOKUP(Übertrag!A6,#REF!,2,FALSE),\"\")","v":{"$error":"#REF!"}},null,null,null,null,null,null,null,null,null,null,null,null,null,null,null,null,null,null,{"$f":"IF(Übertrag!A6>0,VLOOKUP(Übertrag!A6,#REF!,7,FALSE),\"\")","v":{"$error":"#REF!"}},null,null,null,null,{"$f":"IF(Übertrag!A7>0,VLOOKUP(Übertrag!A7,#REF!,2,FALSE),\"\")","v":{"$error":"#REF!"}},null,null,null,null,null,null,null,null,null,null,null,null,null,null,null,null,null,null,{"$f":"IF(Übertrag!A7>0,VLOOKUP(Übertrag!A7,#REF!,7,FALSE),\"\")","v":{"$error":"#REF!"}}]
[]
[]
[]
[]
[{"$f":"IF(Übertrag!A6>0,VLOOKUP(Übertrag!A6,#REF!,3,FALSE),\"\")","v":{"$error":"#REF!"}},null,null,null,null,null,null,null,null,null,null,null,null,null,null,null,null,null,null,{"$f":"IF(Übertrag!A6>0,VLOOKUP(Übertrag!A6,#REF!,8,FALSE),\"\")","v":{"$error":"#REF!"}},null,null,null,null,{"$f":"IF(Übertrag!A7>0,VLOOKUP(Übertrag!A7,#REF!,3,FALSE),\"\")","v":{"$error":"#REF!"}},null,null,null,null,null,null,null,null,null,null,null,null,null,null,null,null,null,null,{"$f":"IF(Übertrag!A7>0,VLOOKUP(Übertrag!A7,#REF!,8,FALSE),\"\")","v":{"$error":"#REF!"}}]
[]
[]
[]
[{"$f":"_xlfn.IFS(Übertrag!A6=\"\",\"\",K155=\"1\",VLOOKUP(Übertrag!A6,#REF!,17,FALSE),Übertrag!A6>0,VLOOKUP(Übertrag!A6,#REF!,16,FALSE))","v":{"$error":"#REF!"}},null,null,null,null,null,null,null,null,null,null,{"$f":"IF(Übertrag!A6>0,VLOOKUP(Übertrag!A6,#REF!,13,FALSE),\"\")","v":{"$error":"#REF!"}},null,null,null,null,null,null,null,{"$f":"IF(Übertrag!A6>0,VLOOKUP(Übertrag!A6,#REF!,4,FALSE),\"\")","v":{"$error":"#REF!"}},null,null,null,null,{"$f":"_xlfn.IFS(Übertrag!A7=\"\",\"\",AI155=\"1\",VLOOKUP(Übertrag!A7,#REF!,17,FALSE),Übertrag!A7>0,VLOOKUP(Übertrag!A7,#REF!,16,FALSE))","v":{"$error":"#REF!"}},null,null,null,null,null,null,null,null,null,null,{"$f":"IF(Übertrag!A7>0,VLOOKUP(Übertrag!A7,#REF!,13,FALSE),\"\")","v":{"$error":"#REF!"}},null,null,null,null,null,null,null,{"$f":"IF(Übertrag!A7>0,VLOOKUP(Übertrag!A7,#REF!,4,FALSE),\"\")","v":{"$error":"#REF!"}}]
[]
[]
[]
[null,null,null,null,null,null,null,null,null,null,null,{"$f":"IF(Übertrag!A6>0,VLOOKUP(Übertrag!A6,#REF!,11,FALSE),\"\")","v":{"$error":"#REF!"}},null,null,null,null,null,null,null,null,null,null,null,null,null,null,null,null,null,null,null,null,null,null,null,{"$f":"IF(Übertrag!A7>0,VLOOKUP(Übertrag!A7,#REF!,11,FALSE),\"\")","v":{"$error":"#REF!"}}]
[]
[]
[]
[]
[]
[]
[]
[]
[]
[]
[]
[]
[]
[]
[]
[]
[]
[null,{"$f":"IF(Übertrag!A6>0,VLOOKUP(Übertrag!A6,#REF!,14,FALSE),\"\")","v":{"$error":"#REF!"}},null,null,null,null,null,null,null,null,{"$f":"IF(Übertrag!A6>0,VLOOKUP(Übertrag!A6,#REF!,15,FALSE),\"\")","v":{"$error":"#REF!"}},{"$f":"IF(N155=\"\",\"\",\"1kg=\")","v":{"$error":"#REF!"}},null,{"$f":"IF(Q155=0,\"\",IF(T155=\"kg\",SUM(L137/Q155),IF(T155=\"g\",SUM(L137/Q155*1000),IF(T155=\"gr\",SUM(L137/Q155*1000),\"\"))))","v":{"$error":"#REF!"}},null,null,{"$f":"IF(Übertrag!A6>0,VLOOKUP(Übertrag!A6,#REF!,9,FALSE),\"\")","v":{"$error":"#REF!"}},null,null,{"$f":"IF(Übertrag!A6>0,VLOOKUP(Übertrag!A6,#REF!,10,FALSE),\"\")","v":{"$error":"#REF!"}},{"$f":"IF(Übertrag!A6>0,VLOOKUP(Übertrag!A6,#REF!,12,FALSE),\"\")","v":{"$error":"#REF!"}},null,null,null,null,{"$f":"IF(Übertrag!A7>0,VLOOKUP(Übertrag!A7,#REF!,14,FALSE),\"\")","v":{"$error":"#REF!"}},null,null,null,null,null,null,null,null,{"$f":"IF(Übertrag!A7>0,VLOOKUP(Übertrag!A7,#REF!,15,FALSE),\"\")","v":{"$error":"#REF!"}},{"$f":"IF(AL155=\"\",\"\",\"1kg=\")","v":{"$error":"#REF!"}},null,{"$f":"IF(AO155=0,\"\",IF(AR155=\"kg\",SUM(AJ137/AO155),IF(AR155=\"g\",SUM(AJ137/AO155*1000),IF(AR155=\"gr\",SUM(AJ137/AO155*1000),\"\"))))","v":{"$error":"#REF!"}},null,null,{"$f":"IF(Übertrag!A7>0,VLOOKUP(Übertrag!A7,#REF!,9,FALSE),\"\")","v":{"$error":"#REF!"}},null,null,{"$f":"IF(Übertrag!A7>0,VLOOKUP(Übertrag!A7,#REF!,10,FALSE),\"\")","v":{"$error":"#REF!"}},{"$f":"IF(Übertrag!A7>0,VLOOKUP(Übertrag!A7,#REF!,12,FALSE),\"\")","v":{"$error":"#REF!"}}]
[]
[]
[{"$f":"IF(Übertrag!A6>0,VLOOKUP(Übertrag!A6,#REF!,5,FALSE),\"\")","v":{"$error":"#REF!"}},null,null,null,null,null,null,null,null,null,null,null,null,null,null,null,null,null,null,null,null,null,null,null,{"$f":"IF(Übertrag!A7>0,VLOOKUP(Übertrag!A7,#REF!,5,FALSE),\"\")","v":{"$error":"#REF!"}}]
[]
[]
[]
[{"$f":"IF(Übertrag!A6>0,VLOOKUP(Übertrag!A6,#REF!,6,FALSE),\"\")","v":{"$error":"#REF!"}},null,null,null,null,null,null,null,null,null,null,null,null,null,null,null,null,null,null,null,null,null,null,null,{"$f":"IF(Übertrag!A7>0,VLOOKUP(Übertrag!A7,#REF!,6,FALSE),\"\")","v":{"$error":"#REF!"}}]
[]
[]
[]
[]
[]
[]
[]
[]
[]
[]
[{"$f":"IF(Übertrag!A6>0,VLOOKUP(Übertrag!A6,Datenbank[],7,FALSE),\"\")","v":"2025-07-16"},null,null,null,null,null,null,null,null,null,null,null,null,null,null,null,null,null,null,null,null,null,null,null,{"$f":"IF(Übertrag!A7>0,VLOOKUP(Übertrag!A7,Datenbank[],7,FALSE),\"\")","v":"2025-07-16"}]
[]
[]
[]
[]
[]
[]
[]
[{"$f":"IF(Übertrag!A8>0,VLOOKUP(Übertrag!A8,#REF!,2,FALSE),\"\")","v":{"$error":"#REF!"}},null,null,null,null,null,null,null,null,null,null,null,null,null,null,null,null,null,null,{"$f":"IF(Übertrag!A8>0,VLOOKUP(Übertrag!A8,#REF!,7,FALSE),\"\")","v":{"$error":"#REF!"}},null,null,null,null,{"$f":"IF(Übertrag!A9>0,VLOOKUP(Übertrag!A9,#REF!,2,FALSE),\"\")","v":{"$error":"#REF!"}},null,null,null,null,null,null,null,null,null,null,null,null,null,null,null,null,null,null,{"$f":"IF(Übertrag!A9>0,VLOOKUP(Übertrag!A9,#REF!,7,FALSE),\"\")","v":{"$error":"#REF!"}}]
[]
[]
[]
[]
[{"$f":"IF(Übertrag!A8>0,VLOOKUP(Übertrag!A8,#REF!,3,FALSE),\"\")","v":{"$error":"#REF!"}},null,null,null,null,null,null,null,null,null,null,null,null,null,null,null,null,null,null,{"$f":"IF(Übertrag!A8>0,VLOOKUP(Übertrag!A8,#REF!,8,FALSE),\"\")","v":{"$error":"#REF!"}},null,null,null,null,{"$f":"IF(Übertrag!A9>0,VLOOKUP(Übertrag!A9,#REF!,3,FALSE),\"\")","v":{"$error":"#REF!"}},null,null,null,null,null,null,null,null,null,null,null,null,null,null,null,null,null,null,{"$f":"IF(Übertrag!A9>0,VLOOKUP(Übertrag!A9,#REF!,8,FALSE),\"\")","v":{"$error":"#REF!"}}]
[]
[]
[]
[{"$f":"_xlfn.IFS(Übertrag!A8=\"\",\"\",K212=\"1\",VLOOKUP(Übertrag!A8,#REF!,17,FALSE),Übertrag!A8>0,VLOOKUP(Übertrag!A8,#REF!,16,FALSE))","v":{"$error":"#REF!"}},null,null,null,null,null,null,null,null,null,null,{"$f":"IF(Übertrag!A8>0,VLOOKUP(Übertrag!A8,#REF!,13,FALSE),\"\")","v":{"$error":"#REF!"}},null,null,null,null,null,null,null,{"$f":"IF(Übertrag!A8>0,VLOOKUP(Übertrag!A8,#REF!,4,FALSE),\"\")","v":{"$error":"#REF!"}},null,null,null,null,{"$f":"_xlfn.IFS(Übertrag!A9=\"\",\"\",AI212=\"1\",VLOOKUP(Übertrag!A9,#REF!,17,FALSE),Übertrag!A9>0,VLOOKUP(Übertrag!A9,#REF!,16,FALSE))","v":{"$error":"#REF!"}},null,null,null,null,null,null,null,null,null,null,{"$f":"IF(Übertrag!A9>0,VLOOKUP(Übertrag!A9,#REF!,13,FALSE),\"\")","v":{"$error":"#REF!"}},null,null,null,null,null,null,null,{"$f":"IF(Übertrag!A9>0,VLOOKUP(Übertrag!A9,#REF!,4,FALSE),\"\")","v":{"$error":"#REF!"}}]
[]
[]
[]
[null,null,null,null,null,null,null,null,null,null,null,{"$f":"IF(Übertrag!A8>0,VLOOKUP(Übertrag!A8,#REF!,11,FALSE),\"\")","v":{"$error":"#REF!"}},null,null,null,null,null,null,null,null,null,null,null,null,null,null,null,null,null,null,null,null,null,null,null,{"$f":"IF(Übertrag!A9>0,VLOOKUP(Übertrag!A9,#REF!,11,FALSE),\"\")","v":{"$error":"#REF!"}}]
[]
[]
[]
[]
[]
[]
[]
[]
[]
[]
[]
[]
[]
[]
[]
[]
[]
[null,{"$f":"IF(Übertrag!A8>0,VLOOKUP(Übertrag!A8,#REF!,14,FALSE),\"\")","v":{"$error":"#REF!"}},null,null,null,null,null,null,null,null,{"$f":"IF(Übertrag!A8>0,VLOOKUP(Übertrag!A8,#REF!,15,FALSE),\"\")","v":{"$error":"#REF!"}},{"$f":"IF(N212=\"\",\"\",\"1kg=\")","v":{"$error":"#REF!"}},null,{"$f":"IF(Q212=0,\"\",IF(T212=\"kg\",SUM(L194/Q212),IF(T212=\"g\",SUM(L194/Q212*1000),IF(T212=\"gr\",SUM(L194/Q212*1000),\"\"))))","v":{"$error":"#REF!"}},null,null,{"$f":"IF(Übertrag!A8>0,VLOOKUP(Übertrag!A8,#REF!,9,FALSE),\"\")","v":{"$error":"#REF!"}},null,null,{"$f":"IF(Übertrag!A8>0,VLOOKUP(Übertrag!A8,#REF!,10,FALSE),\"\")","v":{"$error":"#REF!"}},{"$f":"IF(Übertrag!A8>0,VLOOKUP(Übertrag!A8,#REF!,12,FALSE),\"\")","v":{"$error":"#REF!"}},null,null,null,null,{"$f":"IF(Übertrag!A9>0,VLOOKUP(Übertrag!A9,#REF!,14,FALSE),\"\")","v":{"$error":"#REF!"}},null,null,null,null,null,null,null,null,{"$f":"IF(Übertrag!A9>0,VLOOKUP(Übertrag!A9,#REF!,15,FALSE),\"\")","v":{"$error":"#REF!"}},{"$f":"IF(AL212=\"\",\"\",\"1kg=\")","v":{"$error":"#REF!"}},null,{"$f":"IF(AO212=0,\"\",IF(AR212=\"kg\",SUM(AJ194/AO212),IF(AR212=\"g\",SUM(AJ194/AO212*1000),IF(AR212=\"gr\",SUM(AJ194/AO212*1000),\"\"))))","v":{"$error":"#REF!"}},null,null,{"$f":"IF(Übertrag!A9>0,VLOOKUP(Übertrag!A9,#REF!,9,FALSE),\"\")","v":{"$error":"#REF!"}},null,null,{"$f":"IF(Übertrag!A9>0,VLOOKUP(Übertrag!A9,#REF!,10,FALSE),\"\")","v":{"$error":"#REF!"}},{"$f":"IF(Übertrag!A9>0,VLOOKUP(Übertrag!A9,#REF!,12,FALSE),\"\")","v":{"$error":"#REF!"}}]
[]
[]
[{"$f":"IF(Übertrag!A8>0,VLOOKUP(Übertrag!A8,#REF!,5,FALSE),\"\")","v":{"$error":"#REF!"}},null,null,null,null,null,null,null,null,null,null,null,null,null,null,null,null,null,null,null,null,null,null,null,{"$f":"IF(Übertrag!A9>0,VLOOKUP(Übertrag!A9,#REF!,5,FALSE),\"\")","v":{"$error":"#REF!"}}]
[]
[]
[]
[{"$f":"IF(Übertrag!A8>0,VLOOKUP(Übertrag!A8,#REF!,6,FALSE),\"\")","v":{"$error":"#REF!"}},null,null,null,null,null,null,null,null,null,null,null,null,null,null,null,null,null,null,null,null,null,null,null,{"$f":"IF(Übertrag!A9>0,VLOOKUP(Übertrag!A9,#REF!,6,FALSE),\"\")","v":{"$error":"#REF!"}}]
[]
[]
[]
[]
[]
[]
[]
[]
[]
[]
[{"$f":"IF(Übertrag!A8>0,VLOOKUP(Übertrag!A8,Datenbank[],7,FALSE),\"\")","v":"2025-07-16"},null,null,null,null,null,null,null,null,null,null,null,null,null,null,null,null,null,null,null,null,null,null,null,{"$f":"IF(Übertrag!A9>0,VLOOKUP(Übertrag!A9,Datenbank[],7,FALSE),\"\")","v":"2025-07-16"}]
[{"$f":"IF(Übertrag!A10>0,VLOOKUP(Übertrag!A10,#REF!,2,FALSE),\"\")","v":""},null,null,null,null,null,null,null,null,null,null,null,null,null,null,null,null,null,null,{"$f":"IF(Übertrag!A10>0,VLOOKUP(Übertrag!A10,#REF!,7,FALSE),\"\")","v":""},null,null,null,null,{"$f":"IF(Übertrag!A11>0,VLOOKUP(Übertrag!A11,#REF!,2,FALSE),\"\")","v":""},null,null,null,null,null,null,null,null,null,null,null,null,null,null,null,null,null,null,{"$f":"IF(Übertrag!A11>0,VLOOKUP(Übertrag!A11,#REF!,7,FALSE),\"\")","v":""}]
[]
[]
[]
[]
[{"$f":"IF(Übertrag!A10>0,VLOOKUP(Übertrag!A10,#REF!,3,FALSE),\"\")","v":""},null,null,null,null,null,null,null,null,null,null,null,null,null,null,null,null,null,null,{"$f":"IF(Übertrag!A10>0,VLOOKUP(Übertrag!A10,#REF!,8,FALSE),\"\")","v":""},null,null,null,null,{"$f":"IF(Übertrag!A11>0,VLOOKUP(Übertrag!A11,#REF!,3,FALSE),\"\")","v":""},null,null,null,null,null,null,null,null,null,null,null,null,null,null,null,null,null,null,{"$f":"IF(Übertrag!A11>0,VLOOKUP(Übertrag!A11,#REF!,8,FALSE),\"\")","v":""}]
[]
[]
[]
[{"$f":"_xlfn.IFS(Übertrag!A10=\"\",\"\",K262=\"1\",VLOOKUP(Übertrag!A10,#REF!,17,FALSE),Übertrag!A10>0,VLOOKUP(Übertrag!A10,#REF!,16,FALSE))","v":""},null,null,null,null,null,null,null,null,null,null,{"$f":"IF(Übertrag!A10>0,VLOOKUP(Übertrag!A10,#REF!,13,FALSE),\"\")","v":""},null,null,null,null,null,null,null,{"$f":"IF(Übertrag!A10>0,VLOOKUP(Übertrag!A10,#REF!,4,FALSE),\"\")","v":""},null,null,null,null,{"$f":"_xlfn.IFS(Übertrag!A11=\"\",\"\",AI262=\"1\",VLOOKUP(Übertrag!A11,#REF!,17,FALSE),Übertrag!A11>0,VLOOKUP(Übertrag!A11,#REF!,16,FALSE))","v":""},null,null,null,null,null,null,null,null,null,null,{"$f":"IF(Übertrag!A11>0,VLOOKUP(Übertrag!A11,#REF!,13,FALSE),\"\")","v":""},null,null,null,null,null,null,null,{"$f":"IF(Übertrag!A11>0,VLOOKUP(Übertrag!A11,#REF!,4,FALSE),\"\")","v":""}]
[]
[]
[]
[null,null,null,null,null,null,null,null,null,null,null,{"$f":"IF(Übertrag!A10>0,VLOOKUP(Übertrag!A10,#REF!,11,FALSE),\"\")","v":""},null,null,null,null,null,null,null,null,null,null,null,null,null,null,null,null,null,null,null,null,null,null,null,{"$f":"IF(Übertrag!A11>0,VLOOKUP(Übertrag!A11,#REF!,11,FALSE),\"\")","v":""}]
[]
[]
[]
[]
[]
[]
[]
[]
[]
[]
[]
[]
[]
[]
[]
[]
[]
[null,{"$f":"IF(Übertrag!A10>0,VLOOKUP(Übertrag!A10,#REF!,14,FALSE),\"\")","v":""},null,null,null,null,null,null,null,null,{"$f":"IF(Übertrag!A10>0,VLOOKUP(Übertrag!A10,#REF!,15,FALSE),\"\")","v":""},{"$f":"IF(N262=\"\",\"\",\"1kg=\")","v":""},null,{"$f":"IF(Q262=0,\"\",IF(T262=\"kg\",SUM(L244/Q262),IF(T262=\"g\",SUM(L244/Q262*1000),IF(T262=\"gr\",SUM(L244/Q262*1000),\"\"))))","v":""},null,null,{"$f":"IF(Übertrag!A10>0,VLOOKUP(Übertrag!A10,#REF!,9,FALSE),\"\")","v":""},null,null,{"$f":"IF(Übertrag!A10>0,VLOOKUP(Übertrag!A10,#REF!,10,FALSE),\"\")","v":""},{"$f":"IF(Übertrag!A10>0,VLOOKUP(Übertrag!A10,#REF!,12,FALSE),\"\")","v":""},null,null,null,null,{"$f":"IF(Übertrag!A11>0,VLOOKUP(Übertrag!A11,#REF!,14,FALSE),\"\")","v":""},null,null,null,null,null,null,null,null,{"$f":"IF(Übertrag!A11>0,VLOOKUP(Übertrag!A11,#REF!,15,FALSE),\"\")","v":""},{"$f":"IF(AL262=\"\",\"\",\"1kg=\")","v":""},null,{"$f":"IF(AO262=0,\"\",IF(AR262=\"kg\",SUM(AJ244/AO262),IF(AR262=\"g\",SUM(AJ244/AO262*1000),IF(AR262=\"gr\",SUM(AJ244/AO262*1000),\"\"))))","v":""},null,null,{"$f":"IF(Übertrag!A11>0,VLOOKUP(Übertrag!A11,#REF!,9,FALSE),\"\")","v":""},null,null,{"$f":"IF(Übertrag!A11>0,VLOOKUP(Übertrag!A11,#REF!,10,FALSE),\"\")","v":""},{"$f":"IF(Übertrag!A11>0,VLOOKUP(Übertrag!A11,#REF!,12,FALSE),\"\")","v":""}]
[]
[]
[{"$f":"IF(Übertrag!A10>0,VLOOKUP(Übertrag!A10,#REF!,5,FALSE),\"\")","v":""},null,null,null,null,null,null,null,null,null,null,null,null,null,null,null,null,null,null,null,null,null,null,null,{"$f":"IF(Übertrag!A11>0,VLOOKUP(Übertrag!A11,#REF!,5,FALSE),\"\")","v":""}]
[]
[]
[]
[{"$f":"IF(Übertrag!A10>0,VLOOKUP(Übertrag!A10,#REF!,6,FALSE),\"\")","v":""},null,null,null,null,null,null,null,null,null,null,null,null,null,null,null,null,null,null,null,null,null,null,null,{"$f":"IF(Übertrag!A11>0,VLOOKUP(Übertrag!A11,#REF!,6,FALSE),\"\")","v":""}]
[]
[]
[]
[]
[]
[]
[]
[]
[]
[]
[{"$f":"IF(Übertrag!A10>0,VLOOKUP(Übertrag!A10,Datenbank[],7,FALSE),\"\")","v":""},null,null,null,null,null,null,null,null,null,null,null,null,null,null,null,null,null,null,null,null,null,null,null,{"$f":"IF(Übertrag!A11>0,VLOOKUP(Übertrag!A11,Datenbank[],7,FALSE),\"\")","v":""}]
[]
[]
[]
[]
[]
[]
[]
[{"$f":"IF(Übertrag!A12>0,VLOOKUP(Übertrag!A12,#REF!,2,FALSE),\"\")","v":""},null,null,null,null,null,null,null,null,null,null,null,null,null,null,null,null,null,null,{"$f":"IF(Übertrag!A12>0,VLOOKUP(Übertrag!A12,#REF!,7,FALSE),\"\")","v":""},null,null,null,null,{"$f":"IF(Übertrag!A13>0,VLOOKUP(Übertrag!A13,#REF!,2,FALSE),\"\")","v":""},null,null,null,null,null,null,null,null,null,null,null,null,null,null,null,null,null,null,{"$f":"IF(Übertrag!A13>0,VLOOKUP(Übertrag!A13,#REF!,7,FALSE),\"\")","v":""}]
[]
[]
[]
[]
[{"$f":"IF(Übertrag!A12>0,VLOOKUP(Übertrag!A12,#REF!,3,FALSE),\"\")","v":""},null,null,null,null,null,null,null,null,null,null,null,null,null,null,null,null,null,null,{"$f":"IF(Übertrag!A12>0,VLOOKUP(Übertrag!A12,#REF!,8,FALSE),\"\")","v":""},null,null,null,null,{"$f":"IF(Übertrag!A13>0,VLOOKUP(Übertrag!A13,#REF!,3,FALSE),\"\")","v":""},null,null,null,null,null,null,null,null,null,null,null,null,null,null,null,null,null,null,{"$f":"IF(Übertrag!A13>0,VLOOKUP(Übertrag!A13,#REF!,8,FALSE),\"\")","v":""}]
[]
[]
[]
[{"$f":"_xlfn.IFS(Übertrag!A12=\"\",\"\",K319=\"1\",VLOOKUP(Übertrag!A12,#REF!,17,FALSE),Übertrag!A12>0,VLOOKUP(Übertrag!A12,#REF!,16,FALSE))","v":""},null,null,null,null,null,null,null,null,null,null,{"$f":"IF(Übertrag!A12>0,VLOOKUP(Übertrag!A12,#REF!,13,FALSE),\"\")","v":""},null,null,null,null,null,null,null,{"$f":"IF(Übertrag!A12>0,VLOOKUP(Übertrag!A12,#REF!,4,FALSE),\"\")","v":""},null,null,null,null,{"$f":"_xlfn.IFS(Übertrag!A13=\"\",\"\",AI319=\"1\",VLOOKUP(Übertrag!A13,#REF!,17,FALSE),Übertrag!A13>0,VLOOKUP(Übertrag!A13,#REF!,16,FALSE))","v":""},null,null,null,null,null,null,null,null,null,null,{"$f":"IF(Übertrag!A13>0,VLOOKUP(Übertrag!A13,#REF!,13,FALSE),\"\")","v":""},null,null,null,null,null,null,null,{"$f":"IF(Übertrag!A13>0,VLOOKUP(Übertrag!A13,#REF!,4,FALSE),\"\")","v":""}]
[]
[]
[]
[null,null,null,null,null,null,null,null,null,null,null,{"$f":"IF(Übertrag!A12>0,VLOOKUP(Übertrag!A12,#REF!,11,FALSE),\"\")","v":""},null,null,null,null,null,null,null,null,null,null,null,null,null,null,null,null,null,null,null,null,null,null,null,{"$f":"IF(Übertrag!A13>0,VLOOKUP(Übertrag!A13,#REF!,11,FALSE),\"\")","v":""}]
[]
[]
[]
[]
[]
[]
[]
[]
[]
[]
[]
[]
[]
[]
[]
[]
[]
[null,{"$f":"IF(Übertrag!A12>0,VLOOKUP(Übertrag!A12,#REF!,14,FALSE),\"\")","v":""},null,null,null,null,null,null,null,null,{"$f":"IF(Übertrag!A12>0,VLOOKUP(Übertrag!A12,#REF!,15,FALSE),\"\")","v":""},{"$f":"IF(N319=\"\",\"\",\"1kg=\")","v":""},null,{"$f":"IF(Q319=0,\"\",IF(T319=\"kg\",SUM(L301/Q319),IF(T319=\"g\",SUM(L301/Q319*1000),IF(T319=\"gr\",SUM(L301/Q319*1000),\"\"))))","v":""},null,null,{"$f":"IF(Übertrag!A12>0,VLOOKUP(Übertrag!A12,#REF!,9,FALSE),\"\")","v":""},null,null,{"$f":"IF(Übertrag!A12>0,VLOOKUP(Übertrag!A12,#REF!,10,FALSE),\"\")","v":""},{"$f":"IF(Übertrag!A12>0,VLOOKUP(Übertrag!A12,#REF!,12,FALSE),\"\")","v":""},null,null,null,null,{"$f":"IF(Übertrag!A13>0,VLOOKUP(Übertrag!A13,#REF!,14,FALSE),\"\")","v":""},null,null,null,null,null,null,null,null,{"$f":"IF(Übertrag!A13>0,VLOOKUP(Übertrag!A13,#REF!,15,FALSE),\"\")","v":""},{"$f":"IF(AL319=\"\",\"\",\"1kg=\")","v":""},null,{"$f":"IF(AO319=0,\"\",IF(AR319=\"kg\",SUM(AJ301/AO319),IF(AR319=\"g\",SUM(AJ301/AO319*1000),IF(AR319=\"gr\",SUM(AJ301/AO319*1000),\"\"))))","v":""},null,null,{"$f":"IF(Übertrag!A13>0,VLOOKUP(Übertrag!A13,#REF!,9,FALSE),\"\")","v":""},null,null,{"$f":"IF(Übertrag!A13>0,VLOOKUP(Übertrag!A13,#REF!,10,FALSE),\"\")","v":""},{"$f":"IF(Übertrag!A13>0,VLOOKUP(Übertrag!A13,#REF!,12,FALSE),\"\")","v":""}]
[]
[]
[{"$f":"IF(Übertrag!A12>0,VLOOKUP(Übertrag!A12,#REF!,5,FALSE),\"\")","v":""},null,null,null,null,null,null,null,null,null,null,null,null,null,null,null,null,null,null,null,null,null,null,null,{"$f":"IF(Übertrag!A13>0,VLOOKUP(Übertrag!A13,#REF!,5,FALSE),\"\")","v":""}]
[]
[]
[]
[{"$f":"IF(Übertrag!A12>0,VLOOKUP(Übertrag!A12,#REF!,6,FALSE),\"\")","v":""},null,null,null,null,null,null,null,null,null,null,null,null,null,null,null,null,null,null,null,null,null,null,null,{"$f":"IF(Übertrag!A13>0,VLOOKUP(Übertrag!A13,#REF!,6,FALSE),\"\")","v":""}]
[]
[]
[]
[]
[]
[]
[]
[]
[]
[]
[{"$f":"IF(Übertrag!A12>0,VLOOKUP(Übertrag!A12,Datenbank[],7,FALSE),\"\")","v":""},null,null,null,null,null,null,null,null,null,null,null,null,null,null,null,null,null,null,null,null,null,null,null,{"$f":"IF(Übertrag!A13>0,VLOOKUP(Übertrag!A13,Datenbank[],7,FALSE),\"\")","v":""}]
[]
[]
[]
[]
[]
[]
[]
[{"$f":"IF(Übertrag!A14>0,VLOOKUP(Übertrag!A14,#REF!,2,FALSE),\"\")","v":""},null,null,null,null,null,null,null,null,null,null,null,null,null,null,null,null,null,null,{"$f":"IF(Übertrag!A14>0,VLOOKUP(Übertrag!A14,#REF!,7,FALSE),\"\")","v":""},null,null,null,null,{"$f":"IF(Übertrag!A15>0,VLOOKUP(Übertrag!A15,#REF!,2,FALSE),\"\")","v":""},null,null,null,null,null,null,null,null,null,null,null,null,null,null,null,null,null,null,{"$f":"IF(Übertrag!A15>0,VLOOKUP(Übertrag!A15,#REF!,7,FALSE),\"\")","v":""}]
[]
[]
[]
[]
[{"$f":"IF(Übertrag!A14>0,VLOOKUP(Übertrag!A14,#REF!,3,FALSE),\"\")","v":""},null,null,null,null,null,null,null,null,null,null,null,null,null,null,null,null,null,null,{"$f":"IF(Übertrag!A14>0,VLOOKUP(Übertrag!A14,#REF!,8,FALSE),\"\")","v":""},null,null,null,null,{"$f":"IF(Übertrag!A15>0,VLOOKUP(Übertrag!A15,#REF!,3,FALSE),\"\")","v":""},null,null,null,null,null,null,null,null,null,null,null,null,null,null,null,null,null,null,{"$f":"IF(Übertrag!A15>0,VLOOKUP(Übertrag!A15,#REF!,8,FALSE),\"\")","v":""}]
[]
[]
[]
[{"$f":"_xlfn.IFS(Übertrag!A14=\"\",\"\",K376=\"1\",VLOOKUP(Übertrag!A14,#REF!,17,FALSE),Übertrag!A14>0,VLOOKUP(Übertrag!A14,#REF!,16,FALSE))","v":""},null,null,null,null,null,null,null,null,null,null,{"$f":"IF(Übertrag!A14>0,VLOOKUP(Übertrag!A14,#REF!,13,FALSE),\"\")","v":""},null,null,null,null,null,null,null,{"$f":"IF(Übertrag!A14>0,VLOOKUP(Übertrag!A14,#REF!,4,FALSE),\"\")","v":""},null,null,null,null,{"$f":"_xlfn.IFS(Übertrag!A15=\"\",\"\",AI376=\"1\",VLOOKUP(Übertrag!A15,#REF!,17,FALSE),Übertrag!A15>0,VLOOKUP(Übertrag!A15,#REF!,16,FALSE))","v":""},null,null,null,null,null,null,null,null,null,null,{"$f":"IF(Übertrag!A15>0,VLOOKUP(Übertrag!A15,#REF!,13,FALSE),\"\")","v":""},null,null,null,null,null,null,null,{"$f":"IF(Übertrag!A15>0,VLOOKUP(Übertrag!A15,#REF!,4,FALSE),\"\")","v":""}]
[]
[]
[]
[null,null,null,null,null,null,null,null,null,null,null,{"$f":"IF(Übertrag!A14>0,VLOOKUP(Übertrag!A14,#REF!,11,FALSE),\"\")","v":""},null,null,null,null,null,null,null,null,null,null,null,null,null,null,null,null,null,null,null,null,null,null,null,{"$f":"IF(Übertrag!A15>0,VLOOKUP(Übertrag!A15,#REF!,11,FALSE),\"\")","v":""}]
[]
[]
[]
[]
[]
[]
[]
[]
[]
[]
[]
[]
[]
[]
[]
[]
[]
[null,{"$f":"IF(Übertrag!A14>0,VLOOKUP(Übertrag!A14,#REF!,14,FALSE),\"\")","v":""},null,null,null,null,null,null,null,null,{"$f":"IF(Übertrag!A14>0,VLOOKUP(Übertrag!A14,#REF!,15,FALSE),\"\")","v":""},{"$f":"IF(N376=\"\",\"\",\"1kg=\")","v":""},null,{"$f":"IF(Q376=0,\"\",IF(T376=\"kg\",SUM(L358/Q376),IF(T376=\"g\",SUM(L358/Q376*1000),IF(T376=\"gr\",SUM(L358/Q376*1000),\"\"))))","v":""},null,null,{"$f":"IF(Übertrag!A14>0,VLOOKUP(Übertrag!A14,#REF!,9,FALSE),\"\")","v":""},null,null,{"$f":"IF(Übertrag!A14>0,VLOOKUP(Übertrag!A14,#REF!,10,FALSE),\"\")","v":""},{"$f":"IF(Übertrag!A14>0,VLOOKUP(Übertrag!A14,#REF!,12,FALSE),\"\")","v":""},null,null,null,null,{"$f":"IF(Übertrag!A15>0,VLOOKUP(Übertrag!A15,#REF!,14,FALSE),\"\")","v":""},null,null,null,null,null,null,null,null,{"$f":"IF(Übertrag!A15>0,VLOOKUP(Übertrag!A15,#REF!,15,FALSE),\"\")","v":""},{"$f":"IF(AL376=\"\",\"\",\"1kg=\")","v":""},null,{"$f":"IF(AO376=0,\"\",IF(AR376=\"kg\",SUM(AJ358/AO376),IF(AR376=\"g\",SUM(AJ358/AO376*1000),IF(AR376=\"gr\",SUM(AJ358/AO376*1000),\"\"))))","v":""},null,null,{"$f":"IF(Übertrag!A15>0,VLOOKUP(Übertrag!A15,#REF!,9,FALSE),\"\")","v":""},null,null,{"$f":"IF(Übertrag!A15>0,VLOOKUP(Übertrag!A15,#REF!,10,FALSE),\"\")","v":""},{"$f":"IF(Übertrag!A15>0,VLOOKUP(Übertrag!A15,#REF!,12,FALSE),\"\")","v":""}]
[]
[]
[{"$f":"IF(Übertrag!A14>0,VLOOKUP(Übertrag!A14,#REF!,5,FALSE),\"\")","v":""},null,null,null,null,null,null,null,null,null,null,null,null,null,null,null,null,null,null,null,null,null,null,null,{"$f":"IF(Übertrag!A15>0,VLOOKUP(Übertrag!A15,#REF!,5,FALSE),\"\")","v":""}]
[]
[]
[]
[{"$f":"IF(Übertrag!A14>0,VLOOKUP(Übertrag!A14,#REF!,6,FALSE),\"\")","v":""},null,null,null,null,null,null,null,null,null,null,null,null,null,null,null,null,null,null,null,null,null,null,null,{"$f":"IF(Übertrag!A15>0,VLOOKUP(Übertrag!A15,#REF!,6,FALSE),\"\")","v":""}]
[]
[]
[]
[]
[]
[]
[]
[]
[]
[]
[{"$f":"IF(Übertrag!A14>0,VLOOKUP(Übertrag!A14,Datenbank[],7,FALSE),\"\")","v":""},null,null,null,null,null,null,null,null,null,null,null,null,null,null,null,null,null,null,null,null,null,null,null,{"$f":"IF(Übertrag!A15>0,VLOOKUP(Übertrag!A15,Datenbank[],7,FALSE),\"\")","v":""}]
[]
[]
[]
[]
[]
[]
[]
[{"$f":"IF(Übertrag!A16>0,VLOOKUP(Übertrag!A16,#REF!,2,FALSE),\"\")","v":""},null,null,null,null,null,null,null,null,null,null,null,null,null,null,null,null,null,null,{"$f":"IF(Übertrag!A16>0,VLOOKUP(Übertrag!A16,#REF!,7,FALSE),\"\")","v":""},null,null,null,null,{"$f":"IF(Übertrag!A17>0,VLOOKUP(Übertrag!A17,#REF!,2,FALSE),\"\")","v":""},null,null,null,null,null,null,null,null,null,null,null,null,null,null,null,null,null,null,{"$f":"IF(Übertrag!A17>0,VLOOKUP(Übertrag!A17,#REF!,7,FALSE),\"\")","v":""}]
[]
[]
[]
[]
[{"$f":"IF(Übertrag!A16>0,VLOOKUP(Übertrag!A16,#REF!,3,FALSE),\"\")","v":""},null,null,null,null,null,null,null,null,null,null,null,null,null,null,null,null,null,null,{"$f":"IF(Übertrag!A16>0,VLOOKUP(Übertrag!A16,#REF!,8,FALSE),\"\")","v":""},null,null,null,null,{"$f":"IF(Übertrag!A17>0,VLOOKUP(Übertrag!A17,#REF!,3,FALSE),\"\")","v":""},null,null,null,null,null,null,null,null,null,null,null,null,null,null,null,null,null,null,{"$f":"IF(Übertrag!A17>0,VLOOKUP(Übertrag!A17,#REF!,8,FALSE),\"\")","v":""}]
[]
[]
[]
[{"$f":"_xlfn.IFS(Übertrag!A16=\"\",\"\",K433=\"1\",VLOOKUP(Übertrag!A16,#REF!,17,FALSE),Übertrag!A16>0,VLOOKUP(Übertrag!A16,#REF!,16,FALSE))","v":""},null,null,null,null,null,null,null,null,null,null,{"$f":"IF(Übertrag!A16>0,VLOOKUP(Übertrag!A16,#REF!,13,FALSE),\"\")","v":""},null,null,null,null,null,null,null,{"$f":"IF(Übertrag!A16>0,VLOOKUP(Übertrag!A16,#REF!,4,FALSE),\"\")","v":""},null,null,null,null,{"$f":"_xlfn.IFS(Übertrag!A17=\"\",\"\",AI433=\"1\",VLOOKUP(Übertrag!A17,#REF!,17,FALSE),Übertrag!A17>0,VLOOKUP(Übertrag!A17,#REF!,16,FALSE))","v":""},null,null,null,null,null,null,null,null,null,null,{"$f":"IF(Übertrag!A17>0,VLOOKUP(Übertrag!A17,#REF!,13,FALSE),\"\")","v":""},null,null,null,null,null,null,null,{"$f":"IF(Übertrag!A17>0,VLOOKUP(Übertrag!A17,#REF!,4,FALSE),\"\")","v":""}]
[]
[]
[]
[null,null,null,null,null,null,null,null,null,null,null,{"$f":"IF(Übertrag!A16>0,VLOOKUP(Übertrag!A16,#REF!,11,FALSE),\"\")","v":""},null,null,null,null,null,null,null,null,null,null,null,null,null,null,null,null,null,null,null,null,null,null,null,{"$f":"IF(Übertrag!A17>0,VLOOKUP(Übertrag!A17,#REF!,11,FALSE),\"\")","v":""}]
[]
[]
[]
[]
[]
[]
[]
[]
[]
[]
[]
[]
[]
[]
[]
[]
[]
[null,{"$f":"IF(Übertrag!A16>0,VLOOKUP(Übertrag!A16,#REF!,14,FALSE),\"\")","v":""},null,null,null,null,null,null,null,null,{"$f":"IF(Übertrag!A16>0,VLOOKUP(Übertrag!A16,#REF!,15,FALSE),\"\")","v":""},{"$f":"IF(N433=\"\",\"\",\"1kg=\")","v":""},null,{"$f":"IF(Q433=0,\"\",IF(T433=\"kg\",SUM(L415/Q433),IF(T433=\"g\",SUM(L415/Q433*1000),IF(T433=\"gr\",SUM(L415/Q433*1000),\"\"))))","v":""},null,null,{"$f":"IF(Übertrag!A16>0,VLOOKUP(Übertrag!A16,#REF!,9,FALSE),\"\")","v":""},null,null,{"$f":"IF(Übertrag!A16>0,VLOOKUP(Übertrag!A16,#REF!,10,FALSE),\"\")","v":""},{"$f":"IF(Übertrag!A16>0,VLOOKUP(Übertrag!A16,#REF!,12,FALSE),\"\")","v":""},null,null,null,null,{"$f":"IF(Übertrag!A17>0,VLOOKUP(Übertrag!A17,#REF!,14,FALSE),\"\")","v":""},null,null,null,null,null,null,null,null,{"$f":"IF(Übertrag!A17>0,VLOOKUP(Übertrag!A17,#REF!,15,FALSE),\"\")","v":""},{"$f":"IF(AL433=\"\",\"\",\"1kg=\")","v":""},null,{"$f":"IF(AO433=0,\"\",IF(AR433=\"kg\",SUM(AJ415/AO433),IF(AR433=\"g\",SUM(AJ415/AO433*1000),IF(AR433=\"gr\",SUM(AJ415/AO433*1000),\"\"))))","v":""},null,null,{"$f":"IF(Übertrag!A17>0,VLOOKUP(Übertrag!A17,#REF!,9,FALSE),\"\")","v":""},null,null,{"$f":"IF(Übertrag!A17>0,VLOOKUP(Übertrag!A17,#REF!,10,FALSE),\"\")","v":""},{"$f":"IF(Übertrag!A17>0,VLOOKUP(Übertrag!A17,#REF!,12,FALSE),\"\")","v":""}]
[]
[]
[{"$f":"IF(Übertrag!A16>0,VLOOKUP(Übertrag!A16,#REF!,5,FALSE),\"\")","v":""},null,null,null,null,null,null,null,null,null,null,null,null,null,null,null,null,null,null,null,null,null,null,null,{"$f":"IF(Übertrag!A17>0,VLOOKUP(Übertrag!A17,#REF!,5,FALSE),\"\")","v":""}]
[]
[]
[]
[{"$f":"IF(Übertrag!A16>0,VLOOKUP(Übertrag!A16,#REF!,6,FALSE),\"\")","v":""},null,null,null,null,null,null,null,null,null,null,null,null,null,null,null,null,null,null,null,null,null,null,null,{"$f":"IF(Übertrag!A17>0,VLOOKUP(Übertrag!A17,#REF!,6,FALSE),\"\")","v":""}]
[]
[]
[]
[]
[]
[]
[]
[]
[]
[]
[{"$f":"IF(Übertrag!A16>0,VLOOKUP(Übertrag!A16,Datenbank[],7,FALSE),\"\")","v":""},null,null,null,null,null,null,null,null,null,null,null,null,null,null,null,null,null,null,null,null,null,null,null,{"$f":"IF(Übertrag!A19>0,VLOOKUP(Übertrag!A19,Datenbank[],7,FALSE),\"\")","v":""}]

{"sheet":"Druck 24 Felder","index":5,"n_rows":661,"n_cols":45,"rows_kept":661,"cut":false,"hidden":true,"merged":[[172,24,172,46],[218,0,228,22],[229,0,229,22],[218,24,228,46],[229,24,229,46],[47,0,57,22],[58,0,58,22],[47,24,57,46],[58,24,58,46],[104,0,114,22],[115,0,115,22],[104,24,114,46],[115,24,115,46],[161,0,171,22],[214,0,217,22],[214,24,217,46],[211,19,213,19],[211,20,213,22],[211,24,213,24],[211,25,213,33],[211,34,213,34],[211,35,213,36],[173,0,179,46],[180,0,184,18],[653,44,655,46],[656,0,659,22],[656,24,659,46],[660,0,671,22],[660,24,671,46],[653,24,655,24],[653,25,655,33],[653,34,655,34],[653,35,655,36],[653,37,655,39],[653,40,655,42],[653,0,655,0],[653,1,655,9],[653,10,655,10],[653,11,655,12],[653,13,655,15],[653,16,655,18],[653,19,655,19],[653,20,655,22],[653,43,655,43],[627,0,630,18],[627,19,630,22],[627,24,630,42],[627,43,630,46],[631,0,652,10],[631,11,634,18],[631,19,634,22],[631,24,652,34],[631,35,634,42],[631,43,634,46],[635,11,652,22],[635,35,652,46],[615,0,621,46],[622,0,626,18],[622,19,626,22],[622,24,626,42],[622,43,626,46],[596,37,598,39],[596,40,598,42],[596,43,598,43],[596,44,598,46],[599,0,602,22],[599,24,602,46],[596,19,598,19],[596,20,598,22],[596,24,598,24],[596,25,598,33],[596,34,598,34],[596,35,598,36],[596,0,598,0],[596,1,598,9],[596,10,598,10],[596,11,598,12],[596,13,598,15],[546,0,557,22],[546,24,557,46],[558,0,564,46],[565,0,569,18],[565,19,569,22],[565,23,614,23],[565,24,569,42],[565,43,569,46],[570,0,573,18],[570,19,573,22],[596,16,598,18],[570,24,573,42],[570,43,573,46],[574,0,595,10],[574,11,577,18],[574,19,577,22],[574,24,595,34],[574,35,577,42],[574,43,577,46],[578,11,595,22],[578,35,595,46],[603,0,614,22],[603,24,614,46],[542,0,545,22],[542,24,545,46],[539,19,541,19],[539,20,541,22],[539,24,541,24],[539,25,541,33],[539,34,541,34],[539,35,541,36],[539,0,541,0],[539,1,541,9],[539,10,541,10],[539,11,541,12],[539,13,541,15],[539,16,541,18],[489,0,500,22],[489,24,500,46],[501,0,507,46],[508,0,512,18],[508,19,512,22],[508,23,557,23],[508,24,512,42],[508,43,512,46],[513,0,516,18],[513,19,516,22],[513,24,516,42],[513,43,516,46],[517,0,538,10],[517,11,520,18],[517,19,520,22],[517,24,538,34],[517,35,520,42],[517,43,520,46],[521,11,538,22],[521,35,538,46],[539,37,541,39],[539,40,541,42],[539,43,541,43],[539,44,541,46],[482,20,484,22],[482,24,484,24],[482,25,484,33],[482,34,484,34],[482,35,484,36],[482,0,484,0],[482,1,484,9],[482,10,484,10],[482,11,484,12],[482,13,484,15],[482,16,484,18],[460,11,463,18],[460,19,463,22],[460,24,481,34],[460,35,463,42],[460,43,463,46],[464,11,481,22],[464,35,481,46],[451,0,455,18],[451,19,455,22],[451,23,500,23],[451,24,455,42],[451,43,455,46],[456,0,459,18],[456,19,459,22],[456,24,459,42],[456,43,459,46],[460,0,481,10],[482,37,484,39],[482,40,484,42],[482,43,484,43],[482,44,484,46],[485,0,488,22],[485,24,488,46],[482,19,484,19],[432,44,434,46],[435,0,438,22],[435,24,438,46],[439,0,450,22],[439,24,450,46],[432,24,434,24],[432,25,434,33],[432,34,434,34],[432,35,434,36],[432,37,434,39],[432,40,434,42],[432,0,434,0],[432,1,434,9],[432,10,434,10],[432,11,434,12],[432,13,434,15],[432,16,434,18],[432,19,434,19],[432,20,434,22],[432,43,434,43],[406,0,409,18],[406,19,409,22],[406,24,409,42],[406,43,409,46],[410,0,431,10],[410,11,413,18],[410,19,413,22],[410,24,431,34],[410,35,413,42],[410,43,413,46],[414,11,431,22],[414,35,431,46],[394,0,400,46],[401,0,405,18],[401,19,405,22],[401,24,405,42],[401,43,405,46],[375,37,377,39],[375,40,377,42],[375,43,377,43],[375,44,377,46],[378,0,381,22],[378,24,381,46],[375,19,377,19],[375,20,377,22],[375,24,377,24],[375,25,377,33],[375,34,377,34],[375,35,377,36],[375,0,377,0],[375,1,377,9],[375,10,377,10],[375,11,377,12],[375,13,377,15],[325,0,336,22],[325,24,336,46],[337,0,343,46],[344,0,348,18],[344,19,348,22],[344,23,393,23],[344,24,348,42],[344,43,348,46],[349,0,352,18],[349,19,352,22],[375,16,377,18],[349,24,352,42],[349,43,352,46],[353,0,374,10],[353,11,356,18],[353,19,356,22],[353,24,374,34],[353,35,356,42],[353,43,356,46],[357,11,374,22],[357,35,374,46],[382,0,393,22],[382,24,393,46],[321,0,324,22],[321,24,324,46],[318,19,320,19],[318,20,320,22],[318,24,320,24],[318,25,320,33],[318,34,320,34],[318,35,320,36],[318,0,320,0],[318,1,320,9],[318,10,320,10],[318,11,320,12],[318,13,320,15],[318,16,320,18],[268,0,279,22],[268,24,279,46],[280,0,286,46],[287,0,291,18],[287,19,291,22],[287,23,336,23],[287,24,291,42],[287,43,291,46],[292,0,295,18],[292,19,295,22],[292,24,295,42],[292,43,295,46],[296,0,317,10],[296,11,299,18],[296,19,299,22],[296,24,317,34],[296,35,299,42],[296,43,299,46],[300,11,317,22],[300,35,317,46],[318,37,320,39],[318,40,320,42],[318,43,320,43],[318,44,320,46],[261,44,263,46],[264,0,267,22],[264,24,267,46],[261,19,263,19],[261,20,263,22],[261,24,263,24],[261,25,263,33],[261,34,263,34],[261,35,263,36],[261,0,263,0],[261,1,263,9],[261,10,263,10],[261,11,263,12],[261,13,263,15],[261,16,263,18],[211,0,213,0],[211,1,213,9],[211,10,213,10],[211,11,213,12],[230,0,234,18],[230,19,234,22],[230,23,279,23],[230,24,234,42],[230,43,234,46],[235,0,238,18],[235,19,238,22],[235,24,238,42],[235,43,238,46],[239,0,260,10],[239,11,242,18],[239,19,242,22],[239,24,260,34],[239,35,242,42],[239,43,242,46],[243,11,260,22],[243,35,260,46],[261,37,263,39],[261,40,263,42],[261,43,263,43],[154,10,156,10],[154,11,156,12],[154,13,156,15],[154,16,156,18],[180,19,184,22],[180,23,229,23],[180,24,184,42],[180,43,184,46],[185,0,188,18],[185,19,188,22],[185,24,188,42],[185,43,188,46],[189,0,210,10],[189,11,192,18],[189,19,192,22],[189,24,210,34],[189,35,192,42],[189,43,192,46],[193,11,210,22],[193,35,210,46],[211,37,213,39],[211,40,213,42],[211,43,213,43],[211,44,213,46],[211,13,213,15],[211,16,213,18],[116,0,122,46],[123,0,127,18],[123,19,127,22],[123,23,172,23],[123,24,127,42],[123,43,127,46],[128,0,131,18],[128,19,131,22],[128,24,131,42],[128,43,131,46],[132,0,153,10],[132,11,135,18],[132,19,135,22],[132,24,153,34],[132,35,135,42],[132,43,135,46],[136,11,153,22],[136,35,153,46],[154,37,156,39],[154,40,156,42],[154,43,156,43],[154,44,156,46],[172,0,172,22],[161,24,171,46],[97,19,99,19],[97,20,99,22],[97,24,99,24],[97,25,99,33],[97,34,99,34],[97,35,99,36],[97,0,99,0],[97,1,99,9],[97,10,99,10],[97,11,99,12],[97,13,99,15],[97,16,99,18],[157,0,160,22],[157,24,160,46],[154,19,156,19],[154,20,156,22],[154,24,156,24],[154,25,156,33],[154,34,156,34],[154,35,156,36],[154,0,156,0],[154,1,156,9],[59,0,65,46],[66,0,70,18],[66,19,70,22],[66,23,115,23],[66,24,70,42],[66,43,70,46],[71,0,74,18],[71,19,74,22],[71,24,74,42],[71,43,74,46],[75,0,96,10],[75,11,78,18],[75,19,78,22],[75,24,96,34],[75,35,78,42],[75,43,78,46],[79,11,96,22],[79,35,96,46],[97,37,99,39],[97,40,99,42],[97,43,99,43],[97,44,99,46],[100,0,103,22],[100,24,103,46],[40,20,42,22],[40,24,42,24],[40,25,42,33],[40,34,42,34],[40,35,42,36],[40,0,42,0],[40,1,42,9],[40,10,42,10],[40,11,42,12],[40,13,42,15],[40,16,42,18],[18,11,21,18],[18,19,21,22],[18,24,39,34],[18,35,21,42],[18,43,21,46],[22,11,39,22],[22,35,39,46],[9,0,13,18],[9,19,13,22],[9,23,58,23],[9,24,13,42],[9,43,13,46],[14,0,17,18],[14,19,17,22],[14,24,17,42],[14,43,17,46],[18,0,39,10],[40,37,42,39],[40,40,42,42],[40,43,42,43],[40,44,42,46],[43,0,46,22],[43,24,46,46],[40,19,42,19]]}
[]
[]
[]
[]
[]
[]
[]
[]
[]
[{"$f":"IF(Übertrag!A2>0,VLOOKUP(Übertrag!A2,#REF!,2,FALSE),\"\")","v":{"$error":"#REF!"}},null,null,null,null,null,null,null,null,null,null,null,null,null,null,null,null,null,null,{"$f":"IF(Übertrag!A2>0,VLOOKUP(Übertrag!A2,#REF!,7,FALSE),\"\")","v":{"$error":"#REF!"}},null,null,null,null,{"$f":"IF(Übertrag!A3>0,VLOOKUP(Übertrag!A3,#REF!,2,FALSE),\"\")","v":{"$error":"#REF!"}},null,null,null,null,null,null,null,null,null,null,null,null,null,null,null,null,null,null,{"$f":"IF(Übertrag!A3>0,VLOOKUP(Übertrag!A3,#REF!,7,FALSE),\"\")","v":{"$error":"#REF!"}}]
[]
[]
[]
[]
[{"$f":"IF(Übertrag!A2>0,VLOOKUP(Übertrag!A2,#REF!,3,FALSE),\"\")","v":{"$error":"#REF!"}},null,null,null,null,null,null,null,null,null,null,null,null,null,null,null,null,null,null,{"$f":"IF(Übertrag!A2>0,VLOOKUP(Übertrag!A2,#REF!,8,FALSE),\"\")","v":{"$error":"#REF!"}},null,null,null,null,{"$f":"IF(Übertrag!A3>0,VLOOKUP(Übertrag!A3,#REF!,3,FALSE),\"\")","v":{"$error":"#REF!"}},null,null,null,null,null,null,null,null,null,null,null,null,null,null,null,null,null,null,{"$f":"IF(Übertrag!A3>0,VLOOKUP(Übertrag!A3,#REF!,8,FALSE),\"\")","v":{"$error":"#REF!"}}]
[]
[]
[]
[{"$f":"_xlfn.IFS(Übertrag!A2=\"\",\"\",K41=\"1\",VLOOKUP(Übertrag!A2,#REF!,17,FALSE),Übertrag!A2>0,VLOOKUP(Übertrag!A2,#REF!,16,FALSE))","v":{"$error":"#REF!"}},null,null,null,null,null,null,null,null,null,null,{"$f":"IF(Übertrag!A2>0,VLOOKUP(Übertrag!A2,#REF!,13,FALSE),\"\")","v":{"$error":"#REF!"}},null,null,null,null,null,null,null,{"$f":"IF(Übertrag!A2>0,VLOOKUP(Übertrag!A2,#REF!,4,FALSE),\"\")","v":{"$error":"#REF!"}},null,null,null,null,{"$f":"_xlfn.IFS(Übertrag!A3=\"\",\"\",AI41=\"1\",VLOOKUP(Übertrag!A3,#REF!,17,FALSE),Übertrag!A3>0,VLOOKUP(Übertrag!A3,#REF!,16,FALSE))","v":{"$error":"#REF!"}},null,null,null,null,null,null,null,null,null,null,{"$f":"IF(Übertrag!A3>0,VLOOKUP(Übertrag!A3,#REF!,13,FALSE),\"\")","v":{"$error":"#REF!"}},null,null,null,null,null,null,null,{"$f":"IF(Übertrag!A3>0,VLOOKUP(Übertrag!A3,#REF!,4,FALSE),\"\")","v":{"$error":"#REF!"}}]
[]
[]
[]
[null,null,null,null,null,null,null,null,null,null,null,{"$f":"IF(Übertrag!A2>0,VLOOKUP(Übertrag!A2,#REF!,11,FALSE),\"\")","v":{"$error":"#REF!"}},null,null,null,null,null,null,null,null,null,null,null,null,null,null,null,null,null,null,null,null,null,null,null,{"$f":"IF(Übertrag!A3>0,VLOOKUP(Übertrag!A3,#REF!,11,FALSE),\"\")","v":{"$error":"#REF!"}}]
[]
[]
[]
[]
[]
[]
[]
[]
[]
[]
[]
[]
[]
[]
[]
[]
[]
[null,{"$f":"IF(Übertrag!A2>0,VLOOKUP(Übertrag!A2,#REF!,14,FALSE),\"\")","v":{"$error":"#REF!"}},null,null,null,null,null,null,null,null,{"$f":"IF(Übertrag!A2>0,VLOOKUP(Übertrag!A2,#REF!,15,FALSE),\"\")","v":{"$error":"#REF!"}},{"$f":"IF(N41=\"\",\"\",\"1kg=\")","v":{"$error":"#REF!"}},null,{"$f":"IF(Q41=0,\"\",IF(T41=\"kg\",SUM(L23/Q41),IF(T41=\"g\",SUM(L23/Q41*1000),IF(T41=\"gr\",SUM(L23/Q41*1000),\"\"))))","v":{"$error":"#REF!"}},null,null,{"$f":"IF(Übertrag!A2>0,VLOOKUP(Übertrag!A2,#REF!,9,FALSE),\"\")","v":{"$error":"#REF!"}},null,null,{"$f":"IF(Übertrag!A2>0,VLOOKUP(Übertrag!A2,#REF!,10,FALSE),\"\")","v":{"$error":"#REF!"}},{"$f":"IF(Übertrag!A2>0,VLOOKUP(Übertrag!A2,#REF!,12,FALSE),\"\")","v":{"$error":"#REF!"}},null,null,null,null,{"$f":"IF(Übertrag!A3>0,VLOOKUP(Übertrag!A3,#REF!,14,FALSE),\"\")","v":{"$error":"#REF!"}},null,null,null,null,null,null,null,null,{"$f":"IF(Übertrag!A3>0,VLOOKUP(Übertrag!A3,#REF!,15,FALSE),\"\")","v":{"$error":"#REF!"}},{"$f":"IF(AL41=\"\",\"\",\"1kg=\")","v":{"$error":"#REF!"}},null,{"$f":"IF(AO41=0,\"\",IF(AR41=\"kg\",SUM(AJ23/AO41),IF(AR41=\"g\",SUM(AJ23/AO41*1000),IF(AR41=\"gr\",SUM(AJ23/AO41*1000),\"\"))))","v":{"$error":"#REF!"}},null,null,{"$f":"IF(Übertrag!A3>0,VLOOKUP(Übertrag!A3,#REF!,9,FALSE),\"\")","v":{"$error":"#REF!"}},null,null,{"$f":"IF(Übertrag!A3>0,VLOOKUP(Übertrag!A3,#REF!,10,FALSE),\"\")","v":{"$error":"#REF!"}},{"$f":"IF(Übertrag!A3>0,VLOOKUP(Übertrag!A3,#REF!,12,FALSE),\"\")","v":{"$error":"#REF!"}}]
[]
[]
[{"$f":"IF(Übertrag!A2>0,VLOOKUP(Übertrag!A2,#REF!,5,FALSE),\"\")","v":{"$error":"#REF!"}},null,null,null,null,null,null,null,null,null,null,null,null,null,null,null,null,null,null,null,null,null,null,null,{"$f":"IF(Übertrag!A3>0,VLOOKUP(Übertrag!A3,#REF!,5,FALSE),\"\")","v":{"$error":"#REF!"}}]
[]
[]
[]
[{"$f":"IF(Übertrag!A2>0,VLOOKUP(Übertrag!A2,#REF!,6,FALSE),\"\")","v":{"$error":"#REF!"}},null,null,null,null,null,null,null,null,null,null,null,null,null,null,null,null,null,null,null,null,null,null,null,{"$f":"IF(Übertrag!A3>0,VLOOKUP(Übertrag!A3,#REF!,6,FALSE),\"\")","v":{"$error":"#REF!"}}]
[]
[]
[]
[]
[]
[]
[]
[]
[]
[]
[{"$f":"IF(Übertrag!A2>0,VLOOKUP(Übertrag!A2,Datenbank[],7,FALSE),\"\")","v":"2025-07-16"},null,null,null,null,null,null,null,null,null,null,null,null,null,null,null,null,null,null,null,null,null,null,null,{"$f":"IF(Übertrag!A3>0,VLOOKUP(Übertrag!A3,Datenbank[],7,FALSE),\"\")","v":"2025-07-16"}]
[]
[]
[]
[]
[]
[]
[]
[{"$f":"IF(Übertrag!A4>0,VLOOKUP(Übertrag!A4,#REF!,2,FALSE),\"\")","v":{"$error":"#REF!"}},null,null,null,null,null,null,null,null,null,null,null,null,null,null,null,null,null,null,{"$f":"IF(Übertrag!A4>0,VLOOKUP(Übertrag!A4,#REF!,7,FALSE),\"\")","v":{"$error":"#REF!"}},null,null,null,null,{"$f":"IF(Übertrag!A5>0,VLOOKUP(Übertrag!A5,#REF!,2,FALSE),\"\")","v":{"$error":"#REF!"}},null,null,null,null,null,null,null,null,null,null,null,null,null,null,null,null,null,null,{"$f":"IF(Übertrag!A5>0,VLOOKUP(Übertrag!A5,#REF!,7,FALSE),\"\")","v":{"$error":"#REF!"}}]
[]
[]
[]
[]
[{"$f":"IF(Übertrag!A4>0,VLOOKUP(Übertrag!A4,#REF!,3,FALSE),\"\")","v":{"$error":"#REF!"}},null,null,null,null,null,null,null,null,null,null,null,null,null,null,null,null,null,null,{"$f":"IF(Übertrag!A4>0,VLOOKUP(Übertrag!A4,#REF!,8,FALSE),\"\")","v":{"$error":"#REF!"}},null,null,null,null,{"$f":"IF(Übertrag!A5>0,VLOOKUP(Übertrag!A5,#REF!,3,FALSE),\"\")","v":{"$error":"#REF!"}},null,null,null,null,null,null,null,null,null,null,null,null,null,null,null,null,null,null,{"$f":"IF(Übertrag!A5>0,VLOOKUP(Übertrag!A5,#REF!,8,FALSE),\"\")","v":{"$error":"#REF!"}}]
[]
[]
[]
[{"$f":"_xlfn.IFS(Übertrag!A4=\"\",\"\",K98=\"1\",VLOOKUP(Übertrag!A4,#REF!,17,FALSE),Übertrag!A4>0,VLOOKUP(Übertrag!A4,#REF!,16,FALSE))","v":{"$error":"#REF!"}},null,null,null,null,null,null,null,null,null,null,{"$f":"IF(Übertrag!A4>0,VLOOKUP(Übertrag!A4,#REF!,13,FALSE),\"\")","v":{"$error":"#REF!"}},null,null,null,null,null,null,null,{"$f":"IF(Übertrag!A4>0,VLOOKUP(Übertrag!A4,#REF!,4,FALSE),\"\")","v":{"$error":"#REF!"}},null,null,null,null,{"$f":"_xlfn.IFS(Übertrag!A5=\"\",\"\",AI98=\"1\",VLOOKUP(Übertrag!A5,#REF!,17,FALSE),Übertrag!A5>0,VLOOKUP(Übertrag!A5,#REF!,16,FALSE))","v":{"$error":"#REF!"}},null,null,null,null,null,null,null,null,null,null,{"$f":"IF(Übertrag!A5>0,VLOOKUP(Übertrag!A5,#REF!,13,FALSE),\"\")","v":{"$error":"#REF!"}},null,null,null,null,null,null,null,{"$f":"IF(Übertrag!A5>0,VLOOKUP(Übertrag!A5,#REF!,4,FALSE),\"\")","v":{"$error":"#REF!"}}]
[]
[]
[]
[null,null,null,null,null,null,null,null,null,null,null,{"$f":"IF(Übertrag!A4>0,VLOOKUP(Übertrag!A4,#REF!,11,FALSE),\"\")","v":{"$error":"#REF!"}},null,null,null,null,null,null,null,null,null,null,null,null,null,null,null,null,null,null,null,null,null,null,null,{"$f":"IF(Übertrag!A5>0,VLOOKUP(Übertrag!A5,#REF!,11,FALSE),\"\")","v":{"$error":"#REF!"}}]
[]
[]
[]
[]
[]
[]
[]
[]
[]
[]
[]
[]
[]
[]
[]
[]
[]
[null,{"$f":"IF(Übertrag!A4>0,VLOOKUP(Übertrag!A2,#REF!,14,FALSE),\"\")","v":{"$error":"#REF!"}},null,null,null,null,null,null,null,null,{"$f":"IF(Übertrag!A4>0,VLOOKUP(Übertrag!A4,#REF!,15,FALSE),\"\")","v":{"$error":"#REF!"}},{"$f":"IF(N98=\"\",\"\",\"1kg=\")","v":{"$error":"#REF!"}},null,{"$f":"IF(Q98=0,\"\",IF(T98=\"kg\",SUM(L80/Q98),IF(T98=\"g\",SUM(L80/Q98*1000),IF(T98=\"gr\",SUM(L80/Q98*1000),\"\"))))","v":{"$error":"#REF!"}},null,null,{"$f":"IF(Übertrag!A4>0,VLOOKUP(Übertrag!A4,#REF!,9,FALSE),\"\")","v":{"$error":"#REF!"}},null,null,{"$f":"IF(Übertrag!A4>0,VLOOKUP(Übertrag!A4,#REF!,10,FALSE),\"\")","v":{"$error":"#REF!"}},{"$f":"IF(Übertrag!A4>0,VLOOKUP(Übertrag!A4,#REF!,12,FALSE),\"\")","v":{"$error":"#REF!"}},null,null,null,null,{"$f":"IF(Übertrag!A5>0,VLOOKUP(Übertrag!A5,#REF!,14,FALSE),\"\")","v":{"$error":"#REF!"}},null,null,null,null,null,null,null,null,{"$f":"IF(Übertrag!A5>0,VLOOKUP(Übertrag!A5,#REF!,15,FALSE),\"\")","v":{"$error":"#REF!"}},{"$f":"IF(AL98=\"\",\"\",\"1kg=\")","v":{"$error":"#REF!"}},null,{"$f":"IF(AO98=0,\"\",IF(AS98=\"lose\",\"\",IF(AR98=\"kg\",SUM(AJ80/AO98),IF(AR98=\"g\",SUM(AJ80/AO98*1000),IF(AR98=\"gr\",SUM(AJ80/AO98*1000),\"\")))))","v":{"$error":"#REF!"}},null,null,{"$f":"IF(Übertrag!A5>0,VLOOKUP(Übertrag!A5,#REF!,9,FALSE),\"\")","v":{"$error":"#REF!"}},null,null,{"$f":"IF(Übertrag!A5>0,VLOOKUP(Übertrag!A5,#REF!,10,FALSE),\"\")","v":{"$error":"#REF!"}},{"$f":"IF(Übertrag!A5>0,VLOOKUP(Übertrag!A5,#REF!,12,FALSE),\"\")","v":{"$error":"#REF!"}}]
[]
[]
[{"$f":"IF(Übertrag!A4>0,VLOOKUP(Übertrag!A4,#REF!,5,FALSE),\"\")","v":{"$error":"#REF!"}},null,null,null,null,null,null,null,null,null,null,null,null,null,null,null,null,null,null,null,null,null,null,null,{"$f":"IF(Übertrag!A5>0,VLOOKUP(Übertrag!A5,#REF!,5,FALSE),\"\")","v":{"$error":"#REF!"}}]
[]
[]
[]
[{"$f":"IF(Übertrag!A4>0,VLOOKUP(Übertrag!A4,#REF!,6,FALSE),\"\")","v":{"$error":"#REF!"}},null,null,null,null,null,null,null,null,null,null,null,null,null,null,null,null,null,null,null,null,null,null,null,{"$f":"IF(Übertrag!A5>0,VLOOKUP(Übertrag!A5,#REF!,6,FALSE),\"\")","v":{"$error":"#REF!"}}]
[]
[]
[]
[]
[]
[]
[]
[]
[]
[]
[{"$f":"IF(Übertrag!A4>0,VLOOKUP(Übertrag!A4,Datenbank[],7,FALSE),\"\")","v":"2025-07-16"},null,null,null,null,null,null,null,null,null,null,null,null,null,null,null,null,null,null,null,null,null,null,null,{"$f":"IF(Übertrag!A5>0,VLOOKUP(Übertrag!A5,Datenbank[],7,FALSE),\"\")","v":"2025-07-16"}]
[]
[]
[]
[]
[]
[]
[]
[{"$f":"IF(Übertrag!A6>0,VLOOKUP(Übertrag!A6,#REF!,2,FALSE),\"\")","v":{"$error":"#REF!"}},null,null,null,null,null,null,null,null,null,null,null,null,null,null,null,null,null,null,{"$f":"IF(Übertrag!A6>0,VLOOKUP(Übertrag!A6,#REF!,7,FALSE),\"\")","v":{"$error":"#REF!"}},null,null,null,null,{"$f":"IF(Übertrag!A7>0,VLOOKUP(Übertrag!A7,#REF!,2,FALSE),\"\")","v":{"$error":"#REF!"}},null,null,null,null,null,null,null,null,null,null,null,null,null,null,null,null,null,null,{"$f":"IF(Übertrag!A7>0,VLOOKUP(Übertrag!A7,#REF!,7,FALSE),\"\")","v":{"$error":"#REF!"}}]
[]
[]
[]
[]
[{"$f":"IF(Übertrag!A6>0,VLOOKUP(Übertrag!A6,#REF!,3,FALSE),\"\")","v":{"$error":"#REF!"}},null,null,null,null,null,null,null,null,null,null,null,null,null,null,null,null,null,null,{"$f":"IF(Übertrag!A6>0,VLOOKUP(Übertrag!A6,#REF!,8,FALSE),\"\")","v":{"$error":"#REF!"}},null,null,null,null,{"$f":"IF(Übertrag!A7>0,VLOOKUP(Übertrag!A7,#REF!,3,FALSE),\"\")","v":{"$error":"#REF!"}},null,null,null,null,null,null,null,null,null,null,null,null,null,null,null,null,null,null,{"$f":"IF(Übertrag!A7>0,VLOOKUP(Übertrag!A7,#REF!,8,FALSE),\"\")","v":{"$error":"#REF!"}}]
[]
[]
[]
[{"$f":"_xlfn.IFS(Übertrag!A6=\"\",\"\",K155=\"1\",VLOOKUP(Übertrag!A6,#REF!,17,FALSE),Übertrag!A6>0,VLOOKUP(Übertrag!A6,#REF!,16,FALSE))","v":{"$error":"#REF!"}},null,null,null,null,null,null,null,null,null,null,{"$f":"IF(Übertrag!A6>0,VLOOKUP(Übertrag!A6,#REF!,13,FALSE),\"\")","v":{"$error":"#REF!"}},null,null,null,null,null,null,null,{"$f":"IF(Übertrag!A6>0,VLOOKUP(Übertrag!A6,#REF!,4,FALSE),\"\")","v":{"$error":"#REF!"}},null,null,null,null,{"$f":"_xlfn.IFS(Übertrag!A7=\"\",\"\",AI155=\"1\",VLOOKUP(Übertrag!A7,#REF!,17,FALSE),Übertrag!A7>0,VLOOKUP(Übertrag!A7,#REF!,16,FALSE))","v":{"$error":"#REF!"}},null,null,null,null,null,null,null,null,null,null,{"$f":"IF(Übertrag!A7>0,VLOOKUP(Übertrag!A7,#REF!,13,FALSE),\"\")","v":{"$error":"#REF!"}},null,null,null,null,null,null,null,{"$f":"IF(Übertrag!A7>0,VLOOKUP(Übertrag!A7,#REF!,4,FALSE),\"\")","v":{"$error":"#REF!"}}]
[]
[]
[]
[null,null,null,null,null,null,null,null,null,null,null,{"$f":"IF(Übertrag!A6>0,VLOOKUP(Übertrag!A6,#REF!,11,FALSE),\"\")","v":{"$error":"#REF!"}},null,null,null,null,null,null,null,null,null,null,null,null,null,null,null,null,null,null,null,null,null,null,null,{"$f":"IF(Übertrag!A7>0,VLOOKUP(Übertrag!A7,#REF!,11,FALSE),\"\")","v":{"$error":"#REF!"}}]
[]
[]
[]
[]
[]
[]
[]
[]
[]
[]
[]
[]
[]
[]
[]
[]
[]
[null,{"$f":"IF(Übertrag!A6>0,VLOOKUP(Übertrag!A6,#REF!,14,FALSE),\"\")","v":{"$error":"#REF!"}},null,null,null,null,null,null,null,null,{"$f":"IF(Übertrag!A6>0,VLOOKUP(Übertrag!A6,#REF!,15,FALSE),\"\")","v":{"$error":"#REF!"}},{"$f":"IF(N155=\"\",\"\",\"1kg=\")","v":{"$error":"#REF!"}},null,{"$f":"IF(Q155=0,\"\",IF(T155=\"kg\",SUM(L137/Q155),IF(T155=\"g\",SUM(L137/Q155*1000),IF(T155=\"gr\",SUM(L137/Q155*1000),\"\"))))","v":{"$error":"#REF!"}},null,null,{"$f":"IF(Übertrag!A6>0,VLOOKUP(Übertrag!A6,#REF!,9,FALSE),\"\")","v":{"$error":"#REF!"}},null,null,{"$f":"IF(Übertrag!A6>0,VLOOKUP(Übertrag!A6,#REF!,10,FALSE),\"\")","v":{"$error":"#REF!"}},{"$f":"IF(Übertrag!A6>0,VLOOKUP(Übertrag!A6,#REF!,12,FALSE),\"\")","v":{"$error":"#REF!"}},null,null,null,null,{"$f":"IF(Übertrag!A7>0,VLOOKUP(Übertrag!A7,#REF!,14,FALSE),\"\")","v":{"$error":"#REF!"}},null,null,null,null,null,null,null,null,{"$f":"IF(Übertrag!A7>0,VLOOKUP(Übertrag!A7,#REF!,15,FALSE),\"\")","v":{"$error":"#REF!"}},{"$f":"IF(AL155=\"\",\"\",\"1kg=\")","v":{"$error":"#REF!"}},null,{"$f":"IF(AO155=0,\"\",IF(AR155=\"kg\",SUM(AJ137/AO155),IF(AR155=\"g\",SUM(AJ137/AO155*1000),IF(AR155=\"gr\",SUM(AJ137/AO155*1000),\"\"))))","v":{"$error":"#REF!"}},null,null,{"$f":"IF(Übertrag!A7>0,VLOOKUP(Übertrag!A7,#REF!,9,FALSE),\"\")","v":{"$error":"#REF!"}},null,null,{"$f":"IF(Übertrag!A7>0,VLOOKUP(Übertrag!A7,#REF!,10,FALSE),\"\")","v":{"$error":"#REF!"}},{"$f":"IF(Übertrag!A7>0,VLOOKUP(Übertrag!A7,#REF!,12,FALSE),\"\")","v":{"$error":"#REF!"}}]
[]
[]
[{"$f":"IF(Übertrag!A6>0,VLOOKUP(Übertrag!A6,#REF!,5,FALSE),\"\")","v":{"$error":"#REF!"}},null,null,null,null,null,null,null,null,null,null,null,null,null,null,null,null,null,null,null,null,null,null,null,{"$f":"IF(Übertrag!A7>0,VLOOKUP(Übertrag!A7,#REF!,5,FALSE),\"\")","v":{"$error":"#REF!"}}]
[]
[]
[]
[{"$f":"IF(Übertrag!A6>0,VLOOKUP(Übertrag!A6,#REF!,6,FALSE),\"\")","v":{"$error":"#REF!"}},null,null,null,null,null,null,null,null,null,null,null,null,null,null,null,null,null,null,null,null,null,null,null,{"$f":"IF(Übertrag!A7>0,VLOOKUP(Übertrag!A7,#REF!,6,FALSE),\"\")","v":{"$error":"#REF!"}}]
[]
[]
[]
[]
[]
[]
[]
[]
[]
[]
[{"$f":"IF(Übertrag!A6>0,VLOOKUP(Übertrag!A6,Datenbank[],7,FALSE),\"\")","v":"2025-07-16"},null,null,null,null,null,null,null,null,null,null,null,null,null,null,null,null,null,null,null,null,null,null,null,{"$f":"IF(Übertrag!A7>0,VLOOKUP(Übertrag!A7,Datenbank[],7,FALSE),\"\")","v":"2025-07-16"}]
[]
[]
[]
[]
[]
[]
[]
[{"$f":"IF(Übertrag!A8>0,VLOOKUP(Übertrag!A8,#REF!,2,FALSE),\"\")","v":{"$error":"#REF!"}},null,null,null,null,null,null,null,null,null,null,null,null,null,null,null,null,null,null,{"$f":"IF(Übertrag!A8>0,VLOOKUP(Übertrag!A8,#REF!,7,FALSE),\"\")","v":{"$error":"#REF!"}},null,null,null,null,{"$f":"IF(Übertrag!A9>0,VLOOKUP(Übertrag!A9,#REF!,2,FALSE),\"\")","v":{"$error":"#REF!"}},null,null,null,null,null,null,null,null,null,null,null,null,null,null,null,null,null,null,{"$f":"IF(Übertrag!A9>0,VLOOKUP(Übertrag!A9,#REF!,7,FALSE),\"\")","v":{"$error":"#REF!"}}]
[]
[]
[]
[]
[{"$f":"IF(Übertrag!A8>0,VLOOKUP(Übertrag!A8,#REF!,3,FALSE),\"\")","v":{"$error":"#REF!"}},null,null,null,null,null,null,null,null,null,null,null,null,null,null,null,null,null,null,{"$f":"IF(Übertrag!A8>0,VLOOKUP(Übertrag!A8,#REF!,8,FALSE),\"\")","v":{"$error":"#REF!"}},null,null,null,null,{"$f":"IF(Übertrag!A9>0,VLOOKUP(Übertrag!A9,#REF!,3,FALSE),\"\")","v":{"$error":"#REF!"}},null,null,null,null,null,null,null,null,null,null,null,null,null,null,null,null,null,null,{"$f":"IF(Übertrag!A9>0,VLOOKUP(Übertrag!A9,#REF!,8,FALSE),\"\")","v":{"$error":"#REF!"}}]
[]
[]
[]
[{"$f":"_xlfn.IFS(Übertrag!A8=\"\",\"\",K212=\"1\",VLOOKUP(Übertrag!A8,#REF!,17,FALSE),Übertrag!A8>0,VLOOKUP(Übertrag!A8,#REF!,16,FALSE))","v":{"$error":"#REF!"}},null,null,null,null,null,null,null,null,null,null,{"$f":"IF(Übertrag!A8>0,VLOOKUP(Übertrag!A8,#REF!,13,FALSE),\"\")","v":{"$error":"#REF!"}},null,null,null,null,null,null,null,{"$f":"IF(Übertrag!A8>0,VLOOKUP(Übertrag!A8,#REF!,4,FALSE),\"\")","v":{"$error":"#REF!"}},null,null,null,null,{"$f":"_xlfn.IFS(Übertrag!A9=\"\",\"\",AI212=\"1\",VLOOKUP(Übertrag!A9,#REF!,17,FALSE),Übertrag!A9>0,VLOOKUP(Übertrag!A9,#REF!,16,FALSE))","v":{"$error":"#REF!"}},null,null,null,null,null,null,null,null,null,null,{"$f":"IF(Übertrag!A9>0,VLOOKUP(Übertrag!A9,#REF!,13,FALSE),\"\")","v":{"$error":"#REF!"}},null,null,null,null,null,null,null,{"$f":"IF(Übertrag!A9>0,VLOOKUP(Übertrag!A9,#REF!,4,FALSE),\"\")","v":{"$error":"#REF!"}}]
[]
[]
[]
[null,null,null,null,null,null,null,null,null,null,null,{"$f":"IF(Übertrag!A8>0,VLOOKUP(Übertrag!A8,#REF!,11,FALSE),\"\")","v":{"$error":"#REF!"}},null,null,null,null,null,null,null,null,null,null,null,null,null,null,null,null,null,null,null,null,null,null,null,{"$f":"IF(Übertrag!A9>0,VLOOKUP(Übertrag!A9,#REF!,11,FALSE),\"\")","v":{"$error":"#REF!"}}]
[]
[]
[]
[]
[]
[]
[]
[]
[]
[]
[]
[]
[]
[]
[]
[]
[]
[null,{"$f":"IF(Übertrag!A8>0,VLOOKUP(Übertrag!A8,#REF!,14,FALSE),\"\")","v":{"$error":"#REF!"}},null,null,null,null,null,null,null,null,{"$f":"IF(Übertrag!A8>0,VLOOKUP(Übertrag!A8,#REF!,15,FALSE),\"\")","v":{"$error":"#REF!"}},{"$f":"IF(N212=\"\",\"\",\"1kg=\")","v":{"$error":"#REF!"}},null,{"$f":"IF(Q212=0,\"\",IF(T212=\"kg\",SUM(L194/Q212),IF(T212=\"g\",SUM(L194/Q212*1000),IF(T212=\"gr\",SUM(L194/Q212*1000),\"\"))))","v":{"$error":"#REF!"}},null,null,{"$f":"IF(Übertrag!A8>0,VLOOKUP(Übertrag!A8,#REF!,9,FALSE),\"\")","v":{"$error":"#REF!"}},null,null,{"$f":"IF(Übertrag!A8>0,VLOOKUP(Übertrag!A8,#REF!,10,FALSE),\"\")","v":{"$error":"#REF!"}},{"$f":"IF(Übertrag!A8>0,VLOOKUP(Übertrag!A8,#REF!,12,FALSE),\"\")","v":{"$error":"#REF!"}},null,null,null,null,{"$f":"IF(Übertrag!A9>0,VLOOKUP(Übertrag!A9,#REF!,14,FALSE),\"\")","v":{"$error":"#REF!"}},null,null,null,null,null,null,null,null,{"$f":"IF(Übertrag!A9>0,VLOOKUP(Übertrag!A9,#REF!,15,FALSE),\"\")","v":{"$error":"#REF!"}},{"$f":"IF(AL212=\"\",\"\",\"1kg=\")","v":{"$error":"#REF!"}},null,{"$f":"IF(AO212=0,\"\",IF(AR212=\"kg\",SUM(AJ194/AO212),IF(AR212=\"g\",SUM(AJ194/AO212*1000),IF(AR212=\"gr\",SUM(AJ194/AO212*1000),\"\"))))","v":{"$error":"#REF!"}},null,null,{"$f":"IF(Übertrag!A9>0,VLOOKUP(Übertrag!A9,#REF!,9,FALSE),\"\")","v":{"$error":"#REF!"}},null,null,{"$f":"IF(Übertrag!A9>0,VLOOKUP(Übertrag!A9,#REF!,10,FALSE),\"\")","v":{"$error":"#REF!"}},{"$f":"IF(Übertrag!A9>0,VLOOKUP(Übertrag!A9,#REF!,12,FALSE),\"\")","v":{"$error":"#REF!"}}]
[]
[]
[{"$f":"IF(Übertrag!A8>0,VLOOKUP(Übertrag!A8,#REF!,5,FALSE),\"\")","v":{"$error":"#REF!"}},null,null,null,null,null,null,null,null,null,null,null,null,null,null,null,null,null,null,null,null,null,null,null,{"$f":"IF(Übertrag!A9>0,VLOOKUP(Übertrag!A9,#REF!,5,FALSE),\"\")","v":{"$error":"#REF!"}}]
[]
[]
[]
[{"$f":"IF(Übertrag!A8>0,VLOOKUP(Übertrag!A8,#REF!,6,FALSE),\"\")","v":{"$error":"#REF!"}},null,null,null,null,null,null,null,null,null,null,null,null,null,null,null,null,null,null,null,null,null,null,null,{"$f":"IF(Übertrag!A9>0,VLOOKUP(Übertrag!A9,#REF!,6,FALSE),\"\")","v":{"$error":"#REF!"}}]
[]
[]
[]
[]
[]
[]
[]
[]
[]
[]
[{"$f":"IF(Übertrag!A8>0,VLOOKUP(Übertrag!A8,Datenbank[],7,FALSE),\"\")","v":"2025-07-16"},null,null,null,null,null,null,null,null,null,null,null,null,null,null,null,null,null,null,null,null,null,null,null,{"$f":"IF(Übertrag!A9>0,VLOOKUP(Übertrag!A9,Datenbank[],7,FALSE),\"\")","v":"2025-07-16"}]
[{"$f":"IF(Übertrag!A10>0,VLOOKUP(Übertrag!A10,#REF!,2,FALSE),\"\")","v":""},null,null,null,null,null,null,null,null,null,null,null,null,null,null,null,null,null,null,{"$f":"IF(Übertrag!A10>0,VLOOKUP(Übertrag!A10,#REF!,7,FALSE),\"\")","v":""},null,null,null,null,{"$f":"IF(Übertrag!A11>0,VLOOKUP(Übertrag!A11,#REF!,2,FALSE),\"\")","v":""},null,null,null,null,null,null,null,null,null,null,null,null,null,null,null,null,null,null,{"$f":"IF(Übertrag!A11>0,VLOOKUP(Übertrag!A11,#REF!,7,FALSE),\"\")","v":""}]
[]
[]
[]
[]
[{"$f":"IF(Übertrag!A10>0,VLOOKUP(Übertrag!A10,#REF!,3,FALSE),\"\")","v":""},null,null,null,null,null,null,null,null,null,null,null,null,null,null,null,null,null,null,{"$f":"IF(Übertrag!A10>0,VLOOKUP(Übertrag!A10,#REF!,8,FALSE),\"\")","v":""},null,null,null,null,{"$f":"IF(Übertrag!A11>0,VLOOKUP(Übertrag!A11,#REF!,3,FALSE),\"\")","v":""},null,null,null,null,null,null,null,null,null,null,null,null,null,null,null,null,null,null,{"$f":"IF(Übertrag!A11>0,VLOOKUP(Übertrag!A11,#REF!,8,FALSE),\"\")","v":""}]
[]
[]
[]
[{"$f":"_xlfn.IFS(Übertrag!A10=\"\",\"\",K262=\"1\",VLOOKUP(Übertrag!A10,#REF!,17,FALSE),Übertrag!A10>0,VLOOKUP(Übertrag!A10,#REF!,16,FALSE))","v":""},null,null,null,null,null,null,null,null,null,null,{"$f":"IF(Übertrag!A10>0,VLOOKUP(Übertrag!A10,#REF!,13,FALSE),\"\")","v":""},null,null,null,null,null,null,null,{"$f":"IF(Übertrag!A10>0,VLOOKUP(Übertrag!A10,#REF!,4,FALSE),\"\")","v":""},null,null,null,null,{"$f":"_xlfn.IFS(Übertrag!A11=\"\",\"\",AI262=\"1\",VLOOKUP(Übertrag!A11,#REF!,17,FALSE),Übertrag!A11>0,VLOOKUP(Übertrag!A11,#REF!,16,FALSE))","v":""},null,null,null,null,null,null,null,null,null,null,{"$f":"IF(Übertrag!A11>0,VLOOKUP(Übertrag!A11,#REF!,13,FALSE),\"\")","v":""},null,null,null,null,null,null,null,{"$f":"IF(Übertrag!A11>0,VLOOKUP(Übertrag!A11,#REF!,4,FALSE),\"\")","v":""}]
[]
[]
[]
[null,null,null,null,null,null,null,null,null,null,null,{"$f":"IF(Übertrag!A10>0,VLOOKUP(Übertrag!A10,#REF!,11,FALSE),\"\")","v":""},null,null,null,null,null,null,null,null,null,null,null,null,null,null,null,null,null,null,null,null,null,null,null,{"$f":"IF(Übertrag!A11>0,VLOOKUP(Übertrag!A11,#REF!,11,FALSE),\"\")","v":""}]
[]
[]
[]
[]
[]
[]
[]
[]
[]
[]
[]
[]
[]
[]
[]
[]
[]
[null,{"$f":"IF(Übertrag!A10>0,VLOOKUP(Übertrag!A10,#REF!,14,FALSE),\"\")","v":""},null,null,null,null,null,null,null,null,{"$f":"IF(Übertrag!A10>0,VLOOKUP(Übertrag!A10,#REF!,15,FALSE),\"\")","v":""},{"$f":"IF(N262=\"\",\"\",\"1kg=\")","v":""},null,{"$f":"IF(Q262=0,\"\",IF(T262=\"kg\",SUM(L244/Q262),IF(T262=\"g\",SUM(L244/Q262*1000),IF(T262=\"gr\",SUM(L244/Q262*1000),\"\"))))","v":""},null,null,{"$f":"IF(Übertrag!A10>0,VLOOKUP(Übertrag!A10,#REF!,9,FALSE),\"\")","v":""},null,null,{"$f":"IF(Übertrag!A10>0,VLOOKUP(Übertrag!A10,#REF!,10,FALSE),\"\")","v":""},{"$f":"IF(Übertrag!A10>0,VLOOKUP(Übertrag!A10,#REF!,12,FALSE),\"\")","v":""},null,null,null,null,{"$f":"IF(Übertrag!A11>0,VLOOKUP(Übertrag!A11,#REF!,14,FALSE),\"\")","v":""},null,null,null,null,null,null,null,null,{"$f":"IF(Übertrag!A11>0,VLOOKUP(Übertrag!A11,#REF!,15,FALSE),\"\")","v":""},{"$f":"IF(AL262=\"\",\"\",\"1kg=\")","v":""},null,{"$f":"IF(AO262=0,\"\",IF(AR262=\"kg\",SUM(AJ244/AO262),IF(AR262=\"g\",SUM(AJ244/AO262*1000),IF(AR262=\"gr\",SUM(AJ244/AO262*1000),\"\"))))","v":""},null,null,{"$f":"IF(Übertrag!A11>0,VLOOKUP(Übertrag!A11,#REF!,9,FALSE),\"\")","v":""},null,null,{"$f":"IF(Übertrag!A11>0,VLOOKUP(Übertrag!A11,#REF!,10,FALSE),\"\")","v":""},{"$f":"IF(Übertrag!A11>0,VLOOKUP(Übertrag!A11,#REF!,12,FALSE),\"\")","v":""}]
[]
[]
[{"$f":"IF(Übertrag!A10>0,VLOOKUP(Übertrag!A10,#REF!,5,FALSE),\"\")","v":""},null,null,null,null,null,null,null,null,null,null,null,null,null,null,null,null,null,null,null,null,null,null,null,{"$f":"IF(Übertrag!A11>0,VLOOKUP(Übertrag!A11,#REF!,5,FALSE),\"\")","v":""}]
[]
[]
[]
[{"$f":"IF(Übertrag!A10>0,VLOOKUP(Übertrag!A10,#REF!,6,FALSE),\"\")","v":""},null,null,null,null,null,null,null,null,null,null,null,null,null,null,null,null,null,null,null,null,null,null,null,{"$f":"IF(Übertrag!A11>0,VLOOKUP(Übertrag!A11,#REF!,6,FALSE),\"\")","v":""}]
[]
[]
[]
[]
[]
[]
[]
[]
[]
[]
[]
[]
[]
[]
[]
[]
[]
[]
[{"$f":"IF(Übertrag!A12>0,VLOOKUP(Übertrag!A12,#REF!,2,FALSE),\"\")","v":""},null,null,null,null,null,null,null,null,null,null,null,null,null,null,null,null,null,null,{"$f":"IF(Übertrag!A12>0,VLOOKUP(Übertrag!A12,#REF!,7,FALSE),\"\")","v":""},null,null,null,null,{"$f":"IF(Übertrag!A13>0,VLOOKUP(Übertrag!A13,#REF!,2,FALSE),\"\")","v":""},null,null,null,null,null,null,null,null,null,null,null,null,null,null,null,null,null,null,{"$f":"IF(Übertrag!A13>0,VLOOKUP(Übertrag!A13,#REF!,7,FALSE),\"\")","v":""}]
[]
[]
[]
[]
[{"$f":"IF(Übertrag!A12>0,VLOOKUP(Übertrag!A12,#REF!,3,FALSE),\"\")","v":""},null,null,null,null,null,null,null,null,null,null,null,null,null,null,null,null,null,null,{"$f":"IF(Übertrag!A12>0,VLOOKUP(Übertrag!A12,#REF!,8,FALSE),\"\")","v":""},null,null,null,null,{"$f":"IF(Übertrag!A13>0,VLOOKUP(Übertrag!A13,#REF!,3,FALSE),\"\")","v":""},null,null,null,null,null,null,null,null,null,null,null,null,null,null,null,null,null,null,{"$f":"IF(Übertrag!A13>0,VLOOKUP(Übertrag!A13,#REF!,8,FALSE),\"\")","v":""}]
[]
[]
[]
[{"$f":"_xlfn.IFS(Übertrag!A12=\"\",\"\",K319=\"1\",VLOOKUP(Übertrag!A12,#REF!,17,FALSE),Übertrag!A12>0,VLOOKUP(Übertrag!A12,#REF!,16,FALSE))","v":""},null,null,null,null,null,null,null,null,null,null,{"$f":"IF(Übertrag!A12>0,VLOOKUP(Übertrag!A12,#REF!,13,FALSE),\"\")","v":""},null,null,null,null,null,null,null,{"$f":"IF(Übertrag!A12>0,VLOOKUP(Übertrag!A12,#REF!,4,FALSE),\"\")","v":""},null,null,null,null,{"$f":"_xlfn.IFS(Übertrag!A13=\"\",\"\",AI319=\"1\",VLOOKUP(Übertrag!A13,#REF!,17,FALSE),Übertrag!A13>0,VLOOKUP(Übertrag!A13,#REF!,16,FALSE))","v":""},null,null,null,null,null,null,null,null,null,null,{"$f":"IF(Übertrag!A13>0,VLOOKUP(Übertrag!A13,#REF!,13,FALSE),\"\")","v":""},null,null,null,null,null,null,null,{"$f":"IF(Übertrag!A13>0,VLOOKUP(Übertrag!A13,#REF!,4,FALSE),\"\")","v":""}]
[]
[]
[]
[null,null,null,null,null,null,null,null,null,null,null,{"$f":"IF(Übertrag!A12>0,VLOOKUP(Übertrag!A12,#REF!,11,FALSE),\"\")","v":""},null,null,null,null,null,null,null,null,null,null,null,null,null,null,null,null,null,null,null,null,null,null,null,{"$f":"IF(Übertrag!A13>0,VLOOKUP(Übertrag!A13,#REF!,11,FALSE),\"\")","v":""}]
[]
[]
[]
[]
[]
[]
[]
[]
[]
[]
[]
[]
[]
[]
[]
[]
[]
[null,{"$f":"IF(Übertrag!A12>0,VLOOKUP(Übertrag!A12,#REF!,14,FALSE),\"\")","v":""},null,null,null,null,null,null,null,null,{"$f":"IF(Übertrag!A12>0,VLOOKUP(Übertrag!A12,#REF!,15,FALSE),\"\")","v":""},{"$f":"IF(N319=\"\",\"\",\"1kg=\")","v":""},null,{"$f":"IF(Q319=0,\"\",IF(T319=\"kg\",SUM(L301/Q319),IF(T319=\"g\",SUM(L301/Q319*1000),IF(T319=\"gr\",SUM(L301/Q319*1000),\"\"))))","v":""},null,null,{"$f":"IF(Übertrag!A12>0,VLOOKUP(Übertrag!A12,#REF!,9,FALSE),\"\")","v":""},null,null,{"$f":"IF(Übertrag!A12>0,VLOOKUP(Übertrag!A12,#REF!,10,FALSE),\"\")","v":""},{"$f":"IF(Übertrag!A12>0,VLOOKUP(Übertrag!A12,#REF!,12,FALSE),\"\")","v":""},null,null,null,null,{"$f":"IF(Übertrag!A13>0,VLOOKUP(Übertrag!A13,#REF!,14,FALSE),\"\")","v":""},null,null,null,null,null,null,null,null,{"$f":"IF(Übertrag!A13>0,VLOOKUP(Übertrag!A13,#REF!,15,FALSE),\"\")","v":""},{"$f":"IF(AL319=\"\",\"\",\"1kg=\")","v":""},null,{"$f":"IF(AO319=0,\"\",IF(AR319=\"kg\",SUM(AJ301/AO319),IF(AR319=\"g\",SUM(AJ301/AO319*1000),IF(AR319=\"gr\",SUM(AJ301/AO319*1000),\"\"))))","v":""},null,null,{"$f":"IF(Übertrag!A13>0,VLOOKUP(Übertrag!A13,#REF!,9,FALSE),\"\")","v":""},null,null,{"$f":"IF(Übertrag!A13>0,VLOOKUP(Übertrag!A13,#REF!,10,FALSE),\"\")","v":""},{"$f":"IF(Übertrag!A13>0,VLOOKUP(Übertrag!A13,#REF!,12,FALSE),\"\")","v":""}]
[]
[]
[{"$f":"IF(Übertrag!A12>0,VLOOKUP(Übertrag!A12,#REF!,5,FALSE),\"\")","v":""},null,null,null,null,null,null,null,null,null,null,null,null,null,null,null,null,null,null,null,null,null,null,null,{"$f":"IF(Übertrag!A13>0,VLOOKUP(Übertrag!A13,#REF!,5,FALSE),\"\")","v":""}]
[]
[]
[]
[{"$f":"IF(Übertrag!A12>0,VLOOKUP(Übertrag!A12,#REF!,6,FALSE),\"\")","v":""},null,null,null,null,null,null,null,null,null,null,null,null,null,null,null,null,null,null,null,null,null,null,null,{"$f":"IF(Übertrag!A13>0,VLOOKUP(Übertrag!A13,#REF!,6,FALSE),\"\")","v":""}]
[]
[]
[]
[]
[]
[]
[]
[]
[]
[]
[]
[]
[]
[]
[]
[]
[]
[]
[{"$f":"IF(Übertrag!A14>0,VLOOKUP(Übertrag!A14,#REF!,2,FALSE),\"\")","v":""},null,null,null,null,null,null,null,null,null,null,null,null,null,null,null,null,null,null,{"$f":"IF(Übertrag!A14>0,VLOOKUP(Übertrag!A14,#REF!,7,FALSE),\"\")","v":""},null,null,null,null,{"$f":"IF(Übertrag!A15>0,VLOOKUP(Übertrag!A15,#REF!,2,FALSE),\"\")","v":""},null,null,null,null,null,null,null,null,null,null,null,null,null,null,null,null,null,null,{"$f":"IF(Übertrag!A15>0,VLOOKUP(Übertrag!A15,#REF!,7,FALSE),\"\")","v":""}]
[]
[]
[]
[]
[{"$f":"IF(Übertrag!A14>0,VLOOKUP(Übertrag!A14,#REF!,3,FALSE),\"\")","v":""},null,null,null,null,null,null,null,null,null,null,null,null,null,null,null,null,null,null,{"$f":"IF(Übertrag!A14>0,VLOOKUP(Übertrag!A14,#REF!,8,FALSE),\"\")","v":""},null,null,null,null,{"$f":"IF(Übertrag!A15>0,VLOOKUP(Übertrag!A15,#REF!,3,FALSE),\"\")","v":""},null,null,null,null,null,null,null,null,null,null,null,null,null,null,null,null,null,null,{"$f":"IF(Übertrag!A15>0,VLOOKUP(Übertrag!A15,#REF!,8,FALSE),\"\")","v":""}]
[]
[]
[]
[{"$f":"_xlfn.IFS(Übertrag!A14=\"\",\"\",K376=\"1\",VLOOKUP(Übertrag!A14,#REF!,17,FALSE),Übertrag!A14>0,VLOOKUP(Übertrag!A14,#REF!,16,FALSE))","v":""},null,null,null,null,null,null,null,null,null,null,{"$f":"IF(Übertrag!A14>0,VLOOKUP(Übertrag!A14,#REF!,13,FALSE),\"\")","v":""},null,null,null,null,null,null,null,{"$f":"IF(Übertrag!A14>0,VLOOKUP(Übertrag!A14,#REF!,4,FALSE),\"\")","v":""},null,null,null,null,{"$f":"_xlfn.IFS(Übertrag!A15=\"\",\"\",AI376=\"1\",VLOOKUP(Übertrag!A15,#REF!,17,FALSE),Übertrag!A15>0,VLOOKUP(Übertrag!A15,#REF!,16,FALSE))","v":""},null,null,null,null,null,null,null,null,null,null,{"$f":"IF(Übertrag!A15>0,VLOOKUP(Übertrag!A15,#REF!,13,FALSE),\"\")","v":""},null,null,null,null,null,null,null,{"$f":"IF(Übertrag!A15>0,VLOOKUP(Übertrag!A15,#REF!,4,FALSE),\"\")","v":""}]
[]
[]
[]
[null,null,null,null,null,null,null,null,null,null,null,{"$f":"IF(Übertrag!A14>0,VLOOKUP(Übertrag!A14,#REF!,11,FALSE),\"\")","v":""},null,null,null,null,null,null,null,null,null,null,null,null,null,null,null,null,null,null,null,null,null,null,null,{"$f":"IF(Übertrag!A15>0,VLOOKUP(Übertrag!A15,#REF!,11,FALSE),\"\")","v":""}]
[]
[]
[]
[]
[]
[]
[]
[]
[]
[]
[]
[]
[]
[]
[]
[]
[]
[null,{"$f":"IF(Übertrag!A14>0,VLOOKUP(Übertrag!A14,#REF!,14,FALSE),\"\")","v":""},null,null,null,null,null,null,null,null,{"$f":"IF(Übertrag!A14>0,VLOOKUP(Übertrag!A14,#REF!,15,FALSE),\"\")","v":""},{"$f":"IF(N376=\"\",\"\",\"1kg=\")","v":""},null,{"$f":"IF(Q376=0,\"\",IF(T376=\"kg\",SUM(L358/Q376),IF(T376=\"g\",SUM(L358/Q376*1000),IF(T376=\"gr\",SUM(L358/Q376*1000),\"\"))))","v":""},null,null,{"$f":"IF(Übertrag!A14>0,VLOOKUP(Übertrag!A14,#REF!,9,FALSE),\"\")","v":""},null,null,{"$f":"IF(Übertrag!A14>0,VLOOKUP(Übertrag!A14,#REF!,10,FALSE),\"\")","v":""},{"$f":"IF(Übertrag!A14>0,VLOOKUP(Übertrag!A14,#REF!,12,FALSE),\"\")","v":""},null,null,null,null,{"$f":"IF(Übertrag!A15>0,VLOOKUP(Übertrag!A15,#REF!,14,FALSE),\"\")","v":""},null,null,null,null,null,null,null,null,{"$f":"IF(Übertrag!A15>0,VLOOKUP(Übertrag!A15,#REF!,15,FALSE),\"\")","v":""},{"$f":"IF(AL376=\"\",\"\",\"1kg=\")","v":""},null,{"$f":"IF(AO376=0,\"\",IF(AR376=\"kg\",SUM(AJ358/AO376),IF(AR376=\"g\",SUM(AJ358/AO376*1000),IF(AR376=\"gr\",SUM(AJ358/AO376*1000),\"\"))))","v":""},null,null,{"$f":"IF(Übertrag!A15>0,VLOOKUP(Übertrag!A15,#REF!,9,FALSE),\"\")","v":""},null,null,{"$f":"IF(Übertrag!A15>0,VLOOKUP(Übertrag!A15,#REF!,10,FALSE),\"\")","v":""},{"$f":"IF(Übertrag!A15>0,VLOOKUP(Übertrag!A15,#REF!,12,FALSE),\"\")","v":""}]
[]
[]
[{"$f":"IF(Übertrag!A14>0,VLOOKUP(Übertrag!A14,#REF!,5,FALSE),\"\")","v":""},null,null,null,null,null,null,null,null,null,null,null,null,null,null,null,null,null,null,null,null,null,null,null,{"$f":"IF(Übertrag!A15>0,VLOOKUP(Übertrag!A15,#REF!,5,FALSE),\"\")","v":""}]
[]
[]
[]
[{"$f":"IF(Übertrag!A14>0,VLOOKUP(Übertrag!A14,#REF!,6,FALSE),\"\")","v":""},null,null,null,null,null,null,null,null,null,null,null,null,null,null,null,null,null,null,null,null,null,null,null,{"$f":"IF(Übertrag!A15>0,VLOOKUP(Übertrag!A15,#REF!,6,FALSE),\"\")","v":""}]
[]
[]
[]
[]
[]
[]
[]
[]
[]
[]
[]
[]
[]
[]
[]
[]
[]
[]
[{"$f":"IF(Übertrag!A16>0,VLOOKUP(Übertrag!A16,#REF!,2,FALSE),\"\")","v":""},null,null,null,null,null,null,null,null,null,null,null,null,null,null,null,null,null,null,{"$f":"IF(Übertrag!A16>0,VLOOKUP(Übertrag!A16,#REF!,7,FALSE),\"\")","v":""},null,null,null,null,{"$f":"IF(Übertrag!A17>0,VLOOKUP(Übertrag!A17,#REF!,2,FALSE),\"\")","v":""},null,null,null,null,null,null,null,null,null,null,null,null,null,null,null,null,null,null,{"$f":"IF(Übertrag!A17>0,VLOOKUP(Übertrag!A17,#REF!,7,FALSE),\"\")","v":""}]
[]
[]
[]
[]
[{"$f":"IF(Übertrag!A16>0,VLOOKUP(Übertrag!A16,#REF!,3,FALSE),\"\")","v":""},null,null,null,null,null,null,null,null,null,null,null,null,null,null,null,null,null,null,{"$f":"IF(Übertrag!A16>0,VLOOKUP(Übertrag!A16,#REF!,8,FALSE),\"\")","v":""},null,null,null,null,{"$f":"IF(Übertrag!A17>0,VLOOKUP(Übertrag!A17,#REF!,3,FALSE),\"\")","v":""},null,null,null,null,null,null,null,null,null,null,null,null,null,null,null,null,null,null,{"$f":"IF(Übertrag!A17>0,VLOOKUP(Übertrag!A17,#REF!,8,FALSE),\"\")","v":""}]
[]
[]
[]
[{"$f":"_xlfn.IFS(Übertrag!A16=\"\",\"\",K433=\"1\",VLOOKUP(Übertrag!A16,#REF!,17,FALSE),Übertrag!A16>0,VLOOKUP(Übertrag!A16,#REF!,16,FALSE))","v":""},null,null,null,null,null,null,null,null,null,null,{"$f":"IF(Übertrag!A16>0,VLOOKUP(Übertrag!A16,#REF!,13,FALSE),\"\")","v":""},null,null,null,null,null,null,null,{"$f":"IF(Übertrag!A16>0,VLOOKUP(Übertrag!A16,#REF!,4,FALSE),\"\")","v":""},null,null,null,null,{"$f":"_xlfn.IFS(Übertrag!A17=\"\",\"\",AI433=\"1\",VLOOKUP(Übertrag!A17,#REF!,17,FALSE),Übertrag!A17>0,VLOOKUP(Übertrag!A17,#REF!,16,FALSE))","v":""},null,null,null,null,null,null,null,null,null,null,{"$f":"IF(Übertrag!A17>0,VLOOKUP(Übertrag!A17,#REF!,13,FALSE),\"\")","v":""},null,null,null,null,null,null,null,{"$f":"IF(Übertrag!A17>0,VLOOKUP(Übertrag!A17,#REF!,4,FALSE),\"\")","v":""}]
[]
[]
[]
[null,null,null,null,null,null,null,null,null,null,null,{"$f":"IF(Übertrag!A16>0,VLOOKUP(Übertrag!A16,#REF!,11,FALSE),\"\")","v":""},null,null,null,null,null,null,null,null,null,null,null,null,null,null,null,null,null,null,null,null,null,null,null,{"$f":"IF(Übertrag!A17>0,VLOOKUP(Übertrag!A17,#REF!,11,FALSE),\"\")","v":""}]
[]
[]
[]
[]
[]
[]
[]
[]
[]
[]
[]
[]
[]
[]
[]
[]
[]
[null,{"$f":"IF(Übertrag!A16>0,VLOOKUP(Übertrag!A16,#REF!,14,FALSE),\"\")","v":""},null,null,null,null,null,null,null,null,{"$f":"IF(Übertrag!A16>0,VLOOKUP(Übertrag!A16,#REF!,15,FALSE),\"\")","v":""},{"$f":"IF(N433=\"\",\"\",\"1kg=\")","v":""},null,{"$f":"IF(Q433=0,\"\",IF(T433=\"kg\",SUM(L415/Q433),IF(T433=\"g\",SUM(L415/Q433*1000),IF(T433=\"gr\",SUM(L415/Q433*1000),\"\"))))","v":""},null,null,{"$f":"IF(Übertrag!A16>0,VLOOKUP(Übertrag!A16,#REF!,9,FALSE),\"\")","v":""},null,null,{"$f":"IF(Übertrag!A16>0,VLOOKUP(Übertrag!A16,#REF!,10,FALSE),\"\")","v":""},{"$f":"IF(Übertrag!A16>0,VLOOKUP(Übertrag!A16,#REF!,12,FALSE),\"\")","v":""},null,null,null,null,{"$f":"IF(Übertrag!A17>0,VLOOKUP(Übertrag!A17,#REF!,14,FALSE),\"\")","v":""},null,null,null,null,null,null,null,null,{"$f":"IF(Übertrag!A17>0,VLOOKUP(Übertrag!A17,#REF!,15,FALSE),\"\")","v":""},{"$f":"IF(AL433=\"\",\"\",\"1kg=\")","v":""},null,{"$f":"IF(AO433=0,\"\",IF(AR433=\"kg\",SUM(AJ415/AO433),IF(AR433=\"g\",SUM(AJ415/AO433*1000),IF(AR433=\"gr\",SUM(AJ415/AO433*1000),\"\"))))","v":""},null,null,{"$f":"IF(Übertrag!A17>0,VLOOKUP(Übertrag!A17,#REF!,9,FALSE),\"\")","v":""},null,null,{"$f":"IF(Übertrag!A17>0,VLOOKUP(Übertrag!A17,#REF!,10,FALSE),\"\")","v":""},{"$f":"IF(Übertrag!A17>0,VLOOKUP(Übertrag!A17,#REF!,12,FALSE),\"\")","v":""}]
[]
[]
[{"$f":"IF(Übertrag!A16>0,VLOOKUP(Übertrag!A16,#REF!,5,FALSE),\"\")","v":""},null,null,null,null,null,null,null,null,null,null,null,null,null,null,null,null,null,null,null,null,null,null,null,{"$f":"IF(Übertrag!A17>0,VLOOKUP(Übertrag!A17,#REF!,5,FALSE),\"\")","v":""}]
[]
[]
[]
[{"$f":"IF(Übertrag!A16>0,VLOOKUP(Übertrag!A16,#REF!,6,FALSE),\"\")","v":""},null,null,null,null,null,null,null,null,null,null,null,null,null,null,null,null,null,null,null,null,null,null,null,{"$f":"IF(Übertrag!A17>0,VLOOKUP(Übertrag!A17,#REF!,6,FALSE),\"\")","v":""}]
[]
[]
[]
[]
[]
[]
[]
[]
[]
[]
[]
[{"$f":"IF(Übertrag!A18>0,VLOOKUP(Übertrag!A18,#REF!,2,FALSE),\"\")","v":""},null,null,null,null,null,null,null,null,null,null,null,null,null,null,null,null,null,null,{"$f":"IF(Übertrag!A18>0,VLOOKUP(Übertrag!A18,#REF!,7,FALSE),\"\")","v":""},null,null,null,null,{"$f":"IF(Übertrag!A19>0,VLOOKUP(Übertrag!A19,#REF!,2,FALSE),\"\")","v":""},null,null,null,null,null,null,null,null,null,null,null,null,null,null,null,null,null,null,{"$f":"IF(Übertrag!A19>0,VLOOKUP(Übertrag!A19,#REF!,7,FALSE),\"\")","v":""}]
[]
[]
[]
[]
[{"$f":"IF(Übertrag!A18>0,VLOOKUP(Übertrag!A18,#REF!,3,FALSE),\"\")","v":""},null,null,null,null,null,null,null,null,null,null,null,null,null,null,null,null,null,null,{"$f":"IF(Übertrag!A18>0,VLOOKUP(Übertrag!A18,#REF!,8,FALSE),\"\")","v":""},null,null,null,null,{"$f":"IF(Übertrag!A19>0,VLOOKUP(Übertrag!A19,#REF!,3,FALSE),\"\")","v":""},null,null,null,null,null,null,null,null,null,null,null,null,null,null,null,null,null,null,{"$f":"IF(Übertrag!A19>0,VLOOKUP(Übertrag!A19,#REF!,8,FALSE),\"\")","v":""}]
[]
[]
[]
[{"$f":"_xlfn.IFS(Übertrag!A18=\"\",\"\",K483=\"1\",VLOOKUP(Übertrag!A18,#REF!,17,FALSE),Übertrag!A18>0,VLOOKUP(Übertrag!A18,#REF!,16,FALSE))","v":""},null,null,null,null,null,null,null,null,null,null,{"$f":"IF(Übertrag!A18>0,VLOOKUP(Übertrag!A18,#REF!,13,FALSE),\"\")","v":""},null,null,null,null,null,null,null,{"$f":"IF(Übertrag!A18>0,VLOOKUP(Übertrag!A18,#REF!,4,FALSE),\"\")","v":""},null,null,null,null,{"$f":"_xlfn.IFS(Übertrag!A19=\"\",\"\",AI483=\"1\",VLOOKUP(Übertrag!A19,#REF!,17,FALSE),Übertrag!A19>0,VLOOKUP(Übertrag!A19,#REF!,16,FALSE))","v":""},null,null,null,null,null,null,null,null,null,null,{"$f":"IF(Übertrag!A19>0,VLOOKUP(Übertrag!A19,#REF!,13,FALSE),\"\")","v":""},null,null,null,null,null,null,null,{"$f":"IF(Übertrag!A19>0,VLOOKUP(Übertrag!A19,#REF!,4,FALSE),\"\")","v":""}]
[]
[]
[]
[null,null,null,null,null,null,null,null,null,null,null,{"$f":"IF(Übertrag!A18>0,VLOOKUP(Übertrag!A18,#REF!,11,FALSE),\"\")","v":""},null,null,null,null,null,null,null,null,null,null,null,null,null,null,null,null,null,null,null,null,null,null,null,{"$f":"IF(Übertrag!A19>0,VLOOKUP(Übertrag!A19,#REF!,11,FALSE),\"\")","v":""}]
[]
[]
[]
[]
[]
[]
[]
[]
[]
[]
[]
[]
[]
[]
[]
[]
[]
[null,{"$f":"IF(Übertrag!A18>0,VLOOKUP(Übertrag!A18,#REF!,14,FALSE),\"\")","v":""},null,null,null,null,null,null,null,null,{"$f":"IF(Übertrag!A18>0,VLOOKUP(Übertrag!A18,#REF!,15,FALSE),\"\")","v":""},{"$f":"IF(N483=\"\",\"\",\"1kg=\")","v":""},null,{"$f":"IF(Q483=0,\"\",IF(T483=\"kg\",SUM(L465/Q483),IF(T483=\"g\",SUM(L465/Q483*1000),IF(T483=\"gr\",SUM(L465/Q483*1000),\"\"))))","v":""},null,null,{"$f":"IF(Übertrag!A18>0,VLOOKUP(Übertrag!A18,#REF!,9,FALSE),\"\")","v":""},null,null,{"$f":"IF(Übertrag!A18>0,VLOOKUP(Übertrag!A18,#REF!,10,FALSE),\"\")","v":""},{"$f":"IF(Übertrag!A18>0,VLOOKUP(Übertrag!A18,#REF!,12,FALSE),\"\")","v":""},null,null,null,null,{"$f":"IF(Übertrag!A19>0,VLOOKUP(Übertrag!A19,#REF!,14,FALSE),\"\")","v":""},null,null,null,null,null,null,null,null,{"$f":"IF(Übertrag!A19>0,VLOOKUP(Übertrag!A19,#REF!,15,FALSE),\"\")","v":""},{"$f":"IF(AL483=\"\",\"\",\"1kg=\")","v":""},null,{"$f":"IF(AO483=0,\"\",IF(AR483=\"kg\",SUM(AJ465/AO483),IF(AR483=\"g\",SUM(AJ465/AO483*1000),IF(AR483=\"gr\",SUM(AJ465/AO483*1000),\"\"))))","v":""},null,null,{"$f":"IF(Übertrag!A19>0,VLOOKUP(Übertrag!A19,#REF!,9,FALSE),\"\")","v":""},null,null,{"$f":"IF(Übertrag!A19>0,VLOOKUP(Übertrag!A19,#REF!,10,FALSE),\"\")","v":""},{"$f":"IF(Übertrag!A19>0,VLOOKUP(Übertrag!A19,#REF!,12,FALSE),\"\")","v":""}]
[]
[]
[{"$f":"IF(Übertrag!A18>0,VLOOKUP(Übertrag!A18,#REF!,5,FALSE),\"\")","v":""},null,null,null,null,null,null,null,null,null,null,null,null,null,null,null,null,null,null,null,null,null,null,null,{"$f":"IF(Übertrag!A19>0,VLOOKUP(Übertrag!A19,#REF!,5,FALSE),\"\")","v":""}]
[]
[]
[]
[{"$f":"IF(Übertrag!A18>0,VLOOKUP(Übertrag!A18,#REF!,6,FALSE),\"\")","v":""},null,null,null,null,null,null,null,null,null,null,null,null,null,null,null,null,null,null,null,null,null,null,null,{"$f":"IF(Übertrag!A19>0,VLOOKUP(Übertrag!A19,#REF!,6,FALSE),\"\")","v":""}]
[]
[]
[]
[]
[]
[]
[]
[]
[]
[]
[]
[]
[]
[]
[]
[]
[]
[]
[{"$f":"IF(Übertrag!A20>0,VLOOKUP(Übertrag!A20,#REF!,2,FALSE),\"\")","v":""},null,null,null,null,null,null,null,null,null,null,null,null,null,null,null,null,null,null,{"$f":"IF(Übertrag!A20>0,VLOOKUP(Übertrag!A20,#REF!,7,FALSE),\"\")","v":""},null,null,null,null,{"$f":"IF(Übertrag!A21>0,VLOOKUP(Übertrag!A21,#REF!,2,FALSE),\"\")","v":""},null,null,null,null,null,null,null,null,null,null,null,null,null,null,null,null,null,null,{"$f":"IF(Übertrag!A21>0,VLOOKUP(Übertrag!A21,#REF!,7,FALSE),\"\")","v":""}]
[]
[]
[]
[]
[{"$f":"IF(Übertrag!A20>0,VLOOKUP(Übertrag!A20,#REF!,3,FALSE),\"\")","v":""},null,null,null,null,null,null,null,null,null,null,null,null,null,null,null,null,null,null,{"$f":"IF(Übertrag!A20>0,VLOOKUP(Übertrag!A20,#REF!,8,FALSE),\"\")","v":""},null,null,null,null,{"$f":"IF(Übertrag!A234>0,VLOOKUP(Übertrag!A234,#REF!,3,FALSE),\"\")","v":""},null,null,null,null,null,null,null,null,null,null,null,null,null,null,null,null,null,null,{"$f":"IF(Übertrag!A21>0,VLOOKUP(Übertrag!A21,#REF!,8,FALSE),\"\")","v":""}]
[]
[]
[]
[{"$f":"_xlfn.IFS(Übertrag!A20=\"\",\"\",K540=\"1\",VLOOKUP(Übertrag!A20,#REF!,17,FALSE),Übertrag!A20>0,VLOOKUP(Übertrag!A20,#REF!,16,FALSE))","v":""},null,null,null,null,null,null,null,null,null,null,{"$f":"IF(Übertrag!A20>0,VLOOKUP(Übertrag!A20,#REF!,13,FALSE),\"\")","v":""},null,null,null,null,null,null,null,{"$f":"IF(Übertrag!A20>0,VLOOKUP(Übertrag!A20,#REF!,4,FALSE),\"\")","v":""},null,null,null,null,{"$f":"_xlfn.IFS(Übertrag!A21=\"\",\"\",AI540=\"1\",VLOOKUP(Übertrag!A21,#REF!,17,FALSE),Übertrag!A21>0,VLOOKUP(Übertrag!A21,#REF!,16,FALSE))","v":""},null,null,null,null,null,null,null,null,null,null,{"$f":"IF(Übertrag!A21>0,VLOOKUP(Übertrag!A21,#REF!,13,FALSE),\"\")","v":""},null,null,null,null,null,null,null,{"$f":"IF(Übertrag!A21>0,VLOOKUP(Übertrag!A21,#REF!,4,FALSE),\"\")","v":""}]
[]
[]
[]
[null,null,null,null,null,null,null,null,null,null,null,{"$f":"IF(Übertrag!A20>0,VLOOKUP(Übertrag!A20,#REF!,11,FALSE),\"\")","v":""},null,null,null,null,null,null,null,null,null,null,null,null,null,null,null,null,null,null,null,null,null,null,null,{"$f":"IF(Übertrag!A21>0,VLOOKUP(Übertrag!A21,#REF!,11,FALSE),\"\")","v":""}]
[]
[]
[]
[]
[]
[]
[]
[]
[]
[]
[]
[]
[]
[]
[]
[]
[]
[null,{"$f":"IF(Übertrag!A20>0,VLOOKUP(Übertrag!A20,#REF!,14,FALSE),\"\")","v":""},null,null,null,null,null,null,null,null,{"$f":"IF(Übertrag!A20>0,VLOOKUP(Übertrag!A20,#REF!,15,FALSE),\"\")","v":""},{"$f":"IF(N540=\"\",\"\",\"1kg=\")","v":""},null,{"$f":"IF(Q540=0,\"\",IF(T540=\"kg\",SUM(L522/Q540),IF(T540=\"g\",SUM(L522/Q540*1000),IF(T540=\"gr\",SUM(L522/Q540*1000),\"\"))))","v":""},null,null,{"$f":"IF(Übertrag!A20>0,VLOOKUP(Übertrag!A20,#REF!,9,FALSE),\"\")","v":""},null,null,{"$f":"IF(Übertrag!A20>0,VLOOKUP(Übertrag!A20,#REF!,10,FALSE),\"\")","v":""},{"$f":"IF(Übertrag!A20>0,VLOOKUP(Übertrag!A20,#REF!,12,FALSE),\"\")","v":""},null,null,null,null,{"$f":"IF(Übertrag!A234>0,VLOOKUP(Übertrag!A234,#REF!,14,FALSE),\"\")","v":""},null,null,null,null,null,null,null,null,{"$f":"IF(Übertrag!A234>0,VLOOKUP(Übertrag!A234,#REF!,15,FALSE),\"\")","v":""},{"$f":"IF(AL540=\"\",\"\",\"1kg=\")","v":""},null,{"$f":"IF(AO540=0,\"\",IF(AR540=\"kg\",SUM(AJ522/AO540),IF(AR540=\"g\",SUM(AJ522/AO540*1000),IF(AR540=\"gr\",SUM(AJ522/AO540*1000),\"\"))))","v":""},null,null,{"$f":"IF(Übertrag!A234>0,VLOOKUP(Übertrag!A234,#REF!,9,FALSE),\"\")","v":""},null,null,{"$f":"IF(Übertrag!A234>0,VLOOKUP(Übertrag!A234,#REF!,10,FALSE),\"\")","v":""},{"$f":"IF(Übertrag!A234>0,VLOOKUP(Übertrag!A234,#REF!,12,FALSE),\"\")","v":""}]
[]
[]
[{"$f":"IF(Übertrag!A20>0,VLOOKUP(Übertrag!A20,#REF!,5,FALSE),\"\")","v":""},null,null,null,null,null,null,null,null,null,null,null,null,null,null,null,null,null,null,null,null,null,null,null,{"$f":"IF(Übertrag!A21>0,VLOOKUP(Übertrag!A21,#REF!,5,FALSE),\"\")","v":""}]
[]
[]
[]
[{"$f":"IF(Übertrag!A20>0,VLOOKUP(Übertrag!A20,#REF!,6,FALSE),\"\")","v":""},null,null,null,null,null,null,null,null,null,null,null,null,null,null,null,null,null,null,null,null,null,null,null,{"$f":"IF(Übertrag!A21>0,VLOOKUP(Übertrag!A21,#REF!,6,FALSE),\"\")","v":""}]
[]
[]
[]
[]
[]
[]
[]
[]
[]
[]
[]
[]
[]
[]
[]
[]
[]
[]
[{"$f":"IF(Übertrag!A22>0,VLOOKUP(Übertrag!A22,#REF!,2,FALSE),\"\")","v":""},null,null,null,null,null,null,null,null,null,null,null,null,null,null,null,null,null,null,{"$f":"IF(Übertrag!A22>0,VLOOKUP(Übertrag!A22,#REF!,7,FALSE),\"\")","v":""},null,null,null,null,{"$f":"IF(Übertrag!A23>0,VLOOKUP(Übertrag!A23,#REF!,2,FALSE),\"\")","v":""},null,null,null,null,null,null,null,null,null,null,null,null,null,null,null,null,null,null,{"$f":"IF(Übertrag!A23>0,VLOOKUP(Übertrag!A23,#REF!,7,FALSE),\"\")","v":""}]
[]
[]
[]
[]
[{"$f":"IF(Übertrag!A22>0,VLOOKUP(Übertrag!A22,#REF!,3,FALSE),\"\")","v":""},null,null,null,null,null,null,null,null,null,null,null,null,null,null,null,null,null,null,{"$f":"IF(Übertrag!A22>0,VLOOKUP(Übertrag!A22,#REF!,8,FALSE),\"\")","v":""},null,null,null,null,{"$f":"IF(Übertrag!A23>0,VLOOKUP(Übertrag!A23,#REF!,3,FALSE),\"\")","v":""},null,null,null,null,null,null,null,null,null,null,null,null,null,null,null,null,null,null,{"$f":"IF(Übertrag!A23>0,VLOOKUP(Übertrag!A23,#REF!,8,FALSE),\"\")","v":""}]
[]
[]
[]
[{"$f":"_xlfn.IFS(Übertrag!A22=\"\",\"\",K597=\"1\",VLOOKUP(Übertrag!A22,#REF!,17,FALSE),Übertrag!A22>0,VLOOKUP(Übertrag!A22,#REF!,16,FALSE))","v":""},null,null,null,null,null,null,null,null,null,null,{"$f":"IF(Übertrag!A22>0,VLOOKUP(Übertrag!A22,#REF!,13,FALSE),\"\")","v":""},null,null,null,null,null,null,null,{"$f":"IF(Übertrag!A235>0,VLOOKUP(Übertrag!A235,#REF!,4,FALSE),\"\")","v":""},null,null,null,null,{"$f":"_xlfn.IFS(Übertrag!A23=\"\",\"\",AI597=\"1\",VLOOKUP(Übertrag!A23,#REF!,17,FALSE),Übertrag!A23>0,VLOOKUP(Übertrag!A23,#REF!,16,FALSE))","v":""},null,null,null,null,null,null,null,null,null,null,{"$f":"IF(Übertrag!A23>0,VLOOKUP(Übertrag!A23,#REF!,13,FALSE),\"\")","v":""},null,null,null,null,null,null,null,{"$f":"IF(Übertrag!A23>0,VLOOKUP(Übertrag!A23,#REF!,4,FALSE),\"\")","v":""}]
[]
[]
[]
[null,null,null,null,null,null,null,null,null,null,null,{"$f":"IF(Übertrag!A22>0,VLOOKUP(Übertrag!A22,#REF!,11,FALSE),\"\")","v":""},null,null,null,null,null,null,null,null,null,null,null,null,null,null,null,null,null,null,null,null,null,null,null,{"$f":"IF(Übertrag!A23>0,VLOOKUP(Übertrag!A23,#REF!,11,FALSE),\"\")","v":""}]
[]
[]
[]
[]
[]
[]
[]
[]
[]
[]
[]
[]
[]
[]
[]
[]
[]
[null,{"$f":"IF(Übertrag!A22>0,VLOOKUP(Übertrag!A22,#REF!,14,FALSE),\"\")","v":""},null,null,null,null,null,null,null,null,{"$f":"IF(Übertrag!A22>0,VLOOKUP(Übertrag!A22,#REF!,15,FALSE),\"\")","v":""},{"$f":"IF(N597=\"\",\"\",\"1kg=\")","v":""},null,{"$f":"IF(Q597=0,\"\",IF(T597=\"kg\",SUM(L579/Q597),IF(T597=\"g\",SUM(L579/Q597*1000),IF(T597=\"gr\",SUM(L579/Q597*1000),\"\"))))","v":""},null,null,{"$f":"IF(Übertrag!A22>0,VLOOKUP(Übertrag!A22,#REF!,9,FALSE),\"\")","v":""},null,null,{"$f":"IF(Übertrag!A22>0,VLOOKUP(Übertrag!A22,#REF!,10,FALSE),\"\")","v":""},{"$f":"IF(Übertrag!A22>0,VLOOKUP(Übertrag!A22,#REF!,12,FALSE),\"\")","v":""},null,null,null,null,{"$f":"IF(Übertrag!A23>0,VLOOKUP(Übertrag!A23,#REF!,14,FALSE),\"\")","v":""},null,null,null,null,null,null,null,null,{"$f":"IF(Übertrag!A23>0,VLOOKUP(Übertrag!A23,#REF!,15,FALSE),\"\")","v":""},{"$f":"IF(AL597=\"\",\"\",\"1kg=\")","v":""},null,{"$f":"IF(AO597=0,\"\",IF(AR597=\"kg\",SUM(AJ579/AO597),IF(AR597=\"g\",SUM(AJ579/AO597*1000),IF(AR597=\"gr\",SUM(AJ579/AO597*1000),\"\"))))","v":""},null,null,{"$f":"IF(Übertrag!A23>0,VLOOKUP(Übertrag!A23,#REF!,9,FALSE),\"\")","v":""},null,null,{"$f":"IF(Übertrag!A23>0,VLOOKUP(Übertrag!A23,#REF!,10,FALSE),\"\")","v":""},{"$f":"IF(Übertrag!A23>0,VLOOKUP(Übertrag!A23,#REF!,12,FALSE),\"\")","v":""}]
[]
[]
[{"$f":"IF(Übertrag!A22>0,VLOOKUP(Übertrag!A22,#REF!,5,FALSE),\"\")","v":""},null,null,null,null,null,null,null,null,null,null,null,null,null,null,null,null,null,null,null,null,null,null,null,{"$f":"IF(Übertrag!A23>0,VLOOKUP(Übertrag!A23,#REF!,5,FALSE),\"\")","v":""}]
[]
[]
[]
[{"$f":"IF(Übertrag!A22>0,VLOOKUP(Übertrag!A22,#REF!,6,FALSE),\"\")","v":""},null,null,null,null,null,null,null,null,null,null,null,null,null,null,null,null,null,null,null,null,null,null,null,{"$f":"IF(Übertrag!A23>0,VLOOKUP(Übertrag!A23,#REF!,6,FALSE),\"\")","v":""}]
[]
[]
[]
[]
[]
[]
[]
[]
[]
[]
[]
[]
[]
[]
[]
[]
[]
[]
[{"$f":"IF(Übertrag!A24>0,VLOOKUP(Übertrag!A24,#REF!,2,FALSE),\"\")","v":""},null,null,null,null,null,null,null,null,null,null,null,null,null,null,null,null,null,null,{"$f":"IF(Übertrag!A24>0,VLOOKUP(Übertrag!A24,#REF!,7,FALSE),\"\")","v":""},null,null,null,null,{"$f":"IF(Übertrag!A25>0,VLOOKUP(Übertrag!A25,#REF!,2,FALSE),\"\")","v":""},null,null,null,null,null,null,null,null,null,null,null,null,null,null,null,null,null,null,{"$f":"IF(Übertrag!A25>0,VLOOKUP(Übertrag!A25,#REF!,7,FALSE),\"\")","v":""}]
[]
[]
[]
[]
[{"$f":"IF(Übertrag!A24>0,VLOOKUP(Übertrag!A24,#REF!,3,FALSE),\"\")","v":""},null,null,null,null,null,null,null,null,null,null,null,null,null,null,null,null,null,null,{"$f":"IF(Übertrag!A24>0,VLOOKUP(Übertrag!A24,#REF!,8,FALSE),\"\")","v":""},null,null,null,null,{"$f":"IF(Übertrag!A25>0,VLOOKUP(Übertrag!A25,#REF!,3,FALSE),\"\")","v":""},null,null,null,null,null,null,null,null,null,null,null,null,null,null,null,null,null,null,{"$f":"IF(Übertrag!A25>0,VLOOKUP(Übertrag!A25,#REF!,8,FALSE),\"\")","v":""}]
[]
[]
[]
[{"$f":"_xlfn.IFS(Übertrag!A24=\"\",\"\",K654=\"1\",VLOOKUP(Übertrag!A24,#REF!,17,FALSE),Übertrag!A24>0,VLOOKUP(Übertrag!A24,#REF!,16,FALSE))","v":""},null,null,null,null,null,null,null,null,null,null,{"$f":"IF(Übertrag!A24>0,VLOOKUP(Übertrag!A24,#REF!,13,FALSE),\"\")","v":""},null,null,null,null,null,null,null,{"$f":"IF(Übertrag!A24>0,VLOOKUP(Übertrag!A24,#REF!,4,FALSE),\"\")","v":""},null,null,null,null,{"$f":"_xlfn.IFS(Übertrag!A25=\"\",\"\",AI654=\"1\",VLOOKUP(Übertrag!A25,#REF!,17,FALSE),Übertrag!A25>0,VLOOKUP(Übertrag!A25,#REF!,16,FALSE))","v":""},null,null,null,null,null,null,null,null,null,null,{"$f":"IF(Übertrag!A25>0,VLOOKUP(Übertrag!A25,#REF!,13,FALSE),\"\")","v":""},null,null,null,null,null,null,null,{"$f":"IF(Übertrag!A25>0,VLOOKUP(Übertrag!A25,#REF!,4,FALSE),\"\")","v":""}]
[]
[]
[]
[null,null,null,null,null,null,null,null,null,null,null,{"$f":"IF(Übertrag!A24>0,VLOOKUP(Übertrag!A24,#REF!,11,FALSE),\"\")","v":""},null,null,null,null,null,null,null,null,null,null,null,null,null,null,null,null,null,null,null,null,null,null,null,{"$f":"IF(Übertrag!A25>0,VLOOKUP(Übertrag!A25,#REF!,11,FALSE),\"\")","v":""}]
[]
[]
[]
[]
[]
[]
[]
[]
[]
[]
[]
[]
[]
[]
[]
[]
[]
[null,{"$f":"IF(Übertrag!A24>0,VLOOKUP(Übertrag!A24,#REF!,14,FALSE),\"\")","v":""},null,null,null,null,null,null,null,null,{"$f":"IF(Übertrag!A24>0,VLOOKUP(Übertrag!A24,#REF!,15,FALSE),\"\")","v":""},{"$f":"IF(N654=\"\",\"\",\"1kg=\")","v":""},null,{"$f":"IF(Q654=0,\"\",IF(T654=\"kg\",SUM(L636/Q654),IF(T654=\"g\",SUM(L636/Q654*1000),IF(T654=\"gr\",SUM(L636/Q654*1000),\"\"))))","v":""},null,null,{"$f":"IF(Übertrag!A24>0,VLOOKUP(Übertrag!A24,#REF!,9,FALSE),\"\")","v":""},null,null,{"$f":"IF(Übertrag!A24>0,VLOOKUP(Übertrag!A24,#REF!,10,FALSE),\"\")","v":""},{"$f":"IF(Übertrag!A24>0,VLOOKUP(Übertrag!A24,#REF!,12,FALSE),\"\")","v":""},null,null,null,null,{"$f":"IF(Übertrag!A25>0,VLOOKUP(Übertrag!A25,#REF!,14,FALSE),\"\")","v":""},null,null,null,null,null,null,null,null,{"$f":"IF(Übertrag!A25>0,VLOOKUP(Übertrag!A25,#REF!,15,FALSE),\"\")","v":""},{"$f":"IF(AL654=\"\",\"\",\"1kg=\")","v":""},null,{"$f":"IF(AO654=0,\"\",IF(AR654=\"kg\",SUM(AJ636/AO654),IF(AR654=\"g\",SUM(AJ636/AO654*1000),IF(AR654=\"gr\",SUM(AJ636/AO654*1000),\"\"))))","v":""},null,null,{"$f":"IF(Übertrag!A25>0,VLOOKUP(Übertrag!A25,#REF!,9,FALSE),\"\")","v":""},null,null,{"$f":"IF(Übertrag!A25>0,VLOOKUP(Übertrag!A25,#REF!,10,FALSE),\"\")","v":""},{"$f":"IF(Übertrag!A25>0,VLOOKUP(Übertrag!A25,#REF!,12,FALSE),\"\")","v":""}]
[]
[]
[{"$f":"IF(Übertrag!A24>0,VLOOKUP(Übertrag!A24,#REF!,5,FALSE),\"\")","v":""},null,null,null,null,null,null,null,null,null,null,null,null,null,null,null,null,null,null,null,null,null,null,null,{"$f":"IF(Übertrag!A25>0,VLOOKUP(Übertrag!A25,#REF!,5,FALSE),\"\")","v":""}]
[]
[]
[]
[{"$f":"IF(Übertrag!A24>0,VLOOKUP(Übertrag!A24,#REF!,6,FALSE),\"\")","v":""},null,null,null,null,null,null,null,null,null,null,null,null,null,null,null,null,null,null,null,null,null,null,null,{"$f":"IF(Übertrag!A25>0,VLOOKUP(Übertrag!A25,#REF!,6,FALSE),\"\")","v":""}]

{"sheet":"Druck 32 Felder","index":6,"n_rows":882,"n_cols":45,"rows_kept":882,"cut":false,"hidden":true,"merged":[[185,24,188,42],[185,43,188,46],[189,0,210,10],[189,11,192,18],[189,19,192,22],[189,24,210,34],[47,0,57,22],[47,24,57,46],[58,0,58,22],[58,24,58,46],[104,0,114,22],[104,24,114,46],[115,0,115,22],[115,24,115,46],[161,0,171,22],[161,24,171,46],[116,0,122,46],[123,0,127,18],[123,19,127,22],[123,23,172,23],[123,24,127,42],[123,43,127,46],[128,0,131,18],[128,19,131,22],[874,44,876,46],[877,0,880,22],[877,24,880,46],[881,0,892,22],[881,24,892,46],[874,24,876,24],[874,25,876,33],[874,34,876,34],[874,35,876,36],[874,37,876,39],[874,40,876,42],[874,0,876,0],[874,1,876,9],[874,10,876,10],[874,11,876,12],[874,13,876,15],[874,16,876,18],[874,19,876,19],[874,20,876,22],[874,43,876,43],[848,0,851,18],[848,19,851,22],[848,24,851,42],[848,43,851,46],[852,0,873,10],[852,11,855,18],[852,19,855,22],[852,24,873,34],[852,35,855,42],[852,43,855,46],[856,11,873,22],[856,35,873,46],[836,0,842,46],[843,0,847,18],[843,19,847,22],[843,24,847,42],[843,43,847,46],[817,37,819,39],[817,40,819,42],[817,43,819,43],[817,44,819,46],[820,0,823,22],[820,24,823,46],[817,19,819,19],[817,20,819,22],[817,24,819,24],[817,25,819,33],[817,34,819,34],[817,35,819,36],[817,0,819,0],[817,1,819,9],[817,10,819,10],[817,11,819,12],[817,13,819,15],[767,0,778,22],[767,24,778,46],[779,0,785,46],[786,0,790,18],[786,19,790,22],[786,23,835,23],[786,24,790,42],[786,43,790,46],[791,0,794,18],[791,19,794,22],[817,16,819,18],[791,24,794,42],[791,43,794,46],[795,0,816,10],[795,11,798,18],[795,19,798,22],[795,24,816,34],[795,35,798,42],[795,43,798,46],[799,11,816,22],[799,35,816,46],[824,0,835,22],[824,24,835,46],[763,0,766,22],[763,24,766,46],[760,19,762,19],[760,20,762,22],[760,24,762,24],[760,25,762,33],[760,34,762,34],[760,35,762,36],[760,0,762,0],[760,1,762,9],[760,10,762,10],[760,11,762,12],[760,13,762,15],[760,16,762,18],[710,0,721,22],[710,24,721,46],[722,0,728,46],[729,0,733,18],[729,19,733,22],[729,23,778,23],[729,24,733,42],[729,43,733,46],[734,0,737,18],[734,19,737,22],[734,24,737,42],[734,43,737,46],[738,0,759,10],[738,11,741,18],[738,19,741,22],[738,24,759,34],[738,35,741,42],[738,43,741,46],[742,11,759,22],[742,35,759,46],[760,37,762,39],[760,40,762,42],[760,43,762,43],[760,44,762,46],[703,20,705,22],[703,24,705,24],[703,25,705,33],[703,34,705,34],[703,35,705,36],[703,0,705,0],[703,1,705,9],[703,10,705,10],[703,11,705,12],[703,13,705,15],[703,16,705,18],[681,11,684,18],[681,19,684,22],[681,24,702,34],[681,35,684,42],[681,43,684,46],[685,11,702,22],[685,35,702,46],[672,0,676,18],[672,19,676,22],[672,23,721,23],[672,24,676,42],[672,43,676,46],[677,0,680,18],[677,19,680,22],[677,24,680,42],[677,43,680,46],[681,0,702,10],[703,37,705,39],[703,40,705,42],[703,43,705,43],[703,44,705,46],[706,0,709,22],[706,24,709,46],[703,19,705,19],[653,44,655,46],[656,0,659,22],[656,24,659,46],[660,0,671,22],[660,24,671,46],[653,24,655,24],[653,25,655,33],[653,34,655,34],[653,35,655,36],[653,37,655,39],[653,40,655,42],[653,0,655,0],[653,1,655,9],[653,10,655,10],[653,11,655,12],[653,13,655,15],[653,16,655,18],[653,19,655,19],[653,20,655,22],[653,43,655,43],[627,0,630,18],[627,19,630,22],[627,24,630,42],[627,43,630,46],[631,0,652,10],[631,11,634,18],[631,19,634,22],[631,24,652,34],[631,35,634,42],[631,43,634,46],[635,11,652,22],[635,35,652,46],[615,0,621,46],[622,0,626,18],[622,19,626,22],[622,24,626,42],[622,43,626,46],[596,37,598,39],[596,40,598,42],[596,43,598,43],[596,44,598,46],[599,0,602,22],[599,24,602,46],[596,19,598,19],[596,20,598,22],[596,24,598,24],[596,25,598,33],[596,34,598,34],[596,35,598,36],[596,0,598,0],[596,1,598,9],[596,10,598,10],[596,11,598,12],[596,13,598,15],[546,0,557,22],[546,24,557,46],[558,0,564,46],[565,0,569,18],[565,19,569,22],[565,23,614,23],[565,24,569,42],[565,43,569,46],[570,0,573,18],[570,19,573,22],[596,16,598,18],[570,24,573,42],[570,43,573,46],[574,0,595,10],[574,11,577,18],[574,19,577,22],[574,24,595,34],[574,35,577,42],[574,43,577,46],[578,11,595,22],[578,35,595,46],[603,0,614,22],[603,24,614,46],[542,0,545,22],[542,24,545,46],[539,19,541,19],[539,20,541,22],[539,24,541,24],[539,25,541,33],[539,34,541,34],[539,35,541,36],[539,0,541,0],[539,1,541,9],[539,10,541,10],[539,11,541,12],[539,13,541,15],[539,16,541,18],[489,0,500,22],[489,24,500,46],[501,0,507,46],[508,0,512,18],[508,19,512,22],[508,23,557,23],[508,24,512,42],[508,43,512,46],[513,0,516,18],[513,19,516,22],[513,24,516,42],[513,43,516,46],[517,0,538,10],[517,11,520,18],[517,19,520,22],[517,24,538,34],[517,35,520,42],[517,43,520,46],[521,11,538,22],[521,35,538,46],[539,37,541,39],[539,40,541,42],[539,43,541,43],[539,44,541,46],[482,20,484,22],[482,24,484,24],[482,25,484,33],[482,34,484,34],[482,35,484,36],[482,0,484,0],[482,1,484,9],[482,10,484,10],[482,11,484,12],[482,13,484,15],[482,16,484,18],[460,11,463,18],[460,19,463,22],[460,24,481,34],[460,35,463,42],[460,43,463,46],[464,11,481,22],[464,35,481,46],[451,0,455,18],[451,19,455,22],[451,23,500,23],[451,24,455,42],[451,43,455,46],[456,0,459,18],[456,19,459,22],[456,24,459,42],[456,43,459,46],[460,0,481,10],[482,37,484,39],[482,40,484,42],[482,43,484,43],[482,44,484,46],[485,0,488,22],[485,24,488,46],[482,19,484,19],[432,44,434,46],[435,0,438,22],[435,24,438,46],[439,0,450,22],[439,24,450,46],[432,24,434,24],[432,25,434,33],[432,34,434,34],[432,35,434,36],[432,37,434,39],[432,40,434,42],[432,0,434,0],[432,1,434,9],[432,10,434,10],[432,11,434,12],[432,13,434,15],[432,16,434,18],[432,19,434,19],[432,20,434,22],[432,43,434,43],[406,0,409,18],[406,19,409,22],[406,24,409,42],[406,43,409,46],[410,0,431,10],[410,11,413,18],[410,19,413,22],[410,24,431,34],[410,35,413,42],[410,43,413,46],[414,11,431,22],[414,35,431,46],[394,0,400,46],[401,0,405,18],[401,19,405,22],[401,24,405,42],[401,43,405,46],[375,37,377,39],[375,40,377,42],[375,43,377,43],[375,44,377,46],[378,0,381,22],[378,24,381,46],[375,19,377,19],[375,20,377,22],[375,24,377,24],[375,25,377,33],[375,34,377,34],[375,35,377,36],[375,0,377,0],[375,1,377,9],[375,10,377,10],[375,11,377,12],[375,13,377,15],[325,0,336,22],[325,24,336,46],[337,0,343,46],[344,0,348,18],[344,19,348,22],[344,23,393,23],[344,24,348,42],[344,43,348,46],[349,0,352,18],[349,19,352,22],[375,16,377,18],[349,24,352,42],[349,43,352,46],[353,0,374,10],[353,11,356,18],[353,19,356,22],[353,24,374,34],[353,35,356,42],[353,43,356,46],[357,11,374,22],[357,35,374,46],[382,0,393,22],[382,24,393,46],[321,0,324,22],[321,24,324,46],[318,19,320,19],[318,20,320,22],[318,24,320,24],[318,25,320,33],[318,34,320,34],[318,35,320,36],[318,0,320,0],[318,1,320,9],[318,10,320,10],[318,11,320,12],[318,13,320,15],[318,16,320,18],[268,0,279,22],[268,24,279,46],[280,0,286,46],[287,0,291,18],[287,19,291,22],[287,23,336,23],[287,24,291,42],[287,43,291,46],[292,0,295,18],[292,19,295,22],[292,24,295,42],[292,43,295,46],[296,0,317,10],[296,11,299,18],[296,19,299,22],[296,24,317,34],[296,35,299,42],[296,43,299,46],[300,11,317,22],[300,35,317,46],[318,37,320,39],[318,40,320,42],[318,43,320,43],[318,44,320,46],[261,44,263,46],[264,0,267,22],[264,24,267,46],[261,19,263,19],[261,20,263,22],[261,24,263,24],[261,25,263,33],[261,34,263,34],[261,35,263,36],[261,0,263,0],[261,1,263,9],[261,10,263,10],[261,11,263,12],[261,13,263,15],[261,16,263,18],[180,23,229,23],[180,24,184,42],[180,43,184,46],[185,0,188,18],[230,0,234,18],[230,19,234,22],[230,23,279,23],[230,24,234,42],[230,43,234,46],[235,0,238,18],[235,19,238,22],[235,24,238,42],[235,43,238,46],[239,0,260,10],[239,11,242,18],[239,19,242,22],[239,24,260,34],[239,35,242,42],[239,43,242,46],[243,11,260,22],[243,35,260,46],[261,37,263,39],[261,40,263,42],[261,43,263,43],[173,0,179,46],[180,0,184,18],[180,19,184,22],[185,19,188,22],[218,0,228,22],[218,24,228,46],[229,0,229,22],[229,24,229,46],[214,0,217,22],[214,24,217,46],[211,37,213,39],[211,40,213,42],[211,43,213,43],[211,44,213,46],[211,0,213,0],[211,1,213,9],[211,10,213,10],[211,11,213,12],[211,13,213,15],[211,16,213,18],[211,19,213,19],[211,20,213,22],[211,24,213,24],[211,25,213,33],[132,35,135,42],[132,43,135,46],[136,11,153,22],[136,35,153,46],[211,34,213,34],[211,35,213,36],[157,0,160,22],[157,24,160,46],[154,19,156,19],[154,20,156,22],[154,24,156,24],[154,25,156,33],[154,34,156,34],[154,35,156,36],[154,0,156,0],[154,1,156,9],[154,10,156,10],[154,11,156,12],[154,13,156,15],[154,16,156,18],[189,35,192,42],[189,43,192,46],[193,11,210,22],[193,35,210,46],[154,37,156,39],[154,40,156,42],[154,43,156,43],[154,44,156,46],[172,0,172,22],[172,24,172,46],[97,19,99,19],[97,20,99,22],[97,24,99,24],[97,25,99,33],[97,34,99,34],[97,35,99,36],[97,0,99,0],[97,1,99,9],[97,10,99,10],[97,11,99,12],[97,13,99,15],[97,16,99,18],[128,24,131,42],[128,43,131,46],[132,0,153,10],[132,11,135,18],[132,19,135,22],[132,24,153,34],[59,0,65,46],[66,0,70,18],[66,19,70,22],[66,23,115,23],[66,24,70,42],[66,43,70,46],[71,0,74,18],[71,19,74,22],[71,24,74,42],[71,43,74,46],[75,0,96,10],[75,11,78,18],[75,19,78,22],[75,24,96,34],[75,35,78,42],[75,43,78,46],[79,11,96,22],[79,35,96,46],[97,37,99,39],[97,40,99,42],[97,43,99,43],[97,44,99,46],[100,0,103,22],[100,24,103,46],[40,20,42,22],[40,24,42,24],[40,25,42,33],[40,34,42,34],[40,35,42,36],[40,0,42,0],[40,1,42,9],[40,10,42,10],[40,11,42,12],[40,13,42,15],[40,16,42,18],[18,11,21,18],[18,19,21,22],[18,24,39,34],[18,35,21,42],[18,43,21,46],[22,11,39,22],[22,35,39,46],[9,0,13,18],[9,19,13,22],[9,23,58,23],[9,24,13,42],[9,43,13,46],[14,0,17,18],[14,19,17,22],[14,24,17,42],[14,43,17,46],[18,0,39,10],[40,37,42,39],[40,40,42,42],[40,43,42,43],[40,44,42,46],[43,0,46,22],[43,24,46,46],[40,19,42,19]]}
[]
[]
[]
[]
[]
[]
[]
[]
[]
[{"$f":"IF(Übertrag!A2>0,VLOOKUP(Übertrag!A2,#REF!,2,FALSE),\"\")","v":{"$error":"#REF!"}},null,null,null,null,null,null,null,null,null,null,null,null,null,null,null,null,null,null,{"$f":"IF(Übertrag!A2>0,VLOOKUP(Übertrag!A2,#REF!,7,FALSE),\"\")","v":{"$error":"#REF!"}},null,null,null,null,{"$f":"IF(Übertrag!A3>0,VLOOKUP(Übertrag!A3,#REF!,2,FALSE),\"\")","v":{"$error":"#REF!"}},null,null,null,null,null,null,null,null,null,null,null,null,null,null,null,null,null,null,{"$f":"IF(Übertrag!A3>0,VLOOKUP(Übertrag!A3,#REF!,7,FALSE),\"\")","v":{"$error":"#REF!"}}]
[]
[]
[]
[]
[{"$f":"IF(Übertrag!A2>0,VLOOKUP(Übertrag!A2,#REF!,3,FALSE),\"\")","v":{"$error":"#REF!"}},null,null,null,null,null,null,null,null,null,null,null,null,null,null,null,null,null,null,{"$f":"IF(Übertrag!A2>0,VLOOKUP(Übertrag!A2,#REF!,8,FALSE),\"\")","v":{"$error":"#REF!"}},null,null,null,null,{"$f":"IF(Übertrag!A3>0,VLOOKUP(Übertrag!A3,#REF!,3,FALSE),\"\")","v":{"$error":"#REF!"}},null,null,null,null,null,null,null,null,null,null,null,null,null,null,null,null,null,null,{"$f":"IF(Übertrag!A3>0,VLOOKUP(Übertrag!A3,#REF!,8,FALSE),\"\")","v":{"$error":"#REF!"}}]
[]
[]
[]
[{"$f":"_xlfn.IFS(Übertrag!A2=\"\",\"\",K41=\"1\",VLOOKUP(Übertrag!A2,#REF!,17,FALSE),Übertrag!A2>0,VLOOKUP(Übertrag!A2,#REF!,16,FALSE))","v":{"$error":"#REF!"}},null,null,null,null,null,null,null,null,null,null,{"$f":"IF(Übertrag!A2>0,VLOOKUP(Übertrag!A2,#REF!,13,FALSE),\"\")","v":{"$error":"#REF!"}},null,null,null,null,null,null,null,{"$f":"IF(Übertrag!A2>0,VLOOKUP(Übertrag!A2,#REF!,4,FALSE),\"\")","v":{"$error":"#REF!"}},null,null,null,null,{"$f":"_xlfn.IFS(Übertrag!A3=\"\",\"\",AI41=\"1\",VLOOKUP(Übertrag!A3,#REF!,17,FALSE),Übertrag!A3>0,VLOOKUP(Übertrag!A3,#REF!,16,FALSE))","v":{"$error":"#REF!"}},null,null,null,null,null,null,null,null,null,null,{"$f":"IF(Übertrag!A3>0,VLOOKUP(Übertrag!A3,#REF!,13,FALSE),\"\")","v":{"$error":"#REF!"}},null,null,null,null,null,null,null,{"$f":"IF(Übertrag!A3>0,VLOOKUP(Übertrag!A3,#REF!,4,FALSE),\"\")","v":{"$error":"#REF!"}}]
[]
[]
[]
[null,null,null,null,null,null,null,null,null,null,null,{"$f":"IF(Übertrag!A2>0,VLOOKUP(Übertrag!A2,#REF!,11,FALSE),\"\")","v":{"$error":"#REF!"}},null,null,null,null,null,null,null,null,null,null,null,null,null,null,null,null,null,null,null,null,null,null,null,{"$f":"IF(Übertrag!A3>0,VLOOKUP(Übertrag!A3,#REF!,11,FALSE),\"\")","v":{"$error":"#REF!"}}]
[]
[]
[]
[]
[]
[]
[]
[]
[]
[]
[]
[]
[]
[]
[]
[]
[]
[null,{"$f":"IF(Übertrag!A2>0,VLOOKUP(Übertrag!A2,#REF!,14,FALSE),\"\")","v":{"$error":"#REF!"}},null,null,null,null,null,null,null,null,{"$f":"IF(Übertrag!A2>0,VLOOKUP(Übertrag!A2,#REF!,15,FALSE),\"\")","v":{"$error":"#REF!"}},{"$f":"IF(N41=\"\",\"\",\"1kg=\")","v":{"$error":"#REF!"}},null,{"$f":"IF(Q41=0,\"\",IF(T41=\"kg\",SUM(L23/Q41),IF(T41=\"g\",SUM(L23/Q41*1000),IF(T41=\"gr\",SUM(L23/Q41*1000),\"\"))))","v":{"$error":"#REF!"}},null,null,{"$f":"IF(Übertrag!A2>0,VLOOKUP(Übertrag!A2,#REF!,9,FALSE),\"\")","v":{"$error":"#REF!"}},null,null,{"$f":"IF(Übertrag!A2>0,VLOOKUP(Übertrag!A2,#REF!,10,FALSE),\"\")","v":{"$error":"#REF!"}},{"$f":"IF(Übertrag!A2>0,VLOOKUP(Übertrag!A2,#REF!,12,FALSE),\"\")","v":{"$error":"#REF!"}},null,null,null,null,{"$f":"IF(Übertrag!A3>0,VLOOKUP(Übertrag!A3,#REF!,14,FALSE),\"\")","v":{"$error":"#REF!"}},null,null,null,null,null,null,null,null,{"$f":"IF(Übertrag!A3>0,VLOOKUP(Übertrag!A3,#REF!,15,FALSE),\"\")","v":{"$error":"#REF!"}},{"$f":"IF(AL41=\"\",\"\",\"1kg=\")","v":{"$error":"#REF!"}},null,{"$f":"IF(AO41=0,\"\",IF(AR41=\"kg\",SUM(AJ23/AO41),IF(AR41=\"g\",SUM(AJ23/AO41*1000),IF(AR41=\"gr\",SUM(AJ23/AO41*1000),\"\"))))","v":{"$error":"#REF!"}},null,null,{"$f":"IF(Übertrag!A3>0,VLOOKUP(Übertrag!A3,#REF!,9,FALSE),\"\")","v":{"$error":"#REF!"}},null,null,{"$f":"IF(Übertrag!A3>0,VLOOKUP(Übertrag!A3,#REF!,10,FALSE),\"\")","v":{"$error":"#REF!"}},{"$f":"IF(Übertrag!A3>0,VLOOKUP(Übertrag!A3,#REF!,12,FALSE),\"\")","v":{"$error":"#REF!"}}]
[]
[]
[{"$f":"IF(Übertrag!A2>0,VLOOKUP(Übertrag!A2,#REF!,5,FALSE),\"\")","v":{"$error":"#REF!"}},null,null,null,null,null,null,null,null,null,null,null,null,null,null,null,null,null,null,null,null,null,null,null,{"$f":"IF(Übertrag!A3>0,VLOOKUP(Übertrag!A3,#REF!,5,FALSE),\"\")","v":{"$error":"#REF!"}}]
[]
[]
[]
[{"$f":"IF(Übertrag!A2>0,VLOOKUP(Übertrag!A2,#REF!,6,FALSE),\"\")","v":{"$error":"#REF!"}},null,null,null,null,null,null,null,null,null,null,null,null,null,null,null,null,null,null,null,null,null,null,null,{"$f":"IF(Übertrag!A3>0,VLOOKUP(Übertrag!A3,#REF!,6,FALSE),\"\")","v":{"$error":"#REF!"}}]
[]
[]
[]
[]
[]
[]
[]
[]
[]
[]
[{"$f":"IF(Übertrag!A2>0,VLOOKUP(Übertrag!A2,Datenbank[],7,FALSE),\"\")","v":"2025-07-16"},null,null,null,null,null,null,null,null,null,null,null,null,null,null,null,null,null,null,null,null,null,null,null,{"$f":"IF(Übertrag!A3>0,VLOOKUP(Übertrag!A3,Datenbank[],7,FALSE),\"\")","v":"2025-07-16"}]
[]
[]
[]
[]
[]
[]
[]
[{"$f":"IF(Übertrag!A4>0,VLOOKUP(Übertrag!A4,#REF!,2,FALSE),\"\")","v":{"$error":"#REF!"}},null,null,null,null,null,null,null,null,null,null,null,null,null,null,null,null,null,null,{"$f":"IF(Übertrag!A4>0,VLOOKUP(Übertrag!A4,#REF!,7,FALSE),\"\")","v":{"$error":"#REF!"}},null,null,null,null,{"$f":"IF(Übertrag!A5>0,VLOOKUP(Übertrag!A5,#REF!,2,FALSE),\"\")","v":{"$error":"#REF!"}},null,null,null,null,null,null,null,null,null,null,null,null,null,null,null,null,null,null,{"$f":"IF(Übertrag!A5>0,VLOOKUP(Übertrag!A5,#REF!,7,FALSE),\"\")","v":{"$error":"#REF!"}}]
[]
[]
[]
[]
[{"$f":"IF(Übertrag!A4>0,VLOOKUP(Übertrag!A4,#REF!,3,FALSE),\"\")","v":{"$error":"#REF!"}},null,null,null,null,null,null,null,null,null,null,null,null,null,null,null,null,null,null,{"$f":"IF(Übertrag!A4>0,VLOOKUP(Übertrag!A4,#REF!,8,FALSE),\"\")","v":{"$error":"#REF!"}},null,null,null,null,{"$f":"IF(Übertrag!A5>0,VLOOKUP(Übertrag!A5,#REF!,3,FALSE),\"\")","v":{"$error":"#REF!"}},null,null,null,null,null,null,null,null,null,null,null,null,null,null,null,null,null,null,{"$f":"IF(Übertrag!A5>0,VLOOKUP(Übertrag!A5,#REF!,8,FALSE),\"\")","v":{"$error":"#REF!"}}]
[]
[]
[]
[{"$f":"_xlfn.IFS(Übertrag!A4=\"\",\"\",K98=\"1\",VLOOKUP(Übertrag!A4,#REF!,17,FALSE),Übertrag!A4>0,VLOOKUP(Übertrag!A4,#REF!,16,FALSE))","v":{"$error":"#REF!"}},null,null,null,null,null,null,null,null,null,null,{"$f":"IF(Übertrag!A4>0,VLOOKUP(Übertrag!A4,#REF!,13,FALSE),\"\")","v":{"$error":"#REF!"}},null,null,null,null,null,null,null,{"$f":"IF(Übertrag!A4>0,VLOOKUP(Übertrag!A4,#REF!,4,FALSE),\"\")","v":{"$error":"#REF!"}},null,null,null,null,{"$f":"_xlfn.IFS(Übertrag!A5=\"\",\"\",AI98=\"1\",VLOOKUP(Übertrag!A5,#REF!,17,FALSE),Übertrag!A5>0,VLOOKUP(Übertrag!A5,#REF!,16,FALSE))","v":{"$error":"#REF!"}},null,null,null,null,null,null,null,null,null,null,{"$f":"IF(Übertrag!A5>0,VLOOKUP(Übertrag!A5,#REF!,13,FALSE),\"\")","v":{"$error":"#REF!"}},null,null,null,null,null,null,null,{"$f":"IF(Übertrag!A5>0,VLOOKUP(Übertrag!A5,#REF!,4,FALSE),\"\")","v":{"$error":"#REF!"}}]
[]
[]
[]
[null,null,null,null,null,null,null,null,null,null,null,{"$f":"IF(Übertrag!A4>0,VLOOKUP(Übertrag!A4,#REF!,11,FALSE),\"\")","v":{"$error":"#REF!"}},null,null,null,null,null,null,null,null,null,null,null,null,null,null,null,null,null,null,null,null,null,null,null,{"$f":"IF(Übertrag!A5>0,VLOOKUP(Übertrag!A5,#REF!,11,FALSE),\"\")","v":{"$error":"#REF!"}}]
[]
[]
[]
[]
[]
[]
[]
[]
[]
[]
[]
[]
[]
[]
[]
[]
[]
[null,{"$f":"IF(Übertrag!A4>0,VLOOKUP(Übertrag!A2,#REF!,14,FALSE),\"\")","v":{"$error":"#REF!"}},null,null,null,null,null,null,null,null,{"$f":"IF(Übertrag!A4>0,VLOOKUP(Übertrag!A4,#REF!,15,FALSE),\"\")","v":{"$error":"#REF!"}},{"$f":"IF(N98=\"\",\"\",\"1kg=\")","v":{"$error":"#REF!"}},null,{"$f":"IF(Q98=0,\"\",IF(T98=\"kg\",SUM(L80/Q98),IF(T98=\"g\",SUM(L80/Q98*1000),IF(T98=\"gr\",SUM(L80/Q98*1000),\"\"))))","v":{"$error":"#REF!"}},null,null,{"$f":"IF(Übertrag!A4>0,VLOOKUP(Übertrag!A4,#REF!,9,FALSE),\"\")","v":{"$error":"#REF!"}},null,null,{"$f":"IF(Übertrag!A4>0,VLOOKUP(Übertrag!A4,#REF!,10,FALSE),\"\")","v":{"$error":"#REF!"}},{"$f":"IF(Übertrag!A4>0,VLOOKUP(Übertrag!A4,#REF!,12,FALSE),\"\")","v":{"$error":"#REF!"}},null,null,null,null,{"$f":"IF(Übertrag!A5>0,VLOOKUP(Übertrag!A5,#REF!,14,FALSE),\"\")","v":{"$error":"#REF!"}},null,null,null,null,null,null,null,null,{"$f":"IF(Übertrag!A5>0,VLOOKUP(Übertrag!A5,#REF!,15,FALSE),\"\")","v":{"$error":"#REF!"}},{"$f":"IF(AL98=\"\",\"\",\"1kg=\")","v":{"$error":"#REF!"}},null,{"$f":"IF(AO98=0,\"\",IF(AS98=\"lose\",\"\",IF(AR98=\"kg\",SUM(AJ80/AO98),IF(AR98=\"g\",SUM(AJ80/AO98*1000),IF(AR98=\"gr\",SUM(AJ80/AO98*1000),\"\")))))","v":{"$error":"#REF!"}},null,null,{"$f":"IF(Übertrag!A5>0,VLOOKUP(Übertrag!A5,#REF!,9,FALSE),\"\")","v":{"$error":"#REF!"}},null,null,{"$f":"IF(Übertrag!A5>0,VLOOKUP(Übertrag!A5,#REF!,10,FALSE),\"\")","v":{"$error":"#REF!"}},{"$f":"IF(Übertrag!A5>0,VLOOKUP(Übertrag!A5,#REF!,12,FALSE),\"\")","v":{"$error":"#REF!"}}]
[]
[]
[{"$f":"IF(Übertrag!A4>0,VLOOKUP(Übertrag!A4,#REF!,5,FALSE),\"\")","v":{"$error":"#REF!"}},null,null,null,null,null,null,null,null,null,null,null,null,null,null,null,null,null,null,null,null,null,null,null,{"$f":"IF(Übertrag!A5>0,VLOOKUP(Übertrag!A5,#REF!,5,FALSE),\"\")","v":{"$error":"#REF!"}}]
[]
[]
[]
[{"$f":"IF(Übertrag!A4>0,VLOOKUP(Übertrag!A4,#REF!,6,FALSE),\"\")","v":{"$error":"#REF!"}},null,null,null,null,null,null,null,null,null,null,null,null,null,null,null,null,null,null,null,null,null,null,null,{"$f":"IF(Übertrag!A5>0,VLOOKUP(Übertrag!A5,#REF!,6,FALSE),\"\")","v":{"$error":"#REF!"}}]
[]
[]
[]
[]
[]
[]
[]
[]
[]
[]
[{"$f":"IF(Übertrag!A4>0,VLOOKUP(Übertrag!A4,Datenbank[],7,FALSE),\"\")","v":"2025-07-16"},null,null,null,null,null,null,null,null,null,null,null,null,null,null,null,null,null,null,null,null,null,null,null,{"$f":"IF(Übertrag!A5>0,VLOOKUP(Übertrag!A4,Datenbank[],7,FALSE),\"\")","v":"2025-07-16"}]
[]
[]
[]
[]
[]
[]
[]
[{"$f":"IF(Übertrag!A6>0,VLOOKUP(Übertrag!A6,#REF!,2,FALSE),\"\")","v":{"$error":"#REF!"}},null,null,null,null,null,null,null,null,null,null,null,null,null,null,null,null,null,null,{"$f":"IF(Übertrag!A6>0,VLOOKUP(Übertrag!A6,#REF!,7,FALSE),\"\")","v":{"$error":"#REF!"}},null,null,null,null,{"$f":"IF(Übertrag!A7>0,VLOOKUP(Übertrag!A7,#REF!,2,FALSE),\"\")","v":{"$error":"#REF!"}},null,null,null,null,null,null,null,null,null,null,null,null,null,null,null,null,null,null,{"$f":"IF(Übertrag!A7>0,VLOOKUP(Übertrag!A7,#REF!,7,FALSE),\"\")","v":{"$error":"#REF!"}}]
[]
[]
[]
[]
[{"$f":"IF(Übertrag!A6>0,VLOOKUP(Übertrag!A6,#REF!,3,FALSE),\"\")","v":{"$error":"#REF!"}},null,null,null,null,null,null,null,null,null,null,null,null,null,null,null,null,null,null,{"$f":"IF(Übertrag!A6>0,VLOOKUP(Übertrag!A6,#REF!,8,FALSE),\"\")","v":{"$error":"#REF!"}},null,null,null,null,{"$f":"IF(Übertrag!A7>0,VLOOKUP(Übertrag!A7,#REF!,3,FALSE),\"\")","v":{"$error":"#REF!"}},null,null,null,null,null,null,null,null,null,null,null,null,null,null,null,null,null,null,{"$f":"IF(Übertrag!A7>0,VLOOKUP(Übertrag!A7,#REF!,8,FALSE),\"\")","v":{"$error":"#REF!"}}]
[]
[]
[]
[{"$f":"_xlfn.IFS(Übertrag!A6=\"\",\"\",K155=\"1\",VLOOKUP(Übertrag!A6,#REF!,17,FALSE),Übertrag!A6>0,VLOOKUP(Übertrag!A6,#REF!,16,FALSE))","v":{"$error":"#REF!"}},null,null,null,null,null,null,null,null,null,null,{"$f":"IF(Übertrag!A6>0,VLOOKUP(Übertrag!A6,#REF!,13,FALSE),\"\")","v":{"$error":"#REF!"}},null,null,null,null,null,null,null,{"$f":"IF(Übertrag!A6>0,VLOOKUP(Übertrag!A6,#REF!,4,FALSE),\"\")","v":{"$error":"#REF!"}},null,null,null,null,{"$f":"_xlfn.IFS(Übertrag!A7=\"\",\"\",AI155=\"1\",VLOOKUP(Übertrag!A7,#REF!,17,FALSE),Übertrag!A7>0,VLOOKUP(Übertrag!A7,#REF!,16,FALSE))","v":{"$error":"#REF!"}},null,null,null,null,null,null,null,null,null,null,{"$f":"IF(Übertrag!A7>0,VLOOKUP(Übertrag!A7,#REF!,13,FALSE),\"\")","v":{"$error":"#REF!"}},null,null,null,null,null,null,null,{"$f":"IF(Übertrag!A7>0,VLOOKUP(Übertrag!A7,#REF!,4,FALSE),\"\")","v":{"$error":"#REF!"}}]
[]
[]
[]
[null,null,null,null,null,null,null,null,null,null,null,{"$f":"IF(Übertrag!A6>0,VLOOKUP(Übertrag!A6,#REF!,11,FALSE),\"\")","v":{"$error":"#REF!"}},null,null,null,null,null,null,null,null,null,null,null,null,null,null,null,null,null,null,null,null,null,null,null,{"$f":"IF(Übertrag!A7>0,VLOOKUP(Übertrag!A7,#REF!,11,FALSE),\"\")","v":{"$error":"#REF!"}}]
[]
[]
[]
[]
[]
[]
[]
[]
[]
[]
[]
[]
[]
[]
[]
[]
[]
[null,{"$f":"IF(Übertrag!A6>0,VLOOKUP(Übertrag!A6,#REF!,14,FALSE),\"\")","v":{"$error":"#REF!"}},null,null,null,null,null,null,null,null,{"$f":"IF(Übertrag!A6>0,VLOOKUP(Übertrag!A6,#REF!,15,FALSE),\"\")","v":{"$error":"#REF!"}},{"$f":"IF(N155=\"\",\"\",\"1kg=\")","v":{"$error":"#REF!"}},null,{"$f":"IF(Q155=0,\"\",IF(T155=\"kg\",SUM(L137/Q155),IF(T155=\"g\",SUM(L137/Q155*1000),IF(T155=\"gr\",SUM(L137/Q155*1000),\"\"))))","v":{"$error":"#REF!"}},null,null,{"$f":"IF(Übertrag!A6>0,VLOOKUP(Übertrag!A6,#REF!,9,FALSE),\"\")","v":{"$error":"#REF!"}},null,null,{"$f":"IF(Übertrag!A6>0,VLOOKUP(Übertrag!A6,#REF!,10,FALSE),\"\")","v":{"$error":"#REF!"}},{"$f":"IF(Übertrag!A6>0,VLOOKUP(Übertrag!A6,#REF!,12,FALSE),\"\")","v":{"$error":"#REF!"}},null,null,null,null,{"$f":"IF(Übertrag!A7>0,VLOOKUP(Übertrag!A7,#REF!,14,FALSE),\"\")","v":{"$error":"#REF!"}},null,null,null,null,null,null,null,null,{"$f":"IF(Übertrag!A7>0,VLOOKUP(Übertrag!A7,#REF!,15,FALSE),\"\")","v":{"$error":"#REF!"}},{"$f":"IF(AL155=\"\",\"\",\"1kg=\")","v":{"$error":"#REF!"}},null,{"$f":"IF(AO155=0,\"\",IF(AR155=\"kg\",SUM(AJ137/AO155),IF(AR155=\"g\",SUM(AJ137/AO155*1000),IF(AR155=\"gr\",SUM(AJ137/AO155*1000),\"\"))))","v":{"$error":"#REF!"}},null,null,{"$f":"IF(Übertrag!A7>0,VLOOKUP(Übertrag!A7,#REF!,9,FALSE),\"\")","v":{"$error":"#REF!"}},null,null,{"$f":"IF(Übertrag!A7>0,VLOOKUP(Übertrag!A7,#REF!,10,FALSE),\"\")","v":{"$error":"#REF!"}},{"$f":"IF(Übertrag!A7>0,VLOOKUP(Übertrag!A7,#REF!,12,FALSE),\"\")","v":{"$error":"#REF!"}}]
[]
[]
[{"$f":"IF(Übertrag!A6>0,VLOOKUP(Übertrag!A6,#REF!,5,FALSE),\"\")","v":{"$error":"#REF!"}},null,null,null,null,null,null,null,null,null,null,null,null,null,null,null,null,null,null,null,null,null,null,null,{"$f":"IF(Übertrag!A7>0,VLOOKUP(Übertrag!A7,#REF!,5,FALSE),\"\")","v":{"$error":"#REF!"}}]
[]
[]
[]
[{"$f":"IF(Übertrag!A6>0,VLOOKUP(Übertrag!A6,#REF!,6,FALSE),\"\")","v":{"$error":"#REF!"}},null,null,null,null,null,null,null,null,null,null,null,null,null,null,null,null,null,null,null,null,null,null,null,{"$f":"IF(Übertrag!A7>0,VLOOKUP(Übertrag!A7,#REF!,6,FALSE),\"\")","v":{"$error":"#REF!"}}]
[]
[]
[]
[]
[]
[]
[]
[]
[]
[]
[{"$f":"IF(Übertrag!A6>0,VLOOKUP(Übertrag!A6,Datenbank[],7,FALSE),\"\")","v":"2025-07-16"},null,null,null,null,null,null,null,null,null,null,null,null,null,null,null,null,null,null,null,null,null,null,null,{"$f":"IF(Übertrag!A7>0,VLOOKUP(Übertrag!A7,Datenbank[],7,FALSE),\"\")","v":"2025-07-16"}]
[]
[]
[]
[]
[]
[]
[]
[{"$f":"IF(Übertrag!A8>0,VLOOKUP(Übertrag!A8,#REF!,2,FALSE),\"\")","v":{"$error":"#REF!"}},null,null,null,null,null,null,null,null,null,null,null,null,null,null,null,null,null,null,{"$f":"IF(Übertrag!A8>0,VLOOKUP(Übertrag!A8,#REF!,7,FALSE),\"\")","v":{"$error":"#REF!"}},null,null,null,null,{"$f":"IF(Übertrag!A9>0,VLOOKUP(Übertrag!A9,#REF!,2,FALSE),\"\")","v":{"$error":"#REF!"}},null,null,null,null,null,null,null,null,null,null,null,null,null,null,null,null,null,null,{"$f":"IF(Übertrag!A9>0,VLOOKUP(Übertrag!A9,#REF!,7,FALSE),\"\")","v":{"$error":"#REF!"}}]
[]
[]
[]
[]
[{"$f":"IF(Übertrag!A8>0,VLOOKUP(Übertrag!A8,#REF!,3,FALSE),\"\")","v":{"$error":"#REF!"}},null,null,null,null,null,null,null,null,null,null,null,null,null,null,null,null,null,null,{"$f":"IF(Übertrag!A8>0,VLOOKUP(Übertrag!A8,#REF!,8,FALSE),\"\")","v":{"$error":"#REF!"}},null,null,null,null,{"$f":"IF(Übertrag!A9>0,VLOOKUP(Übertrag!A9,#REF!,3,FALSE),\"\")","v":{"$error":"#REF!"}},null,null,null,null,null,null,null,null,null,null,null,null,null,null,null,null,null,null,{"$f":"IF(Übertrag!A9>0,VLOOKUP(Übertrag!A9,#REF!,8,FALSE),\"\")","v":{"$error":"#REF!"}}]
[]
[]
[]
[{"$f":"_xlfn.IFS(Übertrag!A8=\"\",\"\",K212=\"1\",VLOOKUP(Übertrag!A8,#REF!,17,FALSE),Übertrag!A8>0,VLOOKUP(Übertrag!A8,#REF!,16,FALSE))","v":{"$error":"#REF!"}},null,null,null,null,null,null,null,null,null,null,{"$f":"IF(Übertrag!A8>0,VLOOKUP(Übertrag!A8,#REF!,13,FALSE),\"\")","v":{"$error":"#REF!"}},null,null,null,null,null,null,null,{"$f":"IF(Übertrag!A8>0,VLOOKUP(Übertrag!A8,#REF!,4,FALSE),\"\")","v":{"$error":"#REF!"}},null,null,null,null,{"$f":"_xlfn.IFS(Übertrag!A9=\"\",\"\",AI212=\"1\",VLOOKUP(Übertrag!A9,#REF!,17,FALSE),Übertrag!A9>0,VLOOKUP(Übertrag!A9,#REF!,16,FALSE))","v":{"$error":"#REF!"}},null,null,null,null,null,null,null,null,null,null,{"$f":"IF(Übertrag!A9>0,VLOOKUP(Übertrag!A9,#REF!,13,FALSE),\"\")","v":{"$error":"#REF!"}},null,null,null,null,null,null,null,{"$f":"IF(Übertrag!A9>0,VLOOKUP(Übertrag!A9,#REF!,4,FALSE),\"\")","v":{"$error":"#REF!"}}]
[]
[]
[]
[null,null,null,null,null,null,null,null,null,null,null,{"$f":"IF(Übertrag!A8>0,VLOOKUP(Übertrag!A8,#REF!,11,FALSE),\"\")","v":{"$error":"#REF!"}},null,null,null,null,null,null,null,null,null,null,null,null,null,null,null,null,null,null,null,null,null,null,null,{"$f":"IF(Übertrag!A9>0,VLOOKUP(Übertrag!A9,#REF!,11,FALSE),\"\")","v":{"$error":"#REF!"}}]
[]
[]
[]
[]
[]
[]
[]
[]
[]
[]
[]
[]
[]
[]
[]
[]
[]
[null,{"$f":"IF(Übertrag!A8>0,VLOOKUP(Übertrag!A8,#REF!,14,FALSE),\"\")","v":{"$error":"#REF!"}},null,null,null,null,null,null,null,null,{"$f":"IF(Übertrag!A8>0,VLOOKUP(Übertrag!A8,#REF!,15,FALSE),\"\")","v":{"$error":"#REF!"}},{"$f":"IF(N212=\"\",\"\",\"1kg=\")","v":{"$error":"#REF!"}},null,{"$f":"IF(Q212=0,\"\",IF(T212=\"kg\",SUM(L194/Q212),IF(T212=\"g\",SUM(L194/Q212*1000),IF(T212=\"gr\",SUM(L194/Q212*1000),\"\"))))","v":{"$error":"#REF!"}},null,null,{"$f":"IF(Übertrag!A8>0,VLOOKUP(Übertrag!A8,#REF!,9,FALSE),\"\")","v":{"$error":"#REF!"}},null,null,{"$f":"IF(Übertrag!A8>0,VLOOKUP(Übertrag!A8,#REF!,10,FALSE),\"\")","v":{"$error":"#REF!"}},{"$f":"IF(Übertrag!A8>0,VLOOKUP(Übertrag!A8,#REF!,12,FALSE),\"\")","v":{"$error":"#REF!"}},null,null,null,null,{"$f":"IF(Übertrag!A9>0,VLOOKUP(Übertrag!A9,#REF!,14,FALSE),\"\")","v":{"$error":"#REF!"}},null,null,null,null,null,null,null,null,{"$f":"IF(Übertrag!A9>0,VLOOKUP(Übertrag!A9,#REF!,15,FALSE),\"\")","v":{"$error":"#REF!"}},{"$f":"IF(AL212=\"\",\"\",\"1kg=\")","v":{"$error":"#REF!"}},null,{"$f":"IF(AO212=0,\"\",IF(AR212=\"kg\",SUM(AJ194/AO212),IF(AR212=\"g\",SUM(AJ194/AO212*1000),IF(AR212=\"gr\",SUM(AJ194/AO212*1000),\"\"))))","v":{"$error":"#REF!"}},null,null,{"$f":"IF(Übertrag!A9>0,VLOOKUP(Übertrag!A9,#REF!,9,FALSE),\"\")","v":{"$error":"#REF!"}},null,null,{"$f":"IF(Übertrag!A9>0,VLOOKUP(Übertrag!A9,#REF!,10,FALSE),\"\")","v":{"$error":"#REF!"}},{"$f":"IF(Übertrag!A9>0,VLOOKUP(Übertrag!A9,#REF!,12,FALSE),\"\")","v":{"$error":"#REF!"}}]
[]
[]
[{"$f":"IF(Übertrag!A8>0,VLOOKUP(Übertrag!A8,#REF!,5,FALSE),\"\")","v":{"$error":"#REF!"}},null,null,null,null,null,null,null,null,null,null,null,null,null,null,null,null,null,null,null,null,null,null,null,{"$f":"IF(Übertrag!A9>0,VLOOKUP(Übertrag!A9,#REF!,5,FALSE),\"\")","v":{"$error":"#REF!"}}]
[]
[]
[]
[{"$f":"IF(Übertrag!A8>0,VLOOKUP(Übertrag!A8,#REF!,6,FALSE),\"\")","v":{"$error":"#REF!"}},null,null,null,null,null,null,null,null,null,null,null,null,null,null,null,null,null,null,null,null,null,null,null,{"$f":"IF(Übertrag!A9>0,VLOOKUP(Übertrag!A9,#REF!,6,FALSE),\"\")","v":{"$error":"#REF!"}}]
[]
[]
[]
[]
[]
[]
[]
[]
[]
[]
[{"$f":"IF(Übertrag!A8>0,VLOOKUP(Übertrag!A8,Datenbank[],7,FALSE),\"\")","v":"2025-07-16"},null,null,null,null,null,null,null,null,null,null,null,null,null,null,null,null,null,null,null,null,null,null,null,{"$f":"IF(Übertrag!A9>0,VLOOKUP(Übertrag!A9,Datenbank[],7,FALSE),\"\")","v":"2025-07-16"}]
[{"$f":"IF(Übertrag!A10>0,VLOOKUP(Übertrag!A10,#REF!,2,FALSE),\"\")","v":""},null,null,null,null,null,null,null,null,null,null,null,null,null,null,null,null,null,null,{"$f":"IF(Übertrag!A10>0,VLOOKUP(Übertrag!A10,#REF!,7,FALSE),\"\")","v":""},null,null,null,null,{"$f":"IF(Übertrag!A11>0,VLOOKUP(Übertrag!A11,#REF!,2,FALSE),\"\")","v":""},null,null,null,null,null,null,null,null,null,null,null,null,null,null,null,null,null,null,{"$f":"IF(Übertrag!A11>0,VLOOKUP(Übertrag!A11,#REF!,7,FALSE),\"\")","v":""}]
[]
[]
[]
[]
[{"$f":"IF(Übertrag!A10>0,VLOOKUP(Übertrag!A10,#REF!,3,FALSE),\"\")","v":""},null,null,null,null,null,null,null,null,null,null,null,null,null,null,null,null,null,null,{"$f":"IF(Übertrag!A10>0,VLOOKUP(Übertrag!A10,#REF!,8,FALSE),\"\")","v":""},null,null,null,null,{"$f":"IF(Übertrag!A11>0,VLOOKUP(Übertrag!A11,#REF!,3,FALSE),\"\")","v":""},null,null,null,null,null,null,null,null,null,null,null,null,null,null,null,null,null,null,{"$f":"IF(Übertrag!A11>0,VLOOKUP(Übertrag!A11,#REF!,8,FALSE),\"\")","v":""}]
[]
[]
[]
[{"$f":"_xlfn.IFS(Übertrag!A10=\"\",\"\",K262=\"1\",VLOOKUP(Übertrag!A10,#REF!,17,FALSE),Übertrag!A10>0,VLOOKUP(Übertrag!A10,#REF!,16,FALSE))","v":""},null,null,null,null,null,null,null,null,null,null,{"$f":"IF(Übertrag!A10>0,VLOOKUP(Übertrag!A10,#REF!,13,FALSE),\"\")","v":""},null,null,null,null,null,null,null,{"$f":"IF(Übertrag!A10>0,VLOOKUP(Übertrag!A10,#REF!,4,FALSE),\"\")","v":""},null,null,null,null,{"$f":"_xlfn.IFS(Übertrag!A11=\"\",\"\",AI262=\"1\",VLOOKUP(Übertrag!A11,#REF!,17,FALSE),Übertrag!A11>0,VLOOKUP(Übertrag!A11,#REF!,16,FALSE))","v":""},null,null,null,null,null,null,null,null,null,null,{"$f":"IF(Übertrag!A11>0,VLOOKUP(Übertrag!A11,#REF!,13,FALSE),\"\")","v":""},null,null,null,null,null,null,null,{"$f":"IF(Übertrag!A11>0,VLOOKUP(Übertrag!A11,#REF!,4,FALSE),\"\")","v":""}]
[]
[]
[]
[null,null,null,null,null,null,null,null,null,null,null,{"$f":"IF(Übertrag!A10>0,VLOOKUP(Übertrag!A10,#REF!,11,FALSE),\"\")","v":""},null,null,null,null,null,null,null,null,null,null,null,null,null,null,null,null,null,null,null,null,null,null,null,{"$f":"IF(Übertrag!A11>0,VLOOKUP(Übertrag!A11,#REF!,11,FALSE),\"\")","v":""}]
[]
[]
[]
[]
[]
[]
[]
[]
[]
[]
[]
[]
[]
[]
[]
[]
[]
[null,{"$f":"IF(Übertrag!A10>0,VLOOKUP(Übertrag!A10,#REF!,14,FALSE),\"\")","v":""},null,null,null,null,null,null,null,null,{"$f":"IF(Übertrag!A10>0,VLOOKUP(Übertrag!A10,#REF!,15,FALSE),\"\")","v":""},{"$f":"IF(N262=\"\",\"\",\"1kg=\")","v":""},null,{"$f":"IF(Q262=0,\"\",IF(T262=\"kg\",SUM(L244/Q262),IF(T262=\"g\",SUM(L244/Q262*1000),IF(T262=\"gr\",SUM(L244/Q262*1000),\"\"))))","v":""},null,null,{"$f":"IF(Übertrag!A10>0,VLOOKUP(Übertrag!A10,#REF!,9,FALSE),\"\")","v":""},null,null,{"$f":"IF(Übertrag!A10>0,VLOOKUP(Übertrag!A10,#REF!,10,FALSE),\"\")","v":""},{"$f":"IF(Übertrag!A10>0,VLOOKUP(Übertrag!A10,#REF!,12,FALSE),\"\")","v":""},null,null,null,null,{"$f":"IF(Übertrag!A11>0,VLOOKUP(Übertrag!A11,#REF!,14,FALSE),\"\")","v":""},null,null,null,null,null,null,null,null,{"$f":"IF(Übertrag!A11>0,VLOOKUP(Übertrag!A11,#REF!,15,FALSE),\"\")","v":""},{"$f":"IF(AL262=\"\",\"\",\"1kg=\")","v":""},null,{"$f":"IF(AO262=0,\"\",IF(AR262=\"kg\",SUM(AJ244/AO262),IF(AR262=\"g\",SUM(AJ244/AO262*1000),IF(AR262=\"gr\",SUM(AJ244/AO262*1000),\"\"))))","v":""},null,null,{"$f":"IF(Übertrag!A11>0,VLOOKUP(Übertrag!A11,#REF!,9,FALSE),\"\")","v":""},null,null,{"$f":"IF(Übertrag!A11>0,VLOOKUP(Übertrag!A11,#REF!,10,FALSE),\"\")","v":""},{"$f":"IF(Übertrag!A11>0,VLOOKUP(Übertrag!A11,#REF!,12,FALSE),\"\")","v":""}]
[]
[]
[{"$f":"IF(Übertrag!A10>0,VLOOKUP(Übertrag!A10,#REF!,5,FALSE),\"\")","v":""},null,null,null,null,null,null,null,null,null,null,null,null,null,null,null,null,null,null,null,null,null,null,null,{"$f":"IF(Übertrag!A11>0,VLOOKUP(Übertrag!A11,#REF!,5,FALSE),\"\")","v":""}]
[]
[]
[]
[{"$f":"IF(Übertrag!A10>0,VLOOKUP(Übertrag!A10,#REF!,6,FALSE),\"\")","v":""},null,null,null,null,null,null,null,null,null,null,null,null,null,null,null,null,null,null,null,null,null,null,null,{"$f":"IF(Übertrag!A11>0,VLOOKUP(Übertrag!A11,#REF!,6,FALSE),\"\")","v":""}]
[]
[]
[]
[]
[]
[]
[]
[]
[]
[]
[]
[]
[]
[]
[]
[]
[]
[]
[{"$f":"IF(Übertrag!A12>0,VLOOKUP(Übertrag!A12,#REF!,2,FALSE),\"\")","v":""},null,null,null,null,null,null,null,null,null,null,null,null,null,null,null,null,null,null,{"$f":"IF(Übertrag!A12>0,VLOOKUP(Übertrag!A12,#REF!,7,FALSE),\"\")","v":""},null,null,null,null,{"$f":"IF(Übertrag!A13>0,VLOOKUP(Übertrag!A13,#REF!,2,FALSE),\"\")","v":""},null,null,null,null,null,null,null,null,null,null,null,null,null,null,null,null,null,null,{"$f":"IF(Übertrag!A13>0,VLOOKUP(Übertrag!A13,#REF!,7,FALSE),\"\")","v":""}]
[]
[]
[]
[]
[{"$f":"IF(Übertrag!A12>0,VLOOKUP(Übertrag!A12,#REF!,3,FALSE),\"\")","v":""},null,null,null,null,null,null,null,null,null,null,null,null,null,null,null,null,null,null,{"$f":"IF(Übertrag!A12>0,VLOOKUP(Übertrag!A12,#REF!,8,FALSE),\"\")","v":""},null,null,null,null,{"$f":"IF(Übertrag!A13>0,VLOOKUP(Übertrag!A13,#REF!,3,FALSE),\"\")","v":""},null,null,null,null,null,null,null,null,null,null,null,null,null,null,null,null,null,null,{"$f":"IF(Übertrag!A13>0,VLOOKUP(Übertrag!A13,#REF!,8,FALSE),\"\")","v":""}]
[]
[]
[]
[{"$f":"_xlfn.IFS(Übertrag!A12=\"\",\"\",K319=\"1\",VLOOKUP(Übertrag!A12,#REF!,17,FALSE),Übertrag!A12>0,VLOOKUP(Übertrag!A12,#REF!,16,FALSE))","v":""},null,null,null,null,null,null,null,null,null,null,{"$f":"IF(Übertrag!A12>0,VLOOKUP(Übertrag!A12,#REF!,13,FALSE),\"\")","v":""},null,null,null,null,null,null,null,{"$f":"IF(Übertrag!A12>0,VLOOKUP(Übertrag!A12,#REF!,4,FALSE),\"\")","v":""},null,null,null,null,{"$f":"_xlfn.IFS(Übertrag!A13=\"\",\"\",AI319=\"1\",VLOOKUP(Übertrag!A13,#REF!,17,FALSE),Übertrag!A13>0,VLOOKUP(Übertrag!A13,#REF!,16,FALSE))","v":""},null,null,null,null,null,null,null,null,null,null,{"$f":"IF(Übertrag!A13>0,VLOOKUP(Übertrag!A13,#REF!,13,FALSE),\"\")","v":""},null,null,null,null,null,null,null,{"$f":"IF(Übertrag!A13>0,VLOOKUP(Übertrag!A13,#REF!,4,FALSE),\"\")","v":""}]
[]
[]
[]
[null,null,null,null,null,null,null,null,null,null,null,{"$f":"IF(Übertrag!A12>0,VLOOKUP(Übertrag!A12,#REF!,11,FALSE),\"\")","v":""},null,null,null,null,null,null,null,null,null,null,null,null,null,null,null,null,null,null,null,null,null,null,null,{"$f":"IF(Übertrag!A13>0,VLOOKUP(Übertrag!A13,#REF!,11,FALSE),\"\")","v":""}]
[]
[]
[]
[]
[]
[]
[]
[]
[]
[]
[]
[]
[]
[]
[]
[]
[]
[null,{"$f":"IF(Übertrag!A12>0,VLOOKUP(Übertrag!A12,#REF!,14,FALSE),\"\")","v":""},null,null,null,null,null,null,null,null,{"$f":"IF(Übertrag!A12>0,VLOOKUP(Übertrag!A12,#REF!,15,FALSE),\"\")","v":""},{"$f":"IF(N319=\"\",\"\",\"1kg=\")","v":""},null,{"$f":"IF(Q319=0,\"\",IF(T319=\"kg\",SUM(L301/Q319),IF(T319=\"g\",SUM(L301/Q319*1000),IF(T319=\"gr\",SUM(L301/Q319*1000),\"\"))))","v":""},null,null,{"$f":"IF(Übertrag!A12>0,VLOOKUP(Übertrag!A12,#REF!,9,FALSE),\"\")","v":""},null,null,{"$f":"IF(Übertrag!A12>0,VLOOKUP(Übertrag!A12,#REF!,10,FALSE),\"\")","v":""},{"$f":"IF(Übertrag!A12>0,VLOOKUP(Übertrag!A12,#REF!,12,FALSE),\"\")","v":""},null,null,null,null,{"$f":"IF(Übertrag!A13>0,VLOOKUP(Übertrag!A13,#REF!,14,FALSE),\"\")","v":""},null,null,null,null,null,null,null,null,{"$f":"IF(Übertrag!A13>0,VLOOKUP(Übertrag!A13,#REF!,15,FALSE),\"\")","v":""},{"$f":"IF(AL319=\"\",\"\",\"1kg=\")","v":""},null,{"$f":"IF(AO319=0,\"\",IF(AR319=\"kg\",SUM(AJ301/AO319),IF(AR319=\"g\",SUM(AJ301/AO319*1000),IF(AR319=\"gr\",SUM(AJ301/AO319*1000),\"\"))))","v":""},null,null,{"$f":"IF(Übertrag!A13>0,VLOOKUP(Übertrag!A13,#REF!,9,FALSE),\"\")","v":""},null,null,{"$f":"IF(Übertrag!A13>0,VLOOKUP(Übertrag!A13,#REF!,10,FALSE),\"\")","v":""},{"$f":"IF(Übertrag!A13>0,VLOOKUP(Übertrag!A13,#REF!,12,FALSE),\"\")","v":""}]
[]
[]
[{"$f":"IF(Übertrag!A12>0,VLOOKUP(Übertrag!A12,#REF!,5,FALSE),\"\")","v":""},null,null,null,null,null,null,null,null,null,null,null,null,null,null,null,null,null,null,null,null,null,null,null,{"$f":"IF(Übertrag!A13>0,VLOOKUP(Übertrag!A13,#REF!,5,FALSE),\"\")","v":""}]
[]
[]
[]
[{"$f":"IF(Übertrag!A12>0,VLOOKUP(Übertrag!A12,#REF!,6,FALSE),\"\")","v":""},null,null,null,null,null,null,null,null,null,null,null,null,null,null,null,null,null,null,null,null,null,null,null,{"$f":"IF(Übertrag!A13>0,VLOOKUP(Übertrag!A13,#REF!,6,FALSE),\"\")","v":""}]
[]
[]
[]
[]
[]
[]
[]
[]
[]
[]
[]
[]
[]
[]
[]
[]
[]
[]
[{"$f":"IF(Übertrag!A14>0,VLOOKUP(Übertrag!A14,#REF!,2,FALSE),\"\")","v":""},null,null,null,null,null,null,null,null,null,null,null,null,null,null,null,null,null,null,{"$f":"IF(Übertrag!A14>0,VLOOKUP(Übertrag!A14,#REF!,7,FALSE),\"\")","v":""},null,null,null,null,{"$f":"IF(Übertrag!A15>0,VLOOKUP(Übertrag!A15,#REF!,2,FALSE),\"\")","v":""},null,null,null,null,null,null,null,null,null,null,null,null,null,null,null,null,null,null,{"$f":"IF(Übertrag!A15>0,VLOOKUP(Übertrag!A15,#REF!,7,FALSE),\"\")","v":""}]
[]
[]
[]
[]
[{"$f":"IF(Übertrag!A14>0,VLOOKUP(Übertrag!A14,#REF!,3,FALSE),\"\")","v":""},null,null,null,null,null,null,null,null,null,null,null,null,null,null,null,null,null,null,{"$f":"IF(Übertrag!A14>0,VLOOKUP(Übertrag!A14,#REF!,8,FALSE),\"\")","v":""},null,null,null,null,{"$f":"IF(Übertrag!A15>0,VLOOKUP(Übertrag!A15,#REF!,3,FALSE),\"\")","v":""},null,null,null,null,null,null,null,null,null,null,null,null,null,null,null,null,null,null,{"$f":"IF(Übertrag!A15>0,VLOOKUP(Übertrag!A15,#REF!,8,FALSE),\"\")","v":""}]
[]
[]
[]
[{"$f":"_xlfn.IFS(Übertrag!A14=\"\",\"\",K376=\"1\",VLOOKUP(Übertrag!A14,#REF!,17,FALSE),Übertrag!A14>0,VLOOKUP(Übertrag!A14,#REF!,16,FALSE))","v":""},null,null,null,null,null,null,null,null,null,null,{"$f":"IF(Übertrag!A14>0,VLOOKUP(Übertrag!A14,#REF!,13,FALSE),\"\")","v":""},null,null,null,null,null,null,null,{"$f":"IF(Übertrag!A14>0,VLOOKUP(Übertrag!A14,#REF!,4,FALSE),\"\")","v":""},null,null,null,null,{"$f":"_xlfn.IFS(Übertrag!A15=\"\",\"\",AI376=\"1\",VLOOKUP(Übertrag!A15,#REF!,17,FALSE),Übertrag!A15>0,VLOOKUP(Übertrag!A15,#REF!,16,FALSE))","v":""},null,null,null,null,null,null,null,null,null,null,{"$f":"IF(Übertrag!A15>0,VLOOKUP(Übertrag!A15,#REF!,13,FALSE),\"\")","v":""},null,null,null,null,null,null,null,{"$f":"IF(Übertrag!A15>0,VLOOKUP(Übertrag!A15,#REF!,4,FALSE),\"\")","v":""}]
[]
[]
[]
[null,null,null,null,null,null,null,null,null,null,null,{"$f":"IF(Übertrag!A14>0,VLOOKUP(Übertrag!A14,#REF!,11,FALSE),\"\")","v":""},null,null,null,null,null,null,null,null,null,null,null,null,null,null,null,null,null,null,null,null,null,null,null,{"$f":"IF(Übertrag!A15>0,VLOOKUP(Übertrag!A15,#REF!,11,FALSE),\"\")","v":""}]
[]
[]
[]
[]
[]
[]
[]
[]
[]
[]
[]
[]
[]
[]
[]
[]
[]
[null,{"$f":"IF(Übertrag!A14>0,VLOOKUP(Übertrag!A14,#REF!,14,FALSE),\"\")","v":""},null,null,null,null,null,null,null,null,{"$f":"IF(Übertrag!A14>0,VLOOKUP(Übertrag!A14,#REF!,15,FALSE),\"\")","v":""},{"$f":"IF(N376=\"\",\"\",\"1kg=\")","v":""},null,{"$f":"IF(Q376=0,\"\",IF(T376=\"kg\",SUM(L358/Q376),IF(T376=\"g\",SUM(L358/Q376*1000),IF(T376=\"gr\",SUM(L358/Q376*1000),\"\"))))","v":""},null,null,{"$f":"IF(Übertrag!A14>0,VLOOKUP(Übertrag!A14,#REF!,9,FALSE),\"\")","v":""},null,null,{"$f":"IF(Übertrag!A14>0,VLOOKUP(Übertrag!A14,#REF!,10,FALSE),\"\")","v":""},{"$f":"IF(Übertrag!A14>0,VLOOKUP(Übertrag!A14,#REF!,12,FALSE),\"\")","v":""},null,null,null,null,{"$f":"IF(Übertrag!A15>0,VLOOKUP(Übertrag!A15,#REF!,14,FALSE),\"\")","v":""},null,null,null,null,null,null,null,null,{"$f":"IF(Übertrag!A15>0,VLOOKUP(Übertrag!A15,#REF!,15,FALSE),\"\")","v":""},{"$f":"IF(AL376=\"\",\"\",\"1kg=\")","v":""},null,{"$f":"IF(AO376=0,\"\",IF(AR376=\"kg\",SUM(AJ358/AO376),IF(AR376=\"g\",SUM(AJ358/AO376*1000),IF(AR376=\"gr\",SUM(AJ358/AO376*1000),\"\"))))","v":""},null,null,{"$f":"IF(Übertrag!A15>0,VLOOKUP(Übertrag!A15,#REF!,9,FALSE),\"\")","v":""},null,null,{"$f":"IF(Übertrag!A15>0,VLOOKUP(Übertrag!A15,#REF!,10,FALSE),\"\")","v":""},{"$f":"IF(Übertrag!A15>0,VLOOKUP(Übertrag!A15,#REF!,12,FALSE),\"\")","v":""}]
[]
[]
[{"$f":"IF(Übertrag!A14>0,VLOOKUP(Übertrag!A14,#REF!,5,FALSE),\"\")","v":""},null,null,null,null,null,null,null,null,null,null,null,null,null,null,null,null,null,null,null,null,null,null,null,{"$f":"IF(Übertrag!A15>0,VLOOKUP(Übertrag!A15,#REF!,5,FALSE),\"\")","v":""}]
[]
[]
[]
[{"$f":"IF(Übertrag!A14>0,VLOOKUP(Übertrag!A14,#REF!,6,FALSE),\"\")","v":""},null,null,null,null,null,null,null,null,null,null,null,null,null,null,null,null,null,null,null,null,null,null,null,{"$f":"IF(Übertrag!A15>0,VLOOKUP(Übertrag!A15,#REF!,6,FALSE),\"\")","v":""}]
[]
[]
[]
[]
[]
[]
[]
[]
[]
[]
[]
[]
[]
[]
[]
[]
[]
[]
[{"$f":"IF(Übertrag!A16>0,VLOOKUP(Übertrag!A16,#REF!,2,FALSE),\"\")","v":""},null,null,null,null,null,null,null,null,null,null,null,null,null,null,null,null,null,null,{"$f":"IF(Übertrag!A16>0,VLOOKUP(Übertrag!A16,#REF!,7,FALSE),\"\")","v":""},null,null,null,null,{"$f":"IF(Übertrag!A17>0,VLOOKUP(Übertrag!A17,#REF!,2,FALSE),\"\")","v":""},null,null,null,null,null,null,null,null,null,null,null,null,null,null,null,null,null,null,{"$f":"IF(Übertrag!A17>0,VLOOKUP(Übertrag!A17,#REF!,7,FALSE),\"\")","v":""}]
[]
[]
[]
[]
[{"$f":"IF(Übertrag!A16>0,VLOOKUP(Übertrag!A16,#REF!,3,FALSE),\"\")","v":""},null,null,null,null,null,null,null,null,null,null,null,null,null,null,null,null,null,null,{"$f":"IF(Übertrag!A16>0,VLOOKUP(Übertrag!A16,#REF!,8,FALSE),\"\")","v":""},null,null,null,null,{"$f":"IF(Übertrag!A17>0,VLOOKUP(Übertrag!A17,#REF!,3,FALSE),\"\")","v":""},null,null,null,null,null,null,null,null,null,null,null,null,null,null,null,null,null,null,{"$f":"IF(Übertrag!A17>0,VLOOKUP(Übertrag!A17,#REF!,8,FALSE),\"\")","v":""}]
[]
[]
[]
[{"$f":"_xlfn.IFS(Übertrag!A16=\"\",\"\",K433=\"1\",VLOOKUP(Übertrag!A16,#REF!,17,FALSE),Übertrag!A16>0,VLOOKUP(Übertrag!A16,#REF!,16,FALSE))","v":""},null,null,null,null,null,null,null,null,null,null,{"$f":"IF(Übertrag!A16>0,VLOOKUP(Übertrag!A16,#REF!,13,FALSE),\"\")","v":""},null,null,null,null,null,null,null,{"$f":"IF(Übertrag!A16>0,VLOOKUP(Übertrag!A16,#REF!,4,FALSE),\"\")","v":""},null,null,null,null,{"$f":"_xlfn.IFS(Übertrag!A17=\"\",\"\",AI433=\"1\",VLOOKUP(Übertrag!A17,#REF!,17,FALSE),Übertrag!A17>0,VLOOKUP(Übertrag!A17,#REF!,16,FALSE))","v":""},null,null,null,null,null,null,null,null,null,null,{"$f":"IF(Übertrag!A17>0,VLOOKUP(Übertrag!A17,#REF!,13,FALSE),\"\")","v":""},null,null,null,null,null,null,null,{"$f":"IF(Übertrag!A17>0,VLOOKUP(Übertrag!A17,#REF!,4,FALSE),\"\")","v":""}]
[]
[]
[]
[null,null,null,null,null,null,null,null,null,null,null,{"$f":"IF(Übertrag!A16>0,VLOOKUP(Übertrag!A16,#REF!,11,FALSE),\"\")","v":""},null,null,null,null,null,null,null,null,null,null,null,null,null,null,null,null,null,null,null,null,null,null,null,{"$f":"IF(Übertrag!A17>0,VLOOKUP(Übertrag!A17,#REF!,11,FALSE),\"\")","v":""}]
[]
[]
[]
[]
[]
[]
[]
[]
[]
[]
[]
[]
[]
[]
[]
[]
[]
[null,{"$f":"IF(Übertrag!A16>0,VLOOKUP(Übertrag!A16,#REF!,14,FALSE),\"\")","v":""},null,null,null,null,null,null,null,null,{"$f":"IF(Übertrag!A16>0,VLOOKUP(Übertrag!A16,#REF!,15,FALSE),\"\")","v":""},{"$f":"IF(N433=\"\",\"\",\"1kg=\")","v":""},null,{"$f":"IF(Q433=0,\"\",IF(T433=\"kg\",SUM(L415/Q433),IF(T433=\"g\",SUM(L415/Q433*1000),IF(T433=\"gr\",SUM(L415/Q433*1000),\"\"))))","v":""},null,null,{"$f":"IF(Übertrag!A16>0,VLOOKUP(Übertrag!A16,#REF!,9,FALSE),\"\")","v":""},null,null,{"$f":"IF(Übertrag!A16>0,VLOOKUP(Übertrag!A16,#REF!,10,FALSE),\"\")","v":""},{"$f":"IF(Übertrag!A16>0,VLOOKUP(Übertrag!A16,#REF!,12,FALSE),\"\")","v":""},null,null,null,null,{"$f":"IF(Übertrag!A17>0,VLOOKUP(Übertrag!A17,#REF!,14,FALSE),\"\")","v":""},null,null,null,null,null,null,null,null,{"$f":"IF(Übertrag!A17>0,VLOOKUP(Übertrag!A17,#REF!,15,FALSE),\"\")","v":""},{"$f":"IF(AL433=\"\",\"\",\"1kg=\")","v":""},null,{"$f":"IF(AO433=0,\"\",IF(AR433=\"kg\",SUM(AJ415/AO433),IF(AR433=\"g\",SUM(AJ415/AO433*1000),IF(AR433=\"gr\",SUM(AJ415/AO433*1000),\"\"))))","v":""},null,null,{"$f":"IF(Übertrag!A17>0,VLOOKUP(Übertrag!A17,#REF!,9,FALSE),\"\")","v":""},null,null,{"$f":"IF(Übertrag!A17>0,VLOOKUP(Übertrag!A17,#REF!,10,FALSE),\"\")","v":""},{"$f":"IF(Übertrag!A17>0,VLOOKUP(Übertrag!A17,#REF!,12,FALSE),\"\")","v":""}]
[]
[]
[{"$f":"IF(Übertrag!A16>0,VLOOKUP(Übertrag!A16,#REF!,5,FALSE),\"\")","v":""},null,null,null,null,null,null,null,null,null,null,null,null,null,null,null,null,null,null,null,null,null,null,null,{"$f":"IF(Übertrag!A17>0,VLOOKUP(Übertrag!A17,#REF!,5,FALSE),\"\")","v":""}]
[]
[]
[]
[{"$f":"IF(Übertrag!A16>0,VLOOKUP(Übertrag!A16,#REF!,6,FALSE),\"\")","v":""},null,null,null,null,null,null,null,null,null,null,null,null,null,null,null,null,null,null,null,null,null,null,null,{"$f":"IF(Übertrag!A17>0,VLOOKUP(Übertrag!A17,#REF!,6,FALSE),\"\")","v":""}]
[]
[]
[]
[]
[]
[]
[]
[]
[]
[]
[]
[{"$f":"IF(Übertrag!A18>0,VLOOKUP(Übertrag!A18,#REF!,2,FALSE),\"\")","v":""},null,null,null,null,null,null,null,null,null,null,null,null,null,null,null,null,null,null,{"$f":"IF(Übertrag!A18>0,VLOOKUP(Übertrag!A18,#REF!,7,FALSE),\"\")","v":""},null,null,null,null,{"$f":"IF(Übertrag!A19>0,VLOOKUP(Übertrag!A19,#REF!,2,FALSE),\"\")","v":""},null,null,null,null,null,null,null,null,null,null,null,null,null,null,null,null,null,null,{"$f":"IF(Übertrag!A19>0,VLOOKUP(Übertrag!A19,#REF!,7,FALSE),\"\")","v":""}]
[]
[]
[]
[]
[{"$f":"IF(Übertrag!A18>0,VLOOKUP(Übertrag!A18,#REF!,3,FALSE),\"\")","v":""},null,null,null,null,null,null,null,null,null,null,null,null,null,null,null,null,null,null,{"$f":"IF(Übertrag!A18>0,VLOOKUP(Übertrag!A18,#REF!,8,FALSE),\"\")","v":""},null,null,null,null,{"$f":"IF(Übertrag!A19>0,VLOOKUP(Übertrag!A19,#REF!,3,FALSE),\"\")","v":""},null,null,null,null,null,null,null,null,null,null,null,null,null,null,null,null,null,null,{"$f":"IF(Übertrag!A19>0,VLOOKUP(Übertrag!A19,#REF!,8,FALSE),\"\")","v":""}]
[]
[]
[]
[{"$f":"_xlfn.IFS(Übertrag!A18=\"\",\"\",K483=\"1\",VLOOKUP(Übertrag!A18,#REF!,17,FALSE),Übertrag!A18>0,VLOOKUP(Übertrag!A18,#REF!,16,FALSE))","v":""},null,null,null,null,null,null,null,null,null,null,{"$f":"IF(Übertrag!A18>0,VLOOKUP(Übertrag!A18,#REF!,13,FALSE),\"\")","v":""},null,null,null,null,null,null,null,{"$f":"IF(Übertrag!A18>0,VLOOKUP(Übertrag!A18,#REF!,4,FALSE),\"\")","v":""},null,null,null,null,{"$f":"_xlfn.IFS(Übertrag!A19=\"\",\"\",AI483=\"1\",VLOOKUP(Übertrag!A19,#REF!,17,FALSE),Übertrag!A19>0,VLOOKUP(Übertrag!A19,#REF!,16,FALSE))","v":""},null,null,null,null,null,null,null,null,null,null,{"$f":"IF(Übertrag!A19>0,VLOOKUP(Übertrag!A19,#REF!,13,FALSE),\"\")","v":""},null,null,null,null,null,null,null,{"$f":"IF(Übertrag!A19>0,VLOOKUP(Übertrag!A19,#REF!,4,FALSE),\"\")","v":""}]
[]
[]
[]
[null,null,null,null,null,null,null,null,null,null,null,{"$f":"IF(Übertrag!A18>0,VLOOKUP(Übertrag!A18,#REF!,11,FALSE),\"\")","v":""},null,null,null,null,null,null,null,null,null,null,null,null,null,null,null,null,null,null,null,null,null,null,null,{"$f":"IF(Übertrag!A19>0,VLOOKUP(Übertrag!A19,#REF!,11,FALSE),\"\")","v":""}]
[]
[]
[]
[]
[]
[]
[]
[]
[]
[]
[]
[]
[]
[]
[]
[]
[]
[null,{"$f":"IF(Übertrag!A18>0,VLOOKUP(Übertrag!A18,#REF!,14,FALSE),\"\")","v":""},null,null,null,null,null,null,null,null,{"$f":"IF(Übertrag!A18>0,VLOOKUP(Übertrag!A18,#REF!,15,FALSE),\"\")","v":""},{"$f":"IF(N483=\"\",\"\",\"1kg=\")","v":""},null,{"$f":"IF(Q483=0,\"\",IF(T483=\"kg\",SUM(L465/Q483),IF(T483=\"g\",SUM(L465/Q483*1000),IF(T483=\"gr\",SUM(L465/Q483*1000),\"\"))))","v":""},null,null,{"$f":"IF(Übertrag!A18>0,VLOOKUP(Übertrag!A18,#REF!,9,FALSE),\"\")","v":""},null,null,{"$f":"IF(Übertrag!A18>0,VLOOKUP(Übertrag!A18,#REF!,10,FALSE),\"\")","v":""},{"$f":"IF(Übertrag!A18>0,VLOOKUP(Übertrag!A18,#REF!,12,FALSE),\"\")","v":""},null,null,null,null,{"$f":"IF(Übertrag!A19>0,VLOOKUP(Übertrag!A19,#REF!,14,FALSE),\"\")","v":""},null,null,null,null,null,null,null,null,{"$f":"IF(Übertrag!A19>0,VLOOKUP(Übertrag!A19,#REF!,15,FALSE),\"\")","v":""},{"$f":"IF(AL483=\"\",\"\",\"1kg=\")","v":""},null,{"$f":"IF(AO483=0,\"\",IF(AR483=\"kg\",SUM(AJ465/AO483),IF(AR483=\"g\",SUM(AJ465/AO483*1000),IF(AR483=\"gr\",SUM(AJ465/AO483*1000),\"\"))))","v":""},null,null,{"$f":"IF(Übertrag!A19>0,VLOOKUP(Übertrag!A19,#REF!,9,FALSE),\"\")","v":""},null,null,{"$f":"IF(Übertrag!A19>0,VLOOKUP(Übertrag!A19,#REF!,10,FALSE),\"\")","v":""},{"$f":"IF(Übertrag!A19>0,VLOOKUP(Übertrag!A19,#REF!,12,FALSE),\"\")","v":""}]
[]
[]
[{"$f":"IF(Übertrag!A18>0,VLOOKUP(Übertrag!A18,#REF!,5,FALSE),\"\")","v":""},null,null,null,null,null,null,null,null,null,null,null,null,null,null,null,null,null,null,null,null,null,null,null,{"$f":"IF(Übertrag!A19>0,VLOOKUP(Übertrag!A19,#REF!,5,FALSE),\"\")","v":""}]
[]
[]
[]
[{"$f":"IF(Übertrag!A18>0,VLOOKUP(Übertrag!A18,#REF!,6,FALSE),\"\")","v":""},null,null,null,null,null,null,null,null,null,null,null,null,null,null,null,null,null,null,null,null,null,null,null,{"$f":"IF(Übertrag!A19>0,VLOOKUP(Übertrag!A19,#REF!,6,FALSE),\"\")","v":""}]
[]
[]
[]
[]
[]
[]
[]
[]
[]
[]
[]
[]
[]
[]
[]
[]
[]
[]
[{"$f":"IF(Übertrag!A20>0,VLOOKUP(Übertrag!A20,#REF!,2,FALSE),\"\")","v":""},null,null,null,null,null,null,null,null,null,null,null,null,null,null,null,null,null,null,{"$f":"IF(Übertrag!A20>0,VLOOKUP(Übertrag!A20,#REF!,7,FALSE),\"\")","v":""},null,null,null,null,{"$f":"IF(Übertrag!A21>0,VLOOKUP(Übertrag!A21,#REF!,2,FALSE),\"\")","v":""},null,null,null,null,null,null,null,null,null,null,null,null,null,null,null,null,null,null,{"$f":"IF(Übertrag!A21>0,VLOOKUP(Übertrag!A21,#REF!,7,FALSE),\"\")","v":""}]
[]
[]
[]
[]
[{"$f":"IF(Übertrag!A20>0,VLOOKUP(Übertrag!A20,#REF!,3,FALSE),\"\")","v":""},null,null,null,null,null,null,null,null,null,null,null,null,null,null,null,null,null,null,{"$f":"IF(Übertrag!A20>0,VLOOKUP(Übertrag!A20,#REF!,8,FALSE),\"\")","v":""},null,null,null,null,{"$f":"IF(Übertrag!A234>0,VLOOKUP(Übertrag!A234,#REF!,3,FALSE),\"\")","v":""},null,null,null,null,null,null,null,null,null,null,null,null,null,null,null,null,null,null,{"$f":"IF(Übertrag!A21>0,VLOOKUP(Übertrag!A21,#REF!,8,FALSE),\"\")","v":""}]
[]
[]
[]
[{"$f":"_xlfn.IFS(Übertrag!A20=\"\",\"\",K540=\"1\",VLOOKUP(Übertrag!A20,#REF!,17,FALSE),Übertrag!A20>0,VLOOKUP(Übertrag!A20,#REF!,16,FALSE))","v":""},null,null,null,null,null,null,null,null,null,null,{"$f":"IF(Übertrag!A20>0,VLOOKUP(Übertrag!A20,#REF!,13,FALSE),\"\")","v":""},null,null,null,null,null,null,null,{"$f":"IF(Übertrag!A20>0,VLOOKUP(Übertrag!A20,#REF!,4,FALSE),\"\")","v":""},null,null,null,null,{"$f":"_xlfn.IFS(Übertrag!A21=\"\",\"\",AI540=\"1\",VLOOKUP(Übertrag!A21,#REF!,17,FALSE),Übertrag!A21>0,VLOOKUP(Übertrag!A21,#REF!,16,FALSE))","v":""},null,null,null,null,null,null,null,null,null,null,{"$f":"IF(Übertrag!A21>0,VLOOKUP(Übertrag!A21,#REF!,13,FALSE),\"\")","v":""},null,null,null,null,null,null,null,{"$f":"IF(Übertrag!A21>0,VLOOKUP(Übertrag!A21,#REF!,4,FALSE),\"\")","v":""}]
[]
[]
[]
[null,null,null,null,null,null,null,null,null,null,null,{"$f":"IF(Übertrag!A20>0,VLOOKUP(Übertrag!A20,#REF!,11,FALSE),\"\")","v":""},null,null,null,null,null,null,null,null,null,null,null,null,null,null,null,null,null,null,null,null,null,null,null,{"$f":"IF(Übertrag!A21>0,VLOOKUP(Übertrag!A21,#REF!,11,FALSE),\"\")","v":""}]
[]
[]
[]
[]
[]
[]
[]
[]
[]
[]
[]
[]
[]
[]
[]
[]
[]
[null,{"$f":"IF(Übertrag!A20>0,VLOOKUP(Übertrag!A20,#REF!,14,FALSE),\"\")","v":""},null,null,null,null,null,null,null,null,{"$f":"IF(Übertrag!A20>0,VLOOKUP(Übertrag!A20,#REF!,15,FALSE),\"\")","v":""},{"$f":"IF(N540=\"\",\"\",\"1kg=\")","v":""},null,{"$f":"IF(Q540=0,\"\",IF(T540=\"kg\",SUM(L522/Q540),IF(T540=\"g\",SUM(L522/Q540*1000),IF(T540=\"gr\",SUM(L522/Q540*1000),\"\"))))","v":""},null,null,{"$f":"IF(Übertrag!A20>0,VLOOKUP(Übertrag!A20,#REF!,9,FALSE),\"\")","v":""},null,null,{"$f":"IF(Übertrag!A20>0,VLOOKUP(Übertrag!A20,#REF!,10,FALSE),\"\")","v":""},{"$f":"IF(Übertrag!A20>0,VLOOKUP(Übertrag!A20,#REF!,12,FALSE),\"\")","v":""},null,null,null,null,{"$f":"IF(Übertrag!A234>0,VLOOKUP(Übertrag!A234,#REF!,14,FALSE),\"\")","v":""},null,null,null,null,null,null,null,null,{"$f":"IF(Übertrag!A234>0,VLOOKUP(Übertrag!A234,#REF!,15,FALSE),\"\")","v":""},{"$f":"IF(AL540=\"\",\"\",\"1kg=\")","v":""},null,{"$f":"IF(AO540=0,\"\",IF(AR540=\"kg\",SUM(AJ522/AO540),IF(AR540=\"g\",SUM(AJ522/AO540*1000),IF(AR540=\"gr\",SUM(AJ522/AO540*1000),\"\"))))","v":""},null,null,{"$f":"IF(Übertrag!A234>0,VLOOKUP(Übertrag!A234,#REF!,9,FALSE),\"\")","v":""},null,null,{"$f":"IF(Übertrag!A234>0,VLOOKUP(Übertrag!A234,#REF!,10,FALSE),\"\")","v":""},{"$f":"IF(Übertrag!A234>0,VLOOKUP(Übertrag!A234,#REF!,12,FALSE),\"\")","v":""}]
[]
[]
[{"$f":"IF(Übertrag!A20>0,VLOOKUP(Übertrag!A20,#REF!,5,FALSE),\"\")","v":""},null,null,null,null,null,null,null,null,null,null,null,null,null,null,null,null,null,null,null,null,null,null,null,{"$f":"IF(Übertrag!A21>0,VLOOKUP(Übertrag!A21,#REF!,5,FALSE),\"\")","v":""}]
[]
[]
[]
[{"$f":"IF(Übertrag!A20>0,VLOOKUP(Übertrag!A20,#REF!,6,FALSE),\"\")","v":""},null,null,null,null,null,null,null,null,null,null,null,null,null,null,null,null,null,null,null,null,null,null,null,{"$f":"IF(Übertrag!A21>0,VLOOKUP(Übertrag!A21,#REF!,6,FALSE),\"\")","v":""}]
[]
[]
[]
[]
[]
[]
[]
[]
[]
[]
[]
[]
[]
[]
[]
[]
[]
[]
[{"$f":"IF(Übertrag!A22>0,VLOOKUP(Übertrag!A22,#REF!,2,FALSE),\"\")","v":""},null,null,null,null,null,null,null,null,null,null,null,null,null,null,null,null,null,null,{"$f":"IF(Übertrag!A22>0,VLOOKUP(Übertrag!A22,#REF!,7,FALSE),\"\")","v":""},null,null,null,null,{"$f":"IF(Übertrag!A23>0,VLOOKUP(Übertrag!A23,#REF!,2,FALSE),\"\")","v":""},null,null,null,null,null,null,null,null,null,null,null,null,null,null,null,null,null,null,{"$f":"IF(Übertrag!A23>0,VLOOKUP(Übertrag!A23,#REF!,7,FALSE),\"\")","v":""}]
[]
[]
[]
[]
[{"$f":"IF(Übertrag!A22>0,VLOOKUP(Übertrag!A22,#REF!,3,FALSE),\"\")","v":""},null,null,null,null,null,null,null,null,null,null,null,null,null,null,null,null,null,null,{"$f":"IF(Übertrag!A22>0,VLOOKUP(Übertrag!A22,#REF!,8,FALSE),\"\")","v":""},null,null,null,null,{"$f":"IF(Übertrag!A23>0,VLOOKUP(Übertrag!A23,#REF!,3,FALSE),\"\")","v":""},null,null,null,null,null,null,null,null,null,null,null,null,null,null,null,null,null,null,{"$f":"IF(Übertrag!A23>0,VLOOKUP(Übertrag!A23,#REF!,8,FALSE),\"\")","v":""}]
[]
[]
[]
[{"$f":"_xlfn.IFS(Übertrag!A22=\"\",\"\",K597=\"1\",VLOOKUP(Übertrag!A22,#REF!,17,FALSE),Übertrag!A22>0,VLOOKUP(Übertrag!A22,#REF!,16,FALSE))","v":""},null,null,null,null,null,null,null,null,null,null,{"$f":"IF(Übertrag!A22>0,VLOOKUP(Übertrag!A22,#REF!,13,FALSE),\"\")","v":""},null,null,null,null,null,null,null,{"$f":"IF(Übertrag!A235>0,VLOOKUP(Übertrag!A235,#REF!,4,FALSE),\"\")","v":""},null,null,null,null,{"$f":"_xlfn.IFS(Übertrag!A23=\"\",\"\",AI597=\"1\",VLOOKUP(Übertrag!A23,#REF!,17,FALSE),Übertrag!A23>0,VLOOKUP(Übertrag!A23,#REF!,16,FALSE))","v":""},null,null,null,null,null,null,null,null,null,null,{"$f":"IF(Übertrag!A23>0,VLOOKUP(Übertrag!A23,#REF!,13,FALSE),\"\")","v":""},null,null,null,null,null,null,null,{"$f":"IF(Übertrag!A23>0,VLOOKUP(Übertrag!A23,#REF!,4,FALSE),\"\")","v":""}]
[]
[]
[]
[null,null,null,null,null,null,null,null,null,null,null,{"$f":"IF(Übertrag!A22>0,VLOOKUP(Übertrag!A22,#REF!,11,FALSE),\"\")","v":""},null,null,null,null,null,null,null,null,null,null,null,null,null,null,null,null,null,null,null,null,null,null,null,{"$f":"IF(Übertrag!A23>0,VLOOKUP(Übertrag!A23,#REF!,11,FALSE),\"\")","v":""}]
[]
[]
[]
[]
[]
[]
[]
[]
[]
[]
[]
[]
[]
[]
[]
[]
[]
[null,{"$f":"IF(Übertrag!A22>0,VLOOKUP(Übertrag!A22,#REF!,14,FALSE),\"\")","v":""},null,null,null,null,null,null,null,null,{"$f":"IF(Übertrag!A22>0,VLOOKUP(Übertrag!A22,#REF!,15,FALSE),\"\")","v":""},{"$f":"IF(N597=\"\",\"\",\"1kg=\")","v":""},null,{"$f":"IF(Q597=0,\"\",IF(T597=\"kg\",SUM(L579/Q597),IF(T597=\"g\",SUM(L579/Q597*1000),IF(T597=\"gr\",SUM(L579/Q597*1000),\"\"))))","v":""},null,null,{"$f":"IF(Übertrag!A22>0,VLOOKUP(Übertrag!A22,#REF!,9,FALSE),\"\")","v":""},null,null,{"$f":"IF(Übertrag!A22>0,VLOOKUP(Übertrag!A22,#REF!,10,FALSE),\"\")","v":""},{"$f":"IF(Übertrag!A22>0,VLOOKUP(Übertrag!A22,#REF!,12,FALSE),\"\")","v":""},null,null,null,null,{"$f":"IF(Übertrag!A23>0,VLOOKUP(Übertrag!A23,#REF!,14,FALSE),\"\")","v":""},null,null,null,null,null,null,null,null,{"$f":"IF(Übertrag!A23>0,VLOOKUP(Übertrag!A23,#REF!,15,FALSE),\"\")","v":""},{"$f":"IF(AL597=\"\",\"\",\"1kg=\")","v":""},null,{"$f":"IF(AO597=0,\"\",IF(AR597=\"kg\",SUM(AJ579/AO597),IF(AR597=\"g\",SUM(AJ579/AO597*1000),IF(AR597=\"gr\",SUM(AJ579/AO597*1000),\"\"))))","v":""},null,null,{"$f":"IF(Übertrag!A23>0,VLOOKUP(Übertrag!A23,#REF!,9,FALSE),\"\")","v":""},null,null,{"$f":"IF(Übertrag!A23>0,VLOOKUP(Übertrag!A23,#REF!,10,FALSE),\"\")","v":""},{"$f":"IF(Übertrag!A23>0,VLOOKUP(Übertrag!A23,#REF!,12,FALSE),\"\")","v":""}]
[]
[]
[{"$f":"IF(Übertrag!A22>0,VLOOKUP(Übertrag!A22,#REF!,5,FALSE),\"\")","v":""},null,null,null,null,null,null,null,null,null,null,null,null,null,null,null,null,null,null,null,null,null,null,null,{"$f":"IF(Übertrag!A23>0,VLOOKUP(Übertrag!A23,#REF!,5,FALSE),\"\")","v":""}]
[]
[]
[]
[{"$f":"IF(Übertrag!A22>0,VLOOKUP(Übertrag!A22,#REF!,6,FALSE),\"\")","v":""},null,null,null,null,null,null,null,null,null,null,null,null,null,null,null,null,null,null,null,null,null,null,null,{"$f":"IF(Übertrag!A23>0,VLOOKUP(Übertrag!A23,#REF!,6,FALSE),\"\")","v":""}]
[]
[]
[]
[]
[]
[]
[]
[]
[]
[]
[]
[]
[]
[]
[]
[]
[]
[]
[{"$f":"IF(Übertrag!A24>0,VLOOKUP(Übertrag!A24,#REF!,2,FALSE),\"\")","v":""},null,null,null,null,null,null,null,null,null,null,null,null,null,null,null,null,null,null,{"$f":"IF(Übertrag!A24>0,VLOOKUP(Übertrag!A24,#REF!,7,FALSE),\"\")","v":""},null,null,null,null,{"$f":"IF(Übertrag!A25>0,VLOOKUP(Übertrag!A25,#REF!,2,FALSE),\"\")","v":""},null,null,null,null,null,null,null,null,null,null,null,null,null,null,null,null,null,null,{"$f":"IF(Übertrag!A25>0,VLOOKUP(Übertrag!A25,#REF!,7,FALSE),\"\")","v":""}]
[]
[]
[]
[]
[{"$f":"IF(Übertrag!A24>0,VLOOKUP(Übertrag!A24,#REF!,3,FALSE),\"\")","v":""},null,null,null,null,null,null,null,null,null,null,null,null,null,null,null,null,null,null,{"$f":"IF(Übertrag!A24>0,VLOOKUP(Übertrag!A24,#REF!,8,FALSE),\"\")","v":""},null,null,null,null,{"$f":"IF(Übertrag!A25>0,VLOOKUP(Übertrag!A25,#REF!,3,FALSE),\"\")","v":""},null,null,null,null,null,null,null,null,null,null,null,null,null,null,null,null,null,null,{"$f":"IF(Übertrag!A25>0,VLOOKUP(Übertrag!A25,#REF!,8,FALSE),\"\")","v":""}]
[]
[]
[]
[{"$f":"_xlfn.IFS(Übertrag!A24=\"\",\"\",K654=\"1\",VLOOKUP(Übertrag!A24,#REF!,17,FALSE),Übertrag!A24>0,VLOOKUP(Übertrag!A24,#REF!,16,FALSE))","v":""},null,null,null,null,null,null,null,null,null,null,{"$f":"IF(Übertrag!A24>0,VLOOKUP(Übertrag!A24,#REF!,13,FALSE),\"\")","v":""},null,null,null,null,null,null,null,{"$f":"IF(Übertrag!A24>0,VLOOKUP(Übertrag!A24,#REF!,4,FALSE),\"\")","v":""},null,null,null,null,{"$f":"_xlfn.IFS(Übertrag!A25=\"\",\"\",AI654=\"1\",VLOOKUP(Übertrag!A25,#REF!,17,FALSE),Übertrag!A25>0,VLOOKUP(Übertrag!A25,#REF!,16,FALSE))","v":""},null,null,null,null,null,null,null,null,null,null,{"$f":"IF(Übertrag!A25>0,VLOOKUP(Übertrag!A25,#REF!,13,FALSE),\"\")","v":""},null,null,null,null,null,null,null,{"$f":"IF(Übertrag!A25>0,VLOOKUP(Übertrag!A25,#REF!,4,FALSE),\"\")","v":""}]
[]
[]
[]
[null,null,null,null,null,null,null,null,null,null,null,{"$f":"IF(Übertrag!A24>0,VLOOKUP(Übertrag!A24,#REF!,11,FALSE),\"\")","v":""},null,null,null,null,null,null,null,null,null,null,null,null,null,null,null,null,null,null,null,null,null,null,null,{"$f":"IF(Übertrag!A25>0,VLOOKUP(Übertrag!A25,#REF!,11,FALSE),\"\")","v":""}]
[]
[]
[]
[]
[]
[]
[]
[]
[]
[]
[]
[]
[]
[]
[]
[]
[]
[null,{"$f":"IF(Übertrag!A24>0,VLOOKUP(Übertrag!A24,#REF!,14,FALSE),\"\")","v":""},null,null,null,null,null,null,null,null,{"$f":"IF(Übertrag!A24>0,VLOOKUP(Übertrag!A24,#REF!,15,FALSE),\"\")","v":""},{"$f":"IF(N654=\"\",\"\",\"1kg=\")","v":""},null,{"$f":"IF(Q654=0,\"\",IF(T654=\"kg\",SUM(L636/Q654),IF(T654=\"g\",SUM(L636/Q654*1000),IF(T654=\"gr\",SUM(L636/Q654*1000),\"\"))))","v":""},null,null,{"$f":"IF(Übertrag!A24>0,VLOOKUP(Übertrag!A24,#REF!,9,FALSE),\"\")","v":""},null,null,{"$f":"IF(Übertrag!A24>0,VLOOKUP(Übertrag!A24,#REF!,10,FALSE),\"\")","v":""},{"$f":"IF(Übertrag!A24>0,VLOOKUP(Übertrag!A24,#REF!,12,FALSE),\"\")","v":""},null,null,null,null,{"$f":"IF(Übertrag!A25>0,VLOOKUP(Übertrag!A25,#REF!,14,FALSE),\"\")","v":""},null,null,null,null,null,null,null,null,{"$f":"IF(Übertrag!A25>0,VLOOKUP(Übertrag!A25,#REF!,15,FALSE),\"\")","v":""},{"$f":"IF(AL654=\"\",\"\",\"1kg=\")","v":""},null,{"$f":"IF(AO654=0,\"\",IF(AR654=\"kg\",SUM(AJ636/AO654),IF(AR654=\"g\",SUM(AJ636/AO654*1000),IF(AR654=\"gr\",SUM(AJ636/AO654*1000),\"\"))))","v":""},null,null,{"$f":"IF(Übertrag!A25>0,VLOOKUP(Übertrag!A25,#REF!,9,FALSE),\"\")","v":""},null,null,{"$f":"IF(Übertrag!A25>0,VLOOKUP(Übertrag!A25,#REF!,10,FALSE),\"\")","v":""},{"$f":"IF(Übertrag!A25>0,VLOOKUP(Übertrag!A25,#REF!,12,FALSE),\"\")","v":""}]
[]
[]
[{"$f":"IF(Übertrag!A24>0,VLOOKUP(Übertrag!A24,#REF!,5,FALSE),\"\")","v":""},null,null,null,null,null,null,null,null,null,null,null,null,null,null,null,null,null,null,null,null,null,null,null,{"$f":"IF(Übertrag!A25>0,VLOOKUP(Übertrag!A25,#REF!,5,FALSE),\"\")","v":""}]
[]
[]
[]
[{"$f":"IF(Übertrag!A24>0,VLOOKUP(Übertrag!A24,#REF!,6,FALSE),\"\")","v":""},null,null,null,null,null,null,null,null,null,null,null,null,null,null,null,null,null,null,null,null,null,null,null,{"$f":"IF(Übertrag!A25>0,VLOOKUP(Übertrag!A25,#REF!,6,FALSE),\"\")","v":""}]
[]
[]
[]
[]
[]
[]
[]
[]
[]
[]
[]
[{"$f":"IF(Übertrag!A26>0,VLOOKUP(Übertrag!A26,#REF!,2,FALSE),\"\")","v":""},null,null,null,null,null,null,null,null,null,null,null,null,null,null,null,null,null,null,{"$f":"IF(Übertrag!A26>0,VLOOKUP(Übertrag!A26,#REF!,7,FALSE),\"\")","v":""},null,null,null,null,{"$f":"IF(Übertrag!A27>0,VLOOKUP(Übertrag!A27,#REF!,2,FALSE),\"\")","v":""},null,null,null,null,null,null,null,null,null,null,null,null,null,null,null,null,null,null,{"$f":"IF(Übertrag!A27>0,VLOOKUP(Übertrag!A27,#REF!,7,FALSE),\"\")","v":""}]
[]
[]
[]
[]
[{"$f":"IF(Übertrag!A26>0,VLOOKUP(Übertrag!A26,#REF!,3,FALSE),\"\")","v":""},null,null,null,null,null,null,null,null,null,null,null,null,null,null,null,null,null,null,{"$f":"IF(Übertrag!A26>0,VLOOKUP(Übertrag!A26,#REF!,8,FALSE),\"\")","v":""},null,null,null,null,{"$f":"IF(Übertrag!A27>0,VLOOKUP(Übertrag!A27,#REF!,3,FALSE),\"\")","v":""},null,null,null,null,null,null,null,null,null,null,null,null,null,null,null,null,null,null,{"$f":"IF(Übertrag!A27>0,VLOOKUP(Übertrag!A27,#REF!,8,FALSE),\"\")","v":""}]
[]
[]
[]
[{"$f":"_xlfn.IFS(Übertrag!A26=\"\",\"\",K704=\"1\",VLOOKUP(Übertrag!A26,#REF!,17,FALSE),Übertrag!A26>0,VLOOKUP(Übertrag!A26,#REF!,16,FALSE))","v":""},null,null,null,null,null,null,null,null,null,null,{"$f":"IF(Übertrag!A26>0,VLOOKUP(Übertrag!A26,#REF!,13,FALSE),\"\")","v":""},null,null,null,null,null,null,null,{"$f":"IF(Übertrag!A26>0,VLOOKUP(Übertrag!A26,#REF!,4,FALSE),\"\")","v":""},null,null,null,null,{"$f":"_xlfn.IFS(Übertrag!A27=\"\",\"\",AI704=\"1\",VLOOKUP(Übertrag!A27,#REF!,17,FALSE),Übertrag!A27>0,VLOOKUP(Übertrag!A27,#REF!,16,FALSE))","v":""},null,null,null,null,null,null,null,null,null,null,{"$f":"IF(Übertrag!A27>0,VLOOKUP(Übertrag!A27,#REF!,13,FALSE),\"\")","v":""},null,null,null,null,null,null,null,{"$f":"IF(Übertrag!A27>0,VLOOKUP(Übertrag!A27,#REF!,4,FALSE),\"\")","v":""}]
[]
[]
[]
[null,null,null,null,null,null,null,null,null,null,null,{"$f":"IF(Übertrag!A26>0,VLOOKUP(Übertrag!A26,#REF!,11,FALSE),\"\")","v":""},null,null,null,null,null,null,null,null,null,null,null,null,null,null,null,null,null,null,null,null,null,null,null,{"$f":"IF(Übertrag!A27>0,VLOOKUP(Übertrag!A27,#REF!,11,FALSE),\"\")","v":""}]
[]
[]
[]
[]
[]
[]
[]
[]
[]
[]
[]
[]
[]
[]
[]
[]
[]
[null,{"$f":"IF(Übertrag!A26>0,VLOOKUP(Übertrag!A26,#REF!,14,FALSE),\"\")","v":""},null,null,null,null,null,null,null,null,{"$f":"IF(Übertrag!A26>0,VLOOKUP(Übertrag!A26,#REF!,15,FALSE),\"\")","v":""},{"$f":"IF(N704=\"\",\"\",\"1kg=\")","v":""},null,{"$f":"IF(Q704=0,\"\",IF(T704=\"kg\",SUM(L686/Q704),IF(T704=\"g\",SUM(L686/Q704*1000),IF(T704=\"gr\",SUM(L686/Q704*1000),\"\"))))","v":""},null,null,{"$f":"IF(Übertrag!A26>0,VLOOKUP(Übertrag!A26,#REF!,9,FALSE),\"\")","v":""},null,null,{"$f":"IF(Übertrag!A26>0,VLOOKUP(Übertrag!A26,#REF!,10,FALSE),\"\")","v":""},{"$f":"IF(Übertrag!A26>0,VLOOKUP(Übertrag!A26,#REF!,12,FALSE),\"\")","v":""},null,null,null,null,{"$f":"IF(Übertrag!A27>0,VLOOKUP(Übertrag!A27,#REF!,14,FALSE),\"\")","v":""},null,null,null,null,null,null,null,null,{"$f":"IF(Übertrag!A27>0,VLOOKUP(Übertrag!A27,#REF!,15,FALSE),\"\")","v":""},{"$f":"IF(AL704=\"\",\"\",\"1kg=\")","v":""},null,{"$f":"IF(AO704=0,\"\",IF(AR704=\"kg\",SUM(AJ686/AO704),IF(AR704=\"g\",SUM(AJ686/AO704*1000),IF(AR704=\"gr\",SUM(AJ686/AO704*1000),\"\"))))","v":""},null,null,{"$f":"IF(Übertrag!A27>0,VLOOKUP(Übertrag!A27,#REF!,9,FALSE),\"\")","v":""},null,null,{"$f":"IF(Übertrag!A27>0,VLOOKUP(Übertrag!A27,#REF!,10,FALSE),\"\")","v":""},{"$f":"IF(Übertrag!A27>0,VLOOKUP(Übertrag!A27,#REF!,12,FALSE),\"\")","v":""}]
[]
[]
[{"$f":"IF(Übertrag!A26>0,VLOOKUP(Übertrag!A26,#REF!,5,FALSE),\"\")","v":""},null,null,null,null,null,null,null,null,null,null,null,null,null,null,null,null,null,null,null,null,null,null,null,{"$f":"IF(Übertrag!A27>0,VLOOKUP(Übertrag!A27,#REF!,5,FALSE),\"\")","v":""}]
[]
[]
[]
[{"$f":"IF(Übertrag!A26>0,VLOOKUP(Übertrag!A26,#REF!,6,FALSE),\"\")","v":""},null,null,null,null,null,null,null,null,null,null,null,null,null,null,null,null,null,null,null,null,null,null,null,{"$f":"IF(Übertrag!A27>0,VLOOKUP(Übertrag!A27,#REF!,6,FALSE),\"\")","v":""}]
[]
[]
[]
[]
[]
[]
[]
[]
[]
[]
[]
[]
[]
[]
[]
[]
[]
[]
[{"$f":"IF(Übertrag!A28>0,VLOOKUP(Übertrag!A28,#REF!,2,FALSE),\"\")","v":""},null,null,null,null,null,null,null,null,null,null,null,null,null,null,null,null,null,null,{"$f":"IF(Übertrag!A28>0,VLOOKUP(Übertrag!A28,#REF!,7,FALSE),\"\")","v":""},null,null,null,null,{"$f":"IF(Übertrag!A29>0,VLOOKUP(Übertrag!A29,#REF!,2,FALSE),\"\")","v":""},null,null,null,null,null,null,null,null,null,null,null,null,null,null,null,null,null,null,{"$f":"IF(Übertrag!A29>0,VLOOKUP(Übertrag!A29,#REF!,7,FALSE),\"\")","v":""}]
[]
[]
[]
[]
[{"$f":"IF(Übertrag!A28>0,VLOOKUP(Übertrag!A28,#REF!,3,FALSE),\"\")","v":""},null,null,null,null,null,null,null,null,null,null,null,null,null,null,null,null,null,null,{"$f":"IF(Übertrag!A28>0,VLOOKUP(Übertrag!A28,#REF!,8,FALSE),\"\")","v":""},null,null,null,null,{"$f":"IF(Übertrag!A29>0,VLOOKUP(Übertrag!A29,#REF!,3,FALSE),\"\")","v":""},null,null,null,null,null,null,null,null,null,null,null,null,null,null,null,null,null,null,{"$f":"IF(Übertrag!A29>0,VLOOKUP(Übertrag!A29,#REF!,8,FALSE),\"\")","v":""}]
[]
[]
[]
[{"$f":"_xlfn.IFS(Übertrag!A28=\"\",\"\",K761=\"1\",VLOOKUP(Übertrag!A28,#REF!,17,FALSE),Übertrag!A28>0,VLOOKUP(Übertrag!A28,#REF!,16,FALSE))","v":""},null,null,null,null,null,null,null,null,null,null,{"$f":"IF(Übertrag!A28>0,VLOOKUP(Übertrag!A28,#REF!,13,FALSE),\"\")","v":""},null,null,null,null,null,null,null,{"$f":"IF(Übertrag!A28>0,VLOOKUP(Übertrag!A28,#REF!,4,FALSE),\"\")","v":""},null,null,null,null,{"$f":"_xlfn.IFS(Übertrag!A29=\"\",\"\",AI761=\"1\",VLOOKUP(Übertrag!A29,#REF!,17,FALSE),Übertrag!A29>0,VLOOKUP(Übertrag!A29,#REF!,16,FALSE))","v":""},null,null,null,null,null,null,null,null,null,null,{"$f":"IF(Übertrag!A455>0,VLOOKUP(Übertrag!A455,#REF!,13,FALSE),\"\")","v":""},null,null,null,null,null,null,null,{"$f":"IF(Übertrag!A455>0,VLOOKUP(Übertrag!A455,#REF!,4,FALSE),\"\")","v":""}]
[]
[]
[]
[null,null,null,null,null,null,null,null,null,null,null,{"$f":"IF(Übertrag!A28>0,VLOOKUP(Übertrag!A28,#REF!,11,FALSE),\"\")","v":""},null,null,null,null,null,null,null,null,null,null,null,null,null,null,null,null,null,null,null,null,null,null,null,{"$f":"IF(Übertrag!A29>0,VLOOKUP(Übertrag!A29,#REF!,11,FALSE),\"\")","v":""}]
[]
[]
[]
[]
[]
[]
[]
[]
[]
[]
[]
[]
[]
[]
[]
[]
[]
[null,{"$f":"IF(Übertrag!A28>0,VLOOKUP(Übertrag!A28,#REF!,14,FALSE),\"\")","v":""},null,null,null,null,null,null,null,null,{"$f":"IF(Übertrag!A28>0,VLOOKUP(Übertrag!A28,#REF!,15,FALSE),\"\")","v":""},{"$f":"IF(N761=\"\",\"\",\"1kg=\")","v":""},null,{"$f":"IF(Q761=0,\"\",IF(T761=\"kg\",SUM(L743/Q761),IF(T761=\"g\",SUM(L743/Q761*1000),IF(T761=\"gr\",SUM(L743/Q761*1000),\"\"))))","v":""},null,null,{"$f":"IF(Übertrag!A28>0,VLOOKUP(Übertrag!A28,#REF!,9,FALSE),\"\")","v":""},null,null,{"$f":"IF(Übertrag!A28>0,VLOOKUP(Übertrag!A28,#REF!,10,FALSE),\"\")","v":""},{"$f":"IF(Übertrag!A28>0,VLOOKUP(Übertrag!A28,#REF!,12,FALSE),\"\")","v":""},null,null,null,null,{"$f":"IF(Übertrag!A29>0,VLOOKUP(Übertrag!A29,#REF!,14,FALSE),\"\")","v":""},null,null,null,null,null,null,null,null,{"$f":"IF(Übertrag!A29>0,VLOOKUP(Übertrag!A29,#REF!,15,FALSE),\"\")","v":""},{"$f":"IF(AL761=\"\",\"\",\"1kg=\")","v":""},null,{"$f":"IF(AO761=0,\"\",IF(AR761=\"kg\",SUM(AJ743/AO761),IF(AR761=\"g\",SUM(AJ743/AO761*1000),IF(AR761=\"gr\",SUM(AJ743/AO761*1000),\"\"))))","v":""},null,null,{"$f":"IF(Übertrag!A29>0,VLOOKUP(Übertrag!A29,#REF!,9,FALSE),\"\")","v":""},null,null,{"$f":"IF(Übertrag!A29>0,VLOOKUP(Übertrag!A29,#REF!,10,FALSE),\"\")","v":""},{"$f":"IF(Übertrag!A29>0,VLOOKUP(Übertrag!A29,#REF!,12,FALSE),\"\")","v":""}]
[]
[]
[{"$f":"IF(Übertrag!A28>0,VLOOKUP(Übertrag!A28,#REF!,5,FALSE),\"\")","v":""},null,null,null,null,null,null,null,null,null,null,null,null,null,null,null,null,null,null,null,null,null,null,null,{"$f":"IF(Übertrag!A29>0,VLOOKUP(Übertrag!A29,#REF!,5,FALSE),\"\")","v":""}]
[]
[]
[]
[{"$f":"IF(Übertrag!A28>0,VLOOKUP(Übertrag!A28,#REF!,6,FALSE),\"\")","v":""},null,null,null,null,null,null,null,null,null,null,null,null,null,null,null,null,null,null,null,null,null,null,null,{"$f":"IF(Übertrag!A29>0,VLOOKUP(Übertrag!A29,#REF!,6,FALSE),\"\")","v":""}]
[]
[]
[]
[]
[]
[]
[]
[]
[]
[]
[]
[]
[]
[]
[]
[]
[]
[]
[{"$f":"IF(Übertrag!A30>0,VLOOKUP(Übertrag!A30,#REF!,2,FALSE),\"\")","v":""},null,null,null,null,null,null,null,null,null,null,null,null,null,null,null,null,null,null,{"$f":"IF(Übertrag!A30>0,VLOOKUP(Übertrag!A30,#REF!,7,FALSE),\"\")","v":""},null,null,null,null,{"$f":"IF(Übertrag!A31>0,VLOOKUP(Übertrag!A31,#REF!,2,FALSE),\"\")","v":""},null,null,null,null,null,null,null,null,null,null,null,null,null,null,null,null,null,null,{"$f":"IF(Übertrag!A31>0,VLOOKUP(Übertrag!A31,#REF!,7,FALSE),\"\")","v":""}]
[]
[]
[]
[]
[{"$f":"IF(Übertrag!A30>0,VLOOKUP(Übertrag!A30,#REF!,3,FALSE),\"\")","v":""},null,null,null,null,null,null,null,null,null,null,null,null,null,null,null,null,null,null,{"$f":"IF(Übertrag!A30>0,VLOOKUP(Übertrag!A30,#REF!,8,FALSE),\"\")","v":""},null,null,null,null,{"$f":"IF(Übertrag!A31>0,VLOOKUP(Übertrag!A31,#REF!,3,FALSE),\"\")","v":""},null,null,null,null,null,null,null,null,null,null,null,null,null,null,null,null,null,null,{"$f":"IF(Übertrag!A31>0,VLOOKUP(Übertrag!A31,#REF!,8,FALSE),\"\")","v":""}]
[]
[]
[]
[{"$f":"_xlfn.IFS(Übertrag!A30=\"\",\"\",K818=\"1\",VLOOKUP(Übertrag!A30,#REF!,17,FALSE),Übertrag!A30>0,VLOOKUP(Übertrag!A30,#REF!,16,FALSE))","v":""},null,null,null,null,null,null,null,null,null,null,{"$f":"IF(Übertrag!A30>0,VLOOKUP(Übertrag!A30,#REF!,13,FALSE),\"\")","v":""},null,null,null,null,null,null,null,{"$f":"IF(Übertrag!A30>0,VLOOKUP(Übertrag!A30,#REF!,4,FALSE),\"\")","v":""},null,null,null,null,{"$f":"_xlfn.IFS(Übertrag!A31=\"\",\"\",AI818=\"1\",VLOOKUP(Übertrag!A31,#REF!,17,FALSE),Übertrag!A31>0,VLOOKUP(Übertrag!A31,#REF!,16,FALSE))","v":""},null,null,null,null,null,null,null,null,null,null,{"$f":"IF(Übertrag!A31>0,VLOOKUP(Übertrag!A31,#REF!,13,FALSE),\"\")","v":""},null,null,null,null,null,null,null,{"$f":"IF(Übertrag!A31>0,VLOOKUP(Übertrag!A31,#REF!,4,FALSE),\"\")","v":""}]
[]
[]
[]
[null,null,null,null,null,null,null,null,null,null,null,{"$f":"IF(Übertrag!A30>0,VLOOKUP(Übertrag!A30,#REF!,11,FALSE),\"\")","v":""},null,null,null,null,null,null,null,null,null,null,null,null,null,null,null,null,null,null,null,null,null,null,null,{"$f":"IF(Übertrag!A31>0,VLOOKUP(Übertrag!A31,#REF!,11,FALSE),\"\")","v":""}]
[]
[]
[]
[]
[]
[]
[]
[]
[]
[]
[]
[]
[]
[]
[]
[]
[]
[null,{"$f":"IF(Übertrag!A30>0,VLOOKUP(Übertrag!A30,#REF!,14,FALSE),\"\")","v":""},null,null,null,null,null,null,null,null,{"$f":"IF(Übertrag!A30>0,VLOOKUP(Übertrag!A30,#REF!,15,FALSE),\"\")","v":""},{"$f":"IF(N818=\"\",\"\",\"1kg=\")","v":""},null,{"$f":"IF(Q818=0,\"\",IF(T818=\"kg\",SUM(L800/Q818),IF(T818=\"g\",SUM(L800/Q818*1000),IF(T818=\"gr\",SUM(L800/Q818*1000),\"\"))))","v":""},null,null,{"$f":"IF(Übertrag!A30>0,VLOOKUP(Übertrag!A30,#REF!,9,FALSE),\"\")","v":""},null,null,{"$f":"IF(Übertrag!A30>0,VLOOKUP(Übertrag!A30,#REF!,10,FALSE),\"\")","v":""},{"$f":"IF(Übertrag!A30>0,VLOOKUP(Übertrag!A30,#REF!,12,FALSE),\"\")","v":""},null,null,null,null,{"$f":"IF(Übertrag!A31>0,VLOOKUP(Übertrag!A31,#REF!,14,FALSE),\"\")","v":""},null,null,null,null,null,null,null,null,{"$f":"IF(Übertrag!A31>0,VLOOKUP(Übertrag!A31,#REF!,15,FALSE),\"\")","v":""},{"$f":"IF(AL818=\"\",\"\",\"1kg=\")","v":""},null,{"$f":"IF(AO818=0,\"\",IF(AR818=\"kg\",SUM(AJ800/AO818),IF(AR818=\"g\",SUM(AJ800/AO818*1000),IF(AR818=\"gr\",SUM(AJ800/AO818*1000),\"\"))))","v":""},null,null,{"$f":"IF(Übertrag!A31>0,VLOOKUP(Übertrag!A31,#REF!,9,FALSE),\"\")","v":""},null,null,{"$f":"IF(Übertrag!A31>0,VLOOKUP(Übertrag!A31,#REF!,10,FALSE),\"\")","v":""},{"$f":"IF(Übertrag!A31>0,VLOOKUP(Übertrag!A31,#REF!,12,FALSE),\"\")","v":""}]
[]
[]
[{"$f":"IF(Übertrag!A30>0,VLOOKUP(Übertrag!A30,#REF!,5,FALSE),\"\")","v":""},null,null,null,null,null,null,null,null,null,null,null,null,null,null,null,null,null,null,null,null,null,null,null,{"$f":"IF(Übertrag!A31>0,VLOOKUP(Übertrag!A31,#REF!,5,FALSE),\"\")","v":""}]
[]
[]
[]
[{"$f":"IF(Übertrag!A30>0,VLOOKUP(Übertrag!A30,#REF!,6,FALSE),\"\")","v":""},null,null,null,null,null,null,null,null,null,null,null,null,null,null,null,null,null,null,null,null,null,null,null,{"$f":"IF(Übertrag!A31>0,VLOOKUP(Übertrag!A31,#REF!,6,FALSE),\"\")","v":""}]
[]
[]
[]
[]
[]
[]
[]
[]
[]
[]
[]
[]
[]
[]
[]
[]
[]
[]
[{"$f":"IF(Übertrag!A32>0,VLOOKUP(Übertrag!A32,#REF!,2,FALSE),\"\")","v":""},null,null,null,null,null,null,null,null,null,null,null,null,null,null,null,null,null,null,{"$f":"IF(Übertrag!A32>0,VLOOKUP(Übertrag!A32,#REF!,7,FALSE),\"\")","v":""},null,null,null,null,{"$f":"IF(Übertrag!A33>0,VLOOKUP(Übertrag!A33,#REF!,2,FALSE),\"\")","v":""},null,null,null,null,null,null,null,null,null,null,null,null,null,null,null,null,null,null,{"$f":"IF(Übertrag!A33>0,VLOOKUP(Übertrag!A33,#REF!,7,FALSE),\"\")","v":""}]
[]
[]
[]
[]
[{"$f":"IF(Übertrag!A32>0,VLOOKUP(Übertrag!A32,#REF!,3,FALSE),\"\")","v":""},null,null,null,null,null,null,null,null,null,null,null,null,null,null,null,null,null,null,{"$f":"IF(Übertrag!A32>0,VLOOKUP(Übertrag!A32,#REF!,8,FALSE),\"\")","v":""},null,null,null,null,{"$f":"IF(Übertrag!A33>0,VLOOKUP(Übertrag!A33,#REF!,3,FALSE),\"\")","v":""},null,null,null,null,null,null,null,null,null,null,null,null,null,null,null,null,null,null,{"$f":"IF(Übertrag!A33>0,VLOOKUP(Übertrag!A33,#REF!,8,FALSE),\"\")","v":""}]
[]
[]
[]
[{"$f":"_xlfn.IFS(Übertrag!A32=\"\",\"\",K875=\"1\",VLOOKUP(Übertrag!A32,#REF!,17,FALSE),Übertrag!A32>0,VLOOKUP(Übertrag!A32,#REF!,16,FALSE))","v":""},null,null,null,null,null,null,null,null,null,null,{"$f":"IF(Übertrag!A32>0,VLOOKUP(Übertrag!A32,#REF!,13,FALSE),\"\")","v":""},null,null,null,null,null,null,null,{"$f":"IF(Übertrag!A32>0,VLOOKUP(Übertrag!A32,#REF!,4,FALSE),\"\")","v":""},null,null,null,null,{"$f":"_xlfn.IFS(Übertrag!A33=\"\",\"\",AI875=\"1\",VLOOKUP(Übertrag!A33,#REF!,17,FALSE),Übertrag!A33>0,VLOOKUP(Übertrag!A33,#REF!,16,FALSE))","v":""},null,null,null,null,null,null,null,null,null,null,{"$f":"IF(Übertrag!A33>0,VLOOKUP(Übertrag!A33,#REF!,13,FALSE),\"\")","v":""},null,null,null,null,null,null,null,{"$f":"IF(Übertrag!A33>0,VLOOKUP(Übertrag!A33,#REF!,4,FALSE),\"\")","v":""}]
[]
[]
[]
[null,null,null,null,null,null,null,null,null,null,null,{"$f":"IF(Übertrag!A32>0,VLOOKUP(Übertrag!A32,#REF!,11,FALSE),\"\")","v":""},null,null,null,null,null,null,null,null,null,null,null,null,null,null,null,null,null,null,null,null,null,null,null,{"$f":"IF(Übertrag!A33>0,VLOOKUP(Übertrag!A33,#REF!,11,FALSE),\"\")","v":""}]
[]
[]
[]
[]
[]
[]
[]
[]
[]
[]
[]
[]
[]
[]
[]
[]
[]
[null,{"$f":"IF(Übertrag!A32>0,VLOOKUP(Übertrag!A32,#REF!,14,FALSE),\"\")","v":""},null,null,null,null,null,null,null,null,{"$f":"IF(Übertrag!A32>0,VLOOKUP(Übertrag!A32,#REF!,15,FALSE),\"\")","v":""},{"$f":"IF(N875=\"\",\"\",\"1kg=\")","v":""},null,{"$f":"IF(Q875=0,\"\",IF(T875=\"kg\",SUM(L857/Q875),IF(T875=\"g\",SUM(L857/Q875*1000),IF(T875=\"gr\",SUM(L857/Q875*1000),\"\"))))","v":""},null,null,{"$f":"IF(Übertrag!A32>0,VLOOKUP(Übertrag!A32,#REF!,9,FALSE),\"\")","v":""},null,null,{"$f":"IF(Übertrag!A32>0,VLOOKUP(Übertrag!A32,#REF!,10,FALSE),\"\")","v":""},{"$f":"IF(Übertrag!A32>0,VLOOKUP(Übertrag!A32,#REF!,12,FALSE),\"\")","v":""},null,null,null,null,{"$f":"IF(Übertrag!A33>0,VLOOKUP(Übertrag!A33,#REF!,14,FALSE),\"\")","v":""},null,null,null,null,null,null,null,null,{"$f":"IF(Übertrag!A33>0,VLOOKUP(Übertrag!A33,#REF!,15,FALSE),\"\")","v":""},{"$f":"IF(AL875=\"\",\"\",\"1kg=\")","v":""},null,{"$f":"IF(AO875=0,\"\",IF(AR875=\"kg\",SUM(AJ857/AO875),IF(AR875=\"g\",SUM(AJ857/AO875*1000),IF(AR875=\"gr\",SUM(AJ857/AO875*1000),\"\"))))","v":""},null,null,{"$f":"IF(Übertrag!A33>0,VLOOKUP(Übertrag!A33,#REF!,9,FALSE),\"\")","v":""},null,null,{"$f":"IF(Übertrag!A33>0,VLOOKUP(Übertrag!A33,#REF!,10,FALSE),\"\")","v":""},{"$f":"IF(Übertrag!A33>0,VLOOKUP(Übertrag!A33,#REF!,12,FALSE),\"\")","v":""}]
[]
[]
[{"$f":"IF(Übertrag!A32>0,VLOOKUP(Übertrag!A32,#REF!,5,FALSE),\"\")","v":""},null,null,null,null,null,null,null,null,null,null,null,null,null,null,null,null,null,null,null,null,null,null,null,{"$f":"IF(Übertrag!A33>0,VLOOKUP(Übertrag!A33,#REF!,5,FALSE),\"\")","v":""}]
[]
[]
[]
[{"$f":"IF(Übertrag!A32>0,VLOOKUP(Übertrag!A32,#REF!,6,FALSE),\"\")","v":""},null,null,null,null,null,null,null,null,null,null,null,null,null,null,null,null,null,null,null,null,null,null,null,{"$f":"IF(Übertrag!A33>0,VLOOKUP(Übertrag!A33,#REF!,6,FALSE),\"\")","v":""}]

{"sheet":"Druck2","index":7,"n_rows":440,"n_cols":45,"rows_kept":440,"cut":false,"hidden":true,"merged":[[18,11,21,18],[18,19,21,22],[18,24,39,34],[18,35,21,42],[18,43,21,46],[22,35,39,46],[9,0,13,18],[9,19,13,22],[9,23,58,23],[9,24,13,42],[9,43,13,46],[14,0,17,18],[14,19,17,22],[14,24,17,42],[14,43,17,46],[40,37,42,39],[40,40,42,42],[40,43,42,43],[40,44,42,46],[43,0,46,22],[43,24,46,46],[40,19,42,19],[40,20,42,22],[40,24,42,24],[40,25,42,33],[40,34,42,34],[40,35,42,36],[40,0,42,0],[40,1,42,9],[40,10,42,10],[40,11,42,12],[40,13,42,15],[40,16,42,18],[47,0,58,22],[47,24,58,46],[59,0,65,46],[66,0,70,18],[66,19,70,22],[66,23,115,23],[66,24,70,42],[66,43,70,46],[71,0,74,18],[71,19,74,22],[71,24,74,42],[71,43,74,46],[75,0,96,10],[75,11,78,18],[75,19,78,22],[75,24,96,34],[75,35,78,42],[75,43,78,46],[79,11,96,22],[79,35,96,46],[97,37,99,39],[97,40,99,42],[97,43,99,43],[97,44,99,46],[100,0,103,22],[100,24,103,46],[97,19,99,19],[97,20,99,22],[97,24,99,24],[97,25,99,33],[97,34,99,34],[97,35,99,36],[97,0,99,0],[97,1,99,9],[97,10,99,10],[97,11,99,12],[97,13,99,15],[97,16,99,18],[104,0,115,22],[104,24,115,46],[116,0,122,46],[123,0,127,18],[123,19,127,22],[123,23,172,23],[123,24,127,42],[123,43,127,46],[128,0,131,18],[128,19,131,22],[128,24,131,42],[128,43,131,46],[132,0,153,10],[132,11,135,18],[132,19,135,22],[132,24,153,34],[132,35,135,42],[132,43,135,46],[136,11,153,22],[136,35,153,46],[154,37,156,39],[154,40,156,42],[154,43,156,43],[154,44,156,46],[157,0,160,22],[157,24,160,46],[154,19,156,19],[154,20,156,22],[154,24,156,24],[154,25,156,33],[154,34,156,34],[154,35,156,36],[154,0,156,0],[154,1,156,9],[154,10,156,10],[154,11,156,12],[154,13,156,15],[154,16,156,18],[161,0,172,22],[161,24,172,46],[173,0,179,46],[180,0,184,18],[180,19,184,22],[180,23,229,23],[180,24,184,42],[180,43,184,46],[185,0,188,18],[185,19,188,22],[185,24,188,42],[185,43,188,46],[189,0,210,10],[189,11,192,18],[189,19,192,22],[189,24,210,34],[189,35,192,42],[189,43,192,46],[193,11,210,22],[193,35,210,46],[211,37,213,39],[211,40,213,42],[211,43,213,43],[211,44,213,46],[214,0,217,22],[214,24,217,46],[211,19,213,19],[211,20,213,22],[211,24,213,24],[211,25,213,33],[211,34,213,34],[211,35,213,36],[211,0,213,0],[211,1,213,9],[211,10,213,10],[211,11,213,12],[211,13,213,15],[211,16,213,18],[218,0,229,22],[218,24,229,46],[230,0,234,18],[230,19,234,22],[230,23,279,23],[230,24,234,42],[230,43,234,46],[235,0,238,18],[235,19,238,22],[235,24,238,42],[235,43,238,46],[239,0,260,10],[239,11,242,18],[239,19,242,22],[239,24,260,34],[239,35,242,42],[239,43,242,46],[243,11,260,22],[243,35,260,46],[261,37,263,39],[261,40,263,42],[261,43,263,43],[261,44,263,46],[264,0,267,22],[264,24,267,46],[261,19,263,19],[261,20,263,22],[261,24,263,24],[261,25,263,33],[261,34,263,34],[261,35,263,36],[261,0,263,0],[261,1,263,9],[261,10,263,10],[261,11,263,12],[261,13,263,15],[261,16,263,18],[268,0,279,22],[268,24,279,46],[280,0,286,46],[287,0,291,18],[287,19,291,22],[287,23,336,23],[287,24,291,42],[287,43,291,46],[292,0,295,18],[292,19,295,22],[292,24,295,42],[292,43,295,46],[296,0,317,10],[296,11,299,18],[296,19,299,22],[296,24,317,34],[296,35,299,42],[296,43,299,46],[300,11,317,22],[300,35,317,46],[318,37,320,39],[318,40,320,42],[318,43,320,43],[318,44,320,46],[321,0,324,22],[321,24,324,46],[318,19,320,19],[318,20,320,22],[318,24,320,24],[318,25,320,33],[318,34,320,34],[318,35,320,36],[318,0,320,0],[318,1,320,9],[318,10,320,10],[318,11,320,12],[318,13,320,15],[318,16,320,18],[325,0,336,22],[325,24,336,46],[337,0,343,46],[344,0,348,18],[344,19,348,22],[344,23,393,23],[344,24,348,42],[344,43,348,46],[349,0,352,18],[349,19,352,22],[375,16,377,18],[349,24,352,42],[349,43,352,46],[353,0,374,10],[353,11,356,18],[353,19,356,22],[353,24,374,34],[353,35,356,42],[353,43,356,46],[357,11,374,22],[357,35,374,46],[382,0,393,22],[382,24,393,46],[394,0,400,46],[401,0,405,18],[401,19,405,22],[401,24,405,42],[401,43,405,46],[375,37,377,39],[375,40,377,42],[375,43,377,43],[375,44,377,46],[378,0,381,22],[378,24,381,46],[375,19,377,19],[375,20,377,22],[375,24,377,24],[375,25,377,33],[375,34,377,34],[375,35,377,36],[375,0,377,0],[375,1,377,9],[375,10,377,10],[375,11,377,12],[375,13,377,15],[406,0,409,18],[406,19,409,22],[406,24,409,42],[406,43,409,46],[410,0,431,10],[410,11,413,18],[410,19,413,22],[410,24,431,34],[410,35,413,42],[410,43,413,46],[18,0,39,9],[22,10,39,22],[432,43,434,43],[432,44,434,46],[435,0,438,22],[435,24,438,46],[439,0,450,22],[439,24,450,46],[432,24,434,24],[432,25,434,33],[432,34,434,34],[432,35,434,36],[432,37,434,39],[432,40,434,42],[414,11,431,22],[414,35,431,46],[432,0,434,0],[432,1,434,9],[432,10,434,10],[432,11,434,12],[432,13,434,15],[432,16,434,18],[432,19,434,19],[432,20,434,22]]}
[]
[]
[]
[]
[]
[]
[]
[]
[]
[{"$f":"IF(Übertrag!A2>0,VLOOKUP(Übertrag!A2,#REF!,2,FALSE),\"\")","v":{"$error":"#REF!"}},null,null,null,null,null,null,null,null,null,null,null,null,null,null,null,null,null,null,{"$f":"IF(Übertrag!A2>0,VLOOKUP(Übertrag!A2,#REF!,7,FALSE),\"\")","v":{"$error":"#REF!"}},null,null,null,null,{"$f":"IF(Übertrag!A3>0,VLOOKUP(Übertrag!A3,#REF!,2,FALSE),\"\")","v":{"$error":"#REF!"}},null,null,null,null,null,null,null,null,null,null,null,null,null,null,null,null,null,null,{"$f":"IF(Übertrag!A3>0,VLOOKUP(Übertrag!A3,#REF!,7,FALSE),\"\")","v":{"$error":"#REF!"}}]
[]
[]
[]
[]
[{"$f":"IF(Übertrag!A2>0,VLOOKUP(Übertrag!A2,#REF!,3,FALSE),\"\")","v":{"$error":"#REF!"}},null,null,null,null,null,null,null,null,null,null,null,null,null,null,null,null,null,null,{"$f":"IF(Übertrag!A2>0,VLOOKUP(Übertrag!A2,#REF!,8,FALSE),\"\")","v":{"$error":"#REF!"}},null,null,null,null,{"$f":"IF(Übertrag!A3>0,VLOOKUP(Übertrag!A3,#REF!,3,FALSE),\"\")","v":{"$error":"#REF!"}},null,null,null,null,null,null,null,null,null,null,null,null,null,null,null,null,null,null,{"$f":"IF(Übertrag!A3>0,VLOOKUP(Übertrag!A3,#REF!,8,FALSE),\"\")","v":{"$error":"#REF!"}}]
[]
[]
[]
[{"$f":"_xlfn.IFS(Übertrag!A2=\"\",\"\",K41=\"1\",VLOOKUP(Übertrag!A2,#REF!,17,FALSE),Übertrag!A2>0,VLOOKUP(Übertrag!A2,#REF!,16,FALSE))","v":{"$error":"#REF!"}},null,null,null,null,null,null,null,null,null,null,{"$f":"IF(Übertrag!A2>0,VLOOKUP(Übertrag!A2,#REF!,13,FALSE),\"\")","v":{"$error":"#REF!"}},null,null,null,null,null,null,null,{"$f":"IF(Übertrag!A2>0,VLOOKUP(Übertrag!A2,#REF!,4,FALSE),\"\")","v":{"$error":"#REF!"}},null,null,null,null,{"$f":"_xlfn.IFS(Übertrag!A3=\"\",\"\",AI41=\"1\",VLOOKUP(Übertrag!A3,#REF!,17,FALSE),Übertrag!A3>0,VLOOKUP(Übertrag!A3,#REF!,16,FALSE))","v":{"$error":"#REF!"}},null,null,null,null,null,null,null,null,null,null,{"$f":"IF(Übertrag!A3>0,VLOOKUP(Übertrag!A3,#REF!,13,FALSE),\"\")","v":{"$error":"#REF!"}},null,null,null,null,null,null,null,{"$f":"IF(Übertrag!A3>0,VLOOKUP(Übertrag!A3,#REF!,4,FALSE),\"\")","v":{"$error":"#REF!"}}]
[]
[]
[]
[null,null,null,null,null,null,null,null,null,null,{"$f":"IF(Übertrag!A2>0,VLOOKUP(Übertrag!A2,#REF!,11,FALSE),\"\")","v":{"$error":"#REF!"}},null,null,null,null,null,null,null,null,null,null,null,null,null,null,null,null,null,null,null,null,null,null,null,null,{"$f":"IF(Übertrag!A3>0,VLOOKUP(Übertrag!A3,#REF!,11,FALSE),\"\")","v":{"$error":"#REF!"}}]
[]
[]
[]
[]
[]
[]
[]
[]
[]
[]
[]
[]
[]
[]
[]
[]
[]
[null,{"$f":"IF(Übertrag!A2>0,VLOOKUP(Übertrag!A2,#REF!,14,FALSE),\"\")","v":{"$error":"#REF!"}},null,null,null,null,null,null,null,null,{"$f":"IF(Übertrag!A2>0,VLOOKUP(Übertrag!A2,#REF!,15,FALSE),\"\")","v":{"$error":"#REF!"}},{"$f":"IF(N41=\"\",\"\",\"1kg=\")","v":{"$error":"#REF!"}},null,{"$f":"IF(Q41=0,\"\",IF(U41=\"lose\",\"\",IF(T41=\"kg\",SUM(K23/Q41),IF(T41=\"g\",SUM(K23/Q41*1000),IF(T41=\"gr\",SUM(K23/Q41*1000),\"\")))))","v":{"$error":"#REF!"}},null,null,{"$f":"IF(Übertrag!A2>0,VLOOKUP(Übertrag!A2,#REF!,9,FALSE),\"\")","v":{"$error":"#REF!"}},null,null,{"$f":"IF(Übertrag!A2>0,VLOOKUP(Übertrag!A2,#REF!,10,FALSE),\"\")","v":{"$error":"#REF!"}},{"$f":"IF(Übertrag!A2>0,VLOOKUP(Übertrag!A2,#REF!,12,FALSE),\"\")","v":{"$error":"#REF!"}},null,null,null,null,{"$f":"IF(Übertrag!A3>0,VLOOKUP(Übertrag!A3,#REF!,14,FALSE),\"\")","v":{"$error":"#REF!"}},null,null,null,null,null,null,null,null,{"$f":"IF(Übertrag!A3>0,VLOOKUP(Übertrag!A3,#REF!,15,FALSE),\"\")","v":{"$error":"#REF!"}},{"$f":"IF(AL41=\"\",\"\",\"1kg=\")","v":{"$error":"#REF!"}},null,{"$f":"IF(AO41=0,\"\",IF(AS41=\"lose\",\"\",IF(AR41=\"kg\",SUM(AJ23/AO41),IF(AR41=\"g\",SUM(AJ23/AO41*1000),IF(AR41=\"gr\",SUM(AJ23/AO41*1000),\"\")))))","v":{"$error":"#REF!"}},null,null,{"$f":"IF(Übertrag!A3>0,VLOOKUP(Übertrag!A3,#REF!,9,FALSE),\"\")","v":{"$error":"#REF!"}},null,null,{"$f":"IF(Übertrag!A3>0,VLOOKUP(Übertrag!A3,#REF!,10,FALSE),\"\")","v":{"$error":"#REF!"}},{"$f":"IF(Übertrag!A3>0,VLOOKUP(Übertrag!A3,#REF!,12,FALSE),\"\")","v":{"$error":"#REF!"}}]
[]
[]
[{"$f":"IF(Übertrag!A2>0,VLOOKUP(Übertrag!A2,#REF!,5,FALSE),\"\")","v":{"$error":"#REF!"}},null,null,null,null,null,null,null,null,null,null,null,null,null,null,null,null,null,null,null,null,null,null,null,{"$f":"IF(Übertrag!A3>0,VLOOKUP(Übertrag!A3,#REF!,5,FALSE),\"\")","v":{"$error":"#REF!"}}]
[]
[]
[]
[{"$f":"IF(Übertrag!A2>0,VLOOKUP(Übertrag!A2,#REF!,6,FALSE),\"\")","v":{"$error":"#REF!"}},null,null,null,null,null,null,null,null,null,null,null,null,null,null,null,null,null,null,null,null,null,null,null,{"$f":"IF(Übertrag!A3>0,VLOOKUP(Übertrag!A3,#REF!,6,FALSE),\"\")","v":{"$error":"#REF!"}}]
[]
[]
[]
[]
[]
[]
[]
[]
[]
[]
[]
[]
[]
[]
[]
[]
[]
[]
[{"$f":"IF(Übertrag!A4>0,VLOOKUP(Übertrag!A4,#REF!,2,FALSE),\"\")","v":{"$error":"#REF!"}},null,null,null,null,null,null,null,null,null,null,null,null,null,null,null,null,null,null,{"$f":"IF(Übertrag!A4>0,VLOOKUP(Übertrag!A4,#REF!,7,FALSE),\"\")","v":{"$error":"#REF!"}},null,null,null,null,{"$f":"IF(Übertrag!A5>0,VLOOKUP(Übertrag!A5,#REF!,2,FALSE),\"\")","v":{"$error":"#REF!"}},null,null,null,null,null,null,null,null,null,null,null,null,null,null,null,null,null,null,{"$f":"IF(Übertrag!A5>0,VLOOKUP(Übertrag!A5,#REF!,7,FALSE),\"\")","v":{"$error":"#REF!"}}]
[]
[]
[]
[]
[{"$f":"IF(Übertrag!A4>0,VLOOKUP(Übertrag!A4,#REF!,3,FALSE),\"\")","v":{"$error":"#REF!"}},null,null,null,null,null,null,null,null,null,null,null,null,null,null,null,null,null,null,{"$f":"IF(Übertrag!A4>0,VLOOKUP(Übertrag!A4,#REF!,8,FALSE),\"\")","v":{"$error":"#REF!"}},null,null,null,null,{"$f":"IF(Übertrag!A5>0,VLOOKUP(Übertrag!A5,#REF!,3,FALSE),\"\")","v":{"$error":"#REF!"}},null,null,null,null,null,null,null,null,null,null,null,null,null,null,null,null,null,null,{"$f":"IF(Übertrag!A5>0,VLOOKUP(Übertrag!A5,#REF!,8,FALSE),\"\")","v":{"$error":"#REF!"}}]
[]
[]
[]
[{"$f":"_xlfn.IFS(Übertrag!A4=\"\",\"\",K98=\"1\",VLOOKUP(Übertrag!A4,#REF!,17,FALSE),Übertrag!A4>0,VLOOKUP(Übertrag!A4,#REF!,16,FALSE))","v":{"$error":"#REF!"}},null,null,null,null,null,null,null,null,null,null,{"$f":"IF(Übertrag!A4>0,VLOOKUP(Übertrag!A4,#REF!,13,FALSE),\"\")","v":{"$error":"#REF!"}},null,null,null,null,null,null,null,{"$f":"IF(Übertrag!A4>0,VLOOKUP(Übertrag!A4,#REF!,4,FALSE),\"\")","v":{"$error":"#REF!"}},null,null,null,null,{"$f":"_xlfn.IFS(Übertrag!A5=\"\",\"\",AI98=\"1\",VLOOKUP(Übertrag!A5,#REF!,17,FALSE),Übertrag!A5>0,VLOOKUP(Übertrag!A5,#REF!,16,FALSE))","v":{"$error":"#REF!"}},null,null,null,null,null,null,null,null,null,null,{"$f":"IF(Übertrag!A5>0,VLOOKUP(Übertrag!A5,#REF!,13,FALSE),\"\")","v":{"$error":"#REF!"}},null,null,null,null,null,null,null,{"$f":"IF(Übertrag!A5>0,VLOOKUP(Übertrag!A5,#REF!,4,FALSE),\"\")","v":{"$error":"#REF!"}}]
[]
[]
[]
[null,null,null,null,null,null,null,null,null,null,null,{"$f":"IF(Übertrag!A4>0,VLOOKUP(Übertrag!A4,#REF!,11,FALSE),\"\")","v":{"$error":"#REF!"}},null,null,null,null,null,null,null,null,null,null,null,null,null,null,null,null,null,null,null,null,null,null,null,{"$f":"IF(Übertrag!A5>0,VLOOKUP(Übertrag!A5,#REF!,11,FALSE),\"\")","v":{"$error":"#REF!"}}]
[]
[]
[]
[]
[]
[]
[]
[]
[]
[]
[]
[]
[]
[]
[]
[]
[]
[null,{"$f":"IF(Übertrag!A4>0,VLOOKUP(Übertrag!A2,#REF!,14,FALSE),\"\")","v":{"$error":"#REF!"}},null,null,null,null,null,null,null,null,{"$f":"IF(Übertrag!A4>0,VLOOKUP(Übertrag!A4,#REF!,15,FALSE),\"\")","v":{"$error":"#REF!"}},{"$f":"IF(N98=\"\",\"\",\"1kg=\")","v":{"$error":"#REF!"}},null,{"$f":"IF(Q98=0,\"\",IF(U98=\"lose\",\"\",IF(T98=\"kg\",SUM(L80/Q98),IF(T98=\"g\",SUM(L80/Q98*1000),IF(T98=\"gr\",SUM(L80/Q98*1000),\"\")))))","v":{"$error":"#REF!"}},null,null,{"$f":"IF(Übertrag!A4>0,VLOOKUP(Übertrag!A4,#REF!,9,FALSE),\"\")","v":{"$error":"#REF!"}},null,null,{"$f":"IF(Übertrag!A4>0,VLOOKUP(Übertrag!A4,#REF!,10,FALSE),\"\")","v":{"$error":"#REF!"}},{"$f":"IF(Übertrag!A4>0,VLOOKUP(Übertrag!A4,#REF!,12,FALSE),\"\")","v":{"$error":"#REF!"}},null,null,null,null,{"$f":"IF(Übertrag!A5>0,VLOOKUP(Übertrag!A5,#REF!,14,FALSE),\"\")","v":{"$error":"#REF!"}},null,null,null,null,null,null,null,null,{"$f":"IF(Übertrag!A5>0,VLOOKUP(Übertrag!A5,#REF!,15,FALSE),\"\")","v":{"$error":"#REF!"}},{"$f":"IF(AL98=\"\",\"\",\"1kg=\")","v":{"$error":"#REF!"}},null,{"$f":"IF(AO98=0,\"\",IF(AS98=\"lose\",\"\",IF(AS98=\"lose\",\"\",IF(AR98=\"kg\",SUM(AJ80/AO98),IF(AR98=\"g\",SUM(AJ80/AO98*1000),IF(AR98=\"gr\",SUM(AJ80/AO98*1000),\"\"))))))","v":{"$error":"#REF!"}},null,null,{"$f":"IF(Übertrag!A5>0,VLOOKUP(Übertrag!A5,#REF!,9,FALSE),\"\")","v":{"$error":"#REF!"}},null,null,{"$f":"IF(Übertrag!A5>0,VLOOKUP(Übertrag!A5,#REF!,10,FALSE),\"\")","v":{"$error":"#REF!"}},{"$f":"IF(Übertrag!A5>0,VLOOKUP(Übertrag!A5,#REF!,12,FALSE),\"\")","v":{"$error":"#REF!"}}]
[]
[]
[{"$f":"IF(Übertrag!A4>0,VLOOKUP(Übertrag!A4,#REF!,5,FALSE),\"\")","v":{"$error":"#REF!"}},null,null,null,null,null,null,null,null,null,null,null,null,null,null,null,null,null,null,null,null,null,null,null,{"$f":"IF(Übertrag!A5>0,VLOOKUP(Übertrag!A5,#REF!,5,FALSE),\"\")","v":{"$error":"#REF!"}}]
[]
[]
[]
[{"$f":"IF(Übertrag!A4>0,VLOOKUP(Übertrag!A4,#REF!,6,FALSE),\"\")","v":{"$error":"#REF!"}},null,null,null,null,null,null,null,null,null,null,null,null,null,null,null,null,null,null,null,null,null,null,null,{"$f":"IF(Übertrag!A5>0,VLOOKUP(Übertrag!A5,#REF!,6,FALSE),\"\")","v":{"$error":"#REF!"}}]
[]
[]
[]
[]
[]
[]
[]
[]
[]
[]
[]
[]
[]
[]
[]
[]
[]
[]
[{"$f":"IF(Übertrag!A6>0,VLOOKUP(Übertrag!A6,#REF!,2,FALSE),\"\")","v":{"$error":"#REF!"}},null,null,null,null,null,null,null,null,null,null,null,null,null,null,null,null,null,null,{"$f":"IF(Übertrag!A6>0,VLOOKUP(Übertrag!A6,#REF!,7,FALSE),\"\")","v":{"$error":"#REF!"}},null,null,null,null,{"$f":"IF(Übertrag!A7>0,VLOOKUP(Übertrag!A7,#REF!,2,FALSE),\"\")","v":{"$error":"#REF!"}},null,null,null,null,null,null,null,null,null,null,null,null,null,null,null,null,null,null,{"$f":"IF(Übertrag!A7>0,VLOOKUP(Übertrag!A7,#REF!,7,FALSE),\"\")","v":{"$error":"#REF!"}}]
[]
[]
[]
[]
[{"$f":"IF(Übertrag!A6>0,VLOOKUP(Übertrag!A6,#REF!,3,FALSE),\"\")","v":{"$error":"#REF!"}},null,null,null,null,null,null,null,null,null,null,null,null,null,null,null,null,null,null,{"$f":"IF(Übertrag!A6>0,VLOOKUP(Übertrag!A6,#REF!,8,FALSE),\"\")","v":{"$error":"#REF!"}},null,null,null,null,{"$f":"IF(Übertrag!A7>0,VLOOKUP(Übertrag!A7,#REF!,3,FALSE),\"\")","v":{"$error":"#REF!"}},null,null,null,null,null,null,null,null,null,null,null,null,null,null,null,null,null,null,{"$f":"IF(Übertrag!A7>0,VLOOKUP(Übertrag!A7,#REF!,8,FALSE),\"\")","v":{"$error":"#REF!"}}]
[]
[]
[]
[{"$f":"_xlfn.IFS(Übertrag!A6=\"\",\"\",K155=\"1\",VLOOKUP(Übertrag!A6,#REF!,17,FALSE),Übertrag!A6>0,VLOOKUP(Übertrag!A6,#REF!,16,FALSE))","v":{"$error":"#REF!"}},null,null,null,null,null,null,null,null,null,null,{"$f":"IF(Übertrag!A6>0,VLOOKUP(Übertrag!A6,#REF!,13,FALSE),\"\")","v":{"$error":"#REF!"}},null,null,null,null,null,null,null,{"$f":"IF(Übertrag!A6>0,VLOOKUP(Übertrag!A6,#REF!,4,FALSE),\"\")","v":{"$error":"#REF!"}},null,null,null,null,{"$f":"_xlfn.IFS(Übertrag!A7=\"\",\"\",AI155=\"1\",VLOOKUP(Übertrag!A7,#REF!,17,FALSE),Übertrag!A7>0,VLOOKUP(Übertrag!A7,#REF!,16,FALSE))","v":{"$error":"#REF!"}},null,null,null,null,null,null,null,null,null,null,{"$f":"IF(Übertrag!A7>0,VLOOKUP(Übertrag!A7,#REF!,13,FALSE),\"\")","v":{"$error":"#REF!"}},null,null,null,null,null,null,null,{"$f":"IF(Übertrag!A7>0,VLOOKUP(Übertrag!A7,#REF!,4,FALSE),\"\")","v":{"$error":"#REF!"}}]
[]
[]
[]
[null,null,null,null,null,null,null,null,null,null,null,{"$f":"IF(Übertrag!A6>0,VLOOKUP(Übertrag!A6,#REF!,11,FALSE),\"\")","v":{"$error":"#REF!"}},null,null,null,null,null,null,null,null,null,null,null,null,null,null,null,null,null,null,null,null,null,null,null,{"$f":"IF(Übertrag!A7>0,VLOOKUP(Übertrag!A7,#REF!,11,FALSE),\"\")","v":{"$error":"#REF!"}}]
[]
[]
[]
[]
[]
[]
[]
[]
[]
[]
[]
[]
[]
[]
[]
[]
[]
[null,{"$f":"IF(Übertrag!A6>0,VLOOKUP(Übertrag!A6,#REF!,14,FALSE),\"\")","v":{"$error":"#REF!"}},null,null,null,null,null,null,null,null,{"$f":"IF(Übertrag!A6>0,VLOOKUP(Übertrag!A6,#REF!,15,FALSE),\"\")","v":{"$error":"#REF!"}},{"$f":"IF(N155=\"\",\"\",\"1kg=\")","v":{"$error":"#REF!"}},null,{"$f":"IF(Q155=0,\"\",IF(U155=\"lose\",\"\",IF(T155=\"kg\",SUM(L137/Q155),IF(T155=\"g\",SUM(L137/Q155*1000),IF(T155=\"gr\",SUM(L137/Q155*1000),\"\")))))","v":{"$error":"#REF!"}},null,null,{"$f":"IF(Übertrag!A6>0,VLOOKUP(Übertrag!A6,#REF!,9,FALSE),\"\")","v":{"$error":"#REF!"}},null,null,{"$f":"IF(Übertrag!A6>0,VLOOKUP(Übertrag!A6,#REF!,10,FALSE),\"\")","v":{"$error":"#REF!"}},{"$f":"IF(Übertrag!A6>0,VLOOKUP(Übertrag!A6,#REF!,12,FALSE),\"\")","v":{"$error":"#REF!"}},null,null,null,null,{"$f":"IF(Übertrag!A7>0,VLOOKUP(Übertrag!A7,#REF!,14,FALSE),\"\")","v":{"$error":"#REF!"}},null,null,null,null,null,null,null,null,{"$f":"IF(Übertrag!A7>0,VLOOKUP(Übertrag!A7,#REF!,15,FALSE),\"\")","v":{"$error":"#REF!"}},{"$f":"IF(AL155=\"\",\"\",\"1kg=\")","v":{"$error":"#REF!"}},null,{"$f":"IF(AO155=0,\"\",IF(AS155=\"lose\",\"\",IF(AR155=\"kg\",SUM(AJ137/AO155),IF(AR155=\"g\",SUM(AJ137/AO155*1000),IF(AR155=\"gr\",SUM(AJ137/AO155*1000),\"\")))))","v":{"$error":"#REF!"}},null,null,{"$f":"IF(Übertrag!A7>0,VLOOKUP(Übertrag!A7,#REF!,9,FALSE),\"\")","v":{"$error":"#REF!"}},null,null,{"$f":"IF(Übertrag!A7>0,VLOOKUP(Übertrag!A7,#REF!,10,FALSE),\"\")","v":{"$error":"#REF!"}},{"$f":"IF(Übertrag!A7>0,VLOOKUP(Übertrag!A7,#REF!,12,FALSE),\"\")","v":{"$error":"#REF!"}}]
[]
[]
[{"$f":"IF(Übertrag!A6>0,VLOOKUP(Übertrag!A6,#REF!,5,FALSE),\"\")","v":{"$error":"#REF!"}},null,null,null,null,null,null,null,null,null,null,null,null,null,null,null,null,null,null,null,null,null,null,null,{"$f":"IF(Übertrag!A7>0,VLOOKUP(Übertrag!A7,#REF!,5,FALSE),\"\")","v":{"$error":"#REF!"}}]
[]
[]
[]
[{"$f":"IF(Übertrag!A6>0,VLOOKUP(Übertrag!A6,#REF!,6,FALSE),\"\")","v":{"$error":"#REF!"}},null,null,null,null,null,null,null,null,null,null,null,null,null,null,null,null,null,null,null,null,null,null,null,{"$f":"IF(Übertrag!A7>0,VLOOKUP(Übertrag!A7,#REF!,6,FALSE),\"\")","v":{"$error":"#REF!"}}]
[]
[]
[]
[]
[]
[]
[]
[]
[]
[]
[]
[]
[]
[]
[]
[]
[]
[]
[{"$f":"IF(Übertrag!A8>0,VLOOKUP(Übertrag!A8,#REF!,2,FALSE),\"\")","v":{"$error":"#REF!"}},null,null,null,null,null,null,null,null,null,null,null,null,null,null,null,null,null,null,{"$f":"IF(Übertrag!A8>0,VLOOKUP(Übertrag!A8,#REF!,7,FALSE),\"\")","v":{"$error":"#REF!"}},null,null,null,null,{"$f":"IF(Übertrag!A9>0,VLOOKUP(Übertrag!A9,#REF!,2,FALSE),\"\")","v":{"$error":"#REF!"}},null,null,null,null,null,null,null,null,null,null,null,null,null,null,null,null,null,null,{"$f":"IF(Übertrag!A9>0,VLOOKUP(Übertrag!A9,#REF!,7,FALSE),\"\")","v":{"$error":"#REF!"}}]
[]
[]
[]
[]
[{"$f":"IF(Übertrag!A8>0,VLOOKUP(Übertrag!A8,#REF!,3,FALSE),\"\")","v":{"$error":"#REF!"}},null,null,null,null,null,null,null,null,null,null,null,null,null,null,null,null,null,null,{"$f":"IF(Übertrag!A8>0,VLOOKUP(Übertrag!A8,#REF!,8,FALSE),\"\")","v":{"$error":"#REF!"}},null,null,null,null,{"$f":"IF(Übertrag!A9>0,VLOOKUP(Übertrag!A9,#REF!,3,FALSE),\"\")","v":{"$error":"#REF!"}},null,null,null,null,null,null,null,null,null,null,null,null,null,null,null,null,null,null,{"$f":"IF(Übertrag!A9>0,VLOOKUP(Übertrag!A9,#REF!,8,FALSE),\"\")","v":{"$error":"#REF!"}}]
[]
[]
[]
[{"$f":"_xlfn.IFS(Übertrag!A8=\"\",\"\",K212=\"1\",VLOOKUP(Übertrag!A8,#REF!,17,FALSE),Übertrag!A8>0,VLOOKUP(Übertrag!A8,#REF!,16,FALSE))","v":{"$error":"#REF!"}},null,null,null,null,null,null,null,null,null,null,{"$f":"IF(Übertrag!A8>0,VLOOKUP(Übertrag!A8,#REF!,13,FALSE),\"\")","v":{"$error":"#REF!"}},null,null,null,null,null,null,null,{"$f":"IF(Übertrag!A8>0,VLOOKUP(Übertrag!A8,#REF!,4,FALSE),\"\")","v":{"$error":"#REF!"}},null,null,null,null,{"$f":"_xlfn.IFS(Übertrag!A9=\"\",\"\",AI212=\"1\",VLOOKUP(Übertrag!A9,#REF!,17,FALSE),Übertrag!A9>0,VLOOKUP(Übertrag!A9,#REF!,16,FALSE))","v":{"$error":"#REF!"}},null,null,null,null,null,null,null,null,null,null,{"$f":"IF(Übertrag!A9>0,VLOOKUP(Übertrag!A9,#REF!,13,FALSE),\"\")","v":{"$error":"#REF!"}},null,null,null,null,null,null,null,{"$f":"IF(Übertrag!A9>0,VLOOKUP(Übertrag!A9,#REF!,4,FALSE),\"\")","v":{"$error":"#REF!"}}]
[]
[]
[]
[null,null,null,null,null,null,null,null,null,null,null,{"$f":"IF(Übertrag!A8>0,VLOOKUP(Übertrag!A8,#REF!,11,FALSE),\"\")","v":{"$error":"#REF!"}},null,null,null,null,null,null,null,null,null,null,null,null,null,null,null,null,null,null,null,null,null,null,null,{"$f":"IF(Übertrag!A9>0,VLOOKUP(Übertrag!A9,#REF!,11,FALSE),\"\")","v":{"$error":"#REF!"}}]
[]
[]
[]
[]
[]
[]
[]
[]
[]
[]
[]
[]
[]
[]
[]
[]
[]
[null,{"$f":"IF(Übertrag!A8>0,VLOOKUP(Übertrag!A8,#REF!,14,FALSE),\"\")","v":{"$error":"#REF!"}},null,null,null,null,null,null,null,null,{"$f":"IF(Übertrag!A8>0,VLOOKUP(Übertrag!A8,#REF!,15,FALSE),\"\")","v":{"$error":"#REF!"}},{"$f":"IF(N212=\"\",\"\",\"1kg=\")","v":{"$error":"#REF!"}},null,{"$f":"IF(Q212=0,\"\",IF(U212=\"lose\",\"\",IF(T212=\"kg\",SUM(L194/Q212),IF(T212=\"g\",SUM(L194/Q212*1000),IF(T212=\"gr\",SUM(L194/Q212*1000),\"\")))))","v":{"$error":"#REF!"}},null,null,{"$f":"IF(Übertrag!A8>0,VLOOKUP(Übertrag!A8,#REF!,9,FALSE),\"\")","v":{"$error":"#REF!"}},null,null,{"$f":"IF(Übertrag!A8>0,VLOOKUP(Übertrag!A8,#REF!,10,FALSE),\"\")","v":{"$error":"#REF!"}},{"$f":"IF(Übertrag!A8>0,VLOOKUP(Übertrag!A8,#REF!,12,FALSE),\"\")","v":{"$error":"#REF!"}},null,null,null,null,{"$f":"IF(Übertrag!A9>0,VLOOKUP(Übertrag!A9,#REF!,14,FALSE),\"\")","v":{"$error":"#REF!"}},null,null,null,null,null,null,null,null,{"$f":"IF(Übertrag!A9>0,VLOOKUP(Übertrag!A9,#REF!,15,FALSE),\"\")","v":{"$error":"#REF!"}},{"$f":"IF(AL212=\"\",\"\",\"1kg=\")","v":{"$error":"#REF!"}},null,{"$f":"IF(AO212=0,\"\",IF(AS212=\"lose\",\"\",IF(AR212=\"kg\",SUM(AJ194/AO212),IF(AR212=\"g\",SUM(AJ194/AO212*1000),IF(AR212=\"gr\",SUM(AJ194/AO212*1000),\"\")))))","v":{"$error":"#REF!"}},null,null,{"$f":"IF(Übertrag!A9>0,VLOOKUP(Übertrag!A9,#REF!,9,FALSE),\"\")","v":{"$error":"#REF!"}},null,null,{"$f":"IF(Übertrag!A9>0,VLOOKUP(Übertrag!A9,#REF!,10,FALSE),\"\")","v":{"$error":"#REF!"}},{"$f":"IF(Übertrag!A9>0,VLOOKUP(Übertrag!A9,#REF!,12,FALSE),\"\")","v":{"$error":"#REF!"}}]
[]
[]
[{"$f":"IF(Übertrag!A8>0,VLOOKUP(Übertrag!A8,#REF!,5,FALSE),\"\")","v":{"$error":"#REF!"}},null,null,null,null,null,null,null,null,null,null,null,null,null,null,null,null,null,null,null,null,null,null,null,{"$f":"IF(Übertrag!A9>0,VLOOKUP(Übertrag!A9,#REF!,5,FALSE),\"\")","v":{"$error":"#REF!"}}]
[]
[]
[]
[{"$f":"IF(Übertrag!A8>0,VLOOKUP(Übertrag!A8,#REF!,6,FALSE),\"\")","v":{"$error":"#REF!"}},null,null,null,null,null,null,null,null,null,null,null,null,null,null,null,null,null,null,null,null,null,null,null,{"$f":"IF(Übertrag!A9>0,VLOOKUP(Übertrag!A9,#REF!,6,FALSE),\"\")","v":{"$error":"#REF!"}}]
[]
[]
[]
[]
[]
[]
[]
[]
[]
[]
[]
[{"$f":"IF(Übertrag!A10>0,VLOOKUP(Übertrag!A10,#REF!,2,FALSE),\"\")","v":""},null,null,null,null,null,null,null,null,null,null,null,null,null,null,null,null,null,null,{"$f":"IF(Übertrag!A10>0,VLOOKUP(Übertrag!A10,#REF!,7,FALSE),\"\")","v":""},null,null,null,null,{"$f":"IF(Übertrag!A11>0,VLOOKUP(Übertrag!A11,#REF!,2,FALSE),\"\")","v":""},null,null,null,null,null,null,null,null,null,null,null,null,null,null,null,null,null,null,{"$f":"IF(Übertrag!A11>0,VLOOKUP(Übertrag!A11,#REF!,7,FALSE),\"\")","v":""}]
[]
[]
[]
[]
[{"$f":"IF(Übertrag!A10>0,VLOOKUP(Übertrag!A10,#REF!,3,FALSE),\"\")","v":""},null,null,null,null,null,null,null,null,null,null,null,null,null,null,null,null,null,null,{"$f":"IF(Übertrag!A10>0,VLOOKUP(Übertrag!A10,#REF!,8,FALSE),\"\")","v":""},null,null,null,null,{"$f":"IF(Übertrag!A11>0,VLOOKUP(Übertrag!A11,#REF!,3,FALSE),\"\")","v":""},null,null,null,null,null,null,null,null,null,null,null,null,null,null,null,null,null,null,{"$f":"IF(Übertrag!A11>0,VLOOKUP(Übertrag!A11,#REF!,8,FALSE),\"\")","v":""}]
[]
[]
[]
[{"$f":"_xlfn.IFS(Übertrag!A10=\"\",\"\",K262=\"1\",VLOOKUP(Übertrag!A10,#REF!,17,FALSE),Übertrag!A10>0,VLOOKUP(Übertrag!A10,#REF!,16,FALSE))","v":""},null,null,null,null,null,null,null,null,null,null,{"$f":"IF(Übertrag!A10>0,VLOOKUP(Übertrag!A10,#REF!,13,FALSE),\"\")","v":""},null,null,null,null,null,null,null,{"$f":"IF(Übertrag!A10>0,VLOOKUP(Übertrag!A10,#REF!,4,FALSE),\"\")","v":""},null,null,null,null,{"$f":"_xlfn.IFS(Übertrag!A11=\"\",\"\",AI262=\"1\",VLOOKUP(Übertrag!A11,#REF!,17,FALSE),Übertrag!A11>0,VLOOKUP(Übertrag!A11,#REF!,16,FALSE))","v":""},null,null,null,null,null,null,null,null,null,null,{"$f":"IF(Übertrag!A11>0,VLOOKUP(Übertrag!A11,#REF!,13,FALSE),\"\")","v":""},null,null,null,null,null,null,null,{"$f":"IF(Übertrag!A11>0,VLOOKUP(Übertrag!A11,#REF!,4,FALSE),\"\")","v":""}]
[]
[]
[]
[null,null,null,null,null,null,null,null,null,null,null,{"$f":"IF(Übertrag!A10>0,VLOOKUP(Übertrag!A10,#REF!,11,FALSE),\"\")","v":""},null,null,null,null,null,null,null,null,null,null,null,null,null,null,null,null,null,null,null,null,null,null,null,{"$f":"IF(Übertrag!A11>0,VLOOKUP(Übertrag!A11,#REF!,11,FALSE),\"\")","v":""}]
[]
[]
[]
[]
[]
[]
[]
[]
[]
[]
[]
[]
[]
[]
[]
[]
[]
[null,{"$f":"IF(Übertrag!A10>0,VLOOKUP(Übertrag!A10,#REF!,14,FALSE),\"\")","v":""},null,null,null,null,null,null,null,null,{"$f":"IF(Übertrag!A10>0,VLOOKUP(Übertrag!A10,#REF!,15,FALSE),\"\")","v":""},{"$f":"IF(N262=\"\",\"\",\"1kg=\")","v":""},null,{"$f":"IF(Q262=0,\"\",IF(U262=\"lose\",\"\",IF(T262=\"kg\",SUM(L244/Q262),IF(T262=\"g\",SUM(L244/Q262*1000),IF(T262=\"gr\",SUM(L244/Q262*1000),\"\")))))","v":""},null,null,{"$f":"IF(Übertrag!A10>0,VLOOKUP(Übertrag!A10,#REF!,9,FALSE),\"\")","v":""},null,null,{"$f":"IF(Übertrag!A10>0,VLOOKUP(Übertrag!A10,#REF!,10,FALSE),\"\")","v":""},{"$f":"IF(Übertrag!A10>0,VLOOKUP(Übertrag!A10,#REF!,12,FALSE),\"\")","v":""},null,null,null,null,{"$f":"IF(Übertrag!A11>0,VLOOKUP(Übertrag!A11,#REF!,14,FALSE),\"\")","v":""},null,null,null,null,null,null,null,null,{"$f":"IF(Übertrag!A11>0,VLOOKUP(Übertrag!A11,#REF!,15,FALSE),\"\")","v":""},{"$f":"IF(AL262=\"\",\"\",\"1kg=\")","v":""},null,{"$f":"IF(AO262=0,\"\",IF(AS262=\"lose\",\"\",IF(AR262=\"kg\",SUM(AJ244/AO262),IF(AR262=\"g\",SUM(AJ244/AO262*1000),IF(AR262=\"gr\",SUM(AJ244/AO262*1000),\"\")))))","v":""},null,null,{"$f":"IF(Übertrag!A11>0,VLOOKUP(Übertrag!A11,#REF!,9,FALSE),\"\")","v":""},null,null,{"$f":"IF(Übertrag!A11>0,VLOOKUP(Übertrag!A11,#REF!,10,FALSE),\"\")","v":""},{"$f":"IF(Übertrag!A11>0,VLOOKUP(Übertrag!A11,#REF!,12,FALSE),\"\")","v":""}]
[]
[]
[{"$f":"IF(Übertrag!A10>0,VLOOKUP(Übertrag!A10,#REF!,5,FALSE),\"\")","v":""},null,null,null,null,null,null,null,null,null,null,null,null,null,null,null,null,null,null,null,null,null,null,null,{"$f":"IF(Übertrag!A11>0,VLOOKUP(Übertrag!A11,#REF!,5,FALSE),\"\")","v":""}]
[]
[]
[]
[{"$f":"IF(Übertrag!A10>0,VLOOKUP(Übertrag!A10,#REF!,6,FALSE),\"\")","v":""},null,null,null,null,null,null,null,null,null,null,null,null,null,null,null,null,null,null,null,null,null,null,null,{"$f":"IF(Übertrag!A11>0,VLOOKUP(Übertrag!A11,#REF!,6,FALSE),\"\")","v":""}]
[]
[]
[]
[]
[]
[]
[]
[]
[]
[]
[]
[]
[]
[]
[]
[]
[]
[]
[{"$f":"IF(Übertrag!A12>0,VLOOKUP(Übertrag!A12,#REF!,2,FALSE),\"\")","v":""},null,null,null,null,null,null,null,null,null,null,null,null,null,null,null,null,null,null,{"$f":"IF(Übertrag!A12>0,VLOOKUP(Übertrag!A12,#REF!,7,FALSE),\"\")","v":""},null,null,null,null,{"$f":"IF(Übertrag!A13>0,VLOOKUP(Übertrag!A13,#REF!,2,FALSE),\"\")","v":""},null,null,null,null,null,null,null,null,null,null,null,null,null,null,null,null,null,null,{"$f":"IF(Übertrag!A13>0,VLOOKUP(Übertrag!A13,#REF!,7,FALSE),\"\")","v":""}]
[]
[]
[]
[]
[{"$f":"IF(Übertrag!A12>0,VLOOKUP(Übertrag!A12,#REF!,3,FALSE),\"\")","v":""},null,null,null,null,null,null,null,null,null,null,null,null,null,null,null,null,null,null,{"$f":"IF(Übertrag!A12>0,VLOOKUP(Übertrag!A12,#REF!,8,FALSE),\"\")","v":""},null,null,null,null,{"$f":"IF(Übertrag!A13>0,VLOOKUP(Übertrag!A13,#REF!,3,FALSE),\"\")","v":""},null,null,null,null,null,null,null,null,null,null,null,null,null,null,null,null,null,null,{"$f":"IF(Übertrag!A13>0,VLOOKUP(Übertrag!A13,#REF!,8,FALSE),\"\")","v":""}]
[]
[]
[]
[{"$f":"_xlfn.IFS(Übertrag!A12=\"\",\"\",K319=\"1\",VLOOKUP(Übertrag!A12,#REF!,17,FALSE),Übertrag!A12>0,VLOOKUP(Übertrag!A12,#REF!,16,FALSE))","v":""},null,null,null,null,null,null,null,null,null,null,{"$f":"IF(Übertrag!A12>0,VLOOKUP(Übertrag!A12,#REF!,13,FALSE),\"\")","v":""},null,null,null,null,null,null,null,{"$f":"IF(Übertrag!A12>0,VLOOKUP(Übertrag!A12,#REF!,4,FALSE),\"\")","v":""},null,null,null,null,{"$f":"_xlfn.IFS(Übertrag!A13=\"\",\"\",AI319=\"1\",VLOOKUP(Übertrag!A13,#REF!,17,FALSE),Übertrag!A13>0,VLOOKUP(Übertrag!A13,#REF!,16,FALSE))","v":""},null,null,null,null,null,null,null,null,null,null,{"$f":"IF(Übertrag!A13>0,VLOOKUP(Übertrag!A13,#REF!,13,FALSE),\"\")","v":""},null,null,null,null,null,null,null,{"$f":"IF(Übertrag!A13>0,VLOOKUP(Übertrag!A13,#REF!,4,FALSE),\"\")","v":""}]
[]
[]
[]
[null,null,null,null,null,null,null,null,null,null,null,{"$f":"IF(Übertrag!A12>0,VLOOKUP(Übertrag!A12,#REF!,11,FALSE),\"\")","v":""},null,null,null,null,null,null,null,null,null,null,null,null,null,null,null,null,null,null,null,null,null,null,null,{"$f":"IF(Übertrag!A13>0,VLOOKUP(Übertrag!A13,#REF!,11,FALSE),\"\")","v":""}]
[]
[]
[]
[]
[]
[]
[]
[]
[]
[]
[]
[]
[]
[]
[]
[]
[]
[null,{"$f":"IF(Übertrag!A12>0,VLOOKUP(Übertrag!A12,#REF!,14,FALSE),\"\")","v":""},null,null,null,null,null,null,null,null,{"$f":"IF(Übertrag!A12>0,VLOOKUP(Übertrag!A12,#REF!,15,FALSE),\"\")","v":""},{"$f":"IF(N319=\"\",\"\",\"1kg=\")","v":""},null,{"$f":"IF(Q319=0,\"\",IF(U319=\"lose\",\"\",IF(T319=\"kg\",SUM(L301/Q319),IF(T319=\"g\",SUM(L301/Q319*1000),IF(T319=\"gr\",SUM(L301/Q319*1000),\"\")))))","v":""},null,null,{"$f":"IF(Übertrag!A12>0,VLOOKUP(Übertrag!A12,#REF!,9,FALSE),\"\")","v":""},null,null,{"$f":"IF(Übertrag!A12>0,VLOOKUP(Übertrag!A12,#REF!,10,FALSE),\"\")","v":""},{"$f":"IF(Übertrag!A12>0,VLOOKUP(Übertrag!A12,#REF!,12,FALSE),\"\")","v":""},null,null,null,null,{"$f":"IF(Übertrag!A13>0,VLOOKUP(Übertrag!A13,#REF!,14,FALSE),\"\")","v":""},null,null,null,null,null,null,null,null,{"$f":"IF(Übertrag!A13>0,VLOOKUP(Übertrag!A13,#REF!,15,FALSE),\"\")","v":""},{"$f":"IF(AL319=\"\",\"\",\"1kg=\")","v":""},null,{"$f":"IF(AO319=0,\"\",IF(AS319=\"lose\",\"\",IF(AR319=\"kg\",SUM(AJ301/AO319),IF(AR319=\"g\",SUM(AJ301/AO319*1000),IF(AR319=\"gr\",SUM(AJ301/AO319*1000),\"\")))))","v":""},null,null,{"$f":"IF(Übertrag!A13>0,VLOOKUP(Übertrag!A13,#REF!,9,FALSE),\"\")","v":""},null,null,{"$f":"IF(Übertrag!A13>0,VLOOKUP(Übertrag!A13,#REF!,10,FALSE),\"\")","v":""},{"$f":"IF(Übertrag!A13>0,VLOOKUP(Übertrag!A13,#REF!,12,FALSE),\"\")","v":""}]
[]
[]
[{"$f":"IF(Übertrag!A12>0,VLOOKUP(Übertrag!A12,#REF!,5,FALSE),\"\")","v":""},null,null,null,null,null,null,null,null,null,null,null,null,null,null,null,null,null,null,null,null,null,null,null,{"$f":"IF(Übertrag!A13>0,VLOOKUP(Übertrag!A13,#REF!,5,FALSE),\"\")","v":""}]
[]
[]
[]
[{"$f":"IF(Übertrag!A12>0,VLOOKUP(Übertrag!A12,#REF!,6,FALSE),\"\")","v":""},null,null,null,null,null,null,null,null,null,null,null,null,null,null,null,null,null,null,null,null,null,null,null,{"$f":"IF(Übertrag!A13>0,VLOOKUP(Übertrag!A13,#REF!,6,FALSE),\"\")","v":""}]
[]
[]
[]
[]
[]
[]
[]
[]
[]
[]
[]
[]
[]
[]
[]
[]
[]
[]
[{"$f":"IF(Übertrag!A14>0,VLOOKUP(Übertrag!A14,#REF!,2,FALSE),\"\")","v":""},null,null,null,null,null,null,null,null,null,null,null,null,null,null,null,null,null,null,{"$f":"IF(Übertrag!A14>0,VLOOKUP(Übertrag!A14,#REF!,7,FALSE),\"\")","v":""},null,null,null,null,{"$f":"IF(Übertrag!A15>0,VLOOKUP(Übertrag!A15,#REF!,2,FALSE),\"\")","v":""},null,null,null,null,null,null,null,null,null,null,null,null,null,null,null,null,null,null,{"$f":"IF(Übertrag!A15>0,VLOOKUP(Übertrag!A15,#REF!,7,FALSE),\"\")","v":""}]
[]
[]
[]
[]
[{"$f":"IF(Übertrag!A14>0,VLOOKUP(Übertrag!A14,#REF!,3,FALSE),\"\")","v":""},null,null,null,null,null,null,null,null,null,null,null,null,null,null,null,null,null,null,{"$f":"IF(Übertrag!A14>0,VLOOKUP(Übertrag!A14,#REF!,8,FALSE),\"\")","v":""},null,null,null,null,{"$f":"IF(Übertrag!A15>0,VLOOKUP(Übertrag!A15,#REF!,3,FALSE),\"\")","v":""},null,null,null,null,null,null,null,null,null,null,null,null,null,null,null,null,null,null,{"$f":"IF(Übertrag!A15>0,VLOOKUP(Übertrag!A15,#REF!,8,FALSE),\"\")","v":""}]
[]
[]
[]
[{"$f":"_xlfn.IFS(Übertrag!A14=\"\",\"\",K376=\"1\",VLOOKUP(Übertrag!A14,#REF!,17,FALSE),Übertrag!A14>0,VLOOKUP(Übertrag!A14,#REF!,16,FALSE))","v":""},null,null,null,null,null,null,null,null,null,null,{"$f":"IF(Übertrag!A14>0,VLOOKUP(Übertrag!A14,#REF!,13,FALSE),\"\")","v":""},null,null,null,null,null,null,null,{"$f":"IF(Übertrag!A14>0,VLOOKUP(Übertrag!A14,#REF!,4,FALSE),\"\")","v":""},null,null,null,null,{"$f":"_xlfn.IFS(Übertrag!A15=\"\",\"\",AI376=\"1\",VLOOKUP(Übertrag!A15,#REF!,17,FALSE),Übertrag!A15>0,VLOOKUP(Übertrag!A15,#REF!,16,FALSE))","v":""},null,null,null,null,null,null,null,null,null,null,{"$f":"IF(Übertrag!A15>0,VLOOKUP(Übertrag!A15,#REF!,13,FALSE),\"\")","v":""},null,null,null,null,null,null,null,{"$f":"IF(Übertrag!A15>0,VLOOKUP(Übertrag!A15,#REF!,4,FALSE),\"\")","v":""}]
[]
[]
[]
[null,null,null,null,null,null,null,null,null,null,null,{"$f":"IF(Übertrag!A14>0,VLOOKUP(Übertrag!A14,#REF!,11,FALSE),\"\")","v":""},null,null,null,null,null,null,null,null,null,null,null,null,null,null,null,null,null,null,null,null,null,null,null,{"$f":"IF(Übertrag!A15>0,VLOOKUP(Übertrag!A15,#REF!,11,FALSE),\"\")","v":""}]
[]
[]
[]
[]
[]
[]
[]
[]
[]
[]
[]
[]
[]
[]
[]
[]
[]
[null,{"$f":"IF(Übertrag!A14>0,VLOOKUP(Übertrag!A14,#REF!,14,FALSE),\"\")","v":""},null,null,null,null,null,null,null,null,{"$f":"IF(Übertrag!A14>0,VLOOKUP(Übertrag!A14,#REF!,15,FALSE),\"\")","v":""},{"$f":"IF(N376=\"\",\"\",\"1kg=\")","v":""},null,{"$f":"IF(Q376=0,\"\",IF(U376=\"lose\",\"\",IF(T376=\"kg\",SUM(L358/Q376),IF(T376=\"g\",SUM(L358/Q376*1000),IF(T376=\"gr\",SUM(L358/Q376*1000),\"\")))))","v":""},null,null,{"$f":"IF(Übertrag!A14>0,VLOOKUP(Übertrag!A14,#REF!,9,FALSE),\"\")","v":""},null,null,{"$f":"IF(Übertrag!A14>0,VLOOKUP(Übertrag!A14,#REF!,10,FALSE),\"\")","v":""},{"$f":"IF(Übertrag!A14>0,VLOOKUP(Übertrag!A14,#REF!,12,FALSE),\"\")","v":""},null,null,null,null,{"$f":"IF(Übertrag!A15>0,VLOOKUP(Übertrag!A15,#REF!,14,FALSE),\"\")","v":""},null,null,null,null,null,null,null,null,{"$f":"IF(Übertrag!A15>0,VLOOKUP(Übertrag!A15,#REF!,15,FALSE),\"\")","v":""},{"$f":"IF(AL376=\"\",\"\",\"1kg=\")","v":""},null,{"$f":"IF(AO376=0,\"\",IF(AS376=\"lose\",\"\",IF(AR376=\"kg\",SUM(AJ358/AO376),IF(AR376=\"g\",SUM(AJ358/AO376*1000),IF(AR376=\"gr\",SUM(AJ358/AO376*1000),\"\")))))","v":""},null,null,{"$f":"IF(Übertrag!A15>0,VLOOKUP(Übertrag!A15,#REF!,9,FALSE),\"\")","v":""},null,null,{"$f":"IF(Übertrag!A15>0,VLOOKUP(Übertrag!A15,#REF!,10,FALSE),\"\")","v":""},{"$f":"IF(Übertrag!A15>0,VLOOKUP(Übertrag!A15,#REF!,12,FALSE),\"\")","v":""}]
[]
[]
[{"$f":"IF(Übertrag!A14>0,VLOOKUP(Übertrag!A14,#REF!,5,FALSE),\"\")","v":""},null,null,null,null,null,null,null,null,null,null,null,null,null,null,null,null,null,null,null,null,null,null,null,{"$f":"IF(Übertrag!A15>0,VLOOKUP(Übertrag!A15,#REF!,5,FALSE),\"\")","v":""}]
[]
[]
[]
[{"$f":"IF(Übertrag!A14>0,VLOOKUP(Übertrag!A14,#REF!,6,FALSE),\"\")","v":""},null,null,null,null,null,null,null,null,null,null,null,null,null,null,null,null,null,null,null,null,null,null,null,{"$f":"IF(Übertrag!A15>0,VLOOKUP(Übertrag!A15,#REF!,6,FALSE),\"\")","v":""}]
[]
[]
[]
[]
[]
[]
[]
[]
[]
[]
[]
[]
[]
[]
[]
[]
[]
[]
[{"$f":"IF(Übertrag!A16>0,VLOOKUP(Übertrag!A16,#REF!,2,FALSE),\"\")","v":""},null,null,null,null,null,null,null,null,null,null,null,null,null,null,null,null,null,null,{"$f":"IF(Übertrag!A16>0,VLOOKUP(Übertrag!A16,#REF!,7,FALSE),\"\")","v":""},null,null,null,null,{"$f":"IF(Übertrag!A17>0,VLOOKUP(Übertrag!A17,#REF!,2,FALSE),\"\")","v":""},null,null,null,null,null,null,null,null,null,null,null,null,null,null,null,null,null,null,{"$f":"IF(Übertrag!A17>0,VLOOKUP(Übertrag!A17,#REF!,7,FALSE),\"\")","v":""}]
[]
[]
[]
[]
[{"$f":"IF(Übertrag!A16>0,VLOOKUP(Übertrag!A16,#REF!,3,FALSE),\"\")","v":""},null,null,null,null,null,null,null,null,null,null,null,null,null,null,null,null,null,null,{"$f":"IF(Übertrag!A16>0,VLOOKUP(Übertrag!A16,#REF!,8,FALSE),\"\")","v":""},null,null,null,null,{"$f":"IF(Übertrag!A17>0,VLOOKUP(Übertrag!A17,#REF!,3,FALSE),\"\")","v":""},null,null,null,null,null,null,null,null,null,null,null,null,null,null,null,null,null,null,{"$f":"IF(Übertrag!A17>0,VLOOKUP(Übertrag!A17,#REF!,8,FALSE),\"\")","v":""}]
[]
[]
[]
[{"$f":"_xlfn.IFS(Übertrag!A16=\"\",\"\",K433=\"1\",VLOOKUP(Übertrag!A16,#REF!,17,FALSE),Übertrag!A16>0,VLOOKUP(Übertrag!A16,#REF!,16,FALSE))","v":""},null,null,null,null,null,null,null,null,null,null,{"$f":"IF(Übertrag!A16>0,VLOOKUP(Übertrag!A16,#REF!,13,FALSE),\"\")","v":""},null,null,null,null,null,null,null,{"$f":"IF(Übertrag!A16>0,VLOOKUP(Übertrag!A16,#REF!,4,FALSE),\"\")","v":""},null,null,null,null,{"$f":"_xlfn.IFS(Übertrag!A17=\"\",\"\",AI433=\"1\",VLOOKUP(Übertrag!A17,#REF!,17,FALSE),Übertrag!A17>0,VLOOKUP(Übertrag!A17,#REF!,16,FALSE))","v":""},null,null,null,null,null,null,null,null,null,null,{"$f":"IF(Übertrag!A17>0,VLOOKUP(Übertrag!A17,#REF!,13,FALSE),\"\")","v":""},null,null,null,null,null,null,null,{"$f":"IF(Übertrag!A17>0,VLOOKUP(Übertrag!A17,#REF!,4,FALSE),\"\")","v":""}]
[]
[]
[]
[null,null,null,null,null,null,null,null,null,null,null,{"$f":"IF(Übertrag!A16>0,VLOOKUP(Übertrag!A16,#REF!,11,FALSE),\"\")","v":""},null,null,null,null,null,null,null,null,null,null,null,null,null,null,null,null,null,null,null,null,null,null,null,{"$f":"IF(Übertrag!A17>0,VLOOKUP(Übertrag!A17,#REF!,11,FALSE),\"\")","v":""}]
[]
[]
[]
[]
[]
[]
[]
[]
[]
[]
[]
[]
[]
[]
[]
[]
[]
[null,{"$f":"IF(Übertrag!A16>0,VLOOKUP(Übertrag!A16,#REF!,14,FALSE),\"\")","v":""},null,null,null,null,null,null,null,null,{"$f":"IF(Übertrag!A16>0,VLOOKUP(Übertrag!A16,#REF!,15,FALSE),\"\")","v":""},{"$f":"IF(N433=\"\",\"\",\"1kg=\")","v":""},null,{"$f":"IF(Q433=0,\"\",IF(U433=\"lose\",\"\",IF(T433=\"kg\",SUM(L415/Q433),IF(T433=\"g\",SUM(L415/Q433*1000),IF(T433=\"gr\",SUM(L415/Q433*1000),\"\")))))","v":""},null,null,{"$f":"IF(Übertrag!A16>0,VLOOKUP(Übertrag!A16,#REF!,9,FALSE),\"\")","v":""},null,null,{"$f":"IF(Übertrag!A16>0,VLOOKUP(Übertrag!A16,#REF!,10,FALSE),\"\")","v":""},{"$f":"IF(Übertrag!A16>0,VLOOKUP(Übertrag!A16,#REF!,12,FALSE),\"\")","v":""},null,null,null,null,{"$f":"IF(Übertrag!A17>0,VLOOKUP(Übertrag!A17,#REF!,14,FALSE),\"\")","v":""},null,null,null,null,null,null,null,null,{"$f":"IF(Übertrag!A17>0,VLOOKUP(Übertrag!A17,#REF!,15,FALSE),\"\")","v":""},{"$f":"IF(AL433=\"\",\"\",\"1kg=\")","v":""},null,{"$f":"IF(AO433=0,\"\",IF(AS433=\"lose\",\"\",IF(AR433=\"kg\",SUM(AJ415/AO433),IF(AR433=\"g\",SUM(AJ415/AO433*1000),IF(AR433=\"gr\",SUM(AJ415/AO433*1000),\"\")))))","v":""},null,null,{"$f":"IF(Übertrag!A17>0,VLOOKUP(Übertrag!A17,#REF!,9,FALSE),\"\")","v":""},null,null,{"$f":"IF(Übertrag!A17>0,VLOOKUP(Übertrag!A17,#REF!,10,FALSE),\"\")","v":""},{"$f":"IF(Übertrag!A17>0,VLOOKUP(Übertrag!A17,#REF!,12,FALSE),\"\")","v":""}]
[]
[]
[{"$f":"IF(Übertrag!A16>0,VLOOKUP(Übertrag!A16,#REF!,5,FALSE),\"\")","v":""},null,null,null,null,null,null,null,null,null,null,null,null,null,null,null,null,null,null,null,null,null,null,null,{"$f":"IF(Übertrag!A17>0,VLOOKUP(Übertrag!A17,#REF!,5,FALSE),\"\")","v":""}]
[]
[]
[]
[{"$f":"IF(Übertrag!A16>0,VLOOKUP(Übertrag!A16,#REF!,6,FALSE),\"\")","v":""},null,null,null,null,null,null,null,null,null,null,null,null,null,null,null,null,null,null,null,null,null,null,null,{"$f":"IF(Übertrag!A17>0,VLOOKUP(Übertrag!A17,#REF!,6,FALSE),\"\")","v":""}]