{"text_format":"1","workbook":"xlsx","n_sheets":14,"sheets":["Rd.1","Rd.2","Rd.3","Rd.4","Rd.5","Rd.6","Rd.7","Rd.8","Rd.9","Rd.10","Rd.11","Rd.12","Sieger","Tabelle1"],"not_rendered":{"charts":0,"images":1,"macros":1,"external_links":0,"defined_names":11,"comments":0,"pivot_tables":0},"unopened":[],"bounds":{"document_bytes":16777216,"sheet_cells":100000,"rows_first":2000,"rows_last":500,"rows_between":2000,"halvings":0,"cell_chars":16384,"cell_head_chars":4096},"cells_cut":0,"cells_raw":0,"read":"whole","date_system":"1900"}

{"sheet":"Rd.1","index":0,"n_rows":58,"n_cols":36,"rows_kept":58,"cut":false,"hidden":false,"merged":[[17,11,17,12],[13,18,16,19],[17,18,17,19],[18,4,22,5],[18,11,22,12],[18,18,22,19],[7,25,7,26],[26,18,30,19],[31,18,32,19],[26,25,30,26],[31,25,32,26],[24,18,25,19],[24,25,25,26],[0,3,0,4],[0,10,0,11],[0,17,0,18],[0,24,0,25],[26,11,30,12],[7,4,7,5],[8,18,9,19],[8,25,9,26],[10,18,11,19],[12,18,12,19],[10,25,11,26],[12,25,12,26],[13,25,16,26],[17,25,17,26],[18,25,22,26],[7,18,7,19],[38,3,38,4],[26,4,30,5],[31,4,32,5],[7,11,7,12],[31,11,32,12],[8,11,9,12],[24,4,25,5],[24,11,25,12],[10,4,11,5],[12,4,12,5],[8,4,9,5],[10,11,11,12],[12,11,12,12],[13,4,16,5],[17,4,17,5],[13,11,16,12]]}
[null,null,null,{"$f":"Z43","v":"Ralfie"},null,"Sp.1",null,null,null,null,{"$f":"Z44","v":"Siggi"},null,"Sp.2",null,null,null,null,{"$f":"Z45","v":"Kerstin"},null,"Sp.3",null,null,null,null,{"$f":"Z46","v":"Christian"},null,"Sp.4",null,null,null,{"$f":"K35","v":"Ralfie"},null,{"$f":"D1","v":"Ralfie"},{"$f":"K1","v":"Siggi"},{"$f":"R1","v":"Kerstin"},{"$f":"Y1","v":"Christian"}]
[null,null,null,"Punkte",501,"Start",null,null,null,null,"Punkte",501,"Start",null,null,null,null,"Punkte",501,"Start",null,null,null,null,"Punkte",501,"Start",null,null,null,{"$f":"K36","v":"Ralfie"}]
[null,null,null,"Geworfen",{"$f":"SUM(D34)","v":0},"Punkte",null,null,null,null,"Geworfen",{"$f":"SUM(K34)","v":0},"Punkte",null,null,null,null,"Geworfen",{"$f":"SUM(R34)","v":0},"Punkte",null,null,null,null,"Geworfen",{"$f":"SUM(Y34)","v":0},"Punkte",null,null,null,"Ralfie"]
["RD 1",{"$f":"COUNT(D4)*1","v":0},{"$f":"COUNT(D4)*3","v":0},null,{"$f":"SUM(E2-E3)","v":501},"Rest",null,"RD 1",{"$f":"COUNT(K4)*1","v":0},{"$f":"COUNT(K4)*3","v":0},null,{"$f":"SUM(L2-L3)","v":501},"Rest",null,"RD 1",{"$f":"COUNT(R4)*1","v":0},{"$f":"COUNT(R4)*3","v":0},null,{"$f":"SUM(S2-S3)","v":501},"Rest",null,"RD 1",{"$f":"COUNT(Y4)*1","v":0},{"$f":"COUNT(Y4)*3","v":0},null,{"$f":"SUM(Z2-Z3)","v":501},"Rest",null,null,null,"Ralfie"]
["RD 2",0,0,null,null,null,null,"RD 2",0,0,null,null,null,null,"RD 2",0,0,null,null,null,null,"RD 2",0,0]
["RD 3",0,0,null,"ø pro Spiel",{"$f":"SUM(E3)/B34","v":{"$error":"#DIV/0!"}},null,"RD 3",0,0,null,"ø pro Spiel",{"$f":"SUM(L3)/I34","v":{"$error":"#DIV/0!"}},null,"RD 3",0,0,null,"ø pro Spiel",{"$f":"SUM(S3)/P34","v":{"$error":"#DIV/0!"}},null,"RD 3",0,0,null,"ø pro Spiel",{"$f":"SUM(Z3)/W34","v":{"$error":"#DIV/0!"}}]
["RD 4",0,0,null,"ø pro Pfeil",{"$f":"SUM(E3)/C34","v":{"$error":"#DIV/0!"}},null,"RD 4",0,0,null,"ø pro Pfeil",{"$f":"SUM(L3)/J34","v":{"$error":"#DIV/0!"}},null,"RD 4",0,0,null,"ø pro Pfeil",{"$f":"SUM(S3)/Q34","v":{"$error":"#DIV/0!"}},null,"RD 4",0,0,null,"ø pro Pfeil",{"$f":"SUM(Z3)/X34","v":{"$error":"#DIV/0!"}}]
["RD 5",0,0,null,"Average",null,null,"RD 5",0,0,null,"Average",null,null,"RD 5",0,0,null,"Average",null,null,"RD 5",0,0,null,"Average"]
["RD 6",0,0,null,{"$f":"SUM(F6)","v":{"$error":"#DIV/0!"}},null,null,"RD 6",0,0,null,{"$f":"SUM(M6)","v":{"$error":"#DIV/0!"}},null,null,"RD 6",0,0,null,{"$f":"SUM(T6)","v":{"$error":"#DIV/0!"}},null,null,"RD 6",0,0,null,{"$f":"SUM(AA6)","v":{"$error":"#DIV/0!"}}]
["RD 7",0,0,null,null,null,null,"RD 7",0,0,null,null,null,null,"RD 7",0,0,null,null,null,null,"RD 7",0,0]
["RD 8",0,0,null,{"$f":"IF(F6<40,\"Nicht Gut\",\"\")","v":{"$error":"#DIV/0!"}},null,null,"RD 8",0,0,null,{"$f":"IF(M6<40,\"Nicht Gut\",\"\")","v":{"$error":"#DIV/0!"}},null,null,"RD 8",0,0,null,{"$f":"IF(T6<40,\"Nicht Gut\",\"\")","v":{"$error":"#DIV/0!"}},null,null,"RD 8",0,0,null,{"$f":"IF(AA6<40,\"Nicht Gut\",\"\")","v":{"$error":"#DIV/0!"}}]
["RD 9",0,0,null,null,null,null,"RD 9",0,0,null,null,null,null,"RD 9",0,0,null,null,null,null,"RD 9",0,0,null,null,null,null,null,null,170]
["RD 10",0,0,null,null,null,null,"RD 10",0,0,null,null,null,null,"RD 10",0,0,null,null,null,null,"RD 10",0,0,null,null,null,null,null,null,{"$f":"SUM(AE11-AE12)","v":-170}]
["RD 11",0,0,null,{"$f":"IF(AND(F6>=39,F6<=50),\"GUT\",\"\")","v":{"$error":"#DIV/0!"}},null,null,"RD 11",0,0,null,{"$f":"IF(AND(M6>=39,M6<=50),\"GUT\",\"\")","v":{"$error":"#DIV/0!"}},null,null,"RD 11",0,0,null,{"$f":"IF(AND(T6>=39,T6<=50),\"GUT\",\"\")","v":{"$error":"#DIV/0!"}},null,null,"RD 11",0,0,null,{"$f":"IF(AND(AA6>=39,AA6<=50),\"GUT\",\"\")","v":{"$error":"#DIV/0!"}}]
["RD 12",0,0,null,null,null,null,"RD 12",0,0,null,null,null,null,"RD 12",0,0,null,null,null,null,"RD 12",0,0]
["RD 13",0,0,null,null,null,null,"RD 13",0,0,null,null,null,null,"RD 13",0,0,null,null,null,null,"RD 13",0,0]
["RD 14",0,0,null,null,null,null,"RD 14",0,0,null,null,null,null,"RD 14",0,0,null,null,null,null,"RD 14",0,0]
["RD 15",0,0,null,null,null,null,"RD 15",0,0,null,null,null,null,"RD 15",0,0,null,null,null,null,"RD 15",0,0]
["RD 16",0,0,null,{"$f":"IF(F6>49,\"Sehr Gut\",\"\")","v":{"$error":"#DIV/0!"}},null,null,"RD 16",0,0,null,{"$f":"IF(M6>49,\"Sehr Gut\",\"\")","v":{"$error":"#DIV/0!"}},null,null,"RD 16",0,0,null,{"$f":"IF(T6>49,\"Sehr Gut\",\"\")","v":{"$error":"#DIV/0!"}},null,null,"RD 16",0,0,null,{"$f":"IF(AA6>49,\"Sehr Gut\",\"\")","v":{"$error":"#DIV/0!"}}]
["RD 17",0,0,null,null,null,null,"RD 17",0,0,null,null,null,null,"RD 17",0,0,null,null,null,null,"RD 17",0,0]
["RD 18",0,0,null,null,null,null,"RD 18",0,0,null,null,null,null,"RD 18",0,0,null,null,null,null,"RD 18",0,0]
["RD 19",0,0,null,null,null,null,"RD 19",0,0,null,null,null,null,"RD 19",0,0,null,null,null,null,"RD 19",0,0]
["RD 20",0,0,null,null,null,null,"RD 20",0,0,null,null,null,null,"RD 20",0,0,null,null,null,null,"RD 20",0,0]
["RD 21",0,0,null,"Rest:",{"$f":"E4","v":501},null,"RD 21",0,0,null,"Rest:",{"$f":"L4","v":501},null,"RD 21",0,0,null,"Rest:",{"$f":"S4","v":501},null,"RD 21",0,0,null,"Rest:",{"$f":"Z4","v":501}]
["RD 22",0,0,null,{"$f":"D1","v":"Ralfie"},null,null,"RD 22",0,0,null,{"$f":"K1","v":"Siggi"},null,null,"RD 22",0,0,null,{"$f":"R1","v":"Kerstin"},null,null,"RD 22",0,0,null,{"$f":"Y1","v":"Christian"}]
["RD 23",0,0,null,null,null,null,"RD 23",0,0,null,null,null,null,"RD 23",0,0,null,null,null,null,"RD 23",0,0]
["RD 24",0,0,null,{"$f":"IF(S4<L4+Z4,\"Darf\",IF(S4>L4+Z4,\"Darf nicht\",IF(S4=L4+Z4,\"Darf\"\"\")))","v":"Darf"},null,null,"RD 24",0,0,null,{"$f":"IF(Z4<E4+S4,\"Darf\",IF(Z4>E4+S4,\"Darf nicht\",IF(Z4=E4+S4,\"Darf\"\"\")))","v":"Darf"},null,null,"RD 24",0,0,null,{"$f":"IF(E4<L4+Z4,\"Darf\",IF(E4>L4+Z4,\"Darf nicht\",IF(E4=L4+Z4,\"Darf\"\"\")))","v":"Darf"},null,null,"RD 24",0,0,null,{"$f":"IF(L4<E4+S4,\"Darf\",IF(L4>E4+S4,\"Darf nicht\",IF(L4=E4+S4,\"Darf\"\"\")))","v":"Darf"}]
["RD 25",0,0,null,null,null,null,"RD 25",0,0,null,null,null,null,"RD 25",0,0,null,null,null,null,"RD 25",0,0]
["RD 26",0,0,null,null,null,null,"RD 26",0,0,null,null,null,null,"RD 26",0,0,null,null,null,null,"RD 26",0,0]
["RD 27",0,0,null,null,null,null,"RD 27",0,0,null,null,null,null,"RD 27",0,0,null,null,null,null,"RD 27",0,0]
["RD 28",0,0,null,null,null,null,"RD 28",0,0,null,null,null,null,"RD 28",0,0,null,null,null,null,"RD 28",0,0]
["RD 29",0,0,null,{"$f":"IF(E4=0,\"Sieg\",\"\")","v":""},null,null,"RD 29",0,0,null,{"$f":"IF(L4=0,\"Sieg\",\"\")","v":""},null,null,"RD 29",0,0,null,{"$f":"IF(S4=0,\"Sieg\",\"\")","v":""},null,null,"RD 29",0,0,null,{"$f":"IF(Z4=0,\"Sieg\",\"\")","v":""}]
["RD 30",0,0,null,null,null,null,"RD 30",0,0,null,null,null,null,"RD 30",0,0,null,null,null,null,"RD 30",0,0]
[null,{"$f":"SUM(B4:B33)","v":0},{"$f":"SUM(C4:C33)","v":0},{"$f":"SUM(D4:D33)","v":0},{"$f":"SUM(D4:D32)","v":0},null,null,null,{"$f":"SUM(I4:I33)","v":0},{"$f":"SUM(J4:J33)","v":0},{"$f":"SUM(K4:K33)","v":0},{"$f":"SUM(K4:K32)","v":0},null,null,null,{"$f":"SUM(P4:P33)","v":0},{"$f":"SUM(Q4:Q33)","v":0},{"$f":"SUM(R4:R33)","v":0},{"$f":"SUM(R4:R32)","v":0},null,null,null,{"$f":"SUM(W4:W33)","v":0},{"$f":"SUM(X4:X33)","v":0},{"$f":"SUM(Y4:Y33)","v":0},{"$f":"SUM(Y4:Y32)","v":0}]
[null,null,null,{"$f":"D1","v":"Ralfie"},null,{"$f":"SUM(E3)","v":0},null,null,null,null,{"$f":"INDEX(D35:D38,MATCH(LARGE(F35:F38,1),F35:F38,0))","v":"Ralfie"}]
[null,null,null,{"$f":"K1","v":"Siggi"},null,{"$f":"SUM(L3)","v":0},null,null,null,null,{"$f":"INDEX(D35:D38,MATCH(LARGE(F35:F38,2),F35:F38,0))","v":"Ralfie"}]
[null,null,null,{"$f":"R1","v":"Kerstin"},null,{"$f":"SUM(S3)","v":0},null,null,null,null,{"$f":"INDEX(D35:D38,MATCH(LARGE(F35:F38,3),F35:F38,0))","v":"Ralfie"}]
[null,null,null,{"$f":"Y1","v":"Christian"},null,{"$f":"SUM(Z3)","v":0},null,null,null,null,{"$f":"INDEX(D35:D38,MATCH(LARGE(F35:F38,4),F35:F38,0))","v":"Ralfie"},null,null,null,null,null,null,null,null,null,null,null,null,null,null,null,null,null,null,null,null,null,null,{"$f":"Z43","v":"Ralfie"},{"$f":"Z45","v":"Kerstin"}]
[null,null,null,"MAX(B2:B7",null,{"$f":"SUM(F35:F38)","v":0},null,null,null,null,null,null,null,null,null,null,null,null,null,null,null,null,null,null,null,null,null,null,null,null,"Vincent"]
[null,null,null,null,null,null,null,null,null,null,null,null,null,null,null,null,null,null,null,null,null,null,null,null,null,null,null,null,null,null,"Anja",null,null,{"$f":"Z44","v":"Siggi"},{"$f":"Z46","v":"Christian"}]
[null,null,null,null,null,null,null,null,null,null,null,null,null,null,null,null,null,null,null,null,null,null,null,null,null,null,null,null,null,null,"Erich"]
[null,null,null,null,1002,null,null,null,null,null,null,1002,null,null,null,null,null,null,null,null,null,null,null,null,null,null,{"$f":"RAND()","v":0.88108608949471778},null,null,null,"Siggi",null,null,{"$f":"Z43","v":"Ralfie"},{"$f":"Z46","v":"Christian"}]
[null,null,null,{"$f":"D1","v":"Ralfie"},{"$f":"SUM(D13:D33)","v":0},null,null,null,null,null,{"$f":"K1","v":"Siggi"},{"$f":"SUM(K13:K33)","v":0},null,null,{"$f":"D1","v":"Ralfie"},null,null,{"$f":"SUM(E46)","v":1002},null,{"$f":"INDEX(O43:O46,MATCH(LARGE(R43:R46,ROW(AE4)),R43:R46,0))","v":"Siggi"},null,null,null,null,null,"Ralfie",{"$f":"RAND()","v":0.23103393073923406},null,null,null,"Ralfie"]
[null,null,null,{"$f":"R1","v":"Kerstin"},{"$f":"SUM(R13:R33)","v":0},null,null,null,null,null,{"$f":"Y1","v":"Christian"},{"$f":"SUM(Y13:Y33)","v":0},null,null,{"$f":"R1","v":"Kerstin"},null,null,{"$f":"SUM(E46)+0.1","v":1002.1},null,{"$f":"INDEX(O43:O46,MATCH(LARGE(R43:R46,ROW(AE3)),R43:R46,0))","v":"Christian"},null,null,null,null,null,"Siggi",{"$f":"RAND()","v":0.1033443857423828},null,null,null,"Ralf Kl.",null,null,{"$f":"Z44","v":"Siggi"},{"$f":"Z45","v":"Kerstin"}]
[null,null,null,null,{"$f":"SUM(E43:E44)","v":0},null,null,null,null,null,null,{"$f":"SUM(L43:L44)","v":0},null,null,{"$f":"K1","v":"Siggi"},null,null,{"$f":"L46/2","v":501},null,{"$f":"INDEX(O43:O46,MATCH(LARGE(R43:R46,ROW(AE2)),R43:R46,0))","v":"Ralfie"},null,null,null,null,null,"Kerstin",{"$f":"RAND()","v":0.43393772085753124},null,null,null,"Volker"]
[null,null,null,null,{"$f":"SUM(E42-E45)","v":1002},null,null,null,null,null,null,{"$f":"SUM(L42-L45)","v":1002},null,null,{"$f":"Y1","v":"Christian"},null,null,{"$f":"L46/2+0.1","v":501.1},null,{"$f":"INDEX(O43:O46,MATCH(LARGE(R43:R46,ROW(AE1)),R43:R46,0))","v":"Kerstin"},null,null,null,null,null,"Christian",{"$f":"RAND()","v":0.72291049484494918},null,null,null,"Rene",null,null,{"$f":"Z44","v":"Siggi"},{"$f":"Z43","v":"Ralfie"}]
[null,null,null,null,null,null,null,null,null,null,null,null,null,null,null,null,null,null,null,null,null,null,null,null,null,null,null,null,null,null,"Nicole"]
[null,null,null,null,null,null,null,null,null,null,null,null,null,null,null,null,null,null,null,null,null,null,null,null,null,null,null,null,null,null,"Frank",null,null,{"$f":"Z45","v":"Kerstin"},{"$f":"Z46","v":"Christian"}]
[null,null,null,null,null,null,null,null,null,null,null,null,null,null,null,null,null,null,null,null,null,null,null,null,null,null,null,null,null,null,"Rosi"]
[null,null,null,null,null,null,null,null,null,null,null,null,null,null,null,null,null,null,null,null,null,null,null,null,null,null,null,null,null,null,"Werner"]
[null,null,null,{"$f":"D43","v":"Ralfie"},{"$f":"E4","v":501},null,null,null,null,null,{"$f":"K43","v":"Siggi"},{"$f":"L4","v":501},null,null,"SP1","SP2","SP3","SP2","SP3",null,null,null,null,null,null,null,null,null,null,null,"Christian"]
[null,null,null,{"$f":"D44","v":"Kerstin"},{"$f":"S4","v":501},null,null,null,null,null,{"$f":"K44","v":"Christian"},{"$f":"Z4","v":501},null,null,{"$f":"Z43","v":"Ralfie"},null,null,{"$f":"O55","v":"Christian"},{"$f":"R55","v":"Kerstin"},null,null,null,null,null,null,null,null,null,null,null,"Dirk B."]
[null,null,null,null,{"$f":"SUM(E51:E52)","v":1002},null,null,null,null,null,null,{"$f":"SUM(L51:L52)","v":1002},null,null,{"$f":"Z44","v":"Siggi"},null,null,{"$f":"O52","v":"Ralfie"},{"$f":"R53","v":"Ralfie"},null,null,null,null,null,null,null,null,null,null,null,"Stefan"]
[null,null,null,null,null,null,null,null,null,null,null,null,null,null,"Kerstin",null,null,{"$f":"O53","v":"Siggi"},{"$f":"R52","v":"Christian"},null,null,null,null,null,null,null,null,null,null,null,"Micha"]
[null,null,null,{"$f":"D51","v":"Ralfie"},{"$f":"E51","v":501},{"$f":"SUM(E57:E58)-E56","v":501},null,null,{"$f":"INDEX(E$55:E$58,MATCH(LARGE(F$55:F$58,1),F$55:F$58,0))","v":501},{"$f":"INDEX(F$55:F$58,MATCH(LARGE(G$55:G$58,1),G$55:G$58,0))","v":{"$error":"#NUM!"}},null,null,null,null,"Christian",null,null,{"$f":"O54","v":"Kerstin"},{"$f":"R54","v":"Siggi"},null,null,null,null,null,null,null,null,null,null,null,"Thorsten"]
[null,null,null,{"$f":"D52","v":"Kerstin"},{"$f":"E52","v":501},{"$f":"SUM(E57:E58)-E55","v":501},null,null,null,null,null,null,null,null,null,null,null,null,null,null,null,null,null,null,null,null,null,null,null,null,"Kerstin"]
[null,null,null,{"$f":"K51","v":"Siggi"},{"$f":"L51","v":501},{"$f":"SUM(E55:E56)-E58","v":501}]
[null,null,null,{"$f":"K52","v":"Christian"},{"$f":"L52","v":501}]

{"sheet":"Rd.2","index":1,"n_rows":58,"n_cols":31,"rows_kept":58,"cut":false,"hidden":false,"merged":[[13,25,16,26],[17,25,17,26],[18,25,22,26],[17,11,17,12],[18,11,22,12],[10,18,11,19],[12,18,12,19],[13,18,16,19],[17,18,17,19],[18,18,22,19],[0,24,0,25],[7,4,7,5],[7,11,7,12],[7,18,7,19],[7,25,7,26],[0,3,0,4],[0,10,0,11],[0,17,0,18],[31,18,32,19],[31,25,32,26],[26,4,30,5],[26,11,30,12],[26,18,30,19],[26,25,30,26],[17,4,17,5],[18,4,22,5],[13,11,16,12],[31,4,32,5],[31,11,32,12],[8,25,9,26],[8,4,9,5],[10,25,11,26],[12,25,12,26],[38,3,38,4],[8,11,9,12],[8,18,9,19],[24,4,25,5],[24,11,25,12],[24,18,25,19],[10,4,11,5],[12,4,12,5],[10,11,11,12],[12,11,12,12],[24,25,25,26],[13,4,16,5]]}
[null,null,null,{"$f":"'Rd.1'!AE2","v":"Ralfie"},null,"Sp.1",null,null,null,null,{"$f":"'Rd.1'!AE4","v":"Ralfie"},null,"Sp.2",null,null,null,null,{"$f":"'Rd.1'!AE1","v":"Ralfie"},null,"Sp.3",null,null,null,null,{"$f":"'Rd.1'!AE3","v":"Ralfie"},null,"Sp.4",null,null,null,{"$f":"K35","v":"Ralfie"}]
[null,null,null,"Punkte",501,"Start",null,null,null,null,"Punkte",501,"Start",null,null,null,null,"Punkte",501,"Start",null,null,null,null,"Punkte",501,"Start",null,null,null,{"$f":"K36","v":"Ralfie"}]
[null,null,null,"Geworfen",{"$f":"SUM(D34)","v":0},"Punkte",null,null,null,null,"Geworfen",{"$f":"SUM(K34)","v":0},"Punkte",null,null,null,null,"Geworfen",{"$f":"SUM(R34)","v":0},"Punkte",null,null,null,null,"Geworfen",{"$f":"SUM(Y34)","v":0},"Punkte",null,null,null,"Ralfie"]
["RD 1",{"$f":"COUNT(D4)*1","v":0},{"$f":"COUNT(D4)*3","v":0},null,{"$f":"SUM(E2-E3)","v":501},"Rest",null,"RD 1",{"$f":"COUNT(K4)*1","v":0},{"$f":"COUNT(K4)*3","v":0},null,{"$f":"SUM(L2-L3)","v":501},"Rest",null,"RD 1",{"$f":"COUNT(R4)*1","v":0},{"$f":"COUNT(R4)*3","v":0},null,{"$f":"SUM(S2-S3)","v":501},"Rest",null,"RD 1",{"$f":"COUNT(Y4)*1","v":0},{"$f":"COUNT(Y4)*3","v":0},null,{"$f":"SUM(Z2-Z3)","v":501},"Rest",null,null,null,"Ralfie"]
["RD 2",0,0,null,null,null,null,"RD 2",0,0,null,null,null,null,"RD 2",0,0,null,null,null,null,"RD 2",0,0]
["RD 3",0,0,null,"ø pro Spiel",{"$f":"SUM(E3)/B34","v":{"$error":"#DIV/0!"}},null,"RD 3",0,0,null,"ø pro Spiel",{"$f":"SUM(L3)/I34","v":{"$error":"#DIV/0!"}},null,"RD 3",0,0,null,"ø pro Spiel",{"$f":"SUM(S3)/P34","v":{"$error":"#DIV/0!"}},null,"RD 3",0,0,null,null,{"$f":"SUM(Z3)/W34","v":{"$error":"#DIV/0!"}}]
["RD 4",0,0,null,"ø pro Pfeil",{"$f":"SUM(E3)/C34","v":{"$error":"#DIV/0!"}},null,"RD 4",0,0,null,"ø pro Pfeil",{"$f":"SUM(L3)/J34","v":{"$error":"#DIV/0!"}},null,"RD 4",0,0,null,"ø pro Pfeil",{"$f":"SUM(S3)/Q34","v":{"$error":"#DIV/0!"}},null,"RD 4",0,0,null,"ø pro Pfeil",{"$f":"SUM(Z3)/X34","v":{"$error":"#DIV/0!"}}]
["RD 5",0,0,null,"Average",null,null,"RD 5",0,0,null,"Average",null,null,"RD 5",0,0,null,"Average",null,null,"RD 5",0,0,null,"Average"]
["RD 6",0,0,null,{"$f":"SUM(F6)","v":{"$error":"#DIV/0!"}},null,null,"RD 6",0,0,null,{"$f":"SUM(M6)","v":{"$error":"#DIV/0!"}},null,null,"RD 6",0,0,null,{"$f":"SUM(T6)","v":{"$error":"#DIV/0!"}},null,null,"RD 6",0,0,null,{"$f":"SUM(AA6)","v":{"$error":"#DIV/0!"}}]
["RD 7",0,0,null,null,null,null,"RD 7",0,0,null,null,null,null,"RD 7",0,0,null,null,null,null,"RD 7",0,0]
["RD 8",0,0,null,{"$f":"IF(F6<40,\"Nicht Gut\",\"\")","v":{"$error":"#DIV/0!"}},null,null,"RD 8",0,0,null,{"$f":"IF(M6<40,\"Nicht Gut\",\"\")","v":{"$error":"#DIV/0!"}},null,null,"RD 8",0,0,null,{"$f":"IF(T6<40,\"Nicht Gut\",\"\")","v":{"$error":"#DIV/0!"}},null,null,"RD 8",0,0,null,{"$f":"IF(AA6<40,\"Nicht Gut\",\"\")","v":{"$error":"#DIV/0!"}}]
["RD 9",0,0,null,null,null,null,"RD 9",0,0,null,null,null,null,"RD 9",0,0,null,null,null,null,"RD 9",0,0]
["RD 10",0,0,null,null,null,null,"RD 10",0,0,null,null,null,null,"RD 10",0,0,null,null,null,null,"RD 10",0,0]
["RD 11",0,0,null,{"$f":"IF(AND(F6>=39,F6<=50),\"GUT\",\"\")","v":{"$error":"#DIV/0!"}},null,null,"RD 11",0,0,null,{"$f":"IF(AND(M6>=39,M6<=50),\"GUT\",\"\")","v":{"$error":"#DIV/0!"}},null,null,"RD 11",0,0,null,{"$f":"IF(AND(T6>=39,T6<=50),\"GUT\",\"\")","v":{"$error":"#DIV/0!"}},null,null,"RD 11",0,0,null,{"$f":"IF(AND(AA6>=39,AA6<=50),\"GUT\",\"\")","v":{"$error":"#DIV/0!"}}]
["RD 12",0,0,null,null,null,null,"RD 12",0,0,null,null,null,null,"RD 12",0,0,null,null,null,null,"RD 12",0,0]
["RD 13",0,0,null,null,null,null,"RD 13",0,0,null,null,null,null,"RD 13",0,0,null,null,null,null,"RD 13",0,0]
["RD 14",0,0,null,null,null,null,"RD 14",0,0,null,null,null,null,"RD 14",0,0,null,null,null,null,"RD 14",0,0]
["RD 15",0,0,null,null,null,null,"RD 15",0,0,null,null,null,null,"RD 15",0,0,null,null,null,null,"RD 15",0,0]
["RD 16",0,0,null,{"$f":"IF(F6>49,\"Sehr Gut\",\"\")","v":{"$error":"#DIV/0!"}},null,null,"RD 16",0,0,null,{"$f":"IF(M6>49,\"Sehr Gut\",\"\")","v":{"$error":"#DIV/0!"}},null,null,"RD 16",0,0,null,{"$f":"IF(T6>49,\"Sehr Gut\",\"\")","v":{"$error":"#DIV/0!"}},null,null,"RD 16",0,0,null,{"$f":"IF(AA6>49,\"Sehr Gut\",\"\")","v":{"$error":"#DIV/0!"}}]
["RD 17",0,0,null,null,null,null,"RD 17",0,0,null,null,null,null,"RD 17",0,0,null,null,null,null,"RD 17",0,0]
["RD 18",0,0,null,null,null,null,"RD 18",0,0,null,null,null,null,"RD 18",0,0,null,null,null,null,"RD 18",0,0]
["RD 19",0,0,null,null,null,null,"RD 19",0,0,null,null,null,null,"RD 19",0,0,null,null,null,null,"RD 19",0,0]
["RD 20",0,0,null,null,null,null,"RD 20",0,0,null,null,null,null,"RD 20",0,0,null,null,null,null,"RD 20",0,0]
["RD 21",0,0,null,"Rest:",{"$f":"E4","v":501},null,"RD 21",0,0,null,"Rest:",{"$f":"L4","v":501},null,"RD 21",0,0,null,"Rest:",{"$f":"S4","v":501},null,"RD 21",0,0,null,"Rest:",{"$f":"Z4","v":501}]
["RD 22",0,0,null,{"$f":"D1","v":"Ralfie"},null,null,"RD 22",0,0,null,{"$f":"K1","v":"Ralfie"},null,null,"RD 22",0,0,null,{"$f":"R1","v":"Ralfie"},null,null,"RD 22",0,0,null,{"$f":"Y1","v":"Ralfie"}]
["RD 23",0,0,null,null,null,null,"RD 23",0,0,null,null,null,null,"RD 23",0,0,null,null,null,null,"RD 23",0,0]
["RD 24",0,0,null,{"$f":"IF(S4<L4+Z4,\"Darf\",IF(S4>L4+Z4,\"Darf nicht\",IF(S4=L4+Z4,\"Darf\"\"\")))","v":"Darf"},null,null,"RD 24",0,0,null,{"$f":"IF(Z4<E4+S4,\"Darf\",IF(Z4>E4+S4,\"Darf nicht\",IF(Z4=E4+S4,\"Darf\"\"\")))","v":"Darf"},null,null,"RD 24",0,0,null,{"$f":"IF(E4<L4+Z4,\"Darf\",IF(E4>L4+Z4,\"Darf nicht\",IF(E4=L4+Z4,\"Darf\"\"\")))","v":"Darf"},null,null,"RD 24",0,0,null,{"$f":"IF(L4<E4+S4,\"Darf\",IF(L4>E4+S4,\"Darf nicht\",IF(L4=E4+S4,\"Darf\"\"\")))","v":"Darf"}]
["RD 25",0,0,null,null,null,null,"RD 25",0,0,null,null,null,null,"RD 25",0,0,null,null,null,null,"RD 25",0,0]
["RD 26",0,0,null,null,null,null,"RD 26",0,0,null,null,null,null,"RD 26",0,0,null,null,null,null,"RD 26",0,0]
["RD 27",0,0,null,null,null,null,"RD 27",0,0,null,null,null,null,"RD 27",0,0,null,null,null,null,"RD 27",0,0]
["RD 28",0,0,null,null,null,null,"RD 28",0,0,null,null,null,null,"RD 28",0,0,null,null,null,null,"RD 28",0,0]
["RD 29",0,0,null,{"$f":"IF(E4=0,\"Sieg\",\"\")","v":""},null,null,"RD 29",0,0,null,{"$f":"IF(L4=0,\"Sieg\",\"\")","v":""},null,null,"RD 29",0,0,null,{"$f":"IF(S4=0,\"Sieg\",\"\")","v":""},null,null,"RD 29",0,0,null,{"$f":"IF(Z4=0,\"Sieg\",\"\")","v":""}]
["RD 30",0,0,null,null,null,null,"RD 30",0,0,null,null,null,null,"RD 30",0,0,null,null,null,null,"RD 30",0,0]
[null,{"$f":"SUM(B4:B33)","v":0},{"$f":"SUM(C4:C33)","v":0},{"$f":"SUM(D4:D33)","v":0},{"$f":"SUM(D4:D32)","v":0},null,null,null,{"$f":"SUM(I4:I33)","v":0},{"$f":"SUM(J4:J33)","v":0},{"$f":"SUM(K4:K33)","v":0},{"$f":"SUM(K4:K32)","v":0},null,null,null,{"$f":"SUM(P4:P33)","v":0},{"$f":"SUM(Q4:Q33)","v":0},{"$f":"SUM(R4:R33)","v":0},{"$f":"SUM(R4:R32)","v":0},null,null,null,{"$f":"SUM(W4:W33)","v":0},{"$f":"SUM(X4:X33)","v":0},{"$f":"SUM(Y4:Y33)","v":0},{"$f":"SUM(Y4:Y32)","v":0}]
[null,null,null,{"$f":"D1","v":"Ralfie"},null,{"$f":"SUM(E3)","v":0},null,null,null,null,{"$f":"INDEX(D35:D38,MATCH(LARGE(F35:F38,1),F35:F38,0))","v":"Ralfie"}]
[null,null,null,{"$f":"K1","v":"Ralfie"},null,{"$f":"SUM(L3)","v":0},null,null,null,null,{"$f":"INDEX(D35:D38,MATCH(LARGE(F35:F38,2),F35:F38,0))","v":"Ralfie"}]
[null,null,null,{"$f":"R1","v":"Ralfie"},null,{"$f":"SUM(S3)","v":0},null,null,null,null,{"$f":"INDEX(D35:D38,MATCH(LARGE(F35:F38,3),F35:F38,0))","v":"Ralfie"}]
[null,null,null,{"$f":"Y1","v":"Ralfie"},null,{"$f":"SUM(Z3)","v":0},null,null,null,null,{"$f":"INDEX(D35:D38,MATCH(LARGE(F35:F38,4),F35:F38,0))","v":"Ralfie"}]
[null,null,null,"MAX(B2:B7",null,{"$f":"SUM(F35:F38)","v":0},null,null,null,null,null,null,null,null,null,null,null,null,null,null,null,null,null,null,null,null,null,null,null,null,"Ralf Kl."]
[null,null,null,null,null,null,null,null,null,null,null,null,null,null,null,null,null,null,null,null,null,null,null,null,null,null,null,null,null,null,"Volker"]
[null,null,null,null,null,null,null,null,null,null,null,null,null,null,null,null,null,null,null,null,null,null,null,null,null,null,null,null,null,null,"Rene"]
[null,null,null,null,1002,null,null,null,null,null,null,1002,null,null,null,null,null,null,null,null,null,null,null,null,null,null,{"$f":"RAND()","v":0.80628243462155247},null,null,null,"Nicole"]
[null,null,null,{"$f":"D1","v":"Ralfie"},{"$f":"SUM(D13:D33)","v":0},null,null,null,null,null,{"$f":"K1","v":"Ralfie"},{"$f":"SUM(K13:K33)","v":0},null,null,{"$f":"D1","v":"Ralfie"},null,null,{"$f":"SUM(E46)","v":1002},null,{"$f":"INDEX(O43:O46,MATCH(LARGE(R43:R46,ROW(AE4)),R43:R46,0))","v":"Ralfie"},null,null,null,null,null,{"$f":"'Rd.1'!Z43","v":"Ralfie"},{"$f":"RAND()","v":0.69300520012876665},null,null,null,"Frank"]
[null,null,null,{"$f":"R1","v":"Ralfie"},{"$f":"SUM(R13:R33)","v":0},null,null,null,null,null,{"$f":"Y1","v":"Ralfie"},{"$f":"SUM(Y13:Y33)","v":0},null,null,{"$f":"R1","v":"Ralfie"},null,null,{"$f":"SUM(E46)+0.1","v":1002.1},null,{"$f":"INDEX(O43:O46,MATCH(LARGE(R43:R46,ROW(AE3)),R43:R46,0))","v":"Ralfie"},null,null,null,null,null,{"$f":"'Rd.1'!Z44","v":"Siggi"},{"$f":"RAND()","v":0.65265321172403989},null,null,null,"Rosi"]
[null,null,null,null,{"$f":"SUM(E43:E44)","v":0},null,null,null,null,null,null,{"$f":"SUM(L43:L44)","v":0},null,null,{"$f":"K1","v":"Ralfie"},null,null,{"$f":"L46/2","v":501},null,{"$f":"INDEX(O43:O46,MATCH(LARGE(R43:R46,ROW(AE2)),R43:R46,0))","v":"Ralfie"},null,null,null,null,null,{"$f":"'Rd.1'!Z45","v":"Kerstin"},{"$f":"RAND()","v":0.77834054537819175},null,null,null,"Werner"]
[null,null,null,null,{"$f":"SUM(E42-E45)","v":1002},null,null,null,null,null,null,{"$f":"SUM(L42-L45)","v":1002},null,null,{"$f":"Y1","v":"Ralfie"},null,null,{"$f":"L46/2+0.1","v":501.1},null,{"$f":"INDEX(O43:O46,MATCH(LARGE(R43:R46,ROW(AE1)),R43:R46,0))","v":"Ralfie"},null,null,null,null,null,{"$f":"'Rd.1'!Z46","v":"Christian"},{"$f":"RAND()","v":0.85826457334612338},null,null,null,"Gast"]
[null,null,null,null,null,null,null,null,null,null,null,null,null,null,null,null,null,null,null,null,null,null,null,null,null,null,null,null,null,null,"Joker"]
[null,null,null,null,null,null,null,null,null,null,null,null,null,null,null,null,null,null,null,null,null,null,null,null,null,null,null,null,null,null,"Anja"]
[null,null,null,null,null,null,null,null,null,null,null,null,null,null,null,null,null,null,null,null,null,null,null,null,null,null,null,null,null,null,"Vincent"]
[null,null,null,null,null,null,null,null,null,null,null,null,null,null,null,null,null,null,null,null,null,null,null,null,null,null,null,null,null,null,"Erich"]
[null,null,null,{"$f":"D43","v":"Ralfie"},{"$f":"E4","v":501},null,null,null,null,null,{"$f":"K43","v":"Ralfie"},{"$f":"L4","v":501},null,null,null,null,null,null,null,null,null,null,null,null,null,null,null,null,null,null,"Siggi"]
[null,null,null,{"$f":"D44","v":"Ralfie"},{"$f":"S4","v":501},null,null,null,null,null,{"$f":"K44","v":"Ralfie"},{"$f":"Z4","v":501},null,null,null,null,null,null,null,null,null,null,null,null,null,null,null,null,null,null,"Ralf M."]
[null,null,null,null,{"$f":"SUM(E51:E52)","v":1002},null,null,null,null,null,null,{"$f":"SUM(L51:L52)","v":1002},null,null,null,null,null,null,null,null,null,null,null,null,null,null,null,null,null,null,"Dirk B."]
[null,null,null,null,null,null,null,null,null,null,null,null,null,null,null,null,null,null,null,null,null,null,null,null,null,null,null,null,null,null,"Stefan"]
[null,null,null,{"$f":"D51","v":"Ralfie"},{"$f":"E51","v":501},{"$f":"SUM(E57:E58)-E56","v":501},null,null,{"$f":"INDEX(E$55:E$58,MATCH(LARGE(F$55:F$58,1),F$55:F$58,0))","v":501},{"$f":"INDEX(F$55:F$58,MATCH(LARGE(G$55:G$58,1),G$55:G$58,0))","v":{"$error":"#NUM!"}},null,null,null,null,null,null,null,null,null,null,null,null,null,null,null,null,null,null,null,null,"Micha"]
[null,null,null,{"$f":"D52","v":"Ralfie"},{"$f":"E52","v":501},{"$f":"SUM(E57:E58)-E55","v":501}]
[null,null,null,{"$f":"K51","v":"Ralfie"},{"$f":"L51","v":501},{"$f":"SUM(E55:E56)-E58","v":501}]
[null,null,null,{"$f":"K52","v":"Ralfie"},{"$f":"L52","v":501}]

{"sheet":"Rd.3","index":2,"n_rows":58,"n_cols":31,"rows_kept":58,"cut":false,"hidden":false,"merged":[[0,24,0,25],[7,4,7,5],[7,11,7,12],[7,18,7,19],[7,25,7,26],[0,3,0,4],[0,10,0,11],[0,17,0,18],[31,25,32,26],[26,4,30,5],[26,11,30,12],[26,18,30,19],[26,25,30,26],[24,25,25,26],[13,4,16,5],[17,4,17,5],[18,4,22,5],[13,11,16,12],[13,18,16,19],[17,18,17,19],[18,18,22,19],[13,25,16,26],[17,25,17,26],[18,25,22,26],[17,11,17,12],[18,11,22,12],[38,3,38,4],[8,11,9,12],[8,18,9,19],[24,4,25,5],[24,11,25,12],[24,18,25,19],[10,4,11,5],[12,4,12,5],[10,11,11,12],[12,11,12,12],[31,4,32,5],[31,11,32,12],[31,18,32,19],[10,18,11,19],[12,18,12,19],[9,30,9,31],[8,25,9,26],[8,4,9,5],[10,25,11,26],[12,25,12,26]]}
[null,null,null,{"$f":"'Rd.1'!AH42","v":"Ralfie"},null,"Sp.1",null,null,null,null,{"$f":"'Rd.1'!AI42","v":"Christian"},null,"Sp.2",null,null,null,null,{"$f":"'Rd.1'!AH44","v":"Siggi"},null,"Sp.3",null,null,null,null,{"$f":"'Rd.1'!AI44","v":"Kerstin"},null,"Sp.4",null,null,null,{"$f":"K35","v":"Ralfie"}]
[null,null,null,"Punkte",501,"Start",null,null,null,null,"Punkte",501,"Start",null,null,null,null,"Punkte",501,"Start",null,null,null,null,"Punkte",501,"Start",null,null,null,{"$f":"K36","v":"Ralfie"}]
[null,null,null,"Geworfen",{"$f":"SUM(D34)","v":0},"Punkte",null,null,null,null,"Geworfen",{"$f":"SUM(K34)","v":0},"Punkte",null,null,null,null,"Geworfen",{"$f":"SUM(R34)","v":0},"Punkte",null,null,null,null,"Geworfen",{"$f":"SUM(Y34)","v":0},"Punkte",null,null,null,"Ralfie"]
["RD 1",{"$f":"COUNT(D4)*1","v":0},{"$f":"COUNT(D4)*3","v":0},null,{"$f":"SUM(E2-E3)","v":501},"Rest",null,"RD 1",{"$f":"COUNT(K4)*1","v":0},{"$f":"COUNT(K4)*3","v":0},null,{"$f":"SUM(L2-L3)","v":501},"Rest",null,"RD 1",{"$f":"COUNT(R4)*1","v":0},{"$f":"COUNT(R4)*3","v":0},null,{"$f":"SUM(S2-S3)","v":501},"Rest",null,"RD 1",{"$f":"COUNT(Y4)*1","v":0},{"$f":"COUNT(Y4)*3","v":0},null,{"$f":"SUM(Z2-Z3)","v":501},"Rest",null,null,null,"Ralfie"]
["RD 2",0,0,null,null,null,null,"RD 2",0,0,null,null,null,null,"RD 2",0,0,null,null,null,null,"RD 2",0,0]
["RD 3",0,0,null,"ø pro Spiel",{"$f":"SUM(E3)/B34","v":{"$error":"#DIV/0!"}},null,"RD 3",0,0,null,"ø pro Spiel",{"$f":"SUM(L3)/I34","v":{"$error":"#DIV/0!"}},null,"RD 3",0,0,null,"ø pro Spiel",{"$f":"SUM(S3)/P34","v":{"$error":"#DIV/0!"}},null,"RD 3",0,0,null,null,{"$f":"SUM(Z3)/W34","v":{"$error":"#DIV/0!"}}]
["RD 4",0,0,null,"ø pro Pfeil",{"$f":"SUM(E3)/C34","v":{"$error":"#DIV/0!"}},null,"RD 4",0,0,null,"ø pro Pfeil",{"$f":"SUM(L3)/J34","v":{"$error":"#DIV/0!"}},null,"RD 4",0,0,null,"ø pro Pfeil",{"$f":"SUM(S3)/Q34","v":{"$error":"#DIV/0!"}},null,"RD 4",0,0,null,"ø pro Pfeil",{"$f":"SUM(Z3)/X34","v":{"$error":"#DIV/0!"}}]
["RD 5",0,0,null,"Average",null,null,"RD 5",0,0,null,"Average",null,null,"RD 5",0,0,null,"Average",null,null,"RD 5",0,0,null,"Average"]
["RD 6",0,0,null,{"$f":"SUM(F6)","v":{"$error":"#DIV/0!"}},null,null,"RD 6",0,0,null,{"$f":"SUM(M6)","v":{"$error":"#DIV/0!"}},null,null,"RD 6",0,0,null,{"$f":"SUM(T6)","v":{"$error":"#DIV/0!"}},null,null,"RD 6",0,0,null,{"$f":"SUM(AA6)","v":{"$error":"#DIV/0!"}}]
["RD 7",0,0,null,null,null,null,"RD 7",0,0,null,null,null,null,"RD 7",0,0,null,null,null,null,"RD 7",0,0,null,null,null,null,null,null,"Neu kein Unetschieden"]
["RD 8",0,0,null,{"$f":"IF(F6<40,\"Nicht Gut\",\"\")","v":{"$error":"#DIV/0!"}},null,null,"RD 8",0,0,null,{"$f":"IF(M6<40,\"Nicht Gut\",\"\")","v":{"$error":"#DIV/0!"}},null,null,"RD 8",0,0,null,{"$f":"IF(T6<40,\"Nicht Gut\",\"\")","v":{"$error":"#DIV/0!"}},null,null,"RD 8",0,0,null,{"$f":"IF(AA6<40,\"Nicht Gut\",\"\")","v":{"$error":"#DIV/0!"}},null,null,null,null,{"$f":"'Rd.1'!R52","v":"Christian"}]
["RD 9",0,0,null,null,null,null,"RD 9",0,0,null,null,null,null,"RD 9",0,0,null,null,null,null,"RD 9",0,0,null,null,null,null,null,null,{"$f":"'Rd.1'!R53","v":"Ralfie"}]
["RD 10",0,0,null,null,null,null,"RD 10",0,0,null,null,null,null,"RD 10",0,0,null,null,null,null,"RD 10",0,0,null,null,null,null,null,null,{"$f":"'Rd.1'!R54","v":"Siggi"}]
["RD 11",0,0,null,{"$f":"IF(AND(F6>=39,F6<=50),\"GUT\",\"\")","v":{"$error":"#DIV/0!"}},null,null,"RD 11",0,0,null,{"$f":"IF(AND(M6>=39,M6<=50),\"GUT\",\"\")","v":{"$error":"#DIV/0!"}},null,null,"RD 11",0,0,null,{"$f":"IF(AND(T6>=39,T6<=50),\"GUT\",\"\")","v":{"$error":"#DIV/0!"}},null,null,"RD 11",0,0,null,{"$f":"IF(AND(AA6>=39,AA6<=50),\"GUT\",\"\")","v":{"$error":"#DIV/0!"}},null,null,null,null,{"$f":"'Rd.1'!R55","v":"Kerstin"}]
["RD 12",0,0,null,null,null,null,"RD 12",0,0,null,null,null,null,"RD 12",0,0,null,null,null,null,"RD 12",0,0]
["RD 13",0,0,null,null,null,null,"RD 13",0,0,null,null,null,null,"RD 13",0,0,null,null,null,null,"RD 13",0,0]
["RD 14",0,0,null,null,null,null,"RD 14",0,0,null,null,null,null,"RD 14",0,0,null,null,null,null,"RD 14",0,0]
["RD 15",0,0,null,null,null,null,"RD 15",0,0,null,null,null,null,"RD 15",0,0,null,null,null,null,"RD 15",0,0]
["RD 16",0,0,null,{"$f":"IF(F6>49,\"Sehr Gut\",\"\")","v":{"$error":"#DIV/0!"}},null,null,"RD 16",0,0,null,{"$f":"IF(M6>49,\"Sehr Gut\",\"\")","v":{"$error":"#DIV/0!"}},null,null,"RD 16",0,0,null,{"$f":"IF(T6>49,\"Sehr Gut\",\"\")","v":{"$error":"#DIV/0!"}},null,null,"RD 16",0,0,null,{"$f":"IF(AA6>49,\"Sehr Gut\",\"\")","v":{"$error":"#DIV/0!"}}]
["RD 17",0,0,null,null,null,null,"RD 17",0,0,null,null,null,null,"RD 17",0,0,null,null,null,null,"RD 17",0,0]
["RD 18",0,0,null,null,null,null,"RD 18",0,0,null,null,null,null,"RD 18",0,0,null,null,null,null,"RD 18",0,0]
["RD 19",0,0,null,null,null,null,"RD 19",0,0,null,null,null,null,"RD 19",0,0,null,null,null,null,"RD 19",0,0]
["RD 20",0,0,null,null,null,null,"RD 20",0,0,null,null,null,null,"RD 20",0,0,null,null,null,null,"RD 20",0,0]
["RD 21",0,0,null,"Rest:",{"$f":"E4","v":501},null,"RD 21",0,0,null,"Rest:",{"$f":"L4","v":501},null,"RD 21",0,0,null,"Rest:",{"$f":"S4","v":501},null,"RD 21",0,0,null,"Rest:",{"$f":"Z4","v":501}]
["RD 22",0,0,null,{"$f":"D1","v":"Ralfie"},null,null,"RD 22",0,0,null,{"$f":"K1","v":"Christian"},null,null,"RD 22",0,0,null,{"$f":"R1","v":"Siggi"},null,null,"RD 22",0,0,null,{"$f":"Y1","v":"Kerstin"}]
["RD 23",0,0,null,null,null,null,"RD 23",0,0,null,null,null,null,"RD 23",0,0,null,null,null,null,"RD 23",0,0]
["RD 24",0,0,null,{"$f":"IF(S4<L4+Z4,\"Darf\",IF(S4>L4+Z4,\"Darf nicht\",IF(S4=L4+Z4,\"Darf\"\"\")))","v":"Darf"},null,null,"RD 24",0,0,null,{"$f":"IF(Z4<E4+S4,\"Darf\",IF(Z4>E4+S4,\"Darf nicht\",IF(Z4=E4+S4,\"Darf\"\"\")))","v":"Darf"},null,null,"RD 24",0,0,null,{"$f":"IF(E4<L4+Z4,\"Darf\",IF(E4>L4+Z4,\"Darf nicht\",IF(E4=L4+Z4,\"Darf\"\"\")))","v":"Darf"},null,null,"RD 24",0,0,null,{"$f":"IF(L4<E4+S4,\"Darf\",IF(L4>E4+S4,\"Darf nicht\",IF(L4=E4+S4,\"Darf\"\"\")))","v":"Darf"}]
["RD 25",0,0,null,null,null,null,"RD 25",0,0,null,null,null,null,"RD 25",0,0,null,null,null,null,"RD 25",0,0]
["RD 26",0,0,null,null,null,null,"RD 26",0,0,null,null,null,null,"RD 26",0,0,null,null,null,null,"RD 26",0,0]
["RD 27",0,0,null,null,null,null,"RD 27",0,0,null,null,null,null,"RD 27",0,0,null,null,null,null,"RD 27",0,0]
["RD 28",0,0,null,null,null,null,"RD 28",0,0,null,null,null,null,"RD 28",0,0,null,null,null,null,"RD 28",0,0]
["RD 29",0,0,null,{"$f":"IF(E4=0,\"Sieg\",\"\")","v":""},null,null,"RD 29",0,0,null,{"$f":"IF(L4=0,\"Sieg\",\"\")","v":""},null,null,"RD 29",0,0,null,{"$f":"IF(S4=0,\"Sieg\",\"\")","v":""},null,null,"RD 29",0,0,null,{"$f":"IF(Z4=0,\"Sieg\",\"\")","v":""}]
["RD 30",0,0,null,null,null,null,"RD 30",0,0,null,null,null,null,"RD 30",0,0,null,null,null,null,"RD 30",0,0]
[null,{"$f":"SUM(B4:B33)","v":0},{"$f":"SUM(C4:C33)","v":0},{"$f":"SUM(D4:D33)","v":0},{"$f":"SUM(D4:D32)","v":0},null,null,null,{"$f":"SUM(I4:I33)","v":0},{"$f":"SUM(J4:J33)","v":0},{"$f":"SUM(K4:K33)","v":0},{"$f":"SUM(K4:K32)","v":0},null,null,null,{"$f":"SUM(P4:P33)","v":0},{"$f":"SUM(Q4:Q33)","v":0},{"$f":"SUM(R4:R33)","v":0},{"$f":"SUM(R4:R32)","v":0},null,null,null,{"$f":"SUM(W4:W33)","v":0},{"$f":"SUM(X4:X33)","v":0},{"$f":"SUM(Y4:Y33)","v":0},{"$f":"SUM(Y4:Y32)","v":0}]
[null,null,null,{"$f":"D1","v":"Ralfie"},null,{"$f":"SUM(E3)","v":0},null,null,null,null,{"$f":"INDEX(D35:D38,MATCH(LARGE(F35:F38,1),F35:F38,0))","v":"Ralfie"}]
[null,null,null,{"$f":"K1","v":"Christian"},null,{"$f":"SUM(L3)","v":0},null,null,null,null,{"$f":"INDEX(D35:D38,MATCH(LARGE(F35:F38,2),F35:F38,0))","v":"Ralfie"}]
[null,null,null,{"$f":"R1","v":"Siggi"},null,{"$f":"SUM(S3)","v":0},null,null,null,null,{"$f":"INDEX(D35:D38,MATCH(LARGE(F35:F38,3),F35:F38,0))","v":"Ralfie"}]
[null,null,null,{"$f":"Y1","v":"Kerstin"},null,{"$f":"SUM(Z3)","v":0},null,null,null,null,{"$f":"INDEX(D35:D38,MATCH(LARGE(F35:F38,4),F35:F38,0))","v":"Ralfie"}]
[null,null,null,"MAX(B2:B7",null,{"$f":"SUM(F35:F38)","v":0},null,null,null,null,null,null,null,null,null,null,null,null,null,null,null,null,null,null,null,null,null,null,null,null,"Ralf Kl."]
[null,null,null,null,null,null,null,null,null,null,null,null,null,null,null,null,null,null,null,null,null,null,null,null,null,null,null,null,null,null,"Volker"]
[null,null,null,null,null,null,null,null,null,null,null,null,null,null,null,null,null,null,null,null,null,null,null,null,null,null,null,null,null,null,"Rene"]
[null,null,null,null,1002,null,null,null,null,null,null,1002,null,null,null,null,null,null,null,null,null,null,null,null,null,null,{"$f":"RAND()","v":0.49665683720225118},null,null,null,"Nicole"]
[null,null,null,{"$f":"D1","v":"Ralfie"},{"$f":"SUM(D13:D33)","v":0},null,null,null,null,null,{"$f":"K1","v":"Christian"},{"$f":"SUM(K13:K33)","v":0},null,null,{"$f":"D1","v":"Ralfie"},null,null,{"$f":"SUM(E46)","v":1002},null,{"$f":"INDEX(O43:O46,MATCH(LARGE(R43:R46,ROW(AE4)),R43:R46,0))","v":"Christian"},null,null,null,null,null,{"$f":"'Rd.2'!Z43","v":"Ralfie"},{"$f":"RAND()","v":0.84995439965277797},null,null,null,"Frank"]
[null,null,null,{"$f":"R1","v":"Siggi"},{"$f":"SUM(R13:R33)","v":0},null,null,null,null,null,{"$f":"Y1","v":"Kerstin"},{"$f":"SUM(Y13:Y33)","v":0},null,null,{"$f":"R1","v":"Siggi"},null,null,{"$f":"SUM(E46)+0.1","v":1002.1},null,{"$f":"INDEX(O43:O46,MATCH(LARGE(R43:R46,ROW(AE3)),R43:R46,0))","v":"Kerstin"},null,null,null,null,null,{"$f":"'Rd.2'!Z44","v":"Siggi"},{"$f":"RAND()","v":0.53752463505989967},null,null,null,"Rosi"]
[null,null,null,null,{"$f":"SUM(E43:E44)","v":0},null,null,null,null,null,null,{"$f":"SUM(L43:L44)","v":0},null,null,{"$f":"K1","v":"Christian"},null,null,{"$f":"L46/2","v":501},null,{"$f":"INDEX(O43:O46,MATCH(LARGE(R43:R46,ROW(AE2)),R43:R46,0))","v":"Ralfie"},null,null,null,null,null,{"$f":"'Rd.2'!Z45","v":"Kerstin"},{"$f":"RAND()","v":0.35876630686191335},null,null,null,"Werner"]
[null,null,null,null,{"$f":"SUM(E42-E45)","v":1002},null,null,null,null,null,null,{"$f":"SUM(L42-L45)","v":1002},null,null,{"$f":"Y1","v":"Kerstin"},null,null,{"$f":"L46/2+0.1","v":501.1},null,{"$f":"INDEX(O43:O46,MATCH(LARGE(R43:R46,ROW(AE1)),R43:R46,0))","v":"Siggi"},null,null,null,null,null,{"$f":"'Rd.2'!Z46","v":"Christian"},{"$f":"RAND()","v":0.97161460941205013},null,null,null,"Gast"]
[null,null,null,null,null,null,null,null,null,null,null,null,null,null,null,null,null,null,null,null,null,null,null,null,null,null,null,null,null,null,"Joker"]
[null,null,null,null,null,null,null,null,null,null,null,null,null,null,null,null,null,null,null,null,null,null,null,null,null,null,null,null,null,null,"Anja"]
[null,null,null,null,null,null,null,null,null,null,null,null,null,null,null,null,null,null,null,null,null,null,null,null,null,null,null,null,null,null,"Vincent"]
[null,null,null,null,null,null,null,null,null,null,null,null,null,null,null,null,null,null,null,null,null,null,null,null,null,null,null,null,null,null,"Erich"]
[null,null,null,{"$f":"D43","v":"Ralfie"},{"$f":"E4","v":501},null,null,null,null,null,{"$f":"K43","v":"Christian"},{"$f":"L4","v":501},null,null,null,null,null,null,null,null,null,null,null,null,null,null,null,null,null,null,"Siggi"]
[null,null,null,{"$f":"D44","v":"Siggi"},{"$f":"S4","v":501},null,null,null,null,null,{"$f":"K44","v":"Kerstin"},{"$f":"Z4","v":501},null,null,null,null,null,null,null,null,null,null,null,null,null,null,null,null,null,null,"Ralf M."]
[null,null,null,null,{"$f":"SUM(E51:E52)","v":1002},null,null,null,null,null,null,{"$f":"SUM(L51:L52)","v":1002},null,null,null,null,null,null,null,null,null,null,null,null,null,null,null,null,null,null,"Dirk B."]
[null,null,null,null,null,null,null,null,null,null,null,null,null,null,null,null,null,null,null,null,null,null,null,null,null,null,null,null,null,null,"Stefan"]
[null,null,null,{"$f":"D51","v":"Ralfie"},{"$f":"E51","v":501},{"$f":"SUM(E57:E58)-E56","v":501},null,null,{"$f":"INDEX(E$55:E$58,MATCH(LARGE(F$55:F$58,1),F$55:F$58,0))","v":501},{"$f":"INDEX(F$55:F$58,MATCH(LARGE(G$55:G$58,1),G$55:G$58,0))","v":{"$error":"#NUM!"}},null,null,null,null,null,null,null,null,null,null,null,null,null,null,null,null,null,null,null,null,"Micha"]
[null,null,null,{"$f":"D52","v":"Siggi"},{"$f":"E52","v":501},{"$f":"SUM(E57:E58)-E55","v":501}]
[null,null,null,{"$f":"K51","v":"Christian"},{"$f":"L51","v":501},{"$f":"SUM(E55:E56)-E58","v":501}]
[null,null,null,{"$f":"K52","v":"Kerstin"},{"$f":"L52","v":501}]

{"sheet":"Rd.4","index":3,"n_rows":58,"n_cols":31,"rows_kept":58,"cut":false,"hidden":false,"merged":[[0,24,0,25],[7,4,7,5],[7,11,7,12],[7,18,7,19],[7,25,7,26],[0,3,0,4],[0,10,0,11],[0,17,0,18],[31,25,32,26],[26,4,30,5],[26,11,30,12],[26,18,30,19],[26,25,30,26],[24,25,25,26],[13,4,16,5],[17,4,17,5],[18,4,22,5],[13,11,16,12],[13,18,16,19],[17,18,17,19],[18,18,22,19],[13,25,16,26],[17,25,17,26],[18,25,22,26],[17,11,17,12],[18,11,22,12],[38,3,38,4],[8,11,9,12],[8,18,9,19],[24,4,25,5],[24,11,25,12],[24,18,25,19],[10,4,11,5],[12,4,12,5],[10,11,11,12],[12,11,12,12],[31,4,32,5],[31,11,32,12],[31,18,32,19],[10,18,11,19],[12,18,12,19],[10,30,10,31],[8,25,9,26],[8,4,9,5],[10,25,11,26],[12,25,12,26]]}
[null,null,null,{"$f":"'Rd.3'!AE4","v":"Ralfie"},null,"Sp.1",null,null,null,null,{"$f":"'Rd.3'!AE2","v":"Ralfie"},null,"Sp.2",null,null,null,null,{"$f":"'Rd.3'!AE3","v":"Ralfie"},null,"Sp.3",null,null,null,null,{"$f":"'Rd.3'!AE1","v":"Ralfie"},null,"Sp.4",null,null,null,{"$f":"K35","v":"Ralfie"}]
[null,null,null,"Punkte",501,"Start",null,null,null,null,"Punkte",501,"Start",null,null,null,null,"Punkte",501,"Start",null,null,null,null,"Punkte",501,"Start",null,null,null,{"$f":"K36","v":"Ralfie"}]
[null,null,null,"Geworfen",{"$f":"SUM(D34)","v":0},"Punkte",null,null,null,null,"Geworfen",{"$f":"SUM(K34)","v":0},"Punkte",null,null,null,null,"Geworfen",{"$f":"SUM(R34)","v":0},"Punkte",null,null,null,null,"Geworfen",{"$f":"SUM(Y34)","v":0},"Punkte",null,null,null,"Ralfie"]
["RD 1",{"$f":"COUNT(D4)*1","v":0},{"$f":"COUNT(D4)*3","v":0},null,{"$f":"SUM(E2-E3)","v":501},"Rest",null,"RD 1",{"$f":"COUNT(K4)*1","v":0},{"$f":"COUNT(K4)*3","v":0},null,{"$f":"SUM(L2-L3)","v":501},"Rest",null,"RD 1",{"$f":"COUNT(R4)*1","v":0},{"$f":"COUNT(R4)*3","v":0},null,{"$f":"SUM(S2-S3)","v":501},"Rest",null,"RD 1",{"$f":"COUNT(Y4)*1","v":0},{"$f":"COUNT(Y4)*3","v":0},null,{"$f":"SUM(Z2-Z3)","v":501},"Rest",null,null,null,"Ralfie"]
["RD 2",0,0,null,null,null,null,"RD 2",0,0,null,null,null,null,"RD 2",0,0,null,null,null,null,"RD 2",0,0]
["RD 3",0,0,null,"ø pro Spiel",{"$f":"SUM(E3)/B34","v":{"$error":"#DIV/0!"}},null,"RD 3",0,0,null,"ø pro Spiel",{"$f":"SUM(L3)/I34","v":{"$error":"#DIV/0!"}},null,"RD 3",0,0,null,"ø pro Spiel",{"$f":"SUM(S3)/P34","v":{"$error":"#DIV/0!"}},null,"RD 3",0,0,null,null,{"$f":"SUM(Z3)/W34","v":{"$error":"#DIV/0!"}}]
["RD 4",0,0,null,"ø pro Pfeil",{"$f":"SUM(E3)/C34","v":{"$error":"#DIV/0!"}},null,"RD 4",0,0,null,"ø pro Pfeil",{"$f":"SUM(L3)/J34","v":{"$error":"#DIV/0!"}},null,"RD 4",0,0,null,"ø pro Pfeil",{"$f":"SUM(S3)/Q34","v":{"$error":"#DIV/0!"}},null,"RD 4",0,0,null,"ø pro Pfeil",{"$f":"SUM(Z3)/X34","v":{"$error":"#DIV/0!"}}]
["RD 5",0,0,null,"Average",null,null,"RD 5",0,0,null,"Average",null,null,"RD 5",0,0,null,"Average",null,null,"RD 5",0,0,null,"Average"]
["RD 6",0,0,null,{"$f":"SUM(F6)","v":{"$error":"#DIV/0!"}},null,null,"RD 6",0,0,null,{"$f":"SUM(M6)","v":{"$error":"#DIV/0!"}},null,null,"RD 6",0,0,null,{"$f":"SUM(T6)","v":{"$error":"#DIV/0!"}},null,null,"RD 6",0,0,null,{"$f":"SUM(AA6)","v":{"$error":"#DIV/0!"}}]
["RD 7",0,0,null,null,null,null,"RD 7",0,0,null,null,null,null,"RD 7",0,0,null,null,null,null,"RD 7",0,0]
["RD 8",0,0,null,{"$f":"IF(F6<40,\"Nicht Gut\",\"\")","v":{"$error":"#DIV/0!"}},null,null,"RD 8",0,0,null,{"$f":"IF(M6<40,\"Nicht Gut\",\"\")","v":{"$error":"#DIV/0!"}},null,null,"RD 8",0,0,null,{"$f":"IF(T6<40,\"Nicht Gut\",\"\")","v":{"$error":"#DIV/0!"}},null,null,"RD 8",0,0,null,{"$f":"IF(AA6<40,\"Nicht Gut\",\"\")","v":{"$error":"#DIV/0!"}},null,null,null,null,"Neu nach 3. Sp."]
["RD 9",0,0,null,null,null,null,"RD 9",0,0,null,null,null,null,"RD 9",0,0,null,null,null,null,"RD 9",0,0,null,null,null,null,null,null,{"$f":"'Rd.1'!R52","v":"Christian"}]
["RD 10",0,0,null,null,null,null,"RD 10",0,0,null,null,null,null,"RD 10",0,0,null,null,null,null,"RD 10",0,0,null,null,null,null,null,null,{"$f":"'Rd.1'!R53","v":"Ralfie"}]
["RD 11",0,0,null,{"$f":"IF(AND(F6>=39,F6<=50),\"GUT\",\"\")","v":{"$error":"#DIV/0!"}},null,null,"RD 11",0,0,null,{"$f":"IF(AND(M6>=39,M6<=50),\"GUT\",\"\")","v":{"$error":"#DIV/0!"}},null,null,"RD 11",0,0,null,{"$f":"IF(AND(T6>=39,T6<=50),\"GUT\",\"\")","v":{"$error":"#DIV/0!"}},null,null,"RD 11",0,0,null,{"$f":"IF(AND(AA6>=39,AA6<=50),\"GUT\",\"\")","v":{"$error":"#DIV/0!"}},null,null,null,null,{"$f":"'Rd.1'!R54","v":"Siggi"}]
["RD 12",0,0,null,null,null,null,"RD 12",0,0,null,null,null,null,"RD 12",0,0,null,null,null,null,"RD 12",0,0,null,null,null,null,null,null,{"$f":"'Rd.1'!R55","v":"Kerstin"}]
["RD 13",0,0,null,null,null,null,"RD 13",0,0,null,null,null,null,"RD 13",0,0,null,null,null,null,"RD 13",0,0]
["RD 14",0,0,null,null,null,null,"RD 14",0,0,null,null,null,null,"RD 14",0,0,null,null,null,null,"RD 14",0,0]
["RD 15",0,0,null,null,null,null,"RD 15",0,0,null,null,null,null,"RD 15",0,0,null,null,null,null,"RD 15",0,0]
["RD 16",0,0,null,{"$f":"IF(F6>49,\"Sehr Gut\",\"\")","v":{"$error":"#DIV/0!"}},null,null,"RD 16",0,0,null,{"$f":"IF(M6>49,\"Sehr Gut\",\"\")","v":{"$error":"#DIV/0!"}},null,null,"RD 16",0,0,null,{"$f":"IF(T6>49,\"Sehr Gut\",\"\")","v":{"$error":"#DIV/0!"}},null,null,"RD 16",0,0,null,{"$f":"IF(AA6>49,\"Sehr Gut\",\"\")","v":{"$error":"#DIV/0!"}}]
["RD 17",0,0,null,null,null,null,"RD 17",0,0,null,null,null,null,"RD 17",0,0,null,null,null,null,"RD 17",0,0]
["RD 18",0,0,null,null,null,null,"RD 18",0,0,null,null,null,null,"RD 18",0,0,null,null,null,null,"RD 18",0,0]
["RD 19",0,0,null,null,null,null,"RD 19",0,0,null,null,null,null,"RD 19",0,0,null,null,null,null,"RD 19",0,0]
["RD 20",0,0,null,null,null,null,"RD 20",0,0,null,null,null,null,"RD 20",0,0,null,null,null,null,"RD 20",0,0]
["RD 21",0,0,null,"Rest:",{"$f":"E4","v":501},null,"RD 21",0,0,null,"Rest:",{"$f":"L4","v":501},null,"RD 21",0,0,null,"Rest:",{"$f":"S4","v":501},null,"RD 21",0,0,null,"Rest:",{"$f":"Z4","v":501}]
["RD 22",0,0,null,{"$f":"D1","v":"Ralfie"},null,null,"RD 22",0,0,null,{"$f":"K1","v":"Ralfie"},null,null,"RD 22",0,0,null,{"$f":"R1","v":"Ralfie"},null,null,"RD 22",0,0,null,{"$f":"Y1","v":"Ralfie"}]
["RD 23",0,0,null,null,null,null,"RD 23",0,0,null,null,null,null,"RD 23",0,0,null,null,null,null,"RD 23",0,0]
["RD 24",0,0,null,{"$f":"IF(S4<L4+Z4,\"Darf\",IF(S4>L4+Z4,\"Darf nicht\",IF(S4=L4+Z4,\"Darf\"\"\")))","v":"Darf"},null,null,"RD 24",0,0,null,{"$f":"IF(Z4<E4+S4,\"Darf\",IF(Z4>E4+S4,\"Darf nicht\",IF(Z4=E4+S4,\"Darf\"\"\")))","v":"Darf"},null,null,"RD 24",0,0,null,{"$f":"IF(E4<L4+Z4,\"Darf\",IF(E4>L4+Z4,\"Darf nicht\",IF(E4=L4+Z4,\"Darf\"\"\")))","v":"Darf"},null,null,"RD 24",0,0,null,{"$f":"IF(L4<E4+S4,\"Darf\",IF(L4>E4+S4,\"Darf nicht\",IF(L4=E4+S4,\"Darf\"\"\")))","v":"Darf"}]
["RD 25",0,0,null,null,null,null,"RD 25",0,0,null,null,null,null,"RD 25",0,0,null,null,null,null,"RD 25",0,0]
["RD 26",0,0,null,null,null,null,"RD 26",0,0,null,null,null,null,"RD 26",0,0,null,null,null,null,"RD 26",0,0]
["RD 27",0,0,null,null,null,null,"RD 27",0,0,null,null,null,null,"RD 27",0,0,null,null,null,null,"RD 27",0,0]
["RD 28",0,0,null,null,null,null,"RD 28",0,0,null,null,null,null,"RD 28",0,0,null,null,null,null,"RD 28",0,0]
["RD 29",0,0,null,{"$f":"IF(E4=0,\"Sieg\",\"\")","v":""},null,null,"RD 29",0,0,null,{"$f":"IF(L4=0,\"Sieg\",\"\")","v":""},null,null,"RD 29",0,0,null,{"$f":"IF(S4=0,\"Sieg\",\"\")","v":""},null,null,"RD 29",0,0,null,{"$f":"IF(Z4=0,\"Sieg\",\"\")","v":""}]
["RD 30",0,0,null,null,null,null,"RD 30",0,0,null,null,null,null,"RD 30",0,0,null,null,null,null,"RD 30",0,0]
[null,{"$f":"SUM(B4:B33)","v":0},{"$f":"SUM(C4:C33)","v":0},{"$f":"SUM(D4:D33)","v":0},{"$f":"SUM(D4:D32)","v":0},null,null,null,{"$f":"SUM(I4:I33)","v":0},{"$f":"SUM(J4:J33)","v":0},{"$f":"SUM(K4:K33)","v":0},{"$f":"SUM(K4:K32)","v":0},null,null,null,{"$f":"SUM(P4:P33)","v":0},{"$f":"SUM(Q4:Q33)","v":0},{"$f":"SUM(R4:R33)","v":0},{"$f":"SUM(R4:R32)","v":0},null,null,null,{"$f":"SUM(W4:W33)","v":0},{"$f":"SUM(X4:X33)","v":0},{"$f":"SUM(Y4:Y33)","v":0},{"$f":"SUM(Y4:Y32)","v":0}]
[null,null,null,{"$f":"D1","v":"Ralfie"},null,{"$f":"SUM(E3)","v":0},null,null,null,null,{"$f":"INDEX(D35:D38,MATCH(LARGE(F35:F38,1),F35:F38,0))","v":"Ralfie"}]
[null,null,null,{"$f":"K1","v":"Ralfie"},null,{"$f":"SUM(L3)","v":0},null,null,null,null,{"$f":"INDEX(D35:D38,MATCH(LARGE(F35:F38,2),F35:F38,0))","v":"Ralfie"}]
[null,null,null,{"$f":"R1","v":"Ralfie"},null,{"$f":"SUM(S3)","v":0},null,null,null,null,{"$f":"INDEX(D35:D38,MATCH(LARGE(F35:F38,3),F35:F38,0))","v":"Ralfie"}]
[null,null,null,{"$f":"Y1","v":"Ralfie"},null,{"$f":"SUM(Z3)","v":0},null,null,null,null,{"$f":"INDEX(D35:D38,MATCH(LARGE(F35:F38,4),F35:F38,0))","v":"Ralfie"}]
[null,null,null,"MAX(B2:B7",null,{"$f":"SUM(F35:F38)","v":0},null,null,null,null,null,null,null,null,null,null,null,null,null,null,null,null,null,null,null,null,null,null,null,null,"Ralf Kl."]
[null,null,null,null,null,null,null,null,null,null,null,null,null,null,null,null,null,null,null,null,null,null,null,null,null,null,null,null,null,null,"Volker"]
[null,null,null,null,null,null,null,null,null,null,null,null,null,null,null,null,null,null,null,null,null,null,null,null,null,null,null,null,null,null,"Rene"]
[null,null,null,null,1002,null,null,null,null,null,null,1002,null,null,null,null,null,null,null,null,null,null,null,null,null,null,{"$f":"RAND()","v":0.86536257194517963},null,null,null,"Nicole"]
[null,null,null,{"$f":"D1","v":"Ralfie"},{"$f":"SUM(D13:D33)","v":0},null,null,null,null,null,{"$f":"K1","v":"Ralfie"},{"$f":"SUM(K13:K33)","v":0},null,null,{"$f":"D1","v":"Ralfie"},null,null,{"$f":"SUM(E46)","v":1002},null,{"$f":"INDEX(O43:O46,MATCH(LARGE(R43:R46,ROW(AE4)),R43:R46,0))","v":"Ralfie"},null,null,null,null,null,{"$f":"'Rd.3'!Z43","v":"Ralfie"},{"$f":"RAND()","v":0.86893492291145435},null,null,null,"Frank"]
[null,null,null,{"$f":"R1","v":"Ralfie"},{"$f":"SUM(R13:R33)","v":0},null,null,null,null,null,{"$f":"Y1","v":"Ralfie"},{"$f":"SUM(Y13:Y33)","v":0},null,null,{"$f":"R1","v":"Ralfie"},null,null,{"$f":"SUM(E46)+0.1","v":1002.1},null,{"$f":"INDEX(O43:O46,MATCH(LARGE(R43:R46,ROW(AE3)),R43:R46,0))","v":"Ralfie"},null,null,null,null,null,{"$f":"'Rd.3'!Z44","v":"Siggi"},{"$f":"RAND()","v":0.81787659455031092},null,null,null,"Rosi"]
[null,null,null,null,{"$f":"SUM(E43:E44)","v":0},null,null,null,null,null,null,{"$f":"SUM(L43:L44)","v":0},null,null,{"$f":"K1","v":"Ralfie"},null,null,{"$f":"L46/2","v":501},null,{"$f":"INDEX(O43:O46,MATCH(LARGE(R43:R46,ROW(AE2)),R43:R46,0))","v":"Ralfie"},null,null,null,null,null,{"$f":"'Rd.3'!Z45","v":"Kerstin"},{"$f":"RAND()","v":0.30624476120945909},null,null,null,"Werner"]
[null,null,null,null,{"$f":"SUM(E42-E45)","v":1002},null,null,null,null,null,null,{"$f":"SUM(L42-L45)","v":1002},null,null,{"$f":"Y1","v":"Ralfie"},null,null,{"$f":"L46/2+0.1","v":501.1},null,{"$f":"INDEX(O43:O46,MATCH(LARGE(R43:R46,ROW(AE1)),R43:R46,0))","v":"Ralfie"},null,null,null,null,null,{"$f":"'Rd.3'!Z46","v":"Christian"},{"$f":"RAND()","v":0.81180052618412479},null,null,null,"Gast"]
[null,null,null,null,null,null,null,null,null,null,null,null,null,null,null,null,null,null,null,null,null,null,null,null,null,null,null,null,null,null,"Joker"]
[null,null,null,null,null,null,null,null,null,null,null,null,null,null,null,null,null,null,null,null,null,null,null,null,null,null,null,null,null,null,"Anja"]
[null,null,null,null,null,null,null,null,null,null,null,null,null,null,null,null,null,null,null,null,null,null,null,null,null,null,null,null,null,null,"Vincent"]
[null,null,null,null,null,null,null,null,null,null,null,null,null,null,null,null,null,null,null,null,null,null,null,null,null,null,null,null,null,null,"Erich"]
[null,null,null,{"$f":"D43","v":"Ralfie"},{"$f":"E4","v":501},null,null,null,null,null,{"$f":"K43","v":"Ralfie"},{"$f":"L4","v":501},null,null,null,null,null,null,null,null,null,null,null,null,null,null,null,null,null,null,"Siggi"]
[null,null,null,{"$f":"D44","v":"Ralfie"},{"$f":"S4","v":501},null,null,null,null,null,{"$f":"K44","v":"Ralfie"},{"$f":"Z4","v":501},null,null,null,null,null,null,null,null,null,null,null,null,null,null,null,null,null,null,"Ralf M."]
[null,null,null,null,{"$f":"SUM(E51:E52)","v":1002},null,null,null,null,null,null,{"$f":"SUM(L51:L52)","v":1002},null,null,null,null,null,null,null,null,null,null,null,null,null,null,null,null,null,null,"Dirk B."]
[null,null,null,null,null,null,null,null,null,null,null,null,null,null,null,null,null,null,null,null,null,null,null,null,null,null,null,null,null,null,"Stefan"]
[null,null,null,{"$f":"D51","v":"Ralfie"},{"$f":"E51","v":501},{"$f":"SUM(E57:E58)-E56","v":501},null,null,{"$f":"INDEX(E$55:E$58,MATCH(LARGE(F$55:F$58,1),F$55:F$58,0))","v":501},{"$f":"INDEX(F$55:F$58,MATCH(LARGE(G$55:G$58,1),G$55:G$58,0))","v":{"$error":"#NUM!"}},null,null,null,null,null,null,null,null,null,null,null,null,null,null,null,null,null,null,null,null,"Micha"]
[null,null,null,{"$f":"D52","v":"Ralfie"},{"$f":"E52","v":501},{"$f":"SUM(E57:E58)-E55","v":501}]
[null,null,null,{"$f":"K51","v":"Ralfie"},{"$f":"L51","v":501},{"$f":"SUM(E55:E56)-E58","v":501}]
[null,null,null,{"$f":"K52","v":"Ralfie"},{"$f":"L52","v":501}]

{"sheet":"Rd.5","index":4,"n_rows":58,"n_cols":31,"rows_kept":58,"cut":false,"hidden":false,"merged":[[0,24,0,25],[7,4,7,5],[7,11,7,12],[7,18,7,19],[7,25,7,26],[0,3,0,4],[0,10,0,11],[0,17,0,18],[31,25,32,26],[26,4,30,5],[26,11,30,12],[26,18,30,19],[26,25,30,26],[24,25,25,26],[13,4,16,5],[17,4,17,5],[18,4,22,5],[13,11,16,12],[17,25,17,26],[18,25,22,26],[17,11,17,12],[18,11,22,12],[13,18,16,19],[17,18,17,19],[18,18,22,19],[38,3,38,4],[8,11,9,12],[8,18,9,19],[24,4,25,5],[24,11,25,12],[24,18,25,19],[10,4,11,5],[12,4,12,5],[10,11,11,12],[12,11,12,12],[31,4,32,5],[31,11,32,12],[31,18,32,19],[10,18,11,19],[12,18,12,19],[8,25,9,26],[13,25,16,26],[8,4,9,5],[10,25,11,26],[12,25,12,26]]}
[null,null,null,{"$f":"'Rd.1'!AH46","v":"Siggi"},null,"Sp.1",null,null,null,null,{"$f":"'Rd.1'!AI46","v":"Ralfie"},null,"Sp.2",null,null,null,null,{"$f":"'Rd.1'!AH48","v":"Kerstin"},null,"Sp.3",null,null,null,null,{"$f":"'Rd.1'!AI48","v":"Christian"},null,"Sp.4",null,null,null,{"$f":"K35","v":"Siggi"}]
[null,null,null,"Punkte",501,"Start",null,null,null,null,"Punkte",501,"Start",null,null,null,null,"Punkte",501,"Start",null,null,null,null,"Punkte",501,"Start",null,null,null,{"$f":"K36","v":"Siggi"}]
[null,null,null,"Geworfen",{"$f":"SUM(D34)","v":0},"Punkte",null,null,null,null,"Geworfen",{"$f":"SUM(K34)","v":0},"Punkte",null,null,null,null,"Geworfen",{"$f":"SUM(R34)","v":0},"Punkte",null,null,null,null,"Geworfen",{"$f":"SUM(Y34)","v":0},"Punkte",null,null,null,"Siggi"]
["RD 1",{"$f":"COUNT(D4)*1","v":0},{"$f":"COUNT(D4)*3","v":0},null,{"$f":"SUM(E2-E3)","v":501},"Rest",null,"RD 1",{"$f":"COUNT(K4)*1","v":0},{"$f":"COUNT(K4)*3","v":0},null,{"$f":"SUM(L2-L3)","v":501},"Rest",null,"RD 1",{"$f":"COUNT(R4)*1","v":0},{"$f":"COUNT(R4)*3","v":0},null,{"$f":"SUM(S2-S3)","v":501},"Rest",null,"RD 1",{"$f":"COUNT(Y4)*1","v":0},{"$f":"COUNT(Y4)*3","v":0},null,{"$f":"SUM(Z2-Z3)","v":501},"Rest",null,null,null,"Siggi"]
["RD 2",0,0,null,null,null,null,"RD 2",0,0,null,null,null,null,"RD 2",0,0,null,null,null,null,"RD 2",0,0]
["RD 3",0,0,null,"ø pro Spiel",{"$f":"SUM(E3)/B34","v":{"$error":"#DIV/0!"}},null,"RD 3",0,0,null,"ø pro Spiel",{"$f":"SUM(L3)/I34","v":{"$error":"#DIV/0!"}},null,"RD 3",0,0,null,"ø pro Spiel",{"$f":"SUM(S3)/P34","v":{"$error":"#DIV/0!"}},null,"RD 3",0,0,null,null,{"$f":"SUM(Z3)/W34","v":{"$error":"#DIV/0!"}}]
["RD 4",0,0,null,"ø pro Pfeil",{"$f":"SUM(E3)/C34","v":{"$error":"#DIV/0!"}},null,"RD 4",0,0,null,"ø pro Pfeil",{"$f":"SUM(L3)/J34","v":{"$error":"#DIV/0!"}},null,"RD 4",0,0,null,"ø pro Pfeil",{"$f":"SUM(S3)/Q34","v":{"$error":"#DIV/0!"}},null,"RD 4",0,0,null,"ø pro Pfeil",{"$f":"SUM(Z3)/X34","v":{"$error":"#DIV/0!"}}]
["RD 5",0,0,null,"Average",null,null,"RD 5",0,0,null,"Average",null,null,"RD 5",0,0,null,"Average",null,null,"RD 5",0,0,null,"Average"]
["RD 6",0,0,null,{"$f":"SUM(F6)","v":{"$error":"#DIV/0!"}},null,null,"RD 6",0,0,null,{"$f":"SUM(M6)","v":{"$error":"#DIV/0!"}},null,null,"RD 6",0,0,null,{"$f":"SUM(T6)","v":{"$error":"#DIV/0!"}},null,null,"RD 6",0,0,null,{"$f":"SUM(AA6)","v":{"$error":"#DIV/0!"}}]
["RD 7",0,0,null,null,null,null,"RD 7",0,0,null,null,null,null,"RD 7",0,0,null,null,null,null,"RD 7",0,0]
["RD 8",0,0,null,{"$f":"IF(F6<40,\"Nicht Gut\",\"\")","v":{"$error":"#DIV/0!"}},null,null,"RD 8",0,0,null,{"$f":"IF(M6<40,\"Nicht Gut\",\"\")","v":{"$error":"#DIV/0!"}},null,null,"RD 8",0,0,null,{"$f":"IF(T6<40,\"Nicht Gut\",\"\")","v":{"$error":"#DIV/0!"}},null,null,"RD 8",0,0,null,{"$f":"IF(AA6<40,\"Nicht Gut\",\"\")","v":{"$error":"#DIV/0!"}}]
["RD 9",0,0,null,null,null,null,"RD 9",0,0,null,null,null,null,"RD 9",0,0,null,null,null,null,"RD 9",0,0,null,null,null,null,null,null,{"$f":"'Rd.1'!S52","v":"Kerstin"}]
["RD 10",0,0,null,null,null,null,"RD 10",0,0,null,null,null,null,"RD 10",0,0,null,null,null,null,"RD 10",0,0,null,null,null,null,null,null,{"$f":"'Rd.1'!S53","v":"Ralfie"}]
["RD 11",0,0,null,{"$f":"IF(AND(F6>=39,F6<=50),\"GUT\",\"\")","v":{"$error":"#DIV/0!"}},null,null,"RD 11",0,0,null,{"$f":"IF(AND(M6>=39,M6<=50),\"GUT\",\"\")","v":{"$error":"#DIV/0!"}},null,null,"RD 11",0,0,null,{"$f":"IF(AND(T6>=39,T6<=50),\"GUT\",\"\")","v":{"$error":"#DIV/0!"}},null,null,"RD 11",0,0,null,{"$f":"IF(AND(AA6>=39,AA6<=50),\"GUT\",\"\")","v":{"$error":"#DIV/0!"}},null,null,null,null,{"$f":"'Rd.1'!S54","v":"Christian"}]
["RD 12",0,0,null,null,null,null,"RD 12",0,0,null,null,null,null,"RD 12",0,0,null,null,null,null,"RD 12",0,0,null,null,null,null,null,null,{"$f":"'Rd.1'!S55","v":"Siggi"}]
["RD 13",0,0,null,null,null,null,"RD 13",0,0,null,null,null,null,"RD 13",0,0,null,null,null,null,"RD 13",0,0]
["RD 14",0,0,null,null,null,null,"RD 14",0,0,null,null,null,null,"RD 14",0,0,null,null,null,null,"RD 14",0,0]
["RD 15",0,0,null,null,null,null,"RD 15",0,0,null,null,null,null,"RD 15",0,0,null,null,null,null,"RD 15",0,0]
["RD 16",0,0,null,{"$f":"IF(F6>49,\"Sehr Gut\",\"\")","v":{"$error":"#DIV/0!"}},null,null,"RD 16",0,0,null,{"$f":"IF(M6>49,\"Sehr Gut\",\"\")","v":{"$error":"#DIV/0!"}},null,null,"RD 16",0,0,null,{"$f":"IF(T6>49,\"Sehr Gut\",\"\")","v":{"$error":"#DIV/0!"}},null,null,"RD 16",0,0,null,{"$f":"IF(AA6>49,\"Sehr Gut\",\"\")","v":{"$error":"#DIV/0!"}}]
["RD 17",0,0,null,null,null,null,"RD 17",0,0,null,null,null,null,"RD 17",0,0,null,null,null,null,"RD 17",0,0]
["RD 18",0,0,null,null,null,null,"RD 18",0,0,null,null,null,null,"RD 18",0,0,null,null,null,null,"RD 18",0,0]
["RD 19",0,0,null,null,null,null,"RD 19",0,0,null,null,null,null,"RD 19",0,0,null,null,null,null,"RD 19",0,0]
["RD 20",0,0,null,null,null,null,"RD 20",0,0,null,null,null,null,"RD 20",0,0,null,null,null,null,"RD 20",0,0]
["RD 21",0,0,null,"Rest:",{"$f":"E4","v":501},null,"RD 21",0,0,null,"Rest:",{"$f":"L4","v":501},null,"RD 21",0,0,null,"Rest:",{"$f":"S4","v":501},null,"RD 21",0,0,null,"Rest:",{"$f":"Z4","v":501}]
["RD 22",0,0,null,{"$f":"D1","v":"Siggi"},null,null,"RD 22",0,0,null,{"$f":"K1","v":"Ralfie"},null,null,"RD 22",0,0,null,{"$f":"R1","v":"Kerstin"},null,null,"RD 22",0,0,null,{"$f":"Y1","v":"Christian"}]
["RD 23",0,0,null,null,null,null,"RD 23",0,0,null,null,null,null,"RD 23",0,0,null,null,null,null,"RD 23",0,0]
["RD 24",0,0,null,{"$f":"IF(S4<L4+Z4,\"Darf\",IF(S4>L4+Z4,\"Darf nicht\",IF(S4=L4+Z4,\"Darf\"\"\")))","v":"Darf"},null,null,"RD 24",0,0,null,{"$f":"IF(Z4<E4+S4,\"Darf\",IF(Z4>E4+S4,\"Darf nicht\",IF(Z4=E4+S4,\"Darf\"\"\")))","v":"Darf"},null,null,"RD 24",0,0,null,{"$f":"IF(E4<L4+Z4,\"Darf\",IF(E4>L4+Z4,\"Darf nicht\",IF(E4=L4+Z4,\"Darf\"\"\")))","v":"Darf"},null,null,"RD 24",0,0,null,{"$f":"IF(L4<E4+S4,\"Darf\",IF(L4>E4+S4,\"Darf nicht\",IF(L4=E4+S4,\"Darf\"\"\")))","v":"Darf"}]
["RD 25",0,0,null,null,null,null,"RD 25",0,0,null,null,null,null,"RD 25",0,0,null,null,null,null,"RD 25",0,0]
["RD 26",0,0,null,null,null,null,"RD 26",0,0,null,null,null,null,"RD 26",0,0,null,null,null,null,"RD 26",0,0]
["RD 27",0,0,null,null,null,null,"RD 27",0,0,null,null,null,null,"RD 27",0,0,null,null,null,null,"RD 27",0,0]
["RD 28",0,0,null,null,null,null,"RD 28",0,0,null,null,null,null,"RD 28",0,0,null,null,null,null,"RD 28",0,0]
["RD 29",0,0,null,{"$f":"IF(E4=0,\"Sieg\",\"\")","v":""},null,null,"RD 29",0,0,null,{"$f":"IF(L4=0,\"Sieg\",\"\")","v":""},null,null,"RD 29",0,0,null,{"$f":"IF(S4=0,\"Sieg\",\"\")","v":""},null,null,"RD 29",0,0,null,{"$f":"IF(Z4=0,\"Sieg\",\"\")","v":""}]
["RD 30",0,0,null,null,null,null,"RD 30",0,0,null,null,null,null,"RD 30",0,0,null,null,null,null,"RD 30",0,0]
[null,{"$f":"SUM(B4:B33)","v":0},{"$f":"SUM(C4:C33)","v":0},{"$f":"SUM(D4:D33)","v":0},{"$f":"SUM(D4:D32)","v":0},null,null,null,{"$f":"SUM(I4:I33)","v":0},{"$f":"SUM(J4:J33)","v":0},{"$f":"SUM(K4:K33)","v":0},{"$f":"SUM(K4:K32)","v":0},null,null,null,{"$f":"SUM(P4:P33)","v":0},{"$f":"SUM(Q4:Q33)","v":0},{"$f":"SUM(R4:R33)","v":0},{"$f":"SUM(R4:R32)","v":0},null,null,null,{"$f":"SUM(W4:W33)","v":0},{"$f":"SUM(X4:X33)","v":0},{"$f":"SUM(Y4:Y33)","v":0},{"$f":"SUM(Y4:Y32)","v":0}]
[null,null,null,{"$f":"D1","v":"Siggi"},null,{"$f":"SUM(E3)","v":0},null,null,null,null,{"$f":"INDEX(D35:D38,MATCH(LARGE(F35:F38,1),F35:F38,0))","v":"Siggi"}]
[null,null,null,{"$f":"K1","v":"Ralfie"},null,{"$f":"SUM(L3)","v":0},null,null,null,null,{"$f":"INDEX(D35:D38,MATCH(LARGE(F35:F38,2),F35:F38,0))","v":"Siggi"}]
[null,null,null,{"$f":"R1","v":"Kerstin"},null,{"$f":"SUM(S3)","v":0},null,null,null,null,{"$f":"INDEX(D35:D38,MATCH(LARGE(F35:F38,3),F35:F38,0))","v":"Siggi"}]
[null,null,null,{"$f":"Y1","v":"Christian"},null,{"$f":"SUM(Z3)","v":0},null,null,null,null,{"$f":"INDEX(D35:D38,MATCH(LARGE(F35:F38,4),F35:F38,0))","v":"Siggi"}]
[null,null,null,"MAX(B2:B7",null,{"$f":"SUM(F35:F38)","v":0},null,null,null,null,null,null,null,null,null,null,null,null,null,null,null,null,null,null,null,null,null,null,null,null,"Ralf Kl."]
[null,null,null,null,null,null,null,null,null,null,null,null,null,null,null,null,null,null,null,null,null,null,null,null,null,null,null,null,null,null,"Volker"]
[null,null,null,null,null,null,null,null,null,null,null,null,null,null,null,null,null,null,null,null,null,null,null,null,null,null,null,null,null,null,"Rene"]
[null,null,null,null,1002,null,null,null,null,null,null,1002,null,null,null,null,null,null,null,null,null,null,null,null,null,null,{"$f":"RAND()","v":2.3262753896933219E-2},null,null,null,"Nicole"]
[null,null,null,{"$f":"D1","v":"Siggi"},{"$f":"SUM(D13:D33)","v":0},null,null,null,null,null,{"$f":"K1","v":"Ralfie"},{"$f":"SUM(K13:K33)","v":0},null,null,{"$f":"D1","v":"Siggi"},null,null,{"$f":"SUM(E46)","v":1002},null,{"$f":"INDEX(O43:O46,MATCH(LARGE(R43:R46,ROW(AE4)),R43:R46,0))","v":"Ralfie"},null,null,null,null,null,{"$f":"'Rd.4'!Z43","v":"Ralfie"},{"$f":"RAND()","v":0.66714552056694243},null,null,null,"Frank"]
[null,null,null,{"$f":"R1","v":"Kerstin"},{"$f":"SUM(R13:R33)","v":0},null,null,null,null,null,{"$f":"Y1","v":"Christian"},{"$f":"SUM(Y13:Y33)","v":0},null,null,{"$f":"R1","v":"Kerstin"},null,null,{"$f":"SUM(E46)+0.1","v":1002.1},null,{"$f":"INDEX(O43:O46,MATCH(LARGE(R43:R46,ROW(AE3)),R43:R46,0))","v":"Christian"},null,null,null,null,null,{"$f":"'Rd.4'!Z44","v":"Siggi"},{"$f":"RAND()","v":0.2153358891292888},null,null,null,"Rosi"]
[null,null,null,null,{"$f":"SUM(E43:E44)","v":0},null,null,null,null,null,null,{"$f":"SUM(L43:L44)","v":0},null,null,{"$f":"K1","v":"Ralfie"},null,null,{"$f":"L46/2","v":501},null,{"$f":"INDEX(O43:O46,MATCH(LARGE(R43:R46,ROW(AE2)),R43:R46,0))","v":"Siggi"},null,null,null,null,null,{"$f":"'Rd.4'!Z45","v":"Kerstin"},{"$f":"RAND()","v":0.47852752352066108},null,null,null,"Werner"]
[null,null,null,null,{"$f":"SUM(E42-E45)","v":1002},null,null,null,null,null,null,{"$f":"SUM(L42-L45)","v":1002},null,null,{"$f":"Y1","v":"Christian"},null,null,{"$f":"L46/2+0.1","v":501.1},null,{"$f":"INDEX(O43:O46,MATCH(LARGE(R43:R46,ROW(AE1)),R43:R46,0))","v":"Kerstin"},null,null,null,null,null,{"$f":"'Rd.4'!Z46","v":"Christian"},{"$f":"RAND()","v":0.54824823377223497},null,null,null,"Gast"]
[null,null,null,null,null,null,null,null,null,null,null,null,null,null,null,null,null,null,null,null,null,null,null,null,null,null,null,null,null,null,"Joker"]
[null,null,null,null,null,null,null,null,null,null,null,null,null,null,null,null,null,null,null,null,null,null,null,null,null,null,null,null,null,null,"Anja"]
[null,null,null,null,null,null,null,null,null,null,null,null,null,null,null,null,null,null,null,null,null,null,null,null,null,null,null,null,null,null,"Vincent"]
[null,null,null,null,null,null,null,null,null,null,null,null,null,null,null,null,null,null,null,null,null,null,null,null,null,null,null,null,null,null,"Erich"]
[null,null,null,{"$f":"D43","v":"Siggi"},{"$f":"E4","v":501},null,null,null,null,null,{"$f":"K43","v":"Ralfie"},{"$f":"L4","v":501},null,null,null,null,null,null,null,null,null,null,null,null,null,null,null,null,null,null,"Siggi"]
[null,null,null,{"$f":"D44","v":"Kerstin"},{"$f":"S4","v":501},null,null,null,null,null,{"$f":"K44","v":"Christian"},{"$f":"Z4","v":501},null,null,null,null,null,null,null,null,null,null,null,null,null,null,null,null,null,null,"Ralf M."]
[null,null,null,null,{"$f":"SUM(E51:E52)","v":1002},null,null,null,null,null,null,{"$f":"SUM(L51:L52)","v":1002},null,null,null,null,null,null,null,null,null,null,null,null,null,null,null,null,null,null,"Dirk B."]
[null,null,null,null,null,null,null,null,null,null,null,null,null,null,null,null,null,null,null,null,null,null,null,null,null,null,null,null,null,null,"Stefan"]
[null,null,null,{"$f":"D51","v":"Siggi"},{"$f":"E51","v":501},{"$f":"SUM(E57:E58)-E56","v":501},null,null,{"$f":"INDEX(E$55:E$58,MATCH(LARGE(F$55:F$58,1),F$55:F$58,0))","v":501},{"$f":"INDEX(F$55:F$58,MATCH(LARGE(G$55:G$58,1),G$55:G$58,0))","v":{"$error":"#NUM!"}},null,null,null,null,null,null,null,null,null,null,null,null,null,null,null,null,null,null,null,null,"Micha"]
[null,null,null,{"$f":"D52","v":"Kerstin"},{"$f":"E52","v":501},{"$f":"SUM(E57:E58)-E55","v":501}]
[null,null,null,{"$f":"K51","v":"Ralfie"},{"$f":"L51","v":501},{"$f":"SUM(E55:E56)-E58","v":501}]
[null,null,null,{"$f":"K52","v":"Christian"},{"$f":"L52","v":501}]

{"sheet":"Rd.6","index":5,"n_rows":58,"n_cols":31,"rows_kept":58,"cut":false,"hidden":false,"merged":[[13,25,16,26],[17,25,17,26],[18,25,22,26],[17,11,17,12],[18,11,22,12],[10,18,11,19],[12,18,12,19],[13,18,16,19],[17,18,17,19],[18,18,22,19],[0,24,0,25],[7,4,7,5],[7,11,7,12],[7,18,7,19],[7,25,7,26],[0,3,0,4],[0,10,0,11],[0,17,0,18],[31,18,32,19],[31,25,32,26],[26,4,30,5],[26,11,30,12],[26,18,30,19],[26,25,30,26],[17,4,17,5],[18,4,22,5],[13,11,16,12],[31,4,32,5],[31,11,32,12],[8,25,9,26],[8,4,9,5],[10,25,11,26],[12,25,12,26],[38,3,38,4],[8,11,9,12],[8,18,9,19],[24,4,25,5],[24,11,25,12],[24,18,25,19],[10,4,11,5],[12,4,12,5],[10,11,11,12],[12,11,12,12],[24,25,25,26],[13,4,16,5]]}
[null,null,null,{"$f":"'Rd.5'!AE4","v":"Siggi"},null,"Sp.1",null,null,null,null,{"$f":"'Rd.5'!AE2","v":"Siggi"},null,"Sp.2",null,null,null,null,{"$f":"'Rd.5'!AE3","v":"Siggi"},null,"Sp.3",null,null,null,null,{"$f":"'Rd.5'!AE1","v":"Siggi"},null,"Sp.4",null,null,null,{"$f":"K35","v":"Siggi"}]
[null,null,null,"Punkte",501,"Start",null,null,null,null,"Punkte",501,"Start",null,null,null,null,"Punkte",501,"Start",null,null,null,null,"Punkte",501,"Start",null,null,null,{"$f":"K36","v":"Siggi"}]
[null,null,null,"Geworfen",{"$f":"SUM(D34)","v":0},"Punkte",null,null,null,null,"Geworfen",{"$f":"SUM(K34)","v":0},"Punkte",null,null,null,null,"Geworfen",{"$f":"SUM(R34)","v":0},"Punkte",null,null,null,null,"Geworfen",{"$f":"SUM(Y34)","v":0},"Punkte",null,null,null,"Siggi"]
["RD 1",{"$f":"COUNT(D4)*1","v":0},{"$f":"COUNT(D4)*3","v":0},null,{"$f":"SUM(E2-E3)","v":501},"Rest",null,"RD 1",{"$f":"COUNT(K4)*1","v":0},{"$f":"COUNT(K4)*3","v":0},null,{"$f":"SUM(L2-L3)","v":501},"Rest",null,"RD 1",{"$f":"COUNT(R4)*1","v":0},{"$f":"COUNT(R4)*3","v":0},null,{"$f":"SUM(S2-S3)","v":501},"Rest",null,"RD 1",{"$f":"COUNT(Y4)*1","v":0},{"$f":"COUNT(Y4)*3","v":0},null,{"$f":"SUM(Z2-Z3)","v":501},"Rest",null,null,null,"Siggi"]
["RD 2",0,0,null,null,null,null,"RD 2",0,0,null,null,null,null,"RD 2",0,0,null,null,null,null,"RD 2",0,0]
["RD 3",0,0,null,"ø pro Spiel",{"$f":"SUM(E3)/B34","v":{"$error":"#DIV/0!"}},null,"RD 3",0,0,null,"ø pro Spiel",{"$f":"SUM(L3)/I34","v":{"$error":"#DIV/0!"}},null,"RD 3",0,0,null,"ø pro Spiel",{"$f":"SUM(S3)/P34","v":{"$error":"#DIV/0!"}},null,"RD 3",0,0,null,null,{"$f":"SUM(Z3)/W34","v":{"$error":"#DIV/0!"}}]
["RD 4",0,0,null,"ø pro Pfeil",{"$f":"SUM(E3)/C34","v":{"$error":"#DIV/0!"}},null,"RD 4",0,0,null,"ø pro Pfeil",{"$f":"SUM(L3)/J34","v":{"$error":"#DIV/0!"}},null,"RD 4",0,0,null,"ø pro Pfeil",{"$f":"SUM(S3)/Q34","v":{"$error":"#DIV/0!"}},null,"RD 4",0,0,null,"ø pro Pfeil",{"$f":"SUM(Z3)/X34","v":{"$error":"#DIV/0!"}}]
["RD 5",0,0,null,"Average",null,null,"RD 5",0,0,null,"Average",null,null,"RD 5",0,0,null,"Average",null,null,"RD 5",0,0,null,"Average"]
["RD 6",0,0,null,{"$f":"SUM(F6)","v":{"$error":"#DIV/0!"}},null,null,"RD 6",0,0,null,{"$f":"SUM(M6)","v":{"$error":"#DIV/0!"}},null,null,"RD 6",0,0,null,{"$f":"SUM(T6)","v":{"$error":"#DIV/0!"}},null,null,"RD 6",0,0,null,{"$f":"SUM(AA6)","v":{"$error":"#DIV/0!"}}]
["RD 7",0,0,null,null,null,null,"RD 7",0,0,null,null,null,null,"RD 7",0,0,null,null,null,null,"RD 7",0,0]
["RD 8",0,0,null,{"$f":"IF(F6<40,\"Nicht Gut\",\"\")","v":{"$error":"#DIV/0!"}},null,null,"RD 8",0,0,null,{"$f":"IF(M6<40,\"Nicht Gut\",\"\")","v":{"$error":"#DIV/0!"}},null,null,"RD 8",0,0,null,{"$f":"IF(T6<40,\"Nicht Gut\",\"\")","v":{"$error":"#DIV/0!"}},null,null,"RD 8",0,0,null,{"$f":"IF(AA6<40,\"Nicht Gut\",\"\")","v":{"$error":"#DIV/0!"}}]
["RD 9",0,0,null,null,null,null,"RD 9",0,0,null,null,null,null,"RD 9",0,0,null,null,null,null,"RD 9",0,0]
["RD 10",0,0,null,null,null,null,"RD 10",0,0,null,null,null,null,"RD 10",0,0,null,null,null,null,"RD 10",0,0,null,null,null,null,null,null,{"$f":"'Rd.1'!S52","v":"Kerstin"}]
["RD 11",0,0,null,{"$f":"IF(AND(F6>=39,F6<=50),\"GUT\",\"\")","v":{"$error":"#DIV/0!"}},null,null,"RD 11",0,0,null,{"$f":"IF(AND(M6>=39,M6<=50),\"GUT\",\"\")","v":{"$error":"#DIV/0!"}},null,null,"RD 11",0,0,null,{"$f":"IF(AND(T6>=39,T6<=50),\"GUT\",\"\")","v":{"$error":"#DIV/0!"}},null,null,"RD 11",0,0,null,{"$f":"IF(AND(AA6>=39,AA6<=50),\"GUT\",\"\")","v":{"$error":"#DIV/0!"}},null,null,null,null,{"$f":"'Rd.1'!S53","v":"Ralfie"}]
["RD 12",0,0,null,null,null,null,"RD 12",0,0,null,null,null,null,"RD 12",0,0,null,null,null,null,"RD 12",0,0,null,null,null,null,null,null,{"$f":"'Rd.1'!S54","v":"Christian"}]
["RD 13",0,0,null,null,null,null,"RD 13",0,0,null,null,null,null,"RD 13",0,0,null,null,null,null,"RD 13",0,0,null,null,null,null,null,null,{"$f":"'Rd.1'!S55","v":"Siggi"}]
["RD 14",0,0,null,null,null,null,"RD 14",0,0,null,null,null,null,"RD 14",0,0,null,null,null,null,"RD 14",0,0]
["RD 15",0,0,null,null,null,null,"RD 15",0,0,null,null,null,null,"RD 15",0,0,null,null,null,null,"RD 15",0,0]
["RD 16",0,0,null,{"$f":"IF(F6>49,\"Sehr Gut\",\"\")","v":{"$error":"#DIV/0!"}},null,null,"RD 16",0,0,null,{"$f":"IF(M6>49,\"Sehr Gut\",\"\")","v":{"$error":"#DIV/0!"}},null,null,"RD 16",0,0,null,{"$f":"IF(T6>49,\"Sehr Gut\",\"\")","v":{"$error":"#DIV/0!"}},null,null,"RD 16",0,0,null,{"$f":"IF(AA6>49,\"Sehr Gut\",\"\")","v":{"$error":"#DIV/0!"}}]
["RD 17",0,0,null,null,null,null,"RD 17",0,0,null,null,null,null,"RD 17",0,0,null,null,null,null,"RD 17",0,0]
["RD 18",0,0,null,null,null,null,"RD 18",0,0,null,null,null,null,"RD 18",0,0,null,null,null,null,"RD 18",0,0]
["RD 19",0,0,null,null,null,null,"RD 19",0,0,null,null,null,null,"RD 19",0,0,null,null,null,null,"RD 19",0,0]
["RD 20",0,0,null,null,null,null,"RD 20",0,0,null,null,null,null,"RD 20",0,0,null,null,null,null,"RD 20",0,0]
["RD 21",0,0,null,"Rest:",{"$f":"E4","v":501},null,"RD 21",0,0,null,"Rest:",{"$f":"L4","v":501},null,"RD 21",0,0,null,"Rest:",{"$f":"S4","v":501},null,"RD 21",0,0,null,"Rest:",{"$f":"Z4","v":501}]
["RD 22",0,0,null,{"$f":"D1","v":"Siggi"},null,null,"RD 22",0,0,null,{"$f":"K1","v":"Siggi"},null,null,"RD 22",0,0,null,{"$f":"R1","v":"Siggi"},null,null,"RD 22",0,0,null,{"$f":"Y1","v":"Siggi"}]
["RD 23",0,0,null,null,null,null,"RD 23",0,0,null,null,null,null,"RD 23",0,0,null,null,null,null,"RD 23",0,0]
["RD 24",0,0,null,{"$f":"IF(S4<L4+Z4,\"Darf\",IF(S4>L4+Z4,\"Darf nicht\",IF(S4=L4+Z4,\"Darf\"\"\")))","v":"Darf"},null,null,"RD 24",0,0,null,{"$f":"IF(Z4<E4+S4,\"Darf\",IF(Z4>E4+S4,\"Darf nicht\",IF(Z4=E4+S4,\"Darf\"\"\")))","v":"Darf"},null,null,"RD 24",0,0,null,{"$f":"IF(E4<L4+Z4,\"Darf\",IF(E4>L4+Z4,\"Darf nicht\",IF(E4=L4+Z4,\"Darf\"\"\")))","v":"Darf"},null,null,"RD 24",0,0,null,{"$f":"IF(L4<E4+S4,\"Darf\",IF(L4>E4+S4,\"Darf nicht\",IF(L4=E4+S4,\"Darf\"\"\")))","v":"Darf"}]
["RD 25",0,0,null,null,null,null,"RD 25",0,0,null,null,null,null,"RD 25",0,0,null,null,null,null,"RD 25",0,0]
["RD 26",0,0,null,null,null,null,"RD 26",0,0,null,null,null,null,"RD 26",0,0,null,null,null,null,"RD 26",0,0]
["RD 27",0,0,null,null,null,null,"RD 27",0,0,null,null,null,null,"RD 27",0,0,null,null,null,null,"RD 27",0,0]
["RD 28",0,0,null,null,null,null,"RD 28",0,0,null,null,null,null,"RD 28",0,0,null,null,null,null,"RD 28",0,0]
["RD 29",0,0,null,{"$f":"IF(E4=0,\"Sieg\",\"\")","v":""},null,null,"RD 29",0,0,null,{"$f":"IF(L4=0,\"Sieg\",\"\")","v":""},null,null,"RD 29",0,0,null,{"$f":"IF(S4=0,\"Sieg\",\"\")","v":""},null,null,"RD 29",0,0,null,{"$f":"IF(Z4=0,\"Sieg\",\"\")","v":""}]
["RD 30",0,0,null,null,null,null,"RD 30",0,0,null,null,null,null,"RD 30",0,0,null,null,null,null,"RD 30",0,0]
[null,{"$f":"SUM(B4:B33)","v":0},{"$f":"SUM(C4:C33)","v":0},{"$f":"SUM(D4:D33)","v":0},{"$f":"SUM(D4:D32)","v":0},null,null,null,{"$f":"SUM(I4:I33)","v":0},{"$f":"SUM(J4:J33)","v":0},{"$f":"SUM(K4:K33)","v":0},{"$f":"SUM(K4:K32)","v":0},null,null,null,{"$f":"SUM(P4:P33)","v":0},{"$f":"SUM(Q4:Q33)","v":0},{"$f":"SUM(R4:R33)","v":0},{"$f":"SUM(R4:R32)","v":0},null,null,null,{"$f":"SUM(W4:W33)","v":0},{"$f":"SUM(X4:X33)","v":0},{"$f":"SUM(Y4:Y33)","v":0},{"$f":"SUM(Y4:Y32)","v":0}]
[null,null,null,{"$f":"D1","v":"Siggi"},null,{"$f":"SUM(E3)","v":0},null,null,null,null,{"$f":"INDEX(D35:D38,MATCH(LARGE(F35:F38,1),F35:F38,0))","v":"Siggi"}]
[null,null,null,{"$f":"K1","v":"Siggi"},null,{"$f":"SUM(L3)","v":0},null,null,null,null,{"$f":"INDEX(D35:D38,MATCH(LARGE(F35:F38,2),F35:F38,0))","v":"Siggi"}]
[null,null,null,{"$f":"R1","v":"Siggi"},null,{"$f":"SUM(S3)","v":0},null,null,null,null,{"$f":"INDEX(D35:D38,MATCH(LARGE(F35:F38,3),F35:F38,0))","v":"Siggi"}]
[null,null,null,{"$f":"Y1","v":"Siggi"},null,{"$f":"SUM(Z3)","v":0},null,null,null,null,{"$f":"INDEX(D35:D38,MATCH(LARGE(F35:F38,4),F35:F38,0))","v":"Siggi"}]
[null,null,null,"MAX(B2:B7",null,{"$f":"SUM(F35:F38)","v":0},null,null,null,null,null,null,null,null,null,null,null,null,null,null,null,null,null,null,null,null,null,null,null,null,"Ralf Kl."]
[null,null,null,null,null,null,null,null,null,null,null,null,null,null,null,null,null,null,null,null,null,null,null,null,null,null,null,null,null,null,"Volker"]
[null,null,null,null,null,null,null,null,null,null,null,null,null,null,null,null,null,null,null,null,null,null,null,null,null,null,null,null,null,null,"Rene"]
[null,null,null,null,1002,null,null,null,null,null,null,1002,null,null,null,null,null,null,null,null,null,null,null,null,null,null,{"$f":"RAND()","v":0.99367249725856621},null,null,null,"Nicole"]
[null,null,null,{"$f":"D1","v":"Siggi"},{"$f":"SUM(D13:D33)","v":0},null,null,null,null,null,{"$f":"K1","v":"Siggi"},{"$f":"SUM(K13:K33)","v":0},null,null,{"$f":"D1","v":"Siggi"},null,null,{"$f":"SUM(E46)","v":1002},null,{"$f":"INDEX(O43:O46,MATCH(LARGE(R43:R46,ROW(AE4)),R43:R46,0))","v":"Siggi"},null,null,null,null,null,{"$f":"'Rd.5'!Z43","v":"Ralfie"},{"$f":"RAND()","v":0.61038190622006272},null,null,null,"Frank"]
[null,null,null,{"$f":"R1","v":"Siggi"},{"$f":"SUM(R13:R33)","v":0},null,null,null,null,null,{"$f":"Y1","v":"Siggi"},{"$f":"SUM(Y13:Y33)","v":0},null,null,{"$f":"R1","v":"Siggi"},null,null,{"$f":"SUM(E46)+0.1","v":1002.1},null,{"$f":"INDEX(O43:O46,MATCH(LARGE(R43:R46,ROW(AE3)),R43:R46,0))","v":"Siggi"},null,null,null,null,null,{"$f":"'Rd.5'!Z44","v":"Siggi"},{"$f":"RAND()","v":0.23853094574863853},null,null,null,"Rosi"]
[null,null,null,null,{"$f":"SUM(E43:E44)","v":0},null,null,null,null,null,null,{"$f":"SUM(L43:L44)","v":0},null,null,{"$f":"K1","v":"Siggi"},null,null,{"$f":"L46/2","v":501},null,{"$f":"INDEX(O43:O46,MATCH(LARGE(R43:R46,ROW(AE2)),R43:R46,0))","v":"Siggi"},null,null,null,null,null,{"$f":"'Rd.5'!Z45","v":"Kerstin"},{"$f":"RAND()","v":0.32780661710608461},null,null,null,"Werner"]
[null,null,null,null,{"$f":"SUM(E42-E45)","v":1002},null,null,null,null,null,null,{"$f":"SUM(L42-L45)","v":1002},null,null,{"$f":"Y1","v":"Siggi"},null,null,{"$f":"L46/2+0.1","v":501.1},null,{"$f":"INDEX(O43:O46,MATCH(LARGE(R43:R46,ROW(AE1)),R43:R46,0))","v":"Siggi"},null,null,null,null,null,{"$f":"'Rd.5'!Z46","v":"Christian"},{"$f":"RAND()","v":0.61818018738928882},null,null,null,"Gast"]
[null,null,null,null,null,null,null,null,null,null,null,null,null,null,null,null,null,null,null,null,null,null,null,null,null,null,null,null,null,null,"Joker"]
[null,null,null,null,null,null,null,null,null,null,null,null,null,null,null,null,null,null,null,null,null,null,null,null,null,null,null,null,null,null,"Anja"]
[null,null,null,null,null,null,null,null,null,null,null,null,null,null,null,null,null,null,null,null,null,null,null,null,null,null,null,null,null,null,"Vincent"]
[null,null,null,null,null,null,null,null,null,null,null,null,null,null,null,null,null,null,null,null,null,null,null,null,null,null,null,null,null,null,"Erich"]
[null,null,null,{"$f":"D43","v":"Siggi"},{"$f":"E4","v":501},null,null,null,null,null,{"$f":"K43","v":"Siggi"},{"$f":"L4","v":501},null,null,null,null,null,null,null,null,null,null,null,null,null,null,null,null,null,null,"Siggi"]
[null,null,null,{"$f":"D44","v":"Siggi"},{"$f":"S4","v":501},null,null,null,null,null,{"$f":"K44","v":"Siggi"},{"$f":"Z4","v":501},null,null,null,null,null,null,null,null,null,null,null,null,null,null,null,null,null,null,"Ralf M."]
[null,null,null,null,{"$f":"SUM(E51:E52)","v":1002},null,null,null,null,null,null,{"$f":"SUM(L51:L52)","v":1002},null,null,null,null,null,null,null,null,null,null,null,null,null,null,null,null,null,null,"Dirk B."]
[null,null,null,null,null,null,null,null,null,null,null,null,null,null,null,null,null,null,null,null,null,null,null,null,null,null,null,null,null,null,"Stefan"]
[null,null,null,{"$f":"D51","v":"Siggi"},{"$f":"E51","v":501},{"$f":"SUM(E57:E58)-E56","v":501},null,null,{"$f":"INDEX(E$55:E$58,MATCH(LARGE(F$55:F$58,1),F$55:F$58,0))","v":501},{"$f":"INDEX(F$55:F$58,MATCH(LARGE(G$55:G$58,1),G$55:G$58,0))","v":{"$error":"#NUM!"}},null,null,null,null,null,null,null,null,null,null,null,null,null,null,null,null,null,null,null,null,"Micha"]
[null,null,null,{"$f":"D52","v":"Siggi"},{"$f":"E52","v":501},{"$f":"SUM(E57:E58)-E55","v":501}]
[null,null,null,{"$f":"K51","v":"Siggi"},{"$f":"L51","v":501},{"$f":"SUM(E55:E56)-E58","v":501}]
[null,null,null,{"$f":"K52","v":"Siggi"},{"$f":"L52","v":501}]

{"sheet":"Rd.7","index":6,"n_rows":58,"n_cols":31,"rows_kept":58,"cut":false,"hidden":false,"merged":[[13,25,16,26],[17,25,17,26],[18,25,22,26],[17,11,17,12],[18,11,22,12],[10,18,11,19],[12,18,12,19],[13,18,16,19],[17,18,17,19],[18,18,22,19],[0,24,0,25],[7,4,7,5],[7,11,7,12],[7,18,7,19],[7,25,7,26],[0,3,0,4],[0,10,0,11],[0,17,0,18],[31,18,32,19],[31,25,32,26],[26,4,30,5],[26,11,30,12],[26,18,30,19],[26,25,30,26],[17,4,17,5],[18,4,22,5],[13,11,16,12],[31,4,32,5],[31,11,32,12],[8,25,9,26],[8,4,9,5],[10,25,11,26],[12,25,12,26],[38,3,38,4],[8,11,9,12],[8,18,9,19],[24,4,25,5],[24,11,25,12],[24,18,25,19],[10,4,11,5],[12,4,12,5],[10,11,11,12],[12,11,12,12],[24,25,25,26],[13,4,16,5]]}
[null,null,null,{"$f":"'Rd.1'!#REF!","v":{"$error":"#REF!"}},null,"Sp.1",null,null,null,null,{"$f":"'Rd.1'!#REF!","v":{"$error":"#REF!"}},null,"Sp.2",null,null,null,null,{"$f":"'Rd.1'!#REF!","v":{"$error":"#REF!"}},null,"Sp.3",null,null,null,null,{"$f":"'Rd.1'!#REF!","v":{"$error":"#REF!"}},null,"Sp.4",null,null,null,{"$f":"K35","v":{"$error":"#REF!"}}]
[null,null,null,"Punkte",501,"Start",null,null,null,null,"Punkte",501,"Start",null,null,null,null,"Punkte",501,"Start",null,null,null,null,"Punkte",501,"Start",null,null,null,{"$f":"K36","v":{"$error":"#REF!"}}]
[null,null,null,"Geworfen",{"$f":"SUM(D34)","v":0},"Punkte",null,null,null,null,"Geworfen",{"$f":"SUM(K34)","v":0},"Punkte",null,null,null,null,"Geworfen",{"$f":"SUM(R34)","v":0},"Punkte",null,null,null,null,"Geworfen",{"$f":"SUM(Y34)","v":0},"Punkte",null,null,null,{"$error":"#REF!"}]
["RD 1",{"$f":"COUNT(D4)*1","v":0},{"$f":"COUNT(D4)*3","v":0},null,{"$f":"SUM(E2-E3)","v":501},"Rest",null,"RD 1",{"$f":"COUNT(K4)*1","v":0},{"$f":"COUNT(K4)*3","v":0},null,{"$f":"SUM(L2-L3)","v":501},"Rest",null,"RD 1",{"$f":"COUNT(R4)*1","v":0},{"$f":"COUNT(R4)*3","v":0},null,{"$f":"SUM(S2-S3)","v":501},"Rest",null,"RD 1",{"$f":"COUNT(Y4)*1","v":0},{"$f":"COUNT(Y4)*3","v":0},null,{"$f":"SUM(Z2-Z3)","v":501},"Rest",null,null,null,{"$error":"#REF!"}]
["RD 2",0,0,null,null,null,null,"RD 2",0,0,null,null,null,null,"RD 2",0,0,null,null,null,null,"RD 2",0,0]
["RD 3",0,0,null,"ø pro Spiel",{"$f":"SUM(E3)/B34","v":{"$error":"#DIV/0!"}},null,"RD 3",0,0,null,"ø pro Spiel",{"$f":"SUM(L3)/I34","v":{"$error":"#DIV/0!"}},null,"RD 3",0,0,null,"ø pro Spiel",{"$f":"SUM(S3)/P34","v":{"$error":"#DIV/0!"}},null,"RD 3",0,0,null,null,{"$f":"SUM(Z3)/W34","v":{"$error":"#DIV/0!"}}]
["RD 4",0,0,null,"ø pro Pfeil",{"$f":"SUM(E3)/C34","v":{"$error":"#DIV/0!"}},null,"RD 4",0,0,null,"ø pro Pfeil",{"$f":"SUM(L3)/J34","v":{"$error":"#DIV/0!"}},null,"RD 4",0,0,null,"ø pro Pfeil",{"$f":"SUM(S3)/Q34","v":{"$error":"#DIV/0!"}},null,"RD 4",0,0,null,"ø pro Pfeil",{"$f":"SUM(Z3)/X34","v":{"$error":"#DIV/0!"}}]
["RD 5",0,0,null,"Average",null,null,"RD 5",0,0,null,"Average",null,null,"RD 5",0,0,null,"Average",null,null,"RD 5",0,0,null,"Average"]
["RD 6",0,0,null,{"$f":"SUM(F6)","v":{"$error":"#DIV/0!"}},null,null,"RD 6",0,0,null,{"$f":"SUM(M6)","v":{"$error":"#DIV/0!"}},null,null,"RD 6",0,0,null,{"$f":"SUM(T6)","v":{"$error":"#DIV/0!"}},null,null,"RD 6",0,0,null,{"$f":"SUM(AA6)","v":{"$error":"#DIV/0!"}}]
["RD 7",0,0,null,null,null,null,"RD 7",0,0,null,null,null,null,"RD 7",0,0,null,null,null,null,"RD 7",0,0]
["RD 8",0,0,null,{"$f":"IF(F6<40,\"Nicht Gut\",\"\")","v":{"$error":"#DIV/0!"}},null,null,"RD 8",0,0,null,{"$f":"IF(M6<40,\"Nicht Gut\",\"\")","v":{"$error":"#DIV/0!"}},null,null,"RD 8",0,0,null,{"$f":"IF(T6<40,\"Nicht Gut\",\"\")","v":{"$error":"#DIV/0!"}},null,null,"RD 8",0,0,null,{"$f":"IF(AA6<40,\"Nicht Gut\",\"\")","v":{"$error":"#DIV/0!"}}]
["RD 9",0,0,null,null,null,null,"RD 9",0,0,null,null,null,null,"RD 9",0,0,null,null,null,null,"RD 9",0,0]
["RD 10",0,0,null,null,null,null,"RD 10",0,0,null,null,null,null,"RD 10",0,0,null,null,null,null,"RD 10",0,0]
["RD 11",0,0,null,{"$f":"IF(AND(F6>=39,F6<=50),\"GUT\",\"\")","v":{"$error":"#DIV/0!"}},null,null,"RD 11",0,0,null,{"$f":"IF(AND(M6>=39,M6<=50),\"GUT\",\"\")","v":{"$error":"#DIV/0!"}},null,null,"RD 11",0,0,null,{"$f":"IF(AND(T6>=39,T6<=50),\"GUT\",\"\")","v":{"$error":"#DIV/0!"}},null,null,"RD 11",0,0,null,{"$f":"IF(AND(AA6>=39,AA6<=50),\"GUT\",\"\")","v":{"$error":"#DIV/0!"}}]
["RD 12",0,0,null,null,null,null,"RD 12",0,0,null,null,null,null,"RD 12",0,0,null,null,null,null,"RD 12",0,0]
["RD 13",0,0,null,null,null,null,"RD 13",0,0,null,null,null,null,"RD 13",0,0,null,null,null,null,"RD 13",0,0]
["RD 14",0,0,null,null,null,null,"RD 14",0,0,null,null,null,null,"RD 14",0,0,null,null,null,null,"RD 14",0,0]
["RD 15",0,0,null,null,null,null,"RD 15",0,0,null,null,null,null,"RD 15",0,0,null,null,null,null,"RD 15",0,0]
["RD 16",0,0,null,{"$f":"IF(F6>49,\"Sehr Gut\",\"\")","v":{"$error":"#DIV/0!"}},null,null,"RD 16",0,0,null,{"$f":"IF(M6>49,\"Sehr Gut\",\"\")","v":{"$error":"#DIV/0!"}},null,null,"RD 16",0,0,null,{"$f":"IF(T6>49,\"Sehr Gut\",\"\")","v":{"$error":"#DIV/0!"}},null,null,"RD 16",0,0,null,{"$f":"IF(AA6>49,\"Sehr Gut\",\"\")","v":{"$error":"#DIV/0!"}}]
["RD 17",0,0,null,null,null,null,"RD 17",0,0,null,null,null,null,"RD 17",0,0,null,null,null,null,"RD 17",0,0]
["RD 18",0,0,null,null,null,null,"RD 18",0,0,null,null,null,null,"RD 18",0,0,null,null,null,null,"RD 18",0,0]
["RD 19",0,0,null,null,null,null,"RD 19",0,0,null,null,null,null,"RD 19",0,0,null,null,null,null,"RD 19",0,0]
["RD 20",0,0,null,null,null,null,"RD 20",0,0,null,null,null,null,"RD 20",0,0,null,null,null,null,"RD 20",0,0]
["RD 21",0,0,null,"Rest:",{"$f":"E4","v":501},null,"RD 21",0,0,null,"Rest:",{"$f":"L4","v":501},null,"RD 21",0,0,null,"Rest:",{"$f":"S4","v":501},null,"RD 21",0,0,null,"Rest:",{"$f":"Z4","v":501}]
["RD 22",0,0,null,{"$f":"D1","v":{"$error":"#REF!"}},null,null,"RD 22",0,0,null,{"$f":"K1","v":{"$error":"#REF!"}},null,null,"RD 22",0,0,null,{"$f":"R1","v":{"$error":"#REF!"}},null,null,"RD 22",0,0,null,{"$f":"Y1","v":{"$error":"#REF!"}}]
["RD 23",0,0,null,null,null,null,"RD 23",0,0,null,null,null,null,"RD 23",0,0,null,null,null,null,"RD 23",0,0]
["RD 24",0,0,null,{"$f":"IF(S4<L4+Z4,\"Darf\",IF(S4>L4+Z4,\"Darf nicht\",IF(S4=L4+Z4,\"Darf\"\"\")))","v":"Darf"},null,null,"RD 24",0,0,null,{"$f":"IF(Z4<E4+S4,\"Darf\",IF(Z4>E4+S4,\"Darf nicht\",IF(Z4=E4+S4,\"Darf\"\"\")))","v":"Darf"},null,null,"RD 24",0,0,null,{"$f":"IF(E4<L4+Z4,\"Darf\",IF(E4>L4+Z4,\"Darf nicht\",IF(E4=L4+Z4,\"Darf\"\"\")))","v":"Darf"},null,null,"RD 24",0,0,null,{"$f":"IF(L4<E4+S4,\"Darf\",IF(L4>E4+S4,\"Darf nicht\",IF(L4=E4+S4,\"Darf\"\"\")))","v":"Darf"}]
["RD 25",0,0,null,null,null,null,"RD 25",0,0,null,null,null,null,"RD 25",0,0,null,null,null,null,"RD 25",0,0]
["RD 26",0,0,null,null,null,null,"RD 26",0,0,null,null,null,null,"RD 26",0,0,null,null,null,null,"RD 26",0,0]
["RD 27",0,0,null,null,null,null,"RD 27",0,0,null,null,null,null,"RD 27",0,0,null,null,null,null,"RD 27",0,0]
["RD 28",0,0,null,null,null,null,"RD 28",0,0,null,null,null,null,"RD 28",0,0,null,null,null,null,"RD 28",0,0]
["RD 29",0,0,null,{"$f":"IF(E4=0,\"Sieg\",\"\")","v":""},null,null,"RD 29",0,0,null,{"$f":"IF(L4=0,\"Sieg\",\"\")","v":""},null,null,"RD 29",0,0,null,{"$f":"IF(S4=0,\"Sieg\",\"\")","v":""},null,null,"RD 29",0,0,null,{"$f":"IF(Z4=0,\"Sieg\",\"\")","v":""}]
["RD 30",0,0,null,null,null,null,"RD 30",0,0,null,null,null,null,"RD 30",0,0,null,null,null,null,"RD 30",0,0]
[null,{"$f":"SUM(B4:B33)","v":0},{"$f":"SUM(C4:C33)","v":0},{"$f":"SUM(D4:D33)","v":0},{"$f":"SUM(D4:D32)","v":0},null,null,null,{"$f":"SUM(I4:I33)","v":0},{"$f":"SUM(J4:J33)","v":0},{"$f":"SUM(K4:K33)","v":0},{"$f":"SUM(K4:K32)","v":0},null,null,null,{"$f":"SUM(P4:P33)","v":0},{"$f":"SUM(Q4:Q33)","v":0},{"$f":"SUM(R4:R33)","v":0},{"$f":"SUM(R4:R32)","v":0},null,null,null,{"$f":"SUM(W4:W33)","v":0},{"$f":"SUM(X4:X33)","v":0},{"$f":"SUM(Y4:Y33)","v":0},{"$f":"SUM(Y4:Y32)","v":0}]
[null,null,null,{"$f":"D1","v":{"$error":"#REF!"}},null,{"$f":"SUM(E3)","v":0},null,null,null,null,{"$f":"INDEX(D35:D38,MATCH(LARGE(F35:F38,1),F35:F38,0))","v":{"$error":"#REF!"}}]
[null,null,null,{"$f":"K1","v":{"$error":"#REF!"}},null,{"$f":"SUM(L3)","v":0},null,null,null,null,{"$f":"INDEX(D35:D38,MATCH(LARGE(F35:F38,2),F35:F38,0))","v":{"$error":"#REF!"}}]
[null,null,null,{"$f":"R1","v":{"$error":"#REF!"}},null,{"$f":"SUM(S3)","v":0},null,null,null,null,{"$f":"INDEX(D35:D38,MATCH(LARGE(F35:F38,3),F35:F38,0))","v":{"$error":"#REF!"}}]
[null,null,null,{"$f":"Y1","v":{"$error":"#REF!"}},null,{"$f":"SUM(Z3)","v":0},null,null,null,null,{"$f":"INDEX(D35:D38,MATCH(LARGE(F35:F38,4),F35:F38,0))","v":{"$error":"#REF!"}}]
[null,null,null,"MAX(B2:B7",null,{"$f":"SUM(F35:F38)","v":0},null,null,null,null,null,null,null,null,null,null,null,null,null,null,null,null,null,null,null,null,null,null,null,null,"Ralf Kl."]
[null,null,null,null,null,null,null,null,null,null,null,null,null,null,null,null,null,null,null,null,null,null,null,null,null,null,null,null,null,null,"Volker"]
[null,null,null,null,null,null,null,null,null,null,null,null,null,null,null,null,null,null,null,null,null,null,null,null,null,null,null,null,null,null,"Rene"]
[null,null,null,null,1002,null,null,null,null,null,null,1002,null,null,null,null,null,null,null,null,null,null,null,null,null,null,{"$f":"RAND()","v":0.93966795294198524},null,null,null,"Nicole"]
[null,null,null,{"$f":"D1","v":{"$error":"#REF!"}},{"$f":"SUM(D13:D33)","v":0},null,null,null,null,null,{"$f":"K1","v":{"$error":"#REF!"}},{"$f":"SUM(K13:K33)","v":0},null,null,{"$f":"D1","v":{"$error":"#REF!"}},null,null,{"$f":"SUM(E46)","v":1002},null,{"$f":"INDEX(O43:O46,MATCH(LARGE(R43:R46,ROW(AE4)),R43:R46,0))","v":{"$error":"#REF!"}},null,null,null,null,null,{"$f":"'Rd.6'!Z43","v":"Ralfie"},{"$f":"RAND()","v":0.17646542483764105},null,null,null,"Frank"]
[null,null,null,{"$f":"R1","v":{"$error":"#REF!"}},{"$f":"SUM(R13:R33)","v":0},null,null,null,null,null,{"$f":"Y1","v":{"$error":"#REF!"}},{"$f":"SUM(Y13:Y33)","v":0},null,null,{"$f":"R1","v":{"$error":"#REF!"}},null,null,{"$f":"SUM(E46)+0.1","v":1002.1},null,{"$f":"INDEX(O43:O46,MATCH(LARGE(R43:R46,ROW(AE3)),R43:R46,0))","v":{"$error":"#REF!"}},null,null,null,null,null,{"$f":"'Rd.6'!Z44","v":"Siggi"},{"$f":"RAND()","v":0.93352231374163264},null,null,null,"Rosi"]
[null,null,null,null,{"$f":"SUM(E43:E44)","v":0},null,null,null,null,null,null,{"$f":"SUM(L43:L44)","v":0},null,null,{"$f":"K1","v":{"$error":"#REF!"}},null,null,{"$f":"L46/2","v":501},null,{"$f":"INDEX(O43:O46,MATCH(LARGE(R43:R46,ROW(AE2)),R43:R46,0))","v":{"$error":"#REF!"}},null,null,null,null,null,{"$f":"'Rd.6'!Z45","v":"Kerstin"},{"$f":"RAND()","v":0.79601750344654221},null,null,null,"Werner"]
[null,null,null,null,{"$f":"SUM(E42-E45)","v":1002},null,null,null,null,null,null,{"$f":"SUM(L42-L45)","v":1002},null,null,{"$f":"Y1","v":{"$error":"#REF!"}},null,null,{"$f":"L46/2+0.1","v":501.1},null,{"$f":"INDEX(O43:O46,MATCH(LARGE(R43:R46,ROW(AE1)),R43:R46,0))","v":{"$error":"#REF!"}},null,null,null,null,null,{"$f":"'Rd.6'!Z46","v":"Christian"},{"$f":"RAND()","v":0.9589066344797631},null,null,null,"Gast"]
[null,null,null,null,null,null,null,null,null,null,null,null,null,null,null,null,null,null,null,null,null,null,null,null,null,null,null,null,null,null,"Joker"]
[null,null,null,null,null,null,null,null,null,null,null,null,null,null,null,null,null,null,null,null,null,null,null,null,null,null,null,null,null,null,"Anja"]
[null,null,null,null,null,null,null,null,null,null,null,null,null,null,null,null,null,null,null,null,null,null,null,null,null,null,null,null,null,null,"Vincent"]
[null,null,null,null,null,null,null,null,null,null,null,null,null,null,null,null,null,null,null,null,null,null,null,null,null,null,null,null,null,null,"Erich"]
[null,null,null,{"$f":"D43","v":{"$error":"#REF!"}},{"$f":"E4","v":501},null,null,null,null,null,{"$f":"K43","v":{"$error":"#REF!"}},{"$f":"L4","v":501},null,null,null,null,null,null,null,null,null,null,null,null,null,null,null,null,null,null,"Siggi"]
[null,null,null,{"$f":"D44","v":{"$error":"#REF!"}},{"$f":"S4","v":501},null,null,null,null,null,{"$f":"K44","v":{"$error":"#REF!"}},{"$f":"Z4","v":501},null,null,null,null,null,null,null,null,null,null,null,null,null,null,null,null,null,null,"Ralf M."]
[null,null,null,null,{"$f":"SUM(E51:E52)","v":1002},null,null,null,null,null,null,{"$f":"SUM(L51:L52)","v":1002},null,null,null,null,null,null,null,null,null,null,null,null,null,null,null,null,null,null,"Dirk B."]
[null,null,null,null,null,null,null,null,null,null,null,null,null,null,null,null,null,null,null,null,null,null,null,null,null,null,null,null,null,null,"Stefan"]
[null,null,null,{"$f":"D51","v":{"$error":"#REF!"}},{"$f":"E51","v":501},{"$f":"SUM(E57:E58)-E56","v":501},null,null,{"$f":"INDEX(E$55:E$58,MATCH(LARGE(F$55:F$58,1),F$55:F$58,0))","v":501},{"$f":"INDEX(F$55:F$58,MATCH(LARGE(G$55:G$58,1),G$55:G$58,0))","v":{"$error":"#NUM!"}},null,null,null,null,null,null,null,null,null,null,null,null,null,null,null,null,null,null,null,null,"Micha"]
[null,null,null,{"$f":"D52","v":{"$error":"#REF!"}},{"$f":"E52","v":501},{"$f":"SUM(E57:E58)-E55","v":501}]
[null,null,null,{"$f":"K51","v":{"$error":"#REF!"}},{"$f":"L51","v":501},{"$f":"SUM(E55:E56)-E58","v":501}]
[null,null,null,{"$f":"K52","v":{"$error":"#REF!"}},{"$f":"L52","v":501}]

{"sheet":"Rd.8","index":7,"n_rows":58,"n_cols":31,"rows_kept":58,"cut":false,"hidden":false,"merged":[[13,25,16,26],[17,25,17,26],[18,25,22,26],[17,11,17,12],[18,11,22,12],[10,18,11,19],[12,18,12,19],[13,18,16,19],[17,18,17,19],[18,18,22,19],[0,24,0,25],[7,4,7,5],[7,11,7,12],[7,18,7,19],[7,25,7,26],[0,3,0,4],[0,10,0,11],[0,17,0,18],[31,18,32,19],[31,25,32,26],[26,4,30,5],[26,11,30,12],[26,18,30,19],[26,25,30,26],[17,4,17,5],[18,4,22,5],[13,11,16,12],[31,4,32,5],[31,11,32,12],[8,25,9,26],[8,4,9,5],[10,25,11,26],[12,25,12,26],[38,3,38,4],[8,11,9,12],[8,18,9,19],[24,4,25,5],[24,11,25,12],[24,18,25,19],[10,4,11,5],[12,4,12,5],[10,11,11,12],[12,11,12,12],[24,25,25,26],[13,4,16,5]]}
[null,null,null,{"$f":"'Rd.7'!AE4","v":{"$error":"#REF!"}},null,"Sp.1",null,null,null,null,{"$f":"'Rd.7'!AE2","v":{"$error":"#REF!"}},null,"Sp.2",null,null,null,null,{"$f":"'Rd.7'!AE3","v":{"$error":"#REF!"}},null,"Sp.3",null,null,null,null,{"$f":"'Rd.7'!AE1","v":{"$error":"#REF!"}},null,{"$f":"'Rd.7'!AE1","v":{"$error":"#REF!"}},null,null,null,{"$f":"K35","v":{"$error":"#REF!"}}]
[null,null,null,"Punkte",501,"Start",null,null,null,null,"Punkte",501,"Start",null,null,null,null,"Punkte",501,"Start",null,null,null,null,"Punkte",501,"Start",null,null,null,{"$f":"K36","v":{"$error":"#REF!"}}]
[null,null,null,"Geworfen",{"$f":"SUM(D34)","v":0},"Punkte",null,null,null,null,"Geworfen",{"$f":"SUM(K34)","v":0},"Punkte",null,null,null,null,"Geworfen",{"$f":"SUM(R34)","v":0},"Punkte",null,null,null,null,"Geworfen",{"$f":"SUM(Y34)","v":0},"Punkte",null,null,null,{"$error":"#REF!"}]
["RD 1",{"$f":"COUNT(D4)*1","v":0},{"$f":"COUNT(D4)*3","v":0},null,{"$f":"SUM(E2-E3)","v":501},"Rest",null,"RD 1",{"$f":"COUNT(K4)*1","v":0},{"$f":"COUNT(K4)*3","v":0},null,{"$f":"SUM(L2-L3)","v":501},"Rest",null,"RD 1",{"$f":"COUNT(R4)*1","v":0},{"$f":"COUNT(R4)*3","v":0},null,{"$f":"SUM(S2-S3)","v":501},"Rest",null,"RD 1",{"$f":"COUNT(Y4)*1","v":0},{"$f":"COUNT(Y4)*3","v":0},null,{"$f":"SUM(Z2-Z3)","v":501},"Rest",null,null,null,{"$error":"#REF!"}]
["RD 2",0,0,null,null,null,null,"RD 2",0,0,null,null,null,null,"RD 2",0,0,null,null,null,null,"RD 2",0,0]
["RD 3",0,0,null,"ø pro Spiel",{"$f":"SUM(E3)/B34","v":{"$error":"#DIV/0!"}},null,"RD 3",0,0,null,"ø pro Spiel",{"$f":"SUM(L3)/I34","v":{"$error":"#DIV/0!"}},null,"RD 3",0,0,null,"ø pro Spiel",{"$f":"SUM(S3)/P34","v":{"$error":"#DIV/0!"}},null,"RD 3",0,0,null,null,{"$f":"SUM(Z3)/W34","v":{"$error":"#DIV/0!"}}]
["RD 4",0,0,null,"ø pro Pfeil",{"$f":"SUM(E3)/C34","v":{"$error":"#DIV/0!"}},null,"RD 4",0,0,null,"ø pro Pfeil",{"$f":"SUM(L3)/J34","v":{"$error":"#DIV/0!"}},null,"RD 4",0,0,null,"ø pro Pfeil",{"$f":"SUM(S3)/Q34","v":{"$error":"#DIV/0!"}},null,"RD 4",0,0,null,"ø pro Pfeil",{"$f":"SUM(Z3)/X34","v":{"$error":"#DIV/0!"}}]
["RD 5",0,0,null,"Average",null,null,"RD 5",0,0,null,"Average",null,null,"RD 5",0,0,null,"Average",null,null,"RD 5",0,0,null,"Average"]
["RD 6",0,0,null,{"$f":"SUM(F6)","v":{"$error":"#DIV/0!"}},null,null,"RD 6",0,0,null,{"$f":"SUM(M6)","v":{"$error":"#DIV/0!"}},null,null,"RD 6",0,0,null,{"$f":"SUM(T6)","v":{"$error":"#DIV/0!"}},null,null,"RD 6",0,0,null,{"$f":"SUM(AA6)","v":{"$error":"#DIV/0!"}}]
["RD 7",0,0,null,null,null,null,"RD 7",0,0,null,null,null,null,"RD 7",0,0,null,null,null,null,"RD 7",0,0]
["RD 8",0,0,null,{"$f":"IF(F6<40,\"Nicht Gut\",\"\")","v":{"$error":"#DIV/0!"}},null,null,"RD 8",0,0,null,{"$f":"IF(M6<40,\"Nicht Gut\",\"\")","v":{"$error":"#DIV/0!"}},null,null,"RD 8",0,0,null,{"$f":"IF(T6<40,\"Nicht Gut\",\"\")","v":{"$error":"#DIV/0!"}},null,null,"RD 8",0,0,null,{"$f":"IF(AA6<40,\"Nicht Gut\",\"\")","v":{"$error":"#DIV/0!"}}]
["RD 9",0,0,null,null,null,null,"RD 9",0,0,null,null,null,null,"RD 9",0,0,null,null,null,null,"RD 9",0,0]
["RD 10",0,0,null,null,null,null,"RD 10",0,0,null,null,null,null,"RD 10",0,0,null,null,null,null,"RD 10",0,0]
["RD 11",0,0,null,{"$f":"IF(AND(F6>=39,F6<=50),\"GUT\",\"\")","v":{"$error":"#DIV/0!"}},null,null,"RD 11",0,0,null,{"$f":"IF(AND(M6>=39,M6<=50),\"GUT\",\"\")","v":{"$error":"#DIV/0!"}},null,null,"RD 11",0,0,null,{"$f":"IF(AND(T6>=39,T6<=50),\"GUT\",\"\")","v":{"$error":"#DIV/0!"}},null,null,"RD 11",0,0,null,{"$f":"IF(AND(AA6>=39,AA6<=50),\"GUT\",\"\")","v":{"$error":"#DIV/0!"}}]
["RD 12",0,0,null,null,null,null,"RD 12",0,0,null,null,null,null,"RD 12",0,0,null,null,null,null,"RD 12",0,0]
["RD 13",0,0,null,null,null,null,"RD 13",0,0,null,null,null,null,"RD 13",0,0,null,null,null,null,"RD 13",0,0]
["RD 14",0,0,null,null,null,null,"RD 14",0,0,null,null,null,null,"RD 14",0,0,null,null,null,null,"RD 14",0,0]
["RD 15",0,0,null,null,null,null,"RD 15",0,0,null,null,null,null,"RD 15",0,0,null,null,null,null,"RD 15",0,0]
["RD 16",0,0,null,{"$f":"IF(F6>49,\"Sehr Gut\",\"\")","v":{"$error":"#DIV/0!"}},null,null,"RD 16",0,0,null,{"$f":"IF(M6>49,\"Sehr Gut\",\"\")","v":{"$error":"#DIV/0!"}},null,null,"RD 16",0,0,null,{"$f":"IF(T6>49,\"Sehr Gut\",\"\")","v":{"$error":"#DIV/0!"}},null,null,"RD 16",0,0,null,{"$f":"IF(AA6>49,\"Sehr Gut\",\"\")","v":{"$error":"#DIV/0!"}}]
["RD 17",0,0,null,null,null,null,"RD 17",0,0,null,null,null,null,"RD 17",0,0,null,null,null,null,"RD 17",0,0]
["RD 18",0,0,null,null,null,null,"RD 18",0,0,null,null,null,null,"RD 18",0,0,null,null,null,null,"RD 18",0,0]
["RD 19",0,0,null,null,null,null,"RD 19",0,0,null,null,null,null,"RD 19",0,0,null,null,null,null,"RD 19",0,0]
["RD 20",0,0,null,null,null,null,"RD 20",0,0,null,null,null,null,"RD 20",0,0,null,null,null,null,"RD 20",0,0]
["RD 21",0,0,null,"Rest:",{"$f":"E4","v":501},null,"RD 21",0,0,null,"Rest:",{"$f":"L4","v":501},null,"RD 21",0,0,null,"Rest:",{"$f":"S4","v":501},null,"RD 21",0,0,null,"Rest:",{"$f":"Z4","v":501}]
["RD 22",0,0,null,{"$f":"D1","v":{"$error":"#REF!"}},null,null,"RD 22",0,0,null,{"$f":"K1","v":{"$error":"#REF!"}},null,null,"RD 22",0,0,null,{"$f":"R1","v":{"$error":"#REF!"}},null,null,"RD 22",0,0,null,{"$f":"Y1","v":{"$error":"#REF!"}}]
["RD 23",0,0,null,null,null,null,"RD 23",0,0,null,null,null,null,"RD 23",0,0,null,null,null,null,"RD 23",0,0]
["RD 24",0,0,null,{"$f":"IF(S4<L4+Z4,\"Darf\",IF(S4>L4+Z4,\"Darf nicht\",IF(S4=L4+Z4,\"Darf\"\"\")))","v":"Darf"},null,null,"RD 24",0,0,null,{"$f":"IF(Z4<E4+S4,\"Darf\",IF(Z4>E4+S4,\"Darf nicht\",IF(Z4=E4+S4,\"Darf\"\"\")))","v":"Darf"},null,null,"RD 24",0,0,null,{"$f":"IF(E4<L4+Z4,\"Darf\",IF(E4>L4+Z4,\"Darf nicht\",IF(E4=L4+Z4,\"Darf\"\"\")))","v":"Darf"},null,null,"RD 24",0,0,null,{"$f":"IF(L4<E4+S4,\"Darf\",IF(L4>E4+S4,\"Darf nicht\",IF(L4=E4+S4,\"Darf\"\"\")))","v":"Darf"}]
["RD 25",0,0,null,null,null,null,"RD 25",0,0,null,null,null,null,"RD 25",0,0,null,null,null,null,"RD 25",0,0]
["RD 26",0,0,null,null,null,null,"RD 26",0,0,null,null,null,null,"RD 26",0,0,null,null,null,null,"RD 26",0,0]
["RD 27",0,0,null,null,null,null,"RD 27",0,0,null,null,null,null,"RD 27",0,0,null,null,null,null,"RD 27",0,0]
["RD 28",0,0,null,null,null,null,"RD 28",0,0,null,null,null,null,"RD 28",0,0,null,null,null,null,"RD 28",0,0]
["RD 29",0,0,null,{"$f":"IF(E4=0,\"Sieg\",\"\")","v":""},null,null,"RD 29",0,0,null,{"$f":"IF(L4=0,\"Sieg\",\"\")","v":""},null,null,"RD 29",0,0,null,{"$f":"IF(S4=0,\"Sieg\",\"\")","v":""},null,null,"RD 29",0,0,null,{"$f":"IF(Z4=0,\"Sieg\",\"\")","v":""}]
["RD 30",0,0,null,null,null,null,"RD 30",0,0,null,null,null,null,"RD 30",0,0,null,null,null,null,"RD 30",0,0]
[null,{"$f":"SUM(B4:B33)","v":0},{"$f":"SUM(C4:C33)","v":0},{"$f":"SUM(D4:D33)","v":0},{"$f":"SUM(D4:D32)","v":0},null,null,null,{"$f":"SUM(I4:I33)","v":0},{"$f":"SUM(J4:J33)","v":0},{"$f":"SUM(K4:K33)","v":0},{"$f":"SUM(K4:K32)","v":0},null,null,null,{"$f":"SUM(P4:P33)","v":0},{"$f":"SUM(Q4:Q33)","v":0},{"$f":"SUM(R4:R33)","v":0},{"$f":"SUM(R4:R32)","v":0},null,null,null,{"$f":"SUM(W4:W33)","v":0},{"$f":"SUM(X4:X33)","v":0},{"$f":"SUM(Y4:Y33)","v":0},{"$f":"SUM(Y4:Y32)","v":0}]
[null,null,null,{"$f":"D1","v":{"$error":"#REF!"}},null,{"$f":"SUM(E3)","v":0},null,null,null,null,{"$f":"INDEX(D35:D38,MATCH(LARGE(F35:F38,1),F35:F38,0))","v":{"$error":"#REF!"}}]
[null,null,null,{"$f":"K1","v":{"$error":"#REF!"}},null,{"$f":"SUM(L3)","v":0},null,null,null,null,{"$f":"INDEX(D35:D38,MATCH(LARGE(F35:F38,2),F35:F38,0))","v":{"$error":"#REF!"}}]
[null,null,null,{"$f":"R1","v":{"$error":"#REF!"}},null,{"$f":"SUM(S3)","v":0},null,null,null,null,{"$f":"INDEX(D35:D38,MATCH(LARGE(F35:F38,3),F35:F38,0))","v":{"$error":"#REF!"}}]
[null,null,null,{"$f":"Y1","v":{"$error":"#REF!"}},null,{"$f":"SUM(Z3)","v":0},null,null,null,null,{"$f":"INDEX(D35:D38,MATCH(LARGE(F35:F38,4),F35:F38,0))","v":{"$error":"#REF!"}}]
[null,null,null,"MAX(B2:B7",null,{"$f":"SUM(F35:F38)","v":0},null,null,null,null,null,null,null,null,null,null,null,null,null,null,null,null,null,null,null,null,null,null,null,null,"Ralf Kl."]
[null,null,null,null,null,null,null,null,null,null,null,null,null,null,null,null,null,null,null,null,null,null,null,null,null,null,null,null,null,null,"Volker"]
[null,null,null,null,null,null,null,null,null,null,null,null,null,null,null,null,null,null,null,null,null,null,null,null,null,null,null,null,null,null,"Rene"]
[null,null,null,null,1002,null,null,null,null,null,null,1002,null,null,null,null,null,null,null,null,null,null,null,null,null,null,{"$f":"RAND()","v":0.63809533969581622},null,null,null,"Nicole"]
[null,null,null,{"$f":"D1","v":{"$error":"#REF!"}},{"$f":"SUM(D13:D33)","v":0},null,null,null,null,null,{"$f":"K1","v":{"$error":"#REF!"}},{"$f":"SUM(K13:K33)","v":0},null,null,{"$f":"D1","v":{"$error":"#REF!"}},null,null,{"$f":"SUM(E46)","v":1002},null,{"$f":"INDEX(O43:O46,MATCH(LARGE(R43:R46,ROW(AE4)),R43:R46,0))","v":{"$error":"#REF!"}},null,null,null,null,null,{"$f":"'Rd.7'!Z43","v":"Ralfie"},{"$f":"RAND()","v":0.19924018702656665},null,null,null,"Frank"]
[null,null,null,{"$f":"R1","v":{"$error":"#REF!"}},{"$f":"SUM(R13:R33)","v":0},null,null,null,null,null,{"$f":"Y1","v":{"$error":"#REF!"}},{"$f":"SUM(Y13:Y33)","v":0},null,null,{"$f":"R1","v":{"$error":"#REF!"}},null,null,{"$f":"SUM(E46)+0.1","v":1002.1},null,{"$f":"INDEX(O43:O46,MATCH(LARGE(R43:R46,ROW(AE3)),R43:R46,0))","v":{"$error":"#REF!"}},null,null,null,null,null,{"$f":"'Rd.7'!Z44","v":"Siggi"},{"$f":"RAND()","v":0.73311051236782521},null,null,null,"Rosi"]
[null,null,null,null,{"$f":"SUM(E43:E44)","v":0},null,null,null,null,null,null,{"$f":"SUM(L43:L44)","v":0},null,null,{"$f":"K1","v":{"$error":"#REF!"}},null,null,{"$f":"L46/2","v":501},null,{"$f":"INDEX(O43:O46,MATCH(LARGE(R43:R46,ROW(AE2)),R43:R46,0))","v":{"$error":"#REF!"}},null,null,null,null,null,{"$f":"'Rd.7'!Z45","v":"Kerstin"},{"$f":"RAND()","v":8.4409902844301055E-2},null,null,null,"Werner"]
[null,null,null,null,{"$f":"SUM(E42-E45)","v":1002},null,null,null,null,null,null,{"$f":"SUM(L42-L45)","v":1002},null,null,{"$f":"Y1","v":{"$error":"#REF!"}},null,null,{"$f":"L46/2+0.1","v":501.1},null,{"$f":"INDEX(O43:O46,MATCH(LARGE(R43:R46,ROW(AE1)),R43:R46,0))","v":{"$error":"#REF!"}},null,null,null,null,null,{"$f":"'Rd.7'!Z46","v":"Christian"},{"$f":"RAND()","v":0.60863129342054489},null,null,null,"Gast"]
[null,null,null,null,null,null,null,null,null,null,null,null,null,null,null,null,null,null,null,null,null,null,null,null,null,null,null,null,null,null,"Joker"]
[null,null,null,null,null,null,null,null,null,null,null,null,null,null,null,null,null,null,null,null,null,null,null,null,null,null,null,null,null,null,"Anja"]
[null,null,null,null,null,null,null,null,null,null,null,null,null,null,null,null,null,null,null,null,null,null,null,null,null,null,null,null,null,null,"Vincent"]
[null,null,null,null,null,null,null,null,null,null,null,null,null,null,null,null,null,null,null,null,null,null,null,null,null,null,null,null,null,null,"Erich"]
[null,null,null,{"$f":"D43","v":{"$error":"#REF!"}},{"$f":"E4","v":501},null,null,null,null,null,{"$f":"K43","v":{"$error":"#REF!"}},{"$f":"L4","v":501},null,null,null,null,null,null,null,null,null,null,null,null,null,null,null,null,null,null,"Siggi"]
[null,null,null,{"$f":"D44","v":{"$error":"#REF!"}},{"$f":"S4","v":501},null,null,null,null,null,{"$f":"K44","v":{"$error":"#REF!"}},{"$f":"Z4","v":501},null,null,null,null,null,null,null,null,null,null,null,null,null,null,null,null,null,null,"Ralf M."]
[null,null,null,null,{"$f":"SUM(E51:E52)","v":1002},null,null,null,null,null,null,{"$f":"SUM(L51:L52)","v":1002},null,null,null,null,null,null,null,null,null,null,null,null,null,null,null,null,null,null,"Dirk B."]
[null,null,null,null,null,null,null,null,null,null,null,null,null,null,null,null,null,null,null,null,null,null,null,null,null,null,null,null,null,null,"Stefan"]
[null,null,null,{"$f":"D51","v":{"$error":"#REF!"}},{"$f":"E51","v":501},{"$f":"SUM(E57:E58)-E56","v":501},null,null,{"$f":"INDEX(E$55:E$58,MATCH(LARGE(F$55:F$58,1),F$55:F$58,0))","v":501},{"$f":"INDEX(F$55:F$58,MATCH(LARGE(G$55:G$58,1),G$55:G$58,0))","v":{"$error":"#NUM!"}},null,null,null,null,null,null,null,null,null,null,null,null,null,null,null,null,null,null,null,null,"Micha"]
[null,null,null,{"$f":"D52","v":{"$error":"#REF!"}},{"$f":"E52","v":501},{"$f":"SUM(E57:E58)-E55","v":501}]
[null,null,null,{"$f":"K51","v":{"$error":"#REF!"}},{"$f":"L51","v":501},{"$f":"SUM(E55:E56)-E58","v":501}]
[null,null,null,{"$f":"K52","v":{"$error":"#REF!"}},{"$f":"L52","v":501}]

{"sheet":"Rd.9","index":8,"n_rows":58,"n_cols":31,"rows_kept":58,"cut":false,"hidden":false,"merged":[[13,25,16,26],[17,25,17,26],[18,25,22,26],[17,11,17,12],[18,11,22,12],[10,18,11,19],[12,18,12,19],[13,18,16,19],[17,18,17,19],[18,18,22,19],[0,24,0,25],[7,4,7,5],[7,11,7,12],[7,18,7,19],[7,25,7,26],[0,3,0,4],[0,10,0,11],[0,17,0,18],[31,18,32,19],[31,25,32,26],[26,4,30,5],[26,11,30,12],[26,18,30,19],[26,25,30,26],[17,4,17,5],[18,4,22,5],[13,11,16,12],[31,4,32,5],[31,11,32,12],[8,25,9,26],[8,4,9,5],[10,25,11,26],[12,25,12,26],[38,3,38,4],[8,11,9,12],[8,18,9,19],[24,4,25,5],[24,11,25,12],[24,18,25,19],[10,4,11,5],[12,4,12,5],[10,11,11,12],[12,11,12,12],[24,25,25,26],[13,4,16,5]]}
[null,null,null,{"$f":"'Rd.8'!AE4","v":{"$error":"#REF!"}},null,"Sp.1",null,null,null,null,{"$f":"'Rd.8'!AE2","v":{"$error":"#REF!"}},null,"Sp.2",null,null,null,null,{"$f":"'Rd.8'!AE3","v":{"$error":"#REF!"}},null,"Sp.3",null,null,null,null,{"$f":"'Rd.8'!AE1","v":{"$error":"#REF!"}},null,"Sp.4",null,null,null,{"$f":"K35","v":{"$error":"#REF!"}}]
[null,null,null,"Punkte",501,"Start",null,null,null,null,"Punkte",501,"Start",null,null,null,null,"Punkte",501,"Start",null,null,null,null,"Punkte",501,"Start",null,null,null,{"$f":"K36","v":{"$error":"#REF!"}}]
[null,null,null,"Geworfen",{"$f":"SUM(D34)","v":0},"Punkte",null,null,null,null,"Geworfen",{"$f":"SUM(K34)","v":0},"Punkte",null,null,null,null,"Geworfen",{"$f":"SUM(R34)","v":0},"Punkte",null,null,null,null,"Geworfen",{"$f":"SUM(Y34)","v":0},"Punkte",null,null,null,{"$error":"#REF!"}]
["RD 1",{"$f":"COUNT(D4)*1","v":0},{"$f":"COUNT(D4)*3","v":0},null,{"$f":"SUM(E2-E3)","v":501},"Rest",null,"RD 1",{"$f":"COUNT(K4)*1","v":0},{"$f":"COUNT(K4)*3","v":0},null,{"$f":"SUM(L2-L3)","v":501},"Rest",null,"RD 1",{"$f":"COUNT(R4)*1","v":0},{"$f":"COUNT(R4)*3","v":0},null,{"$f":"SUM(S2-S3)","v":501},"Rest",null,"RD 1",{"$f":"COUNT(Y4)*1","v":0},{"$f":"COUNT(Y4)*3","v":0},null,{"$f":"SUM(Z2-Z3)","v":501},"Rest",null,null,null,{"$error":"#REF!"}]
["RD 2",0,0,null,null,null,null,"RD 2",0,0,null,null,null,null,"RD 2",0,0,null,null,null,null,"RD 2",0,0]
["RD 3",0,0,null,"ø pro Spiel",{"$f":"SUM(E3)/B34","v":{"$error":"#DIV/0!"}},null,"RD 3",0,0,null,"ø pro Spiel",{"$f":"SUM(L3)/I34","v":{"$error":"#DIV/0!"}},null,"RD 3",0,0,null,"ø pro Spiel",{"$f":"SUM(S3)/P34","v":{"$error":"#DIV/0!"}},null,"RD 3",0,0,null,null,{"$f":"SUM(Z3)/W34","v":{"$error":"#DIV/0!"}}]
["RD 4",0,0,null,"ø pro Pfeil",{"$f":"SUM(E3)/C34","v":{"$error":"#DIV/0!"}},null,"RD 4",0,0,null,"ø pro Pfeil",{"$f":"SUM(L3)/J34","v":{"$error":"#DIV/0!"}},null,"RD 4",0,0,null,"ø pro Pfeil",{"$f":"SUM(S3)/Q34","v":{"$error":"#DIV/0!"}},null,"RD 4",0,0,null,"ø pro Pfeil",{"$f":"SUM(Z3)/X34","v":{"$error":"#DIV/0!"}}]
["RD 5",0,0,null,"Average",null,null,"RD 5",0,0,null,"Average",null,null,"RD 5",0,0,null,"Average",null,null,"RD 5",0,0,null,"Average"]
["RD 6",0,0,null,{"$f":"SUM(F6)","v":{"$error":"#DIV/0!"}},null,null,"RD 6",0,0,null,{"$f":"SUM(M6)","v":{"$error":"#DIV/0!"}},null,null,"RD 6",0,0,null,{"$f":"SUM(T6)","v":{"$error":"#DIV/0!"}},null,null,"RD 6",0,0,null,{"$f":"SUM(AA6)","v":{"$error":"#DIV/0!"}}]
["RD 7",0,0,null,null,null,null,"RD 7",0,0,null,null,null,null,"RD 7",0,0,null,null,null,null,"RD 7",0,0]
["RD 8",0,0,null,{"$f":"IF(F6<40,\"Nicht Gut\",\"\")","v":{"$error":"#DIV/0!"}},null,null,"RD 8",0,0,null,{"$f":"IF(M6<40,\"Nicht Gut\",\"\")","v":{"$error":"#DIV/0!"}},null,null,"RD 8",0,0,null,{"$f":"IF(T6<40,\"Nicht Gut\",\"\")","v":{"$error":"#DIV/0!"}},null,null,"RD 8",0,0,null,{"$f":"IF(AA6<40,\"Nicht Gut\",\"\")","v":{"$error":"#DIV/0!"}}]
["RD 9",0,0,null,null,null,null,"RD 9",0,0,null,null,null,null,"RD 9",0,0,null,null,null,null,"RD 9",0,0]
["RD 10",0,0,null,null,null,null,"RD 10",0,0,null,null,null,null,"RD 10",0,0,null,null,null,null,"RD 10",0,0]
["RD 11",0,0,null,{"$f":"IF(AND(F6>=39,F6<=50),\"GUT\",\"\")","v":{"$error":"#DIV/0!"}},null,null,"RD 11",0,0,null,{"$f":"IF(AND(M6>=39,M6<=50),\"GUT\",\"\")","v":{"$error":"#DIV/0!"}},null,null,"RD 11",0,0,null,{"$f":"IF(AND(T6>=39,T6<=50),\"GUT\",\"\")","v":{"$error":"#DIV/0!"}},null,null,"RD 11",0,0,null,{"$f":"IF(AND(AA6>=39,AA6<=50),\"GUT\",\"\")","v":{"$error":"#DIV/0!"}}]
["RD 12",0,0,null,null,null,null,"RD 12",0,0,null,null,null,null,"RD 12",0,0,null,null,null,null,"RD 12",0,0]
["RD 13",0,0,null,null,null,null,"RD 13",0,0,null,null,null,null,"RD 13",0,0,null,null,null,null,"RD 13",0,0]
["RD 14",0,0,null,null,null,null,"RD 14",0,0,null,null,null,null,"RD 14",0,0,null,null,null,null,"RD 14",0,0]
["RD 15",0,0,null,null,null,null,"RD 15",0,0,null,null,null,null,"RD 15",0,0,null,null,null,null,"RD 15",0,0]
["RD 16",0,0,null,{"$f":"IF(F6>49,\"Sehr Gut\",\"\")","v":{"$error":"#DIV/0!"}},null,null,"RD 16",0,0,null,{"$f":"IF(M6>49,\"Sehr Gut\",\"\")","v":{"$error":"#DIV/0!"}},null,null,"RD 16",0,0,null,{"$f":"IF(T6>49,\"Sehr Gut\",\"\")","v":{"$error":"#DIV/0!"}},null,null,"RD 16",0,0,null,{"$f":"IF(AA6>49,\"Sehr Gut\",\"\")","v":{"$error":"#DIV/0!"}}]
["RD 17",0,0,null,null,null,null,"RD 17",0,0,null,null,null,null,"RD 17",0,0,null,null,null,null,"RD 17",0,0]
["RD 18",0,0,null,null,null,null,"RD 18",0,0,null,null,null,null,"RD 18",0,0,null,null,null,null,"RD 18",0,0]
["RD 19",0,0,null,null,null,null,"RD 19",0,0,null,null,null,null,"RD 19",0,0,null,null,null,null,"RD 19",0,0]
["RD 20",0,0,null,null,null,null,"RD 20",0,0,null,null,null,null,"RD 20",0,0,null,null,null,null,"RD 20",0,0]
["RD 21",0,0,null,"Rest:",{"$f":"E4","v":501},null,"RD 21",0,0,null,"Rest:",{"$f":"L4","v":501},null,"RD 21",0,0,null,"Rest:",{"$f":"S4","v":501},null,"RD 21",0,0,null,"Rest:",{"$f":"Z4","v":501}]
["RD 22",0,0,null,{"$f":"D1","v":{"$error":"#REF!"}},null,null,"RD 22",0,0,null,{"$f":"K1","v":{"$error":"#REF!"}},null,null,"RD 22",0,0,null,{"$f":"R1","v":{"$error":"#REF!"}},null,null,"RD 22",0,0,null,{"$f":"Y1","v":{"$error":"#REF!"}}]
["RD 23",0,0,null,null,null,null,"RD 23",0,0,null,null,null,null,"RD 23",0,0,null,null,null,null,"RD 23",0,0]
["RD 24",0,0,null,{"$f":"IF(S4<L4+Z4,\"Darf\",IF(S4>L4+Z4,\"Darf nicht\",IF(S4=L4+Z4,\"Darf\"\"\")))","v":"Darf"},null,null,"RD 24",0,0,null,{"$f":"IF(Z4<E4+S4,\"Darf\",IF(Z4>E4+S4,\"Darf nicht\",IF(Z4=E4+S4,\"Darf\"\"\")))","v":"Darf"},null,null,"RD 24",0,0,null,{"$f":"IF(E4<L4+Z4,\"Darf\",IF(E4>L4+Z4,\"Darf nicht\",IF(E4=L4+Z4,\"Darf\"\"\")))","v":"Darf"},null,null,"RD 24",0,0,null,{"$f":"IF(L4<E4+S4,\"Darf\",IF(L4>E4+S4,\"Darf nicht\",IF(L4=E4+S4,\"Darf\"\"\")))","v":"Darf"}]
["RD 25",0,0,null,null,null,null,"RD 25",0,0,null,null,null,null,"RD 25",0,0,null,null,null,null,"RD 25",0,0]
["RD 26",0,0,null,null,null,null,"RD 26",0,0,null,null,null,null,"RD 26",0,0,null,null,null,null,"RD 26",0,0]
["RD 27",0,0,null,null,null,null,"RD 27",0,0,null,null,null,null,"RD 27",0,0,null,null,null,null,"RD 27",0,0]
["RD 28",0,0,null,null,null,null,"RD 28",0,0,null,null,null,null,"RD 28",0,0,null,null,null,null,"RD 28",0,0]
["RD 29",0,0,null,{"$f":"IF(E4=0,\"Sieg\",\"\")","v":""},null,null,"RD 29",0,0,null,{"$f":"IF(L4=0,\"Sieg\",\"\")","v":""},null,null,"RD 29",0,0,null,{"$f":"IF(S4=0,\"Sieg\",\"\")","v":""},null,null,"RD 29",0,0,null,{"$f":"IF(Z4=0,\"Sieg\",\"\")","v":""}]
["RD 30",0,0,null,null,null,null,"RD 30",0,0,null,null,null,null,"RD 30",0,0,null,null,null,null,"RD 30",0,0]
[null,{"$f":"SUM(B4:B33)","v":0},{"$f":"SUM(C4:C33)","v":0},{"$f":"SUM(D4:D33)","v":0},{"$f":"SUM(D4:D32)","v":0},null,null,null,{"$f":"SUM(I4:I33)","v":0},{"$f":"SUM(J4:J33)","v":0},{"$f":"SUM(K4:K33)","v":0},{"$f":"SUM(K4:K32)","v":0},null,null,null,{"$f":"SUM(P4:P33)","v":0},{"$f":"SUM(Q4:Q33)","v":0},{"$f":"SUM(R4:R33)","v":0},{"$f":"SUM(R4:R32)","v":0},null,null,null,{"$f":"SUM(W4:W33)","v":0},{"$f":"SUM(X4:X33)","v":0},{"$f":"SUM(Y4:Y33)","v":0},{"$f":"SUM(Y4:Y32)","v":0}]
[null,null,null,{"$f":"D1","v":{"$error":"#REF!"}},null,{"$f":"SUM(E3)","v":0},null,null,null,null,{"$f":"INDEX(D35:D38,MATCH(LARGE(F35:F38,1),F35:F38,0))","v":{"$error":"#REF!"}}]
[null,null,null,{"$f":"K1","v":{"$error":"#REF!"}},null,{"$f":"SUM(L3)","v":0},null,null,null,null,{"$f":"INDEX(D35:D38,MATCH(LARGE(F35:F38,2),F35:F38,0))","v":{"$error":"#REF!"}}]
[null,null,null,{"$f":"R1","v":{"$error":"#REF!"}},null,{"$f":"SUM(S3)","v":0},null,null,null,null,{"$f":"INDEX(D35:D38,MATCH(LARGE(F35:F38,3),F35:F38,0))","v":{"$error":"#REF!"}}]
[null,null,null,{"$f":"Y1","v":{"$error":"#REF!"}},null,{"$f":"SUM(Z3)","v":0},null,null,null,null,{"$f":"INDEX(D35:D38,MATCH(LARGE(F35:F38,4),F35:F38,0))","v":{"$error":"#REF!"}}]
[null,null,null,"MAX(B2:B7",null,{"$f":"SUM(F35:F38)","v":0},null,null,null,null,null,null,null,null,null,null,null,null,null,null,null,null,null,null,null,null,null,null,null,null,"Ralf Kl."]
[null,null,null,null,null,null,null,null,null,null,null,null,null,null,null,null,null,null,null,null,null,null,null,null,null,null,null,null,null,null,"Volker"]
[null,null,null,null,null,null,null,null,null,null,null,null,null,null,null,null,null,null,null,null,null,null,null,null,null,null,null,null,null,null,"Rene"]
[null,null,null,null,1002,null,null,null,null,null,null,1002,null,null,null,null,null,null,null,null,null,null,null,null,null,null,{"$f":"RAND()","v":8.2684607032531887E-2},null,null,null,"Nicole"]
[null,null,null,{"$f":"D1","v":{"$error":"#REF!"}},{"$f":"SUM(D13:D33)","v":0},null,null,null,null,null,{"$f":"K1","v":{"$error":"#REF!"}},{"$f":"SUM(K13:K33)","v":0},null,null,{"$f":"D1","v":{"$error":"#REF!"}},null,null,{"$f":"SUM(E46)","v":1002},null,{"$f":"INDEX(O43:O46,MATCH(LARGE(R43:R46,ROW(AE4)),R43:R46,0))","v":{"$error":"#REF!"}},null,null,null,null,null,{"$f":"'Rd.8'!Z43","v":"Ralfie"},{"$f":"RAND()","v":0.32553591268523308},null,null,null,"Frank"]
[null,null,null,{"$f":"R1","v":{"$error":"#REF!"}},{"$f":"SUM(R13:R33)","v":0},null,null,null,null,null,{"$f":"Y1","v":{"$error":"#REF!"}},{"$f":"SUM(Y13:Y33)","v":0},null,null,{"$f":"R1","v":{"$error":"#REF!"}},null,null,{"$f":"SUM(E46)+0.1","v":1002.1},null,{"$f":"INDEX(O43:O46,MATCH(LARGE(R43:R46,ROW(AE3)),R43:R46,0))","v":{"$error":"#REF!"}},null,null,null,null,null,{"$f":"'Rd.8'!Z44","v":"Siggi"},{"$f":"RAND()","v":0.59761148918297025},null,null,null,"Rosi"]
[null,null,null,null,{"$f":"SUM(E43:E44)","v":0},null,null,null,null,null,null,{"$f":"SUM(L43:L44)","v":0},null,null,{"$f":"K1","v":{"$error":"#REF!"}},null,null,{"$f":"L46/2","v":501},null,{"$f":"INDEX(O43:O46,MATCH(LARGE(R43:R46,ROW(AE2)),R43:R46,0))","v":{"$error":"#REF!"}},null,null,null,null,null,{"$f":"'Rd.8'!Z45","v":"Kerstin"},{"$f":"RAND()","v":0.20546443113057822},null,null,null,"Werner"]
[null,null,null,null,{"$f":"SUM(E42-E45)","v":1002},null,null,null,null,null,null,{"$f":"SUM(L42-L45)","v":1002},null,null,{"$f":"Y1","v":{"$error":"#REF!"}},null,null,{"$f":"L46/2+0.1","v":501.1},null,{"$f":"INDEX(O43:O46,MATCH(LARGE(R43:R46,ROW(AE1)),R43:R46,0))","v":{"$error":"#REF!"}},null,null,null,null,null,{"$f":"'Rd.8'!Z46","v":"Christian"},{"$f":"RAND()","v":0.28583441695292588},null,null,null,"Gast"]
[null,null,null,null,null,null,null,null,null,null,null,null,null,null,null,null,null,null,null,null,null,null,null,null,null,null,null,null,null,null,"Joker"]
[null,null,null,null,null,null,null,null,null,null,null,null,null,null,null,null,null,null,null,null,null,null,null,null,null,null,null,null,null,null,"Anja"]
[null,null,null,null,null,null,null,null,null,null,null,null,null,null,null,null,null,null,null,null,null,null,null,null,null,null,null,null,null,null,"Vincent"]
[null,null,null,null,null,null,null,null,null,null,null,null,null,null,null,null,null,null,null,null,null,null,null,null,null,null,null,null,null,null,"Erich"]
[null,null,null,{"$f":"D43","v":{"$error":"#REF!"}},{"$f":"E4","v":501},null,null,null,null,null,{"$f":"K43","v":{"$error":"#REF!"}},{"$f":"L4","v":501},null,null,null,null,null,null,null,null,null,null,null,null,null,null,null,null,null,null,"Siggi"]
[null,null,null,{"$f":"D44","v":{"$error":"#REF!"}},{"$f":"S4","v":501},null,null,null,null,null,{"$f":"K44","v":{"$error":"#REF!"}},{"$f":"Z4","v":501},null,null,null,null,null,null,null,null,null,null,null,null,null,null,null,null,null,null,"Ralf M."]
[null,null,null,null,{"$f":"SUM(E51:E52)","v":1002},null,null,null,null,null,null,{"$f":"SUM(L51:L52)","v":1002},null,null,null,null,null,null,null,null,null,null,null,null,null,null,null,null,null,null,"Dirk B."]
[null,null,null,null,null,null,null,null,null,null,null,null,null,null,null,null,null,null,null,null,null,null,null,null,null,null,null,null,null,null,"Stefan"]
[null,null,null,{"$f":"D51","v":{"$error":"#REF!"}},{"$f":"E51","v":501},{"$f":"SUM(E57:E58)-E56","v":501},null,null,{"$f":"INDEX(E$55:E$58,MATCH(LARGE(F$55:F$58,1),F$55:F$58,0))","v":501},{"$f":"INDEX(F$55:F$58,MATCH(LARGE(G$55:G$58,1),G$55:G$58,0))","v":{"$error":"#NUM!"}},null,null,null,null,null,null,null,null,null,null,null,null,null,null,null,null,null,null,null,null,"Micha"]
[null,null,null,{"$f":"D52","v":{"$error":"#REF!"}},{"$f":"E52","v":501},{"$f":"SUM(E57:E58)-E55","v":501}]
[null,null,null,{"$f":"K51","v":{"$error":"#REF!"}},{"$f":"L51","v":501},{"$f":"SUM(E55:E56)-E58","v":501}]
[null,null,null,{"$f":"K52","v":{"$error":"#REF!"}},{"$f":"L52","v":501}]

{"sheet":"Rd.10","index":9,"n_rows":58,"n_cols":31,"rows_kept":58,"cut":false,"hidden":false,"merged":[[13,25,16,26],[17,25,17,26],[18,25,22,26],[17,11,17,12],[18,11,22,12],[10,18,11,19],[12,18,12,19],[13,18,16,19],[17,18,17,19],[18,18,22,19],[0,24,0,25],[7,4,7,5],[7,11,7,12],[7,18,7,19],[7,25,7,26],[0,3,0,4],[0,10,0,11],[0,17,0,18],[31,18,32,19],[31,25,32,26],[26,4,30,5],[26,11,30,12],[26,18,30,19],[26,25,30,26],[17,4,17,5],[18,4,22,5],[13,11,16,12],[31,4,32,5],[31,11,32,12],[8,25,9,26],[8,4,9,5],[10,25,11,26],[12,25,12,26],[38,3,38,4],[8,11,9,12],[8,18,9,19],[24,4,25,5],[24,11,25,12],[24,18,25,19],[10,4,11,5],[12,4,12,5],[10,11,11,12],[12,11,12,12],[24,25,25,26],[13,4,16,5]]}
[null,null,null,{"$f":"'Rd.9'!AE4","v":{"$error":"#REF!"}},null,"Sp.1",null,null,null,null,{"$f":"'Rd.9'!AE2","v":{"$error":"#REF!"}},null,"Sp.2",null,null,null,null,{"$f":"'Rd.9'!AE3","v":{"$error":"#REF!"}},null,"Sp.3",null,null,null,null,{"$f":"'Rd.9'!AE1","v":{"$error":"#REF!"}},null,"Sp.4",null,null,null,{"$f":"K35","v":{"$error":"#REF!"}}]
[null,null,null,"Punkte",501,"Start",null,null,null,null,"Punkte",501,"Start",null,null,null,null,"Punkte",501,"Start",null,null,null,null,"Punkte",501,"Start",null,null,null,{"$f":"K36","v":{"$error":"#REF!"}}]
[null,null,null,"Geworfen",{"$f":"SUM(D34)","v":0},"Punkte",null,null,null,null,"Geworfen",{"$f":"SUM(K34)","v":0},"Punkte",null,null,null,null,"Geworfen",{"$f":"SUM(R34)","v":0},"Punkte",null,null,null,null,"Geworfen",{"$f":"SUM(Y34)","v":0},"Punkte",null,null,null,{"$error":"#REF!"}]
["RD 1",{"$f":"COUNT(D4)*1","v":0},{"$f":"COUNT(D4)*3","v":0},null,{"$f":"SUM(E2-E3)","v":501},"Rest",null,"RD 1",{"$f":"COUNT(K4)*1","v":0},{"$f":"COUNT(K4)*3","v":0},null,{"$f":"SUM(L2-L3)","v":501},"Rest",null,"RD 1",{"$f":"COUNT(R4)*1","v":0},{"$f":"COUNT(R4)*3","v":0},null,{"$f":"SUM(S2-S3)","v":501},"Rest",null,"RD 1",{"$f":"COUNT(Y4)*1","v":0},{"$f":"COUNT(Y4)*3","v":0},null,{"$f":"SUM(Z2-Z3)","v":501},"Rest",null,null,null,{"$error":"#REF!"}]
["RD 2",0,0,null,null,null,null,"RD 2",0,0,null,null,null,null,"RD 2",0,0,null,null,null,null,"RD 2",0,0]
["RD 3",0,0,null,"ø pro Spiel",{"$f":"SUM(E3)/B34","v":{"$error":"#DIV/0!"}},null,"RD 3",0,0,null,"ø pro Spiel",{"$f":"SUM(L3)/I34","v":{"$error":"#DIV/0!"}},null,"RD 3",0,0,null,"ø pro Spiel",{"$f":"SUM(S3)/P34","v":{"$error":"#DIV/0!"}},null,"RD 3",0,0,null,null,{"$f":"SUM(Z3)/W34","v":{"$error":"#DIV/0!"}}]
["RD 4",0,0,null,"ø pro Pfeil",{"$f":"SUM(E3)/C34","v":{"$error":"#DIV/0!"}},null,"RD 4",0,0,null,"ø pro Pfeil",{"$f":"SUM(L3)/J34","v":{"$error":"#DIV/0!"}},null,"RD 4",0,0,null,"ø pro Pfeil",{"$f":"SUM(S3)/Q34","v":{"$error":"#DIV/0!"}},null,"RD 4",0,0,null,"ø pro Pfeil",{"$f":"SUM(Z3)/X34","v":{"$error":"#DIV/0!"}}]
["RD 5",0,0,null,"Average",null,null,"RD 5",0,0,null,"Average",null,null,"RD 5",0,0,null,"Average",null,null,"RD 5",0,0,null,"Average"]
["RD 6",0,0,null,{"$f":"SUM(F6)","v":{"$error":"#DIV/0!"}},null,null,"RD 6",0,0,null,{"$f":"SUM(M6)","v":{"$error":"#DIV/0!"}},null,null,"RD 6",0,0,null,{"$f":"SUM(T6)","v":{"$error":"#DIV/0!"}},null,null,"RD 6",0,0,null,{"$f":"SUM(AA6)","v":{"$error":"#DIV/0!"}}]
["RD 7",0,0,null,null,null,null,"RD 7",0,0,null,null,null,null,"RD 7",0,0,null,null,null,null,"RD 7",0,0]
["RD 8",0,0,null,{"$f":"IF(F6<40,\"Nicht Gut\",\"\")","v":{"$error":"#DIV/0!"}},null,null,"RD 8",0,0,null,{"$f":"IF(M6<40,\"Nicht Gut\",\"\")","v":{"$error":"#DIV/0!"}},null,null,"RD 8",0,0,null,{"$f":"IF(T6<40,\"Nicht Gut\",\"\")","v":{"$error":"#DIV/0!"}},null,null,"RD 8",0,0,null,{"$f":"IF(AA6<40,\"Nicht Gut\",\"\")","v":{"$error":"#DIV/0!"}}]
["RD 9",0,0,null,null,null,null,"RD 9",0,0,null,null,null,null,"RD 9",0,0,null,null,null,null,"RD 9",0,0]
["RD 10",0,0,null,null,null,null,"RD 10",0,0,null,null,null,null,"RD 10",0,0,null,null,null,null,"RD 10",0,0]
["RD 11",0,0,null,{"$f":"IF(AND(F6>=39,F6<=50),\"GUT\",\"\")","v":{"$error":"#DIV/0!"}},null,null,"RD 11",0,0,null,{"$f":"IF(AND(M6>=39,M6<=50),\"GUT\",\"\")","v":{"$error":"#DIV/0!"}},null,null,"RD 11",0,0,null,{"$f":"IF(AND(T6>=39,T6<=50),\"GUT\",\"\")","v":{"$error":"#DIV/0!"}},null,null,"RD 11",0,0,null,{"$f":"IF(AND(AA6>=39,AA6<=50),\"GUT\",\"\")","v":{"$error":"#DIV/0!"}}]
["RD 12",0,0,null,null,null,null,"RD 12",0,0,null,null,null,null,"RD 12",0,0,null,null,null,null,"RD 12",0,0]
["RD 13",0,0,null,null,null,null,"RD 13",0,0,null,null,null,null,"RD 13",0,0,null,null,null,null,"RD 13",0,0]
["RD 14",0,0,null,null,null,null,"RD 14",0,0,null,null,null,null,"RD 14",0,0,null,null,null,null,"RD 14",0,0]
["RD 15",0,0,null,null,null,null,"RD 15",0,0,null,null,null,null,"RD 15",0,0,null,null,null,null,"RD 15",0,0]
["RD 16",0,0,null,{"$f":"IF(F6>49,\"Sehr Gut\",\"\")","v":{"$error":"#DIV/0!"}},null,null,"RD 16",0,0,null,{"$f":"IF(M6>49,\"Sehr Gut\",\"\")","v":{"$error":"#DIV/0!"}},null,null,"RD 16",0,0,null,{"$f":"IF(T6>49,\"Sehr Gut\",\"\")","v":{"$error":"#DIV/0!"}},null,null,"RD 16",0,0,null,{"$f":"IF(AA6>49,\"Sehr Gut\",\"\")","v":{"$error":"#DIV/0!"}}]
["RD 17",0,0,null,null,null,null,"RD 17",0,0,null,null,null,null,"RD 17",0,0,null,null,null,null,"RD 17",0,0]
["RD 18",0,0,null,null,null,null,"RD 18",0,0,null,null,null,null,"RD 18",0,0,null,null,null,null,"RD 18",0,0]
["RD 19",0,0,null,null,null,null,"RD 19",0,0,null,null,null,null,"RD 19",0,0,null,null,null,null,"RD 19",0,0]
["RD 20",0,0,null,null,null,null,"RD 20",0,0,null,null,null,null,"RD 20",0,0,null,null,null,null,"RD 20",0,0]
["RD 21",0,0,null,"Rest:",{"$f":"E4","v":501},null,"RD 21",0,0,null,"Rest:",{"$f":"L4","v":501},null,"RD 21",0,0,null,"Rest:",{"$f":"S4","v":501},null,"RD 21",0,0,null,"Rest:",{"$f":"Z4","v":501}]
["RD 22",0,0,null,{"$f":"D1","v":{"$error":"#REF!"}},null,null,"RD 22",0,0,null,{"$f":"K1","v":{"$error":"#REF!"}},null,null,"RD 22",0,0,null,{"$f":"R1","v":{"$error":"#REF!"}},null,null,"RD 22",0,0,null,{"$f":"Y1","v":{"$error":"#REF!"}}]
["RD 23",0,0,null,null,null,null,"RD 23",0,0,null,null,null,null,"RD 23",0,0,null,null,null,null,"RD 23",0,0]
["RD 24",0,0,null,{"$f":"IF(S4<L4+Z4,\"Darf\",IF(S4>L4+Z4,\"Darf nicht\",IF(S4=L4+Z4,\"Darf\"\"\")))","v":"Darf"},null,null,"RD 24",0,0,null,{"$f":"IF(Z4<E4+S4,\"Darf\",IF(Z4>E4+S4,\"Darf nicht\",IF(Z4=E4+S4,\"Darf\"\"\")))","v":"Darf"},null,null,"RD 24",0,0,null,{"$f":"IF(E4<L4+Z4,\"Darf\",IF(E4>L4+Z4,\"Darf nicht\",IF(E4=L4+Z4,\"Darf\"\"\")))","v":"Darf"},null,null,"RD 24",0,0,null,{"$f":"IF(L4<E4+S4,\"Darf\",IF(L4>E4+S4,\"Darf nicht\",IF(L4=E4+S4,\"Darf\"\"\")))","v":"Darf"}]
["RD 25",0,0,null,null,null,null,"RD 25",0,0,null,null,null,null,"RD 25",0,0,null,null,null,null,"RD 25",0,0]
["RD 26",0,0,null,null,null,null,"RD 26",0,0,null,null,null,null,"RD 26",0,0,null,null,null,null,"RD 26",0,0]
["RD 27",0,0,null,null,null,null,"RD 27",0,0,null,null,null,null,"RD 27",0,0,null,null,null,null,"RD 27",0,0]
["RD 28",0,0,null,null,null,null,"RD 28",0,0,null,null,null,null,"RD 28",0,0,null,null,null,null,"RD 28",0,0]
["RD 29",0,0,null,{"$f":"IF(E4=0,\"Sieg\",\"\")","v":""},null,null,"RD 29",0,0,null,{"$f":"IF(L4=0,\"Sieg\",\"\")","v":""},null,null,"RD 29",0,0,null,{"$f":"IF(S4=0,\"Sieg\",\"\")","v":""},null,null,"RD 29",0,0,null,{"$f":"IF(Z4=0,\"Sieg\",\"\")","v":""}]
["RD 30",0,0,null,null,null,null,"RD 30",0,0,null,null,null,null,"RD 30",0,0,null,null,null,null,"RD 30",0,0]
[null,{"$f":"SUM(B4:B33)","v":0},{"$f":"SUM(C4:C33)","v":0},{"$f":"SUM(D4:D33)","v":0},{"$f":"SUM(D4:D32)","v":0},null,null,null,{"$f":"SUM(I4:I33)","v":0},{"$f":"SUM(J4:J33)","v":0},{"$f":"SUM(K4:K33)","v":0},{"$f":"SUM(K4:K32)","v":0},null,null,null,{"$f":"SUM(P4:P33)","v":0},{"$f":"SUM(Q4:Q33)","v":0},{"$f":"SUM(R4:R33)","v":0},{"$f":"SUM(R4:R32)","v":0},null,null,null,{"$f":"SUM(W4:W33)","v":0},{"$f":"SUM(X4:X33)","v":0},{"$f":"SUM(Y4:Y33)","v":0},{"$f":"SUM(Y4:Y32)","v":0}]
[null,null,null,{"$f":"D1","v":{"$error":"#REF!"}},null,{"$f":"SUM(E3)","v":0},null,null,null,null,{"$f":"INDEX(D35:D38,MATCH(LARGE(F35:F38,1),F35:F38,0))","v":{"$error":"#REF!"}}]
[null,null,null,{"$f":"K1","v":{"$error":"#REF!"}},null,{"$f":"SUM(L3)","v":0},null,null,null,null,{"$f":"INDEX(D35:D38,MATCH(LARGE(F35:F38,2),F35:F38,0))","v":{"$error":"#REF!"}}]
[null,null,null,{"$f":"R1","v":{"$error":"#REF!"}},null,{"$f":"SUM(S3)","v":0},null,null,null,null,{"$f":"INDEX(D35:D38,MATCH(LARGE(F35:F38,3),F35:F38,0))","v":{"$error":"#REF!"}}]
[null,null,null,{"$f":"Y1","v":{"$error":"#REF!"}},null,{"$f":"SUM(Z3)","v":0},null,null,null,null,{"$f":"INDEX(D35:D38,MATCH(LARGE(F35:F38,4),F35:F38,0))","v":{"$error":"#REF!"}}]
[null,null,null,"MAX(B2:B7",null,{"$f":"SUM(F35:F38)","v":0},null,null,null,null,null,null,null,null,null,null,null,null,null,null,null,null,null,null,null,null,null,null,null,null,"Ralf Kl."]
[null,null,null,null,null,null,null,null,null,null,null,null,null,null,null,null,null,null,null,null,null,null,null,null,null,null,null,null,null,null,"Volker"]
[null,null,null,null,null,null,null,null,null,null,null,null,null,null,null,null,null,null,null,null,null,null,null,null,null,null,null,null,null,null,"Rene"]
[null,null,null,null,1002,null,null,null,null,null,null,1002,null,null,null,null,null,null,null,null,null,null,null,null,null,null,{"$f":"RAND()","v":0.80841990304210476},null,null,null,"Nicole"]
[null,null,null,{"$f":"D1","v":{"$error":"#REF!"}},{"$f":"SUM(D13:D33)","v":0},null,null,null,null,null,{"$f":"K1","v":{"$error":"#REF!"}},{"$f":"SUM(K13:K33)","v":0},null,null,{"$f":"D1","v":{"$error":"#REF!"}},null,null,{"$f":"SUM(E46)","v":1002},null,{"$f":"INDEX(O43:O46,MATCH(LARGE(R43:R46,ROW(AE4)),R43:R46,0))","v":{"$error":"#REF!"}},null,null,null,null,null,{"$f":"'Rd.9'!Z43","v":"Ralfie"},{"$f":"RAND()","v":0.32779106651516843},null,null,null,"Frank"]
[null,null,null,{"$f":"R1","v":{"$error":"#REF!"}},{"$f":"SUM(R13:R33)","v":0},null,null,null,null,null,{"$f":"Y1","v":{"$error":"#REF!"}},{"$f":"SUM(Y13:Y33)","v":0},null,null,{"$f":"R1","v":{"$error":"#REF!"}},null,null,{"$f":"SUM(E46)+0.1","v":1002.1},null,{"$f":"INDEX(O43:O46,MATCH(LARGE(R43:R46,ROW(AE3)),R43:R46,0))","v":{"$error":"#REF!"}},null,null,null,null,null,{"$f":"'Rd.9'!Z44","v":"Siggi"},{"$f":"RAND()","v":0.17724238516069069},null,null,null,"Rosi"]
[null,null,null,null,{"$f":"SUM(E43:E44)","v":0},null,null,null,null,null,null,{"$f":"SUM(L43:L44)","v":0},null,null,{"$f":"K1","v":{"$error":"#REF!"}},null,null,{"$f":"L46/2","v":501},null,{"$f":"INDEX(O43:O46,MATCH(LARGE(R43:R46,ROW(AE2)),R43:R46,0))","v":{"$error":"#REF!"}},null,null,null,null,null,{"$f":"'Rd.9'!Z45","v":"Kerstin"},{"$f":"RAND()","v":0.47795660759244574},null,null,null,"Werner"]
[null,null,null,null,{"$f":"SUM(E42-E45)","v":1002},null,null,null,null,null,null,{"$f":"SUM(L42-L45)","v":1002},null,null,{"$f":"Y1","v":{"$error":"#REF!"}},null,null,{"$f":"L46/2+0.1","v":501.1},null,{"$f":"INDEX(O43:O46,MATCH(LARGE(R43:R46,ROW(AE1)),R43:R46,0))","v":{"$error":"#REF!"}},null,null,null,null,null,{"$f":"'Rd.9'!Z46","v":"Christian"},{"$f":"RAND()","v":0.10176427712200153},null,null,null,"Gast"]
[null,null,null,null,null,null,null,null,null,null,null,null,null,null,null,null,null,null,null,null,null,null,null,null,null,null,null,null,null,null,"Joker"]
[null,null,null,null,null,null,null,null,null,null,null,null,null,null,null,null,null,null,null,null,null,null,null,null,null,null,null,null,null,null,"Anja"]
[null,null,null,null,null,null,null,null,null,null,null,null,null,null,null,null,null,null,null,null,null,null,null,null,null,null,null,null,null,null,"Vincent"]
[null,null,null,null,null,null,null,null,null,null,null,null,null,null,null,null,null,null,null,null,null,null,null,null,null,null,null,null,null,null,"Erich"]
[null,null,null,{"$f":"D43","v":{"$error":"#REF!"}},{"$f":"E4","v":501},null,null,null,null,null,{"$f":"K43","v":{"$error":"#REF!"}},{"$f":"L4","v":501},null,null,null,null,null,null,null,null,null,null,null,null,null,null,null,null,null,null,"Siggi"]
[null,null,null,{"$f":"D44","v":{"$error":"#REF!"}},{"$f":"S4","v":501},null,null,null,null,null,{"$f":"K44","v":{"$error":"#REF!"}},{"$f":"Z4","v":501},null,null,null,null,null,null,null,null,null,null,null,null,null,null,null,null,null,null,"Ralf M."]
[null,null,null,null,{"$f":"SUM(E51:E52)","v":1002},null,null,null,null,null,null,{"$f":"SUM(L51:L52)","v":1002},null,null,null,null,null,null,null,null,null,null,null,null,null,null,null,null,null,null,"Dirk B."]
[null,null,null,null,null,null,null,null,null,null,null,null,null,null,null,null,null,null,null,null,null,null,null,null,null,null,null,null,null,null,"Stefan"]
[null,null,null,{"$f":"D51","v":{"$error":"#REF!"}},{"$f":"E51","v":501},{"$f":"SUM(E57:E58)-E56","v":501},null,null,{"$f":"INDEX(E$55:E$58,MATCH(LARGE(F$55:F$58,1),F$55:F$58,0))","v":501},{"$f":"INDEX(F$55:F$58,MATCH(LARGE(G$55:G$58,1),G$55:G$58,0))","v":{"$error":"#NUM!"}},null,null,null,null,null,null,null,null,null,null,null,null,null,null,null,null,null,null,null,null,"Micha"]
[null,null,null,{"$f":"D52","v":{"$error":"#REF!"}},{"$f":"E52","v":501},{"$f":"SUM(E57:E58)-E55","v":501}]
[null,null,null,{"$f":"K51","v":{"$error":"#REF!"}},{"$f":"L51","v":501},{"$f":"SUM(E55:E56)-E58","v":501}]
[null,null,null,{"$f":"K52","v":{"$error":"#REF!"}},{"$f":"L52","v":501}]

{"sheet":"Rd.11","index":10,"n_rows":58,"n_cols":31,"rows_kept":58,"cut":false,"hidden":false,"merged":[[13,25,16,26],[17,25,17,26],[18,25,22,26],[17,11,17,12],[18,11,22,12],[10,18,11,19],[12,18,12,19],[13,18,16,19],[17,18,17,19],[18,18,22,19],[0,24,0,25],[7,4,7,5],[7,11,7,12],[7,18,7,19],[7,25,7,26],[0,3,0,4],[0,10,0,11],[0,17,0,18],[31,18,32,19],[31,25,32,26],[26,4,30,5],[26,11,30,12],[26,18,30,19],[26,25,30,26],[17,4,17,5],[18,4,22,5],[13,11,16,12],[31,4,32,5],[31,11,32,12],[8,25,9,26],[8,4,9,5],[10,25,11,26],[12,25,12,26],[38,3,38,4],[8,11,9,12],[8,18,9,19],[24,4,25,5],[24,11,25,12],[24,18,25,19],[10,4,11,5],[12,4,12,5],[10,11,11,12],[12,11,12,12],[24,25,25,26],[13,4,16,5]]}
[null,null,null,{"$f":"'Rd.10'!AE4","v":{"$error":"#REF!"}},null,"Sp.1",null,null,null,null,{"$f":"'Rd.10'!AE2","v":{"$error":"#REF!"}},null,"Sp.2",null,null,null,null,{"$f":"'Rd.10'!AE3","v":{"$error":"#REF!"}},null,"Sp.3",null,null,null,null,{"$f":"'Rd.10'!AE1","v":{"$error":"#REF!"}},null,"Sp.4",null,null,null,{"$f":"K35","v":{"$error":"#REF!"}}]
[null,null,null,"Punkte",501,"Start",null,null,null,null,"Punkte",501,"Start",null,null,null,null,"Punkte",501,"Start",null,null,null,null,"Punkte",501,"Start",null,null,null,{"$f":"K36","v":{"$error":"#REF!"}}]
[null,null,null,"Geworfen",{"$f":"SUM(D34)","v":0},"Punkte",null,null,null,null,"Geworfen",{"$f":"SUM(K34)","v":0},"Punkte",null,null,null,null,"Geworfen",{"$f":"SUM(R34)","v":0},"Punkte",null,null,null,null,"Geworfen",{"$f":"SUM(Y34)","v":0},"Punkte",null,null,null,{"$error":"#REF!"}]
["RD 1",{"$f":"COUNT(D4)*1","v":0},{"$f":"COUNT(D4)*3","v":0},null,{"$f":"SUM(E2-E3)","v":501},"Rest",null,"RD 1",{"$f":"COUNT(K4)*1","v":0},{"$f":"COUNT(K4)*3","v":0},null,{"$f":"SUM(L2-L3)","v":501},"Rest",null,"RD 1",{"$f":"COUNT(R4)*1","v":0},{"$f":"COUNT(R4)*3","v":0},null,{"$f":"SUM(S2-S3)","v":501},"Rest",null,"RD 1",{"$f":"COUNT(Y4)*1","v":0},{"$f":"COUNT(Y4)*3","v":0},null,{"$f":"SUM(Z2-Z3)","v":501},"Rest",null,null,null,{"$error":"#REF!"}]
["RD 2",0,0,null,null,null,null,"RD 2",0,0,null,null,null,null,"RD 2",0,0,null,null,null,null,"RD 2",0,0]
["RD 3",0,0,null,"ø pro Spiel",{"$f":"SUM(E3)/B34","v":{"$error":"#DIV/0!"}},null,"RD 3",0,0,null,"ø pro Spiel",{"$f":"SUM(L3)/I34","v":{"$error":"#DIV/0!"}},null,"RD 3",0,0,null,"ø pro Spiel",{"$f":"SUM(S3)/P34","v":{"$error":"#DIV/0!"}},null,"RD 3",0,0,null,null,{"$f":"SUM(Z3)/W34","v":{"$error":"#DIV/0!"}}]
["RD 4",0,0,null,"ø pro Pfeil",{"$f":"SUM(E3)/C34","v":{"$error":"#DIV/0!"}},null,"RD 4",0,0,null,"ø pro Pfeil",{"$f":"SUM(L3)/J34","v":{"$error":"#DIV/0!"}},null,"RD 4",0,0,null,"ø pro Pfeil",{"$f":"SUM(S3)/Q34","v":{"$error":"#DIV/0!"}},null,"RD 4",0,0,null,"ø pro Pfeil",{"$f":"SUM(Z3)/X34","v":{"$error":"#DIV/0!"}}]
["RD 5",0,0,null,"Average",null,null,"RD 5",0,0,null,"Average",null,null,"RD 5",0,0,null,"Average",null,null,"RD 5",0,0,null,"Average"]
["RD 6",0,0,null,{"$f":"SUM(F6)","v":{"$error":"#DIV/0!"}},null,null,"RD 6",0,0,null,{"$f":"SUM(M6)","v":{"$error":"#DIV/0!"}},null,null,"RD 6",0,0,null,{"$f":"SUM(T6)","v":{"$error":"#DIV/0!"}},null,null,"RD 6",0,0,null,{"$f":"SUM(AA6)","v":{"$error":"#DIV/0!"}}]
["RD 7",0,0,null,null,null,null,"RD 7",0,0,null,null,null,null,"RD 7",0,0,null,null,null,null,"RD 7",0,0]
["RD 8",0,0,null,{"$f":"IF(F6<40,\"Nicht Gut\",\"\")","v":{"$error":"#DIV/0!"}},null,null,"RD 8",0,0,null,{"$f":"IF(M6<40,\"Nicht Gut\",\"\")","v":{"$error":"#DIV/0!"}},null,null,"RD 8",0,0,null,{"$f":"IF(T6<40,\"Nicht Gut\",\"\")","v":{"$error":"#DIV/0!"}},null,null,"RD 8",0,0,null,{"$f":"IF(AA6<40,\"Nicht Gut\",\"\")","v":{"$error":"#DIV/0!"}}]
["RD 9",0,0,null,null,null,null,"RD 9",0,0,null,null,null,null,"RD 9",0,0,null,null,null,null,"RD 9",0,0]
["RD 10",0,0,null,null,null,null,"RD 10",0,0,null,null,null,null,"RD 10",0,0,null,null,null,null,"RD 10",0,0]
["RD 11",0,0,null,{"$f":"IF(AND(F6>=39,F6<=50),\"GUT\",\"\")","v":{"$error":"#DIV/0!"}},null,null,"RD 11",0,0,null,{"$f":"IF(AND(M6>=39,M6<=50),\"GUT\",\"\")","v":{"$error":"#DIV/0!"}},null,null,"RD 11",0,0,null,{"$f":"IF(AND(T6>=39,T6<=50),\"GUT\",\"\")","v":{"$error":"#DIV/0!"}},null,null,"RD 11",0,0,null,{"$f":"IF(AND(AA6>=39,AA6<=50),\"GUT\",\"\")","v":{"$error":"#DIV/0!"}}]
["RD 12",0,0,null,null,null,null,"RD 12",0,0,null,null,null,null,"RD 12",0,0,null,null,null,null,"RD 12",0,0]
["RD 13",0,0,null,null,null,null,"RD 13",0,0,null,null,null,null,"RD 13",0,0,null,null,null,null,"RD 13",0,0]
["RD 14",0,0,null,null,null,null,"RD 14",0,0,null,null,null,null,"RD 14",0,0,null,null,null,null,"RD 14",0,0]
["RD 15",0,0,null,null,null,null,"RD 15",0,0,null,null,null,null,"RD 15",0,0,null,null,null,null,"RD 15",0,0]
["RD 16",0,0,null,{"$f":"IF(F6>49,\"Sehr Gut\",\"\")","v":{"$error":"#DIV/0!"}},null,null,"RD 16",0,0,null,{"$f":"IF(M6>49,\"Sehr Gut\",\"\")","v":{"$error":"#DIV/0!"}},null,null,"RD 16",0,0,null,{"$f":"IF(T6>49,\"Sehr Gut\",\"\")","v":{"$error":"#DIV/0!"}},null,null,"RD 16",0,0,null,{"$f":"IF(AA6>49,\"Sehr Gut\",\"\")","v":{"$error":"#DIV/0!"}}]
["RD 17",0,0,null,null,null,null,"RD 17",0,0,null,null,null,null,"RD 17",0,0,null,null,null,null,"RD 17",0,0]
["RD 18",0,0,null,null,null,null,"RD 18",0,0,null,null,null,null,"RD 18",0,0,null,null,null,null,"RD 18",0,0]
["RD 19",0,0,null,null,null,null,"RD 19",0,0,null,null,null,null,"RD 19",0,0,null,null,null,null,"RD 19",0,0]
["RD 20",0,0,null,null,null,null,"RD 20",0,0,null,null,null,null,"RD 20",0,0,null,null,null,null,"RD 20",0,0]
["RD 21",0,0,null,"Rest:",{"$f":"E4","v":501},null,"RD 21",0,0,null,"Rest:",{"$f":"L4","v":501},null,"RD 21",0,0,null,"Rest:",{"$f":"S4","v":501},null,"RD 21",0,0,null,"Rest:",{"$f":"Z4","v":501}]
["RD 22",0,0,null,{"$f":"D1","v":{"$error":"#REF!"}},null,null,"RD 22",0,0,null,{"$f":"K1","v":{"$error":"#REF!"}},null,null,"RD 22",0,0,null,{"$f":"R1","v":{"$error":"#REF!"}},null,null,"RD 22",0,0,null,{"$f":"Y1","v":{"$error":"#REF!"}}]
["RD 23",0,0,null,null,null,null,"RD 23",0,0,null,null,null,null,"RD 23",0,0,null,null,null,null,"RD 23",0,0]
["RD 24",0,0,null,{"$f":"IF(S4<L4+Z4,\"Darf\",IF(S4>L4+Z4,\"Darf nicht\",IF(S4=L4+Z4,\"Darf\"\"\")))","v":"Darf"},null,null,"RD 24",0,0,null,{"$f":"IF(Z4<E4+S4,\"Darf\",IF(Z4>E4+S4,\"Darf nicht\",IF(Z4=E4+S4,\"Darf\"\"\")))","v":"Darf"},null,null,"RD 24",0,0,null,{"$f":"IF(E4<L4+Z4,\"Darf\",IF(E4>L4+Z4,\"Darf nicht\",IF(E4=L4+Z4,\"Darf\"\"\")))","v":"Darf"},null,null,"RD 24",0,0,null,{"$f":"IF(L4<E4+S4,\"Darf\",IF(L4>E4+S4,\"Darf nicht\",IF(L4=E4+S4,\"Darf\"\"\")))","v":"Darf"}]
["RD 25",0,0,null,null,null,null,"RD 25",0,0,null,null,null,null,"RD 25",0,0,null,null,null,null,"RD 25",0,0]
["RD 26",0,0,null,null,null,null,"RD 26",0,0,null,null,null,null,"RD 26",0,0,null,null,null,null,"RD 26",0,0]
["RD 27",0,0,null,null,null,null,"RD 27",0,0,null,null,null,null,"RD 27",0,0,null,null,null,null,"RD 27",0,0]
["RD 28",0,0,null,null,null,null,"RD 28",0,0,null,null,null,null,"RD 28",0,0,null,null,null,null,"RD 28",0,0]
["RD 29",0,0,null,{"$f":"IF(E4=0,\"Sieg\",\"\")","v":""},null,null,"RD 29",0,0,null,{"$f":"IF(L4=0,\"Sieg\",\"\")","v":""},null,null,"RD 29",0,0,null,{"$f":"IF(S4=0,\"Sieg\",\"\")","v":""},null,null,"RD 29",0,0,null,{"$f":"IF(Z4=0,\"Sieg\",\"\")","v":""}]
["RD 30",0,0,null,null,null,null,"RD 30",0,0,null,null,null,null,"RD 30",0,0,null,null,null,null,"RD 30",0,0]
[null,{"$f":"SUM(B4:B33)","v":0},{"$f":"SUM(C4:C33)","v":0},{"$f":"SUM(D4:D33)","v":0},{"$f":"SUM(D4:D32)","v":0},null,null,null,{"$f":"SUM(I4:I33)","v":0},{"$f":"SUM(J4:J33)","v":0},{"$f":"SUM(K4:K33)","v":0},{"$f":"SUM(K4:K32)","v":0},null,null,null,{"$f":"SUM(P4:P33)","v":0},{"$f":"SUM(Q4:Q33)","v":0},{"$f":"SUM(R4:R33)","v":0},{"$f":"SUM(R4:R32)","v":0},null,null,null,{"$f":"SUM(W4:W33)","v":0},{"$f":"SUM(X4:X33)","v":0},{"$f":"SUM(Y4:Y33)","v":0},{"$f":"SUM(Y4:Y32)","v":0}]
[null,null,null,{"$f":"D1","v":{"$error":"#REF!"}},null,{"$f":"SUM(E3)","v":0},null,null,null,null,{"$f":"INDEX(D35:D38,MATCH(LARGE(F35:F38,1),F35:F38,0))","v":{"$error":"#REF!"}}]
[null,null,null,{"$f":"K1","v":{"$error":"#REF!"}},null,{"$f":"SUM(L3)","v":0},null,null,null,null,{"$f":"INDEX(D35:D38,MATCH(LARGE(F35:F38,2),F35:F38,0))","v":{"$error":"#REF!"}}]
[null,null,null,{"$f":"R1","v":{"$error":"#REF!"}},null,{"$f":"SUM(S3)","v":0},null,null,null,null,{"$f":"INDEX(D35:D38,MATCH(LARGE(F35:F38,3),F35:F38,0))","v":{"$error":"#REF!"}}]
[null,null,null,{"$f":"Y1","v":{"$error":"#REF!"}},null,{"$f":"SUM(Z3)","v":0},null,null,null,null,{"$f":"INDEX(D35:D38,MATCH(LARGE(F35:F38,4),F35:F38,0))","v":{"$error":"#REF!"}}]
[null,null,null,"MAX(B2:B7",null,{"$f":"SUM(F35:F38)","v":0},null,null,null,null,null,null,null,null,null,null,null,null,null,null,null,null,null,null,null,null,null,null,null,null,"Ralf Kl."]
[null,null,null,null,null,null,null,null,null,null,null,null,null,null,null,null,null,null,null,null,null,null,null,null,null,null,null,null,null,null,"Volker"]
[null,null,null,null,null,null,null,null,null,null,null,null,null,null,null,null,null,null,null,null,null,null,null,null,null,null,null,null,null,null,"Rene"]
[null,null,null,null,1002,null,null,null,null,null,null,1002,null,null,null,null,null,null,null,null,null,null,null,null,null,null,{"$f":"RAND()","v":0.73099453692342009},null,null,null,"Nicole"]
[null,null,null,{"$f":"D1","v":{"$error":"#REF!"}},{"$f":"SUM(D13:D33)","v":0},null,null,null,null,null,{"$f":"K1","v":{"$error":"#REF!"}},{"$f":"SUM(K13:K33)","v":0},null,null,{"$f":"D1","v":{"$error":"#REF!"}},null,null,{"$f":"SUM(E46)","v":1002},null,{"$f":"INDEX(O43:O46,MATCH(LARGE(R43:R46,ROW(AE4)),R43:R46,0))","v":{"$error":"#REF!"}},null,null,null,null,null,{"$f":"'Rd.10'!Z43","v":"Ralfie"},{"$f":"RAND()","v":0.93245636741176918},null,null,null,"Frank"]
[null,null,null,{"$f":"R1","v":{"$error":"#REF!"}},{"$f":"SUM(R13:R33)","v":0},null,null,null,null,null,{"$f":"Y1","v":{"$error":"#REF!"}},{"$f":"SUM(Y13:Y33)","v":0},null,null,{"$f":"R1","v":{"$error":"#REF!"}},null,null,{"$f":"SUM(E46)+0.1","v":1002.1},null,{"$f":"INDEX(O43:O46,MATCH(LARGE(R43:R46,ROW(AE3)),R43:R46,0))","v":{"$error":"#REF!"}},null,null,null,null,null,{"$f":"'Rd.10'!Z44","v":"Siggi"},{"$f":"RAND()","v":0.52977202009025715},null,null,null,"Rosi"]
[null,null,null,null,{"$f":"SUM(E43:E44)","v":0},null,null,null,null,null,null,{"$f":"SUM(L43:L44)","v":0},null,null,{"$f":"K1","v":{"$error":"#REF!"}},null,null,{"$f":"L46/2","v":501},null,{"$f":"INDEX(O43:O46,MATCH(LARGE(R43:R46,ROW(AE2)),R43:R46,0))","v":{"$error":"#REF!"}},null,null,null,null,null,{"$f":"'Rd.10'!Z45","v":"Kerstin"},{"$f":"RAND()","v":0.22153679172043916},null,null,null,"Werner"]
[null,null,null,null,{"$f":"SUM(E42-E45)","v":1002},null,null,null,null,null,null,{"$f":"SUM(L42-L45)","v":1002},null,null,{"$f":"Y1","v":{"$error":"#REF!"}},null,null,{"$f":"L46/2+0.1","v":501.1},null,{"$f":"INDEX(O43:O46,MATCH(LARGE(R43:R46,ROW(AE1)),R43:R46,0))","v":{"$error":"#REF!"}},null,null,null,null,null,{"$f":"'Rd.10'!Z46","v":"Christian"},{"$f":"RAND()","v":5.3759409640659728E-2},null,null,null,"Gast"]
[null,null,null,null,null,null,null,null,null,null,null,null,null,null,null,null,null,null,null,null,null,null,null,null,null,null,null,null,null,null,"Joker"]
[null,null,null,null,null,null,null,null,null,null,null,null,null,null,null,null,null,null,null,null,null,null,null,null,null,null,null,null,null,null,"Anja"]
[null,null,null,null,null,null,null,null,null,null,null,null,null,null,null,null,null,null,null,null,null,null,null,null,null,null,null,null,null,null,"Vincent"]
[null,null,null,null,null,null,null,null,null,null,null,null,null,null,null,null,null,null,null,null,null,null,null,null,null,null,null,null,null,null,"Erich"]
[null,null,null,{"$f":"D43","v":{"$error":"#REF!"}},{"$f":"E4","v":501},null,null,null,null,null,{"$f":"K43","v":{"$error":"#REF!"}},{"$f":"L4","v":501},null,null,null,null,null,null,null,null,null,null,null,null,null,null,null,null,null,null,"Siggi"]
[null,null,null,{"$f":"D44","v":{"$error":"#REF!"}},{"$f":"S4","v":501},null,null,null,null,null,{"$f":"K44","v":{"$error":"#REF!"}},{"$f":"Z4","v":501},null,null,null,null,null,null,null,null,null,null,null,null,null,null,null,null,null,null,"Ralf M."]
[null,null,null,null,{"$f":"SUM(E51:E52)","v":1002},null,null,null,null,null,null,{"$f":"SUM(L51:L52)","v":1002},null,null,null,null,null,null,null,null,null,null,null,null,null,null,null,null,null,null,"Dirk B."]
[null,null,null,null,null,null,null,null,null,null,null,null,null,null,null,null,null,null,null,null,null,null,null,null,null,null,null,null,null,null,"Stefan"]
[null,null,null,{"$f":"D51","v":{"$error":"#REF!"}},{"$f":"E51","v":501},{"$f":"SUM(E57:E58)-E56","v":501},null,null,{"$f":"INDEX(E$55:E$58,MATCH(LARGE(F$55:F$58,1),F$55:F$58,0))","v":501},{"$f":"INDEX(F$55:F$58,MATCH(LARGE(G$55:G$58,1),G$55:G$58,0))","v":{"$error":"#NUM!"}},null,null,null,null,null,null,null,null,null,null,null,null,null,null,null,null,null,null,null,null,"Micha"]
[null,null,null,{"$f":"D52","v":{"$error":"#REF!"}},{"$f":"E52","v":501},{"$f":"SUM(E57:E58)-E55","v":501}]
[null,null,null,{"$f":"K51","v":{"$error":"#REF!"}},{"$f":"L51","v":501},{"$f":"SUM(E55:E56)-E58","v":501}]
[null,null,null,{"$f":"K52","v":{"$error":"#REF!"}},{"$f":"L52","v":501}]

{"sheet":"Rd.12","index":11,"n_rows":58,"n_cols":31,"rows_kept":58,"cut":false,"hidden":false,"merged":[[13,25,16,26],[17,25,17,26],[18,25,22,26],[17,11,17,12],[18,11,22,12],[10,18,11,19],[12,18,12,19],[13,18,16,19],[17,18,17,19],[18,18,22,19],[0,24,0,25],[7,4,7,5],[7,11,7,12],[7,18,7,19],[7,25,7,26],[0,3,0,4],[0,10,0,11],[0,17,0,18],[31,18,32,19],[31,25,32,26],[26,4,30,5],[26,11,30,12],[26,18,30,19],[26,25,30,26],[17,4,17,5],[18,4,22,5],[13,11,16,12],[31,4,32,5],[31,11,32,12],[8,25,9,26],[8,4,9,5],[10,25,11,26],[12,25,12,26],[38,3,38,4],[8,11,9,12],[8,18,9,19],[24,4,25,5],[24,11,25,12],[24,18,25,19],[10,4,11,5],[12,4,12,5],[10,11,11,12],[12,11,12,12],[24,25,25,26],[13,4,16,5]]}
[null,null,null,{"$f":"'Rd.11'!AE4","v":{"$error":"#REF!"}},null,"Sp.1",null,null,null,null,{"$f":"'Rd.11'!AE2","v":{"$error":"#REF!"}},null,"Sp.2",null,null,null,null,{"$f":"'Rd.11'!AE3","v":{"$error":"#REF!"}},null,"Sp.3",null,null,null,null,{"$f":"'Rd.11'!AE1","v":{"$error":"#REF!"}},null,"Sp.4",null,null,null,{"$f":"K35","v":{"$error":"#REF!"}}]
[null,null,null,"Punkte",501,"Start",null,null,null,null,"Punkte",501,"Start",null,null,null,null,"Punkte",501,"Start",null,null,null,null,"Punkte",501,"Start",null,null,null,{"$f":"K36","v":{"$error":"#REF!"}}]
[null,null,null,"Geworfen",{"$f":"SUM(D34)","v":0},"Punkte",null,null,null,null,"Geworfen",{"$f":"SUM(K34)","v":0},"Punkte",null,null,null,null,"Geworfen",{"$f":"SUM(R34)","v":0},"Punkte",null,null,null,null,"Geworfen",{"$f":"SUM(Y34)","v":0},"Punkte",null,null,null,{"$error":"#REF!"}]
["RD 1",{"$f":"COUNT(D4)*1","v":0},{"$f":"COUNT(D4)*3","v":0},null,{"$f":"SUM(E2-E3)","v":501},"Rest",null,"RD 1",{"$f":"COUNT(K4)*1","v":0},{"$f":"COUNT(K4)*3","v":0},null,{"$f":"SUM(L2-L3)","v":501},"Rest",null,"RD 1",{"$f":"COUNT(R4)*1","v":0},{"$f":"COUNT(R4)*3","v":0},null,{"$f":"SUM(S2-S3)","v":501},"Rest",null,"RD 1",{"$f":"COUNT(Y4)*1","v":0},{"$f":"COUNT(Y4)*3","v":0},null,{"$f":"SUM(Z2-Z3)","v":501},"Rest",null,null,null,{"$error":"#REF!"}]
["RD 2",0,0,null,null,null,null,"RD 2",0,0,null,null,null,null,"RD 2",0,0,null,null,null,null,"RD 2",0,0]
["RD 3",0,0,null,"ø pro Spiel",{"$f":"SUM(E3)/B34","v":{"$error":"#DIV/0!"}},null,"RD 3",0,0,null,"ø pro Spiel",{"$f":"SUM(L3)/I34","v":{"$error":"#DIV/0!"}},null,"RD 3",0,0,null,"ø pro Spiel",{"$f":"SUM(S3)/P34","v":{"$error":"#DIV/0!"}},null,"RD 3",0,0,null,null,{"$f":"SUM(Z3)/W34","v":{"$error":"#DIV/0!"}}]
["RD 4",0,0,null,"ø pro Pfeil",{"$f":"SUM(E3)/C34","v":{"$error":"#DIV/0!"}},null,"RD 4",0,0,null,"ø pro Pfeil",{"$f":"SUM(L3)/J34","v":{"$error":"#DIV/0!"}},null,"RD 4",0,0,null,"ø pro Pfeil",{"$f":"SUM(S3)/Q34","v":{"$error":"#DIV/0!"}},null,"RD 4",0,0,null,"ø pro Pfeil",{"$f":"SUM(Z3)/X34","v":{"$error":"#DIV/0!"}}]
["RD 5",0,0,null,"Average",null,null,"RD 5",0,0,null,"Average",null,null,"RD 5",0,0,null,"Average",null,null,"RD 5",0,0,null,"Average"]
["RD 6",0,0,null,{"$f":"SUM(F6)","v":{"$error":"#DIV/0!"}},null,null,"RD 6",0,0,null,{"$f":"SUM(M6)","v":{"$error":"#DIV/0!"}},null,null,"RD 6",0,0,null,{"$f":"SUM(T6)","v":{"$error":"#DIV/0!"}},null,null,"RD 6",0,0,null,{"$f":"SUM(AA6)","v":{"$error":"#DIV/0!"}}]
["RD 7",0,0,null,null,null,null,"RD 7",0,0,null,null,null,null,"RD 7",0,0,null,null,null,null,"RD 7",0,0]
["RD 8",0,0,null,{"$f":"IF(F6<40,\"Nicht Gut\",\"\")","v":{"$error":"#DIV/0!"}},null,null,"RD 8",0,0,null,{"$f":"IF(M6<40,\"Nicht Gut\",\"\")","v":{"$error":"#DIV/0!"}},null,null,"RD 8",0,0,null,{"$f":"IF(T6<40,\"Nicht Gut\",\"\")","v":{"$error":"#DIV/0!"}},null,null,"RD 8",0,0,null,{"$f":"IF(AA6<40,\"Nicht Gut\",\"\")","v":{"$error":"#DIV/0!"}}]
["RD 9",0,0,null,null,null,null,"RD 9",0,0,null,null,null,null,"RD 9",0,0,null,null,null,null,"RD 9",0,0]
["RD 10",0,0,null,null,null,null,"RD 10",0,0,null,null,null,null,"RD 10",0,0,null,null,null,null,"RD 10",0,0]
["RD 11",0,0,null,{"$f":"IF(AND(F6>=39,F6<=50),\"GUT\",\"\")","v":{"$error":"#DIV/0!"}},null,null,"RD 11",0,0,null,{"$f":"IF(AND(M6>=39,M6<=50),\"GUT\",\"\")","v":{"$error":"#DIV/0!"}},null,null,"RD 11",0,0,null,{"$f":"IF(AND(T6>=39,T6<=50),\"GUT\",\"\")","v":{"$error":"#DIV/0!"}},null,null,"RD 11",0,0,null,{"$f":"IF(AND(AA6>=39,AA6<=50),\"GUT\",\"\")","v":{"$error":"#DIV/0!"}}]
["RD 12",0,0,null,null,null,null,"RD 12",0,0,null,null,null,null,"RD 12",0,0,null,null,null,null,"RD 12",0,0]
["RD 13",0,0,null,null,null,null,"RD 13",0,0,null,null,null,null,"RD 13",0,0,null,null,null,null,"RD 13",0,0]
["RD 14",0,0,null,null,null,null,"RD 14",0,0,null,null,null,null,"RD 14",0,0,null,null,null,null,"RD 14",0,0]
["RD 15",0,0,null,null,null,null,"RD 15",0,0,null,null,null,null,"RD 15",0,0,null,null,null,null,"RD 15",0,0]
["RD 16",0,0,null,{"$f":"IF(F6>49,\"Sehr Gut\",\"\")","v":{"$error":"#DIV/0!"}},null,null,"RD 16",0,0,null,{"$f":"IF(M6>49,\"Sehr Gut\",\"\")","v":{"$error":"#DIV/0!"}},null,null,"RD 16",0,0,null,{"$f":"IF(T6>49,\"Sehr Gut\",\"\")","v":{"$error":"#DIV/0!"}},null,null,"RD 16",0,0,null,{"$f":"IF(AA6>49,\"Sehr Gut\",\"\")","v":{"$error":"#DIV/0!"}}]
["RD 17",0,0,null,null,null,null,"RD 17",0,0,null,null,null,null,"RD 17",0,0,null,null,null,null,"RD 17",0,0]
["RD 18",0,0,null,null,null,null,"RD 18",0,0,null,null,null,null,"RD 18",0,0,null,null,null,null,"RD 18",0,0]
["RD 19",0,0,null,null,null,null,"RD 19",0,0,null,null,null,null,"RD 19",0,0,null,null,null,null,"RD 19",0,0]
["RD 20",0,0,null,null,null,null,"RD 20",0,0,null,null,null,null,"RD 20",0,0,null,null,null,null,"RD 20",0,0]
["RD 21",0,0,null,"Rest:",{"$f":"E4","v":501},null,"RD 21",0,0,null,"Rest:",{"$f":"L4","v":501},null,"RD 21",0,0,null,"Rest:",{"$f":"S4","v":501},null,"RD 21",0,0,null,"Rest:",{"$f":"Z4","v":501}]
["RD 22",0,0,null,{"$f":"D1","v":{"$error":"#REF!"}},null,null,"RD 22",0,0,null,{"$f":"K1","v":{"$error":"#REF!"}},null,null,"RD 22",0,0,null,{"$f":"R1","v":{"$error":"#REF!"}},null,null,"RD 22",0,0,null,{"$f":"Y1","v":{"$error":"#REF!"}}]
["RD 23",0,0,null,null,null,null,"RD 23",0,0,null,null,null,null,"RD 23",0,0,null,null,null,null,"RD 23",0,0]
["RD 24",0,0,null,{"$f":"IF(S4<L4+Z4,\"Darf\",IF(S4>L4+Z4,\"Darf nicht\",IF(S4=L4+Z4,\"Darf\"\"\")))","v":"Darf"},null,null,"RD 24",0,0,null,{"$f":"IF(Z4<E4+S4,\"Darf\",IF(Z4>E4+S4,\"Darf nicht\",IF(Z4=E4+S4,\"Darf\"\"\")))","v":"Darf"},null,null,"RD 24",0,0,null,{"$f":"IF(E4<L4+Z4,\"Darf\",IF(E4>L4+Z4,\"Darf nicht\",IF(E4=L4+Z4,\"Darf\"\"\")))","v":"Darf"},null,null,"RD 24",0,0,null,{"$f":"IF(L4<E4+S4,\"Darf\",IF(L4>E4+S4,\"Darf nicht\",IF(L4=E4+S4,\"Darf\"\"\")))","v":"Darf"}]
["RD 25",0,0,null,null,null,null,"RD 25",0,0,null,null,null,null,"RD 25",0,0,null,null,null,null,"RD 25",0,0]
["RD 26",0,0,null,null,null,null,"RD 26",0,0,null,null,null,null,"RD 26",0,0,null,null,null,null,"RD 26",0,0]
["RD 27",0,0,null,null,null,null,"RD 27",0,0,null,null,null,null,"RD 27",0,0,null,null,null,null,"RD 27",0,0]
["RD 28",0,0,null,null,null,null,"RD 28",0,0,null,null,null,null,"RD 28",0,0,null,null,null,null,"RD 28",0,0]
["RD 29",0,0,null,{"$f":"IF(E4=0,\"Sieg\",\"\")","v":""},null,null,"RD 29",0,0,null,{"$f":"IF(L4=0,\"Sieg\",\"\")","v":""},null,null,"RD 29",0,0,null,{"$f":"IF(S4=0,\"Sieg\",\"\")","v":""},null,null,"RD 29",0,0,null,{"$f":"IF(Z4=0,\"Sieg\",\"\")","v":""}]
["RD 30",0,0,null,null,null,null,"RD 30",0,0,null,null,null,null,"RD 30",0,0,null,null,null,null,"RD 30",0,0]
[null,{"$f":"SUM(B4:B33)","v":0},{"$f":"SUM(C4:C33)","v":0},{"$f":"SUM(D4:D33)","v":0},{"$f":"SUM(D4:D32)","v":0},null,null,null,{"$f":"SUM(I4:I33)","v":0},{"$f":"SUM(J4:J33)","v":0},{"$f":"SUM(K4:K33)","v":0},{"$f":"SUM(K4:K32)","v":0},null,null,null,{"$f":"SUM(P4:P33)","v":0},{"$f":"SUM(Q4:Q33)","v":0},{"$f":"SUM(R4:R33)","v":0},{"$f":"SUM(R4:R32)","v":0},null,null,null,{"$f":"SUM(W4:W33)","v":0},{"$f":"SUM(X4:X33)","v":0},{"$f":"SUM(Y4:Y33)","v":0},{"$f":"SUM(Y4:Y32)","v":0}]
[null,null,null,{"$f":"D1","v":{"$error":"#REF!"}},null,{"$f":"SUM(E3)","v":0},null,null,null,null,{"$f":"INDEX(D35:D38,MATCH(LARGE(F35:F38,1),F35:F38,0))","v":{"$error":"#REF!"}}]
[null,null,null,{"$f":"K1","v":{"$error":"#REF!"}},null,{"$f":"SUM(L3)","v":0},null,null,null,null,{"$f":"INDEX(D35:D38,MATCH(LARGE(F35:F38,2),F35:F38,0))","v":{"$error":"#REF!"}}]
[null,null,null,{"$f":"R1","v":{"$error":"#REF!"}},null,{"$f":"SUM(S3)","v":0},null,null,null,null,{"$f":"INDEX(D35:D38,MATCH(LARGE(F35:F38,3),F35:F38,0))","v":{"$error":"#REF!"}}]
[null,null,null,{"$f":"Y1","v":{"$error":"#REF!"}},null,{"$f":"SUM(Z3)","v":0},null,null,null,null,{"$f":"INDEX(D35:D38,MATCH(LARGE(F35:F38,4),F35:F38,0))","v":{"$error":"#REF!"}}]
[null,null,null,"MAX(B2:B7",null,{"$f":"SUM(F35:F38)","v":0},null,null,null,null,null,null,null,null,null,null,null,null,null,null,null,null,null,null,null,null,null,null,null,null,"Ralf Kl."]
[null,null,null,null,null,null,null,null,null,null,null,null,null,null,null,null,null,null,null,null,null,null,null,null,null,null,null,null,null,null,"Volker"]
[null,null,null,null,null,null,null,null,null,null,null,null,null,null,null,null,null,null,null,null,null,null,null,null,null,null,null,null,null,null,"Rene"]
[null,null,null,null,1002,null,null,null,null,null,null,1002,null,null,null,null,null,null,null,null,null,null,null,null,null,null,{"$f":"RAND()","v":0.51615142085328247},null,null,null,"Nicole"]
[null,null,null,{"$f":"D1","v":{"$error":"#REF!"}},{"$f":"SUM(D13:D33)","v":0},null,null,null,null,null,{"$f":"K1","v":{"$error":"#REF!"}},{"$f":"SUM(K13:K33)","v":0},null,null,{"$f":"D1","v":{"$error":"#REF!"}},null,null,{"$f":"SUM(E46)","v":1002},null,{"$f":"INDEX(O43:O46,MATCH(LARGE(R43:R46,ROW(AE4)),R43:R46,0))","v":{"$error":"#REF!"}},null,null,null,null,null,{"$f":"'Rd.11'!Z43","v":"Ralfie"},{"$f":"RAND()","v":0.25415984737016284},null,null,null,"Frank"]
[null,null,null,{"$f":"R1","v":{"$error":"#REF!"}},{"$f":"SUM(R13:R33)","v":0},null,null,null,null,null,{"$f":"Y1","v":{"$error":"#REF!"}},{"$f":"SUM(Y13:Y33)","v":0},null,null,{"$f":"R1","v":{"$error":"#REF!"}},null,null,{"$f":"SUM(E46)+0.1","v":1002.1},null,{"$f":"INDEX(O43:O46,MATCH(LARGE(R43:R46,ROW(AE3)),R43:R46,0))","v":{"$error":"#REF!"}},null,null,null,null,null,{"$f":"'Rd.11'!Z44","v":"Siggi"},{"$f":"RAND()","v":0.89905828587758829},null,null,null,"Rosi"]
[null,null,null,null,{"$f":"SUM(E43:E44)","v":0},null,null,null,null,null,null,{"$f":"SUM(L43:L44)","v":0},null,null,{"$f":"K1","v":{"$error":"#REF!"}},null,null,{"$f":"L46/2","v":501},null,{"$f":"INDEX(O43:O46,MATCH(LARGE(R43:R46,ROW(AE2)),R43:R46,0))","v":{"$error":"#REF!"}},null,null,null,null,null,{"$f":"'Rd.11'!Z45","v":"Kerstin"},{"$f":"RAND()","v":0.35106536961683876},null,null,null,"Werner"]
[null,null,null,null,{"$f":"SUM(E42-E45)","v":1002},null,null,null,null,null,null,{"$f":"SUM(L42-L45)","v":1002},null,null,{"$f":"Y1","v":{"$error":"#REF!"}},null,null,{"$f":"L46/2+0.1","v":501.1},null,{"$f":"INDEX(O43:O46,MATCH(LARGE(R43:R46,ROW(AE1)),R43:R46,0))","v":{"$error":"#REF!"}},null,null,null,null,null,{"$f":"'Rd.11'!Z46","v":"Christian"},{"$f":"RAND()","v":0.94160318526422204},null,null,null,"Gast"]
[null,null,null,null,null,null,null,null,null,null,null,null,null,null,null,null,null,null,null,null,null,null,null,null,null,null,null,null,null,null,"Joker"]
[null,null,null,null,null,null,null,null,null,null,null,null,null,null,null,null,null,null,null,null,null,null,null,null,null,null,null,null,null,null,"Anja"]
[null,null,null,null,null,null,null,null,null,null,null,null,null,null,null,null,null,null,null,null,null,null,null,null,null,null,null,null,null,null,"Vincent"]
[null,null,null,null,null,null,null,null,null,null,null,null,null,null,null,null,null,null,null,null,null,null,null,null,null,null,null,null,null,null,"Erich"]
[null,null,null,{"$f":"D43","v":{"$error":"#REF!"}},{"$f":"E4","v":501},null,null,null,null,null,{"$f":"K43","v":{"$error":"#REF!"}},{"$f":"L4","v":501},null,null,null,null,null,null,null,null,null,null,null,null,null,null,null,null,null,null,"Siggi"]
[null,null,null,{"$f":"D44","v":{"$error":"#REF!"}},{"$f":"S4","v":501},null,null,null,null,null,{"$f":"K44","v":{"$error":"#REF!"}},{"$f":"Z4","v":501},null,null,null,null,null,null,null,null,null,null,null,null,null,null,null,null,null,null,"Ralf M."]
[null,null,null,null,{"$f":"SUM(E51:E52)","v":1002},null,null,null,null,null,null,{"$f":"SUM(L51:L52)","v":1002},null,null,null,null,null,null,null,null,null,null,null,null,null,null,null,null,null,null,"Dirk B."]
[null,null,null,null,null,null,null,null,null,null,null,null,null,null,null,null,null,null,null,null,null,null,null,null,null,null,null,null,null,null,"Stefan"]
[null,null,null,{"$f":"D51","v":{"$error":"#REF!"}},{"$f":"E51","v":501},{"$f":"SUM(E57:E58)-E56","v":501},null,null,{"$f":"INDEX(E$55:E$58,MATCH(LARGE(F$55:F$58,1),F$55:F$58,0))","v":501},{"$f":"INDEX(F$55:F$58,MATCH(LARGE(G$55:G$58,1),G$55:G$58,0))","v":{"$error":"#NUM!"}},null,null,null,null,null,null,null,null,null,null,null,null,null,null,null,null,null,null,null,null,"Micha"]
[null,null,null,{"$f":"D52","v":{"$error":"#REF!"}},{"$f":"E52","v":501},{"$f":"SUM(E57:E58)-E55","v":501}]
[null,null,null,{"$f":"K51","v":{"$error":"#REF!"}},{"$f":"L51","v":501},{"$f":"SUM(E55:E56)-E58","v":501}]
[null,null,null,{"$f":"K52","v":{"$error":"#REF!"}},{"$f":"L52","v":501}]

{"sheet":"Sieger","index":12,"n_rows":13,"n_cols":12,"rows_kept":13,"cut":false,"hidden":false,"merged":[[6,10,6,13],[0,4,0,7],[0,1,0,2],[2,11,2,12]]}
[null,"Sieger"]
["Rd.1",{"$f":"'Rd.1'!T$43","v":"Siggi"},null,{"$f":"'Rd.1'!T$44","v":"Christian"}]
["Rd.2",{"$f":"'Rd.2'!T$43","v":"Ralfie"},null,{"$f":"'Rd.2'!T$44","v":"Ralfie"},null,null,null,null,null,null,null,"Passwort"]
["Rd.3",{"$f":"'Rd.3'!T$43","v":"Christian"},null,{"$f":"'Rd.3'!T$44","v":"Kerstin"}]
["Rd.4",{"$f":"'Rd.4'!T$43","v":"Ralfie"},null,{"$f":"'Rd.4'!T$44","v":"Ralfie"}]
["Rd.5",{"$f":"'Rd.5'!T$43","v":"Ralfie"},null,{"$f":"'Rd.5'!T$44","v":"Christian"}]
["Rd.6",{"$f":"'Rd.6'!T$43","v":"Siggi"},null,{"$f":"'Rd.6'!T$44","v":"Siggi"},null,null,null,null,null,null,"Alles Leeren"]
["Rd.7",{"$f":"'Rd.7'!T$43","v":{"$error":"#REF!"}},null,{"$f":"'Rd.7'!T$44","v":{"$error":"#REF!"}}]
["Rd.8",{"$f":"'Rd.8'!T$44","v":{"$error":"#REF!"}},null,{"$f":"'Rd.8'!T$44","v":{"$error":"#REF!"}}]
["Rd.9",{"$f":"'Rd.9'!T$44","v":{"$error":"#REF!"}},null,{"$f":"'Rd.9'!T$44","v":{"$error":"#REF!"}}]
["Rd.10",{"$f":"'Rd.10'!T$44","v":{"$error":"#REF!"}},null,{"$f":"'Rd.10'!T$44","v":{"$error":"#REF!"}}]
["Rd.11",{"$f":"'Rd.11'!T$44","v":{"$error":"#REF!"}},null,{"$f":"'Rd.11'!T$44","v":{"$error":"#REF!"}}]
["Rd.12",{"$f":"'Rd.12'!T$44","v":{"$error":"#REF!"}},null,{"$f":"'Rd.12'!T$44","v":{"$error":"#REF!"}}]

{"sheet":"Tabelle1","index":13,"n_rows":47,"n_cols":4,"rows_kept":47,"cut":false,"hidden":false,"merged":[]}
["Anja/Erich","Ralf Kl."]
["Anja/Siggi","Volker",null,2]
["Anja/Ralf M.","Rene",null,2]
["Anja/Ralf Kl.","Nicole",null,3]
["Anja/Volker","Frank",null,3]
["Anja/Rene","Rosi",null,4]
["Anja/Nicole","Werner",null,4]
["Anja/Frank","Gast"]
["Anja/Gast","Joker"]
["Joker","Anja"]
["Erich/Siggi","Vincent"]
["Erich/Ralf M.","Erich"]
["Erich/Ralf Kl.","Siggi"]
["Erich/Volker","Ralf M."]
["Erich/Rene","Dirk B."]
["Erich/Nicole","Stefan"]
["Erich/Frank","Micha"]
["Erich/Gast"]
["Siggi/Ralf M."]
["Siggi/Ralf Kl."]
["Siggi/Volker"]
["Siggi/Rene"]
["Siggi/Nicole"]
["Siggi/Frank"]
["Siggi/Gast"]
["Ralf M./Ralf Kl."]
["Ralf M./Volker"]
["Ralf M./Rene"]
["Ralf M./Nicole"]
["Ralf M./Frank"]
["Ralf M./Gast"]
["Ralf Kl./Volker"]
["Ralf Kl./Rene"]
["Ralf Kl./Nicole"]
["Ralf Kl./Frank"]
["Ralf Kl./Gast"]
["Volker/Rene"]
["Volker/Nicole"]
["Volker/Frank"]
["Volker/Gast"]
["Rene/Nicole"]
["Rene/Frank"]
["Rene/Gast"]
["Nicole/Frank"]
["Nicole/Gast"]
["Frank/Gast"]
["Joker"]