{"text_format":"1","workbook":"xlsx","n_sheets":4,"sheets":["Vereinsliste","PL_Ü40+Ü50","Kalender","Spielfreie Tage"],"not_rendered":{"charts":0,"images":1,"macros":1,"external_links":0,"defined_names":5,"comments":0,"pivot_tables":0},"unopened":[],"bounds":{"document_bytes":16777216,"sheet_cells":100000,"rows_first":2000,"rows_last":500,"rows_between":2000,"halvings":0,"cell_chars":16384,"cell_head_chars":4096},"cells_cut":0,"cells_raw":0,"read":"whole","date_system":"1900"}

{"sheet":"Vereinsliste","index":0,"n_rows":33,"n_cols":7,"rows_kept":33,"cut":false,"hidden":false,"merged":[]}
["Mannschaftsname","Spielstätte","Alternativ-Spielstätte","Ü40        Ü50","Mannschaftsname","Spielstätte","Alternativ-Spielstätte"]
["ESV Wilhelmshaven Ü40","WHV, Güterstr. 10 a, A-Platz",null,null,"ESV Wilhelmshaven Ü50 o. W.","WHV, Güterstr. 10, A-Platz"]
["FC Ezidxan WHV Ü40","WHV, Freiligrathstr. 81 b, C-Platz (Kunstrasen/Flut)",null,null,"Frisia Wilhelmshaven Ü50","WHV, Freiligrathstr., C-Platz (Kunstrasen/Flut)"]
["SG Sengwarden/Fedderwarden Ü40","Sengwarden, Hauptstraße 26","Fedderwarden,Robert-Raschke-Platz (Schlacke/Flut)",null,"Heidmühler FC Ü50","Heidmühle, Klosterpark, B-Platz (Kunstrasen/Flut)"]
["SG TSV C´siel - Frisia N´siel - SV Werdum","Carolinensiel, Wittmunder Str. 22, A-Platz, Flut.",null,null,"SG Middelsfähr/Voslapp Ü50","Middelsfähr, A-Platz (Flut), Pappelweg"]
["SC Wangerland Ü40","Horumersiel, Kiebitzhörn (Rasen)","Hohenkirchen, Schule, B-Platz (Flut)",null,"SC Wangerland Ü50","Tettens, Schule, A-Platz","Hohenkirchen, Schule, B-Platz (Flut)"]
["TuS Sillenstede Ü40","Sillenstede, Jeversche Landstr. 30 a, B-Platz (Flut)",null,null,"SG Zetel/Neuenburg Ü50","Neuenburg, Urwaldkampfbahn (Flut),  Urwaldstr. 37, 26340 Zetel"]
["Heidmühler FC Ü40","Heidmühle, Klosterpark, B-Platz (Kunstrasen/Flut)",null,null,"SSV Jeddeloh Ü50","Jeddeloh II, HASKAMP-Arena"]
["SV FC Mariensiel","Sande, Falkenweg 3, OBS Sande (Kunstrasen/Flut)",null,null,"TuS Obenstrohe Ü50","Obenstrohe, B-Platz (Flut)"]
["WSC Frisia","WHV, Freiligrathstr. 81 c, D-Platz (Kunstrasen/Flut)",null,null,"."]
["TuS Varel 09 Ü40","Varel, Windallee 31, C-Platz Kleinfeld",null,null,"."]
["VfL Wilhelmshaven Ü40","WHV, Plauenstr. 2, A-Platz (Kunstrasen/Flut)",null,null,"."]
["SG Friesiches Wehde","Bockhorn, Hilgenholter Straße 39 f, (Flut)",null,null,"."]
["TuS Obenstrohe","Obenstrohe, Landgerichtsweg 39, (Flut)",null,null,"."]
["TuS Varel 09 Ü40 II o. W.","Varel, Windallee 31, C-Platz Kleinfeld",null,null,"."]
[".",null,null,null,"."]
[".",null,null,null,"."]
[".",null,null,null,"."]
[".",null,null,null,"."]
[".",null,null,null,"."]
[".",null,null,null,"."]
[".",null,null,null,"."]
[".",null,null,null,"."]
[".",null,null,null,"."]
[".",null,null,null,"."]
[".",null,null,null,"."]
[".",null,null,null,"."]
[".",null,null,null,"."]
[".",null,null,null,"."]
[".",null,null,null,"."]
[".",null,null,null,"."]
[]
["Mannschaften_Ü40",null,null,null,"Mannschaften_Ü50"]

{"sheet":"PL_Ü40+Ü50","index":1,"n_rows":2082,"n_cols":15,"rows_kept":2082,"cut":false,"hidden":false,"merged":[[1,13,1,14],[1,5,1,6]]}
["DFBnet - Spielplan","Ü40",null,null,null,"2025-07-16","11:24:00","SG Wangerland","DFBnet - Spielplan                                                                                                                                             19.07.2024 14:33","Ü50",null,null,null,"2025-07-27","13:30:00"]
["Saison",null,null,": 25/26\n\n\n\n\n","Staffel",": 001 2.Kreisklasse Ü40 JWH Staffel 1",null,"Ü40                         Ü50 ","Saison",null,null,": 25/26\n\n\n\n\n","Staffel",": 001 1.Kreisklasse Ü50 JWH Staffel 1\n\n\n\n\n"]
["Verband",null,null,": Niedersächsischer Fußballverband","Kennung",": 010923",null,null,"Verband",null,null,": Niedersächsischer Fußballverband","Kennung",": 011176"]
["Mannschaftsart",null,null,": 011 Altsenioren Ü40","Status",": Spielbetrieb geplant",null,null,"Mannschaftsart",null,null,": 009 Altsenioren Ü50","Status",": Spiele geplant"]
["Spielklasse",null,null,": 054 1.Kreisklasse","Staffelleiter",null,null,null,"Spielklasse",null,null,": 054 1.Kreisklasse","staffelleiter"]
["Spielgebiet",null,null,": 090 Kreis Jade-Weser-Hunte","Telefon",null,null,null,"Spielgebiet",null,null,": 090 Kreis Jade-Weser-Hunte","Telefon"]
["Rahmenspielplan",null,null,": 1","E-Mail",null,null,null,"Rahmenspielplan",null,null,": 1","E-Mail"]
[]
["Datum","Sptg. Ü40","Spielkennung","Heimmannschaft","Gastmannschaft","Zeit","Spielstätte","Bemerkungen","Datum","Sptg. Ü50","Spielkennung","Heimmannschaft","Gastmannschaft","Zeit","Spielstätte"]
[{"$f":"IF(WEEKDAY(DATE(Kalender!A1,8,1),2)=5,DATE(Kalender!A1,8,1),DATE(Kalender!A1,8,1)+(3-WEEKDAY(DATE(Kalender!A1,8,1),2))+(WEEKDAY(DATE(Kalender!A1,8,1),2)>3)*7)","v":"2025-08-01"},null,null,null,null,null,null,null,{"$f":"A10","v":"2025-08-01"}]
[]
[]
[]
[]
[]
[]
[{"$f":"A10+1","v":"2025-08-02"},null,null,null,null,null,null,null,{"$f":"A17","v":"2025-08-02"}]
[]
[]
[]
[]
[]
[]
[{"$f":"A17+1","v":"2025-08-03"},null,null,null,null,null,null,null,{"$f":"A24","v":"2025-08-03"}]
[]
[]
[]
[]
[]
[]
[{"$f":"A24+1","v":"2025-08-04"},null,null,null,null,null,null,null,{"$f":"A31","v":"2025-08-04"}]
[]
[]
[]
[]
[]
[]
[{"$f":"A31+2","v":"2025-08-06"},null,null,null,null,null,null,null,{"$f":"A38","v":"2025-08-06"}]
[]
[]
{"$rows_left_out":2043}
{"sheet":"Kalender","index":2,"n_rows":65,"n_cols":43,"rows_kept":65,"cut":false,"hidden":false,"merged":[]}
[2025,"Ü40","Ü50",{"$f":"D2","v":"2025-02-01"},"Ü40","Ü50",{"$f":"G2","v":"2025-03-01"},"Ü40","Ü50",{"$f":"J2","v":"2025-04-01"},"Ü40","Ü50",{"$f":"M2","v":"2025-05-01"},"Ü40","Ü50",{"$f":"P2","v":"2025-06-01"},"Ü40","Ü50",{"$f":"S2","v":"2025-07-01"},"Ü40","Ü50",{"$f":"V2","v":"2025-08-01"},"Ü40","Ü50",{"$f":"Y2","v":"2025-09-01"},"Ü40","Ü50",{"$f":"AB2","v":"2025-10-01"},"Ü40","Ü50",{"$f":"AE2","v":"2025-11-01"},"Ü40","Ü50",{"$f":"AH2","v":"2025-12-01"},"Ü40","Ü50",null,null,"Feiertage",{"$f":"A1","v":2025},"Ferien","von","bis"]
[{"$f":"DATE(A1,1,1)","v":"2025-01-01"},null,null,{"$f":"IF(MONTH(DATE($A$1,COLUMN()-2,ROW()-1))=COLUMN()-2,DATE($A$1,COLUMN()-2,ROW()-1),\"\")","v":"2025-02-01"},null,null,{"$f":"IF(MONTH(DATE($A$1,COLUMN()-4,ROW()-1))=COLUMN()-4,DATE($A$1,COLUMN()-4,ROW()-1),\"\")","v":"2025-03-01"},null,null,{"$f":"IF(MONTH(DATE($A$1,COLUMN()-6,ROW()-1))=COLUMN()-6,DATE($A$1,COLUMN()-6,ROW()-1),\"\")","v":"2025-04-01"},null,null,{"$f":"IF(MONTH(DATE($A$1,COLUMN()-8,ROW()-1))=COLUMN()-8,DATE($A$1,COLUMN()-8,ROW()-1),\"\")","v":"2025-05-01"},null,null,{"$f":"IF(MONTH(DATE($A$1,COLUMN()-10,ROW()-1))=COLUMN()-10,DATE($A$1,COLUMN()-10,ROW()-1),\"\")","v":"2025-06-01"},null,null,{"$f":"IF(MONTH(DATE($A$1,COLUMN()-12,ROW()-1))=COLUMN()-12,DATE($A$1,COLUMN()-12,ROW()-1),\"\")","v":"2025-07-01"},null,null,{"$f":"IF(MONTH(DATE($A$1,COLUMN()-14,ROW()-1))=COLUMN()-14,DATE($A$1,COLUMN()-14,ROW()-1),\"\")","v":"2025-08-01"},null,null,{"$f":"IF(MONTH(DATE($A$1,COLUMN()-16,ROW()-1))=COLUMN()-16,DATE($A$1,COLUMN()-16,ROW()-1),\"\")","v":"2025-09-01"},null,null,{"$f":"IF(MONTH(DATE($A$1,COLUMN()-18,ROW()-1))=COLUMN()-18,DATE($A$1,COLUMN()-18,ROW()-1),\"\")","v":"2025-10-01"},null,null,{"$f":"IF(MONTH(DATE($A$1,COLUMN()-20,ROW()-1))=COLUMN()-20,DATE($A$1,COLUMN()-20,ROW()-1),\"\")","v":"2025-11-01"},null,null,{"$f":"IF(MONTH(DATE($A$1,COLUMN()-22,ROW()-1))=COLUMN()-22,DATE($A$1,COLUMN()-22,ROW()-1),\"\")","v":"2025-12-01"},null,null,2018,{"$f":"AM2","v":"2025-01-01"},{"$f":"DATE(A1,1,1)","v":"2025-01-01"},"Neujahr","Herbstferien","2025-10-13","2025-10-25"]
[{"$f":"IF(MONTH(DATE($A$1,COLUMN(),ROW()-1))=COLUMN(),DATE($A$1,COLUMN(),ROW()-1),\"\")","v":"2025-01-02"},null,null,"2025-02-02",null,null,"2025-03-02",null,null,"2025-04-02",null,null,"2025-05-02",null,null,"2025-06-02",null,null,"2025-07-02",null,null,"2025-08-02",null,null,"2025-09-02",null,null,"2025-10-02",null,null,"2025-11-02",null,null,"2025-12-02",null,null,2019,"2025-04-18",{"$f":"AM4-2","v":"2025-04-18"},"Karfreitag","Weihn.-ferien","2025-12-22","2026-01-05"]
["2025-01-03",null,null,"2025-02-03",null,null,"2025-03-03",null,null,"2025-04-03",null,null,"2025-05-03",null,null,"2025-06-03",null,null,"2025-07-03",null,null,"2025-08-03",null,null,"2025-09-03",null,"H","2025-10-03",null,null,"2025-11-03",null,null,"2025-12-03",null,null,2020,"2025-04-20",{"$f":"DATE(A1,3,1)+MOD((255-11*MOD(A1,19)-21),30)+21+(MOD((255-11*MOD(A1,19)-21),30) + 21>48)+6-MOD(A1+INT(A1/4)+MOD((255- 11*MOD(A1,19)- 21),30)+21+(MOD((255-11*MOD(A1,19)-21),30)+21>48)+1,7)","v":"2025-04-20"},"Ostersonntag","Chr.himm., Brückentg.","2025-05-30","2025-05-30"]
["2025-01-04",null,null,"2025-02-04",null,null,"2025-03-04",null,null,"2025-04-04",null,null,"2025-05-04",null,null,"2025-06-04",null,null,"2025-07-04",null,null,"2025-08-04",null,null,"2025-09-04",null,null,"2025-10-04",null,null,"2025-11-04",null,null,"2025-12-04",null,null,2021,"2025-04-21",{"$f":"AM4+1","v":"2025-04-21"},"Ostermontag","Pfingsten, Brückentg.","2025-06-10","2025-06-10"]
["2025-01-05",null,null,"2025-02-05",null,null,"2025-03-05",null,null,"2025-04-05",null,null,"2025-05-05",null,null,"2025-06-05",null,null,"2025-07-05",null,null,"2025-08-05",null,null,"2025-09-05","H",null,"2025-10-05",null,null,"2025-11-05",null,null,"2025-12-05",null,null,2022,"2025-05-01",{"$f":"DATE(A1,5,1)","v":"2025-05-01"},"Tag der Arbeit","Somm.-ferien","2025-07-03","2025-08-13"]
["2025-01-06",null,null,"2025-02-06",null,null,"2025-03-06",null,null,"2025-04-06",null,null,"2025-05-06",null,null,"2025-06-06",null,null,"2025-07-06",null,null,"2025-08-06",null,null,"2025-09-06",null,null,"2025-10-06",null,null,"2025-11-06",null,null,"2025-12-06",null,null,2023,"2025-05-29",{"$f":"AM4+39","v":"2025-05-29"},"Christi Himmelfahrt"]
["2025-01-07",null,null,"2025-02-07",null,null,"2025-03-07",null,null,"2025-04-07",null,null,"2025-05-07",null,null,"2025-06-07",null,null,"2025-07-07",null,null,"2025-08-07",null,null,"2025-09-07",null,null,"2025-10-07",null,null,"2025-11-07","H",null,"2025-12-07",null,null,2024,"2025-06-08",{"$f":"AM4+49","v":"2025-06-08"},"Pfingstsonntag"]
["2025-01-08",null,null,"2025-02-08",null,null,"2025-03-08",null,null,"2025-04-08",null,null,"2025-05-08",null,null,"2025-06-08",null,null,"2025-07-08",null,null,"2025-08-08",null,null,"2025-09-08",null,null,"2025-10-08",{"$f":"IFERROR(CHOOSE(2-MOD(MATCH(\"SC Wangerland \"&AC$1,INDEX('PL_Ü40+Ü50'!$D$1:$M$1192, _xlfn.AGGREGATE(15,6,ROW(AC$8:AC$999)/(INDEX('PL_Ü40+Ü50'!$A$8:$I$1192,,1+(AC$1=\"Ü50\")*8) =INDEX(AA9:AB9,2-(AC$1=\"Ü50\")))/MMULT(('PL_Ü40+Ü50'!$D$8:$M1193=\"SC Wangerland \"&AC$1)*1, ROW($D$1:$D$10)^0),1)/ISNUMBER(INDEX(AA9:AB9,2-(AC$1=\"Ü50\"))),),0),2),\"H\",\"A\"),\"\")","v":"A"},{"$f":"IFERROR(CHOOSE(2-MOD(MATCH(\"SC Wangerland \"&AD$1,INDEX('PL_Ü40+Ü50'!$D$1:$M$1192, _xlfn.AGGREGATE(15,6,ROW(AD$8:AD$999)/(INDEX('PL_Ü40+Ü50'!$A$8:$I$1192,,1+(AD$1=\"Ü50\")*8) =INDEX(AB9:AC9,2-(AD$1=\"Ü50\")))/MMULT(('PL_Ü40+Ü50'!$D$8:$M1193=\"SC Wangerland \"&AD$1)*1, ROW($D$1:$D$10)^0),1)/ISNUMBER(INDEX(AB9:AC9,2-(AD$1=\"Ü50\"))),),0),2),\"H\",\"A\"),\"\")","v":"H"},"2025-11-08",null,null,"2025-12-08",null,null,2025,"2025-06-09",{"$f":"AM8+1","v":"2025-06-09"},"Pfingstmontag"]
["2025-01-09",null,null,"2025-02-09",null,null,"2025-03-09",null,null,"2025-04-09",null,null,"2025-05-09",null,null,"2025-06-09",null,null,"2025-07-09",null,null,"2025-08-09",null,null,"2025-09-09",null,null,"2025-10-09",null,null,"2025-11-09",null,null,"2025-12-09",null,null,2026,"2025-10-03",{"$f":"DATE(A1,10,3)","v":"2025-10-03"},"Tag der D. Einheit"]
["2025-01-10",null,null,"2025-02-10",null,null,"2025-03-10",null,null,"2025-04-10",null,null,"2025-05-10",null,null,"2025-06-10",null,null,"2025-07-10",null,null,"2025-08-10",null,null,"2025-09-10",null,null,"2025-10-10",null,null,"2025-11-10",null,null,"2025-12-10",null,null,2027,"2025-10-31",{"$f":"DATE(A1,10,31)","v":"2025-10-31"},"Reformationstag"]
["2025-01-11",null,null,"2025-02-11",null,null,"2025-03-11",null,null,"2025-04-11",null,null,"2025-05-11",null,null,"2025-06-11",null,null,"2025-07-11",null,null,"2025-08-11",null,null,"2025-09-11",null,null,"2025-10-11",null,null,"2025-11-11",null,null,"2025-12-11",null,null,2028,"2025-12-24",{"$f":"DATE(A1,12,24)","v":"2025-12-24"},"Heiligabend"]
["2025-01-12",null,null,"2025-02-12",null,null,"2025-03-12",null,null,"2025-04-12",null,null,"2025-05-12",null,null,"2025-06-12",null,null,"2025-07-12",null,null,"2025-08-12",null,null,"2025-09-12",null,"A","2025-10-12",null,null,"2025-11-12",null,null,"2025-12-12",null,null,2029,"2025-12-25",{"$f":"AM12+1","v":"2025-12-25"},"1. Weihnachtstag"]
["2025-01-13",null,null,"2025-02-13",null,null,"2025-03-13",null,null,"2025-04-13",null,null,"2025-05-13",null,null,"2025-06-13",null,null,"2025-07-13",null,null,"2025-08-13",null,null,"2025-09-13",null,null,"2025-10-13",null,null,"2025-11-13",null,null,"2025-12-13",null,null,2030,"2025-12-26",{"$f":"AM13+1","v":"2025-12-26"},"2. Weihnachtstag"]
["2025-01-14",null,null,"2025-02-14",null,null,"2025-03-14",null,null,"2025-04-14",null,null,"2025-05-14",null,null,"2025-06-14",null,null,"2025-07-14",null,null,"2025-08-14",null,null,"2025-09-14","A",null,"2025-10-14",null,null,"2025-11-14",null,null,"2025-12-14",null,null,null,"2025-12-31",{"$f":"DATE(A1,12,31)","v":"2025-12-31"},"Sylvester"]
["2025-01-15",null,null,"2025-02-15",null,null,"2025-03-15",null,null,"2025-04-15",null,null,"2025-05-15",null,null,"2025-06-15",null,null,"2025-07-15",null,null,"2025-08-15","H",null,"2025-09-15",null,null,"2025-10-15",null,null,"2025-11-15",null,null,"2025-12-15",null,null,null,"2026-01-01",{"$f":"AM15+1","v":"2026-01-01"},"Neujahr"]
["2025-01-16",null,null,"2025-02-16",null,null,"2025-03-16",null,null,"2025-04-16",null,null,"2025-05-16",null,null,"2025-06-16",null,null,"2025-07-16",null,null,"2025-08-16",null,null,"2025-09-16",null,null,"2025-10-16",null,null,"2025-11-16","A",null,"2025-12-16"]
["2025-01-17",null,null,"2025-02-17",null,null,"2025-03-17",null,null,"2025-04-17",null,null,"2025-05-17",null,null,"2025-06-17",null,null,"2025-07-17",null,null,"2025-08-17",null,null,"2025-09-17",null,"H","2025-10-17",null,null,"2025-11-17",null,null,"2025-12-17"]
["2025-01-18",null,null,"2025-02-18",null,null,"2025-03-18",null,null,"2025-04-18",null,null,"2025-05-18",null,null,"2025-06-18",null,null,"2025-07-18",null,null,"2025-08-18",null,null,"2025-09-18",null,null,"2025-10-18",null,null,"2025-11-18",null,null,"2025-12-18"]
["2025-01-19",null,null,"2025-02-19",null,null,"2025-03-19",null,null,"2025-04-19",null,null,"2025-05-19",null,null,"2025-06-19",null,null,"2025-07-19",null,null,"2025-08-19","H",null,"2025-09-19",null,null,"2025-10-19",null,null,"2025-11-19",null,null,"2025-12-19"]
["2025-01-20",null,null,"2025-02-20",null,null,"2025-03-20",null,null,"2025-04-20",null,null,"2025-05-20",null,null,"2025-06-20",null,null,"2025-07-20",null,null,"2025-08-20",null,null,"2025-09-20",null,null,"2025-10-20",null,null,"2025-11-20",null,null,"2025-12-20"]
["2025-01-21",null,null,"2025-02-21",null,null,"2025-03-21",null,null,"2025-04-21",null,null,"2025-05-21",null,null,"2025-06-21",null,null,"2025-07-21",null,null,"2025-08-21",null,null,"2025-09-21","A",null,"2025-10-21",null,null,"2025-11-21","H",null,"2025-12-21"]
["2025-01-22",null,null,"2025-02-22",null,null,"2025-03-22",null,null,"2025-04-22",null,null,"2025-05-22",null,null,"2025-06-22",null,null,"2025-07-22",null,null,"2025-08-22","A",null,"2025-09-22",null,null,"2025-10-22",null,null,"2025-11-22",null,null,"2025-12-22"]
["2025-01-23",null,null,"2025-02-23",null,null,"2025-03-23",null,null,"2025-04-23",null,null,"2025-05-23",null,null,"2025-06-23",null,null,"2025-07-23",null,null,"2025-08-23",null,null,"2025-09-23",null,null,"2025-10-23",null,null,"2025-11-23",null,null,"2025-12-23"]
["2025-01-24",null,null,"2025-02-24",null,null,"2025-03-24",null,null,"2025-04-24",null,null,"2025-05-24",null,null,"2025-06-24",null,null,"2025-07-24",null,null,"2025-08-24",null,null,"2025-09-24",null,null,"2025-10-24",null,null,"2025-11-24",null,null,"2025-12-24"]
["2025-01-25",null,null,"2025-02-25",null,null,"2025-03-25",null,null,"2025-04-25",null,null,"2025-05-25",null,null,"2025-06-25",null,null,"2025-07-25",null,null,"2025-08-25",null,null,"2025-09-25",null,null,"2025-10-25",null,null,"2025-11-25",null,null,"2025-12-25"]
["2025-01-26",null,null,"2025-02-26",null,null,"2025-03-26",null,null,"2025-04-26",null,null,"2025-05-26",null,null,"2025-06-26",null,null,"2025-07-26",null,null,"2025-08-26",null,null,"2025-09-26","H","A","2025-10-26",null,null,"2025-11-26",null,null,"2025-12-26"]
["2025-01-27",null,null,"2025-02-27",null,null,"2025-03-27",null,null,"2025-04-27",null,null,"2025-05-27",null,null,"2025-06-27",null,null,"2025-07-27",null,null,"2025-08-27",null,"H","2025-09-27",null,null,"2025-10-27",null,null,"2025-11-27",null,null,"2025-12-27"]
["2025-01-28",null,null,"2025-02-28",null,null,"2025-03-28",null,null,"2025-04-28",null,null,"2025-05-28",null,null,"2025-06-28",null,null,"2025-07-28",null,null,"2025-08-28",null,null,"2025-09-28",null,null,"2025-10-28",null,null,"2025-11-28",null,null,"2025-12-28"]
["2025-01-29",null,null,"",null,null,"2025-03-29",null,null,"2025-04-29",null,null,"2025-05-29",null,null,"2025-06-29",null,null,"2025-07-29",null,null,"2025-08-29","A",null,"2025-09-29",null,null,"2025-10-29",null,null,"2025-11-29",null,null,"2025-12-29"]
["2025-01-30",null,null,"",null,null,"2025-03-30",null,null,"2025-04-30",null,null,"2025-05-30",null,null,"2025-06-30",null,null,"2025-07-30",null,null,"2025-08-30",null,null,"2025-09-30",null,null,"2025-10-30",null,null,"2025-11-30","A",null,"2025-12-30"]
["2025-01-31",null,null,"",null,null,"2025-03-31",null,null,"",null,null,"2025-05-31",null,null,"",null,null,"2025-07-31",null,null,"2025-08-31",null,null,"",null,null,"2025-10-31",null,null,"",{"$f":"IFERROR(CHOOSE(2-MOD(MATCH(\"SC Wangerland \"&AF$1,INDEX('PL_Ü40+Ü50'!$D$1:$M$1192, _xlfn.AGGREGATE(15,6,ROW(AF$8:AF$999)/(INDEX('PL_Ü40+Ü50'!$A$8:$I$1192,,1+(AF$1=\"Ü50\")*8) =INDEX(AD32:AE32,2-(AF$1=\"Ü50\")))/MMULT(('PL_Ü40+Ü50'!$D$8:$M1216=\"SC Wangerland \"&AF$1)*1, ROW($D$1:$D$10)^0),1)/ISNUMBER(INDEX(AD32:AE32,2-(AF$1=\"Ü50\"))),),0),2),\"H\",\"A\"),\"\")","v":""},null,"2025-12-31"]
[]
[{"$f":"A1+1","v":2026},"Ü40","Ü50",{"$f":"D35","v":"2026-02-01"},"Ü40","Ü50",{"$f":"G35","v":"2026-03-01"},"Ü40","Ü50",{"$f":"J35","v":"2026-04-01"},"Ü40","Ü50",{"$f":"M35","v":"2026-05-01"},"Ü40","Ü50",{"$f":"P35","v":"2026-06-01"},"Ü40","Ü50",{"$f":"S35","v":"2026-07-01"},"Ü40","Ü50",{"$f":"V35","v":"2026-08-01"},"Ü40","Ü50",{"$f":"Y35","v":"2026-09-01"},"Ü40","Ü50",{"$f":"AB35","v":"2026-10-01"},"Ü40","Ü50",{"$f":"AE35","v":"2026-11-01"},"Ü40","Ü50",{"$f":"AH35","v":"2026-12-01"},"Ü40","Ü50",null,null,"Feiertage",{"$f":"A34","v":2026},"Ferien","von","bis"]
[{"$f":"DATE(A34,1,1)","v":"2026-01-01"},null,null,{"$f":"DATE($A34,2,1)","v":"2026-02-01"},null,null,{"$f":"DATE($A34,3,1)","v":"2026-03-01"},null,null,{"$f":"DATE($A34,4,1)","v":"2026-04-01"},null,null,{"$f":"DATE($A34,5,1)","v":"2026-05-01"},null,null,{"$f":"DATE($A34,6,1)","v":"2026-06-01"},null,null,{"$f":"DATE($A34,7,1)","v":"2026-07-01"},null,null,{"$f":"DATE($A34,8,1)","v":"2026-08-01"},null,null,{"$f":"DATE($A34,9,1)","v":"2026-09-01"},null,null,{"$f":"DATE($A34,10,1)","v":"2026-10-01"},null,null,{"$f":"DATE($A34,11,1)","v":"2026-11-01"},null,null,{"$f":"DATE($A34,12,1)","v":"2026-12-01"},null,null,2018,{"$f":"AM35","v":"2026-01-01"},{"$f":"DATE(A34,1,1)","v":"2026-01-01"},"Neujahr","Weihn.-ferien","2026-01-01","2026-01-05"]
[{"$f":"A35+1","v":"2026-01-02"},null,null,{"$f":"D35+1","v":"2026-02-02"},null,null,{"$f":"G35+1","v":"2026-03-02"},null,null,{"$f":"J35+1","v":"2026-04-02"},null,null,{"$f":"M35+1","v":"2026-05-02"},null,null,{"$f":"P35+1","v":"2026-06-02"},null,null,{"$f":"S35+1","v":"2026-07-02"},null,null,{"$f":"V35+1","v":"2026-08-02"},null,null,{"$f":"Y35+1","v":"2026-09-02"},null,null,{"$f":"AB35+1","v":"2026-10-02"},null,null,{"$f":"AE35+1","v":"2026-11-02"},null,null,{"$f":"AH35+1","v":"2026-12-02"},null,null,2019,"2026-04-03",{"$f":"AM37-2","v":"2026-04-03"},"Karfreitag","Osterferien","2026-03-23","2026-04-07"]
["2026-01-03",null,null,"2026-02-03",null,null,"2026-03-03",null,null,"2026-04-03",null,null,"2026-05-03","A",null,"2026-06-03",null,null,"2026-07-03",null,null,"2026-08-03",null,null,"2026-09-03",null,null,"2026-10-03",null,null,"2026-11-03",null,null,"2026-12-03",null,null,2020,"2026-04-05",{"$f":"DATE(A34,3,1)+MOD((255-11*MOD(A34,19)-21),30)+21+(MOD((255-11*MOD(A34,19)-21),30) + 21>48)+6-MOD(A34+INT(A34/4)+MOD((255- 11*MOD(A34,19)- 21),30)+21+(MOD((255-11*MOD(A34,19)-21),30)+21>48)+1,7)","v":"2026-04-05"},"Ostersonntag","Chr.himm., Brückentg.","2026-05-15","2026-05-15"]
["2026-01-04",null,null,"2026-02-04",null,null,"2026-03-04",null,null,"2026-04-04",null,null,"2026-05-04",null,null,"2026-06-04",null,null,"2026-07-04",null,null,"2026-08-04",null,null,"2026-09-04",null,null,"2026-10-04",null,null,"2026-11-04",null,null,"2026-12-04",null,null,2021,"2026-04-06",{"$f":"AM37+1","v":"2026-04-06"},"Ostermontag","Pfingsten, Brückentg.","2026-05-26","2026-05-26"]
["2026-01-05",null,null,"2026-02-05",null,null,"2026-03-05",null,null,"2026-04-05",null,null,"2026-05-05",null,null,"2026-06-05","H",null,"2026-07-05",null,null,"2026-08-05",null,null,"2026-09-05",null,null,"2026-10-05",null,null,"2026-11-05",null,null,"2026-12-05",null,null,2022,"2026-05-01",{"$f":"DATE(A34,5,1)","v":"2026-05-01"},"Tag der Arbeit","Somm.-ferien","2026-07-02","2026-08-12"]
["2026-01-06",null,null,"2026-02-06",null,null,"2026-03-06","H",null,"2026-04-06",null,null,"2026-05-06",null,null,"2026-06-06",null,null,"2026-07-06",null,null,"2026-08-06",null,null,"2026-09-06",null,null,"2026-10-06",null,null,"2026-11-06",null,null,"2026-12-06",null,null,2023,"2026-05-14",{"$f":"AM37+39","v":"2026-05-14"},"Christi Himmelfahrt"]
{"$rows_left_out":26}
{"sheet":"Spielfreie Tage","index":3,"n_rows":24,"n_cols":3,"rows_kept":24,"cut":false,"hidden":false,"merged":[]}
["Ü40/Ü50"]
["Keine Spieltage an Feiertagen oder Brückentagen. Keine Auswärtsspiele, wenn die jeweils andere Mannschaft spielt"]
["Gemeinsame Spieltage Ü40 und Ü50 vermeiden"]
[]
["2025-10-03","2025-10-05","Tag der Deutschen Einheit am 03.10.25"]
["2025-10-31","2025-11-02","Reformationstag am 31.10.25"]
["2026-03-21","2025-04-07","Osterferien"]
["2026-04-26",null,"Konfirmationen"]
["2026-05-14","2026-05-17","Christi Himmelfahrt-Wochenende"]
["2026-05-23","26.05.2026 incl. Brückentag","Pfingsten incl. Brückentag 26.05.26"]
[]
["Ü40"]
["Heimspielorte:","Horumersiel"]
["Heimspieltag","Freitag"]
["Uhrzeit:","19:00 Uhr"]
[]
[]
["Ü50"]
["Heimspielorte:","Bis zum 01.10. finden die Heimspiele in Tettens statt."]
[null,"Ab dem 15.04. kehren wir wieder nach Tettens zurück."]
[null,"Ab dem 15.04. kehren wir wieder nach Tettens zurück."]
[]
["Heimspieltag","Mittwoch"]
["Uhrzeit:","19:00 Uhr"]