{"text_format":"1","workbook":"xlsx","n_sheets":8,"sheets":["Tabelle1","Tabelle2","Tabelle3","Tabelle4","Tabelle5","Tabelle6","Halbfinale","Finale"],"not_rendered":{"charts":0,"images":0,"macros":1,"external_links":0,"defined_names":5,"comments":0,"pivot_tables":0},"unopened":[],"bounds":{"document_bytes":16777216,"sheet_cells":100000,"rows_first":2000,"rows_last":500,"rows_between":2000,"halvings":0,"cell_chars":16384,"cell_head_chars":4096},"cells_cut":0,"cells_raw":0,"read":"whole","date_system":"1900"}

{"sheet":"Tabelle1","index":0,"n_rows":22,"n_cols":15,"rows_kept":22,"cut":false,"hidden":false,"merged":[[26,0,26,1]]}
["Spielernamen (Reihenfolge wird ausgelost)","Anfangswert um die Reihenfolge festlegen zu können",null,"Team 1","Punktevergabe nach dem Spiel","Team 1","Punktevergabe nach dem Spiel","gegen","Team 2","Punktevergabe nach dem Spiel","Team 2","Punktevergabe nach dem Spiel","Ergebnis per Hand – nur Statistik","Punkte TEAM1","Punkte TEAM2"]
[]
["Henry",0.2,null,{"$f":"INDEX($A$3:$A$22,MATCH(LARGE($B$3:$B$22,1),$B$3:$B$22,0))","v":"Henry"},{"$f":"VLOOKUP(D3,$A$3:$B$22,2,0)+$N3","v":1.2},{"$f":"INDEX($A$3:$A$22,MATCH(SMALL($B$3:$B$22,1),$B$3:$B$22,0))","v":"Manfred"},{"$f":"VLOOKUP(F3,$A$3:$B$22,2,0)+$N3","v":1.01},null,{"$f":"INDEX($A$3:$A$22,MATCH(LARGE($B$3:$B$22,2),$B$3:$B$22,0))","v":"Kurt"},{"$f":"VLOOKUP(I3,$A$3:$B$22,2,0)+$O3","v":0.19},{"$f":"INDEX($A$3:$A$22,MATCH(SMALL($B$3:$B$22,2),$B$3:$B$22,0))","v":"Sören"},{"$f":"VLOOKUP(K3,$A$3:$B$22,2,0)+$O3","v":0.02},"21 zu 12",1,0]
["Kurt",0.19,null,{"$f":"INDEX($A$3:$A$22,MATCH(LARGE($B$3:$B$22,3),$B$3:$B$22,0))","v":"Franz"},0.18,{"$f":"INDEX($A$3:$A$22,MATCH(SMALL($B$3:$B$22,3),$B$3:$B$22,0))","v":"Christoph"},0.03,null,{"$f":"INDEX($A$3:$A$22,MATCH(LARGE($B$3:$B$22,4),$B$3:$B$22,0))","v":"Günther"},1.67,{"$f":"INDEX($A$3:$A$22,MATCH(SMALL($B$3:$B$22,4),$B$3:$B$22,0))","v":"Rudi"},1.54,"6 zu 21",0,1.5]
["Franz",0.18,null,{"$f":"INDEX($A$3:$A$22,MATCH(LARGE($B$3:$B$22,5),$B$3:$B$22,0))","v":"Bernd"},0.16,{"$f":"INDEX($A$3:$A$22,MATCH(SMALL($B$3:$B$22,5),$B$3:$B$22,0))","v":"Peter"},0.05,null,{"$f":"INDEX($A$3:$A$22,MATCH(LARGE($B$3:$B$22,6),$B$3:$B$22,0))","v":"Ralf"},0.65,{"$f":"INDEX($A$3:$A$22,MATCH(SMALL($B$3:$B$22,6),$B$3:$B$22,0))","v":"Marec"},0.56000000000000005,"19 zu 21",0,0.5]
["Günther",0.17,null,{"$f":"INDEX($A$3:$A$22,MATCH(LARGE($B$3:$B$22,7),$B$3:$B$22,0))","v":"Georg"},0.14000000000000001,{"$f":"INDEX($A$3:$A$22,MATCH(SMALL($B$3:$B$22,7),$B$3:$B$22,0))","v":"Mario"},7.0000000000000007E-2,null,{"$f":"INDEX($A$3:$A$22,MATCH(LARGE($B$3:$B$22,8),$B$3:$B$22,0))","v":"Henrik"},1.63,{"$f":"INDEX($A$3:$A$22,MATCH(SMALL($B$3:$B$22,8),$B$3:$B$22,0))","v":"Timo"},1.58,"8 zu 21",0,1.5]
["Bernd",0.16,null,{"$f":"INDEX($A$3:$A$22,MATCH(LARGE($B$3:$B$22,9),$B$3:$B$22,0))","v":"Wolfgang"},0.62,{"$f":"INDEX($A$3:$A$22,MATCH(SMALL($B$3:$B$22,9),$B$3:$B$22,0))","v":"Willi"},0.59,null,{"$f":"INDEX($A$3:$A$22,MATCH(LARGE($B$3:$B$22,10),$B$3:$B$22,0))","v":"Jens"},0.11,{"$f":"INDEX($A$3:$A$22,MATCH(SMALL($B$3:$B$22,10),$B$3:$B$22,0))","v":"Dieter"},0.1,"21 zu 19",0.5,0]
["Ralf",0.15]
["Georg",0.14000000000000001]
["Henrik",0.13]
["Wolfgang",0.12]
["Jens",0.11]
["Dieter",0.1]
["Willi",0.09]
["Timo",0.08]
["Mario",7.0000000000000007E-2]
["Marec",0.06]
["Peter",0.05]
["Rudi",0.04]
["Christoph",0.03]
["Sören",0.02]
["Manfred",0.01]

{"sheet":"Tabelle2","index":1,"n_rows":22,"n_cols":15,"rows_kept":22,"cut":false,"hidden":false,"merged":[[26,0,26,1]]}
["Spielernamen (Reihenfolge wird ausgelost)","Wert aus bisher gespielten Spielen",null,"Team 1","Punktevergabe nach dem Spiel","Team 1","Punktevergabe nach dem Spiel","gegen","Team 2","Punktevergabe nach dem Spiel","Team 2","Punktevergabe nach dem Spiel","Ergebnis per Hand – nur Statistik","Punkte TEAM1","Punkte TEAM2"]
[]
[{"$f":"IFERROR(INDEX(Tabelle1!$I$3:$I$7,MATCH(B3,Tabelle1!$J$3:$J$7,0)),IFERROR(INDEX(Tabelle1!$K$3:$K$7,MATCH(B3,Tabelle1!$L$3:$L$7,0)),IFERROR(INDEX(Tabelle1!$F$3:$F$7,MATCH(B3,Tabelle1!$G$3:$G$7,0)),IFERROR(INDEX(Tabelle1!$D$3:$D$7,MATCH(B3,Tabelle1!$E$3:$E$7,0)),\"Nicht gefunden\"))))","v":"Günther"},{"$f":"LARGE(Tabelle1!$D$3:$L$7,ROW()-2)","v":1.67},null,{"$f":"INDEX($A$3:$A$22,MATCH(LARGE($B$3:$B$22,1),$B$3:$B$22,0))","v":"Günther"},{"$f":"VLOOKUP(D3,$A$3:$B$22,2,0)+$N3","v":2.67},{"$f":"INDEX($A$3:$A$22,MATCH(SMALL($B$3:$B$22,1),$B$3:$B$22,0))","v":"Sören"},{"$f":"VLOOKUP(F3,$A$3:$B$22,2,0)+$N3","v":1.02},null,{"$f":"INDEX($A$3:$A$22,MATCH(LARGE($B$3:$B$22,2),$B$3:$B$22,0))","v":"Henrik"},{"$f":"VLOOKUP(I3,$A$3:$B$22,2,0)+$O3","v":1.63},{"$f":"INDEX($A$3:$A$22,MATCH(SMALL($B$3:$B$22,2),$B$3:$B$22,0))","v":"Christoph"},{"$f":"VLOOKUP(K3,$A$3:$B$22,2,0)+$O3","v":0.03},"21 zu 12",1]
[{"$f":"IFERROR(INDEX(Tabelle1!$I$3:$I$7,MATCH(B4,Tabelle1!$J$3:$J$7,0)),IFERROR(INDEX(Tabelle1!$K$3:$K$7,MATCH(B4,Tabelle1!$L$3:$L$7,0)),IFERROR(INDEX(Tabelle1!$F$3:$F$7,MATCH(B4,Tabelle1!$G$3:$G$7,0)),IFERROR(INDEX(Tabelle1!$D$3:$D$7,MATCH(B4,Tabelle1!$E$3:$E$7,0)),\"Nicht gefunden\"))))","v":"Henrik"},{"$f":"LARGE(Tabelle1!$D$3:$L$7,ROW()-2)","v":1.63},null,{"$f":"INDEX($A$3:$A$22,MATCH(LARGE($B$3:$B$22,3),$B$3:$B$22,0))","v":"Timo"},1.58,{"$f":"INDEX($A$3:$A$22,MATCH(SMALL($B$3:$B$22,3),$B$3:$B$22,0))","v":"Peter"},0.05,null,{"$f":"INDEX($A$3:$A$22,MATCH(LARGE($B$3:$B$22,4),$B$3:$B$22,0))","v":"Rudi"},3.04,{"$f":"INDEX($A$3:$A$22,MATCH(SMALL($B$3:$B$22,4),$B$3:$B$22,0))","v":"Mario"},1.57,"6 zu 21",null,1.5]
[{"$f":"IFERROR(INDEX(Tabelle1!$I$3:$I$7,MATCH(B5,Tabelle1!$J$3:$J$7,0)),IFERROR(INDEX(Tabelle1!$K$3:$K$7,MATCH(B5,Tabelle1!$L$3:$L$7,0)),IFERROR(INDEX(Tabelle1!$F$3:$F$7,MATCH(B5,Tabelle1!$G$3:$G$7,0)),IFERROR(INDEX(Tabelle1!$D$3:$D$7,MATCH(B5,Tabelle1!$E$3:$E$7,0)),\"Nicht gefunden\"))))","v":"Timo"},{"$f":"LARGE(Tabelle1!$D$3:$L$7,ROW()-2)","v":1.58},null,{"$f":"INDEX($A$3:$A$22,MATCH(LARGE($B$3:$B$22,5),$B$3:$B$22,0))","v":"Henry"},1.2,{"$f":"INDEX($A$3:$A$22,MATCH(SMALL($B$3:$B$22,5),$B$3:$B$22,0))","v":"Dieter"},0.1,null,{"$f":"INDEX($A$3:$A$22,MATCH(LARGE($B$3:$B$22,6),$B$3:$B$22,0))","v":"Manfred"},1.51,{"$f":"INDEX($A$3:$A$22,MATCH(SMALL($B$3:$B$22,6),$B$3:$B$22,0))","v":"Jens"},0.61,"19 zu 21",null,0.5]
[{"$f":"IFERROR(INDEX(Tabelle1!$I$3:$I$7,MATCH(B6,Tabelle1!$J$3:$J$7,0)),IFERROR(INDEX(Tabelle1!$K$3:$K$7,MATCH(B6,Tabelle1!$L$3:$L$7,0)),IFERROR(INDEX(Tabelle1!$F$3:$F$7,MATCH(B6,Tabelle1!$G$3:$G$7,0)),IFERROR(INDEX(Tabelle1!$D$3:$D$7,MATCH(B6,Tabelle1!$E$3:$E$7,0)),\"Nicht gefunden\"))))","v":"Rudi"},{"$f":"LARGE(Tabelle1!$D$3:$L$7,ROW()-2)","v":1.54},null,{"$f":"INDEX($A$3:$A$22,MATCH(LARGE($B$3:$B$22,7),$B$3:$B$22,0))","v":"Ralf"},0.65,{"$f":"INDEX($A$3:$A$22,MATCH(SMALL($B$3:$B$22,7),$B$3:$B$22,0))","v":"Georg"},0.14000000000000001,null,{"$f":"INDEX($A$3:$A$22,MATCH(LARGE($B$3:$B$22,8),$B$3:$B$22,0))","v":"Wolfgang"},2.12,{"$f":"INDEX($A$3:$A$22,MATCH(SMALL($B$3:$B$22,8),$B$3:$B$22,0))","v":"Bernd"},1.66,"8 zu 21",null,1.5]
[{"$f":"IFERROR(INDEX(Tabelle1!$I$3:$I$7,MATCH(B7,Tabelle1!$J$3:$J$7,0)),IFERROR(INDEX(Tabelle1!$K$3:$K$7,MATCH(B7,Tabelle1!$L$3:$L$7,0)),IFERROR(INDEX(Tabelle1!$F$3:$F$7,MATCH(B7,Tabelle1!$G$3:$G$7,0)),IFERROR(INDEX(Tabelle1!$D$3:$D$7,MATCH(B7,Tabelle1!$E$3:$E$7,0)),\"Nicht gefunden\"))))","v":"Henry"},{"$f":"LARGE(Tabelle1!$D$3:$L$7,ROW()-2)","v":1.2},null,{"$f":"INDEX($A$3:$A$22,MATCH(LARGE($B$3:$B$22,9),$B$3:$B$22,0))","v":"Willi"},1.0899999999999999,{"$f":"INDEX($A$3:$A$22,MATCH(SMALL($B$3:$B$22,9),$B$3:$B$22,0))","v":"Franz"},0.67999999999999994,null,{"$f":"INDEX($A$3:$A$22,MATCH(LARGE($B$3:$B$22,10),$B$3:$B$22,0))","v":"Marec"},0.56000000000000005,{"$f":"INDEX($A$3:$A$22,MATCH(SMALL($B$3:$B$22,10),$B$3:$B$22,0))","v":"Kurt"},0.19,"21 zu 19",0.5]
[{"$f":"IFERROR(INDEX(Tabelle1!$I$3:$I$7,MATCH(B8,Tabelle1!$J$3:$J$7,0)),IFERROR(INDEX(Tabelle1!$K$3:$K$7,MATCH(B8,Tabelle1!$L$3:$L$7,0)),IFERROR(INDEX(Tabelle1!$F$3:$F$7,MATCH(B8,Tabelle1!$G$3:$G$7,0)),IFERROR(INDEX(Tabelle1!$D$3:$D$7,MATCH(B8,Tabelle1!$E$3:$E$7,0)),\"Nicht gefunden\"))))","v":"Manfred"},{"$f":"LARGE(Tabelle1!$D$3:$L$7,ROW()-2)","v":1.01}]
[{"$f":"IFERROR(INDEX(Tabelle1!$I$3:$I$7,MATCH(B9,Tabelle1!$J$3:$J$7,0)),IFERROR(INDEX(Tabelle1!$K$3:$K$7,MATCH(B9,Tabelle1!$L$3:$L$7,0)),IFERROR(INDEX(Tabelle1!$F$3:$F$7,MATCH(B9,Tabelle1!$G$3:$G$7,0)),IFERROR(INDEX(Tabelle1!$D$3:$D$7,MATCH(B9,Tabelle1!$E$3:$E$7,0)),\"Nicht gefunden\"))))","v":"Ralf"},{"$f":"LARGE(Tabelle1!$D$3:$L$7,ROW()-2)","v":0.65}]
[{"$f":"IFERROR(INDEX(Tabelle1!$I$3:$I$7,MATCH(B10,Tabelle1!$J$3:$J$7,0)),IFERROR(INDEX(Tabelle1!$K$3:$K$7,MATCH(B10,Tabelle1!$L$3:$L$7,0)),IFERROR(INDEX(Tabelle1!$F$3:$F$7,MATCH(B10,Tabelle1!$G$3:$G$7,0)),IFERROR(INDEX(Tabelle1!$D$3:$D$7,MATCH(B10,Tabelle1!$E$3:$E$7,0)),\"Nicht gefunden\"))))","v":"Wolfgang"},{"$f":"LARGE(Tabelle1!$D$3:$L$7,ROW()-2)","v":0.62}]
[{"$f":"IFERROR(INDEX(Tabelle1!$I$3:$I$7,MATCH(B11,Tabelle1!$J$3:$J$7,0)),IFERROR(INDEX(Tabelle1!$K$3:$K$7,MATCH(B11,Tabelle1!$L$3:$L$7,0)),IFERROR(INDEX(Tabelle1!$F$3:$F$7,MATCH(B11,Tabelle1!$G$3:$G$7,0)),IFERROR(INDEX(Tabelle1!$D$3:$D$7,MATCH(B11,Tabelle1!$E$3:$E$7,0)),\"Nicht gefunden\"))))","v":"Willi"},{"$f":"LARGE(Tabelle1!$D$3:$L$7,ROW()-2)","v":0.59}]
[{"$f":"IFERROR(INDEX(Tabelle1!$I$3:$I$7,MATCH(B12,Tabelle1!$J$3:$J$7,0)),IFERROR(INDEX(Tabelle1!$K$3:$K$7,MATCH(B12,Tabelle1!$L$3:$L$7,0)),IFERROR(INDEX(Tabelle1!$F$3:$F$7,MATCH(B12,Tabelle1!$G$3:$G$7,0)),IFERROR(INDEX(Tabelle1!$D$3:$D$7,MATCH(B12,Tabelle1!$E$3:$E$7,0)),\"Nicht gefunden\"))))","v":"Marec"},{"$f":"LARGE(Tabelle1!$D$3:$L$7,ROW()-2)","v":0.56000000000000005}]
[{"$f":"IFERROR(INDEX(Tabelle1!$I$3:$I$7,MATCH(B13,Tabelle1!$J$3:$J$7,0)),IFERROR(INDEX(Tabelle1!$K$3:$K$7,MATCH(B13,Tabelle1!$L$3:$L$7,0)),IFERROR(INDEX(Tabelle1!$F$3:$F$7,MATCH(B13,Tabelle1!$G$3:$G$7,0)),IFERROR(INDEX(Tabelle1!$D$3:$D$7,MATCH(B13,Tabelle1!$E$3:$E$7,0)),\"Nicht gefunden\"))))","v":"Kurt"},{"$f":"LARGE(Tabelle1!$D$3:$L$7,ROW()-2)","v":0.19}]
[{"$f":"IFERROR(INDEX(Tabelle1!$I$3:$I$7,MATCH(B14,Tabelle1!$J$3:$J$7,0)),IFERROR(INDEX(Tabelle1!$K$3:$K$7,MATCH(B14,Tabelle1!$L$3:$L$7,0)),IFERROR(INDEX(Tabelle1!$F$3:$F$7,MATCH(B14,Tabelle1!$G$3:$G$7,0)),IFERROR(INDEX(Tabelle1!$D$3:$D$7,MATCH(B14,Tabelle1!$E$3:$E$7,0)),\"Nicht gefunden\"))))","v":"Franz"},{"$f":"LARGE(Tabelle1!$D$3:$L$7,ROW()-2)","v":0.18}]
[{"$f":"IFERROR(INDEX(Tabelle1!$I$3:$I$7,MATCH(B15,Tabelle1!$J$3:$J$7,0)),IFERROR(INDEX(Tabelle1!$K$3:$K$7,MATCH(B15,Tabelle1!$L$3:$L$7,0)),IFERROR(INDEX(Tabelle1!$F$3:$F$7,MATCH(B15,Tabelle1!$G$3:$G$7,0)),IFERROR(INDEX(Tabelle1!$D$3:$D$7,MATCH(B15,Tabelle1!$E$3:$E$7,0)),\"Nicht gefunden\"))))","v":"Bernd"},{"$f":"LARGE(Tabelle1!$D$3:$L$7,ROW()-2)","v":0.16}]
[{"$f":"IFERROR(INDEX(Tabelle1!$I$3:$I$7,MATCH(B16,Tabelle1!$J$3:$J$7,0)),IFERROR(INDEX(Tabelle1!$K$3:$K$7,MATCH(B16,Tabelle1!$L$3:$L$7,0)),IFERROR(INDEX(Tabelle1!$F$3:$F$7,MATCH(B16,Tabelle1!$G$3:$G$7,0)),IFERROR(INDEX(Tabelle1!$D$3:$D$7,MATCH(B16,Tabelle1!$E$3:$E$7,0)),\"Nicht gefunden\"))))","v":"Georg"},{"$f":"LARGE(Tabelle1!$D$3:$L$7,ROW()-2)","v":0.14000000000000001}]
[{"$f":"IFERROR(INDEX(Tabelle1!$I$3:$I$7,MATCH(B17,Tabelle1!$J$3:$J$7,0)),IFERROR(INDEX(Tabelle1!$K$3:$K$7,MATCH(B17,Tabelle1!$L$3:$L$7,0)),IFERROR(INDEX(Tabelle1!$F$3:$F$7,MATCH(B17,Tabelle1!$G$3:$G$7,0)),IFERROR(INDEX(Tabelle1!$D$3:$D$7,MATCH(B17,Tabelle1!$E$3:$E$7,0)),\"Nicht gefunden\"))))","v":"Jens"},{"$f":"LARGE(Tabelle1!$D$3:$L$7,ROW()-2)","v":0.11}]
[{"$f":"IFERROR(INDEX(Tabelle1!$I$3:$I$7,MATCH(B18,Tabelle1!$J$3:$J$7,0)),IFERROR(INDEX(Tabelle1!$K$3:$K$7,MATCH(B18,Tabelle1!$L$3:$L$7,0)),IFERROR(INDEX(Tabelle1!$F$3:$F$7,MATCH(B18,Tabelle1!$G$3:$G$7,0)),IFERROR(INDEX(Tabelle1!$D$3:$D$7,MATCH(B18,Tabelle1!$E$3:$E$7,0)),\"Nicht gefunden\"))))","v":"Dieter"},{"$f":"LARGE(Tabelle1!$D$3:$L$7,ROW()-2)","v":0.1}]
[{"$f":"IFERROR(INDEX(Tabelle1!$I$3:$I$7,MATCH(B19,Tabelle1!$J$3:$J$7,0)),IFERROR(INDEX(Tabelle1!$K$3:$K$7,MATCH(B19,Tabelle1!$L$3:$L$7,0)),IFERROR(INDEX(Tabelle1!$F$3:$F$7,MATCH(B19,Tabelle1!$G$3:$G$7,0)),IFERROR(INDEX(Tabelle1!$D$3:$D$7,MATCH(B19,Tabelle1!$E$3:$E$7,0)),\"Nicht gefunden\"))))","v":"Mario"},{"$f":"LARGE(Tabelle1!$D$3:$L$7,ROW()-2)","v":7.0000000000000007E-2}]
[{"$f":"IFERROR(INDEX(Tabelle1!$I$3:$I$7,MATCH(B20,Tabelle1!$J$3:$J$7,0)),IFERROR(INDEX(Tabelle1!$K$3:$K$7,MATCH(B20,Tabelle1!$L$3:$L$7,0)),IFERROR(INDEX(Tabelle1!$F$3:$F$7,MATCH(B20,Tabelle1!$G$3:$G$7,0)),IFERROR(INDEX(Tabelle1!$D$3:$D$7,MATCH(B20,Tabelle1!$E$3:$E$7,0)),\"Nicht gefunden\"))))","v":"Peter"},{"$f":"LARGE(Tabelle1!$D$3:$L$7,ROW()-2)","v":0.05}]
[{"$f":"IFERROR(INDEX(Tabelle1!$I$3:$I$7,MATCH(B21,Tabelle1!$J$3:$J$7,0)),IFERROR(INDEX(Tabelle1!$K$3:$K$7,MATCH(B21,Tabelle1!$L$3:$L$7,0)),IFERROR(INDEX(Tabelle1!$F$3:$F$7,MATCH(B21,Tabelle1!$G$3:$G$7,0)),IFERROR(INDEX(Tabelle1!$D$3:$D$7,MATCH(B21,Tabelle1!$E$3:$E$7,0)),\"Nicht gefunden\"))))","v":"Christoph"},{"$f":"LARGE(Tabelle1!$D$3:$L$7,ROW()-2)","v":0.03}]
[{"$f":"IFERROR(INDEX(Tabelle1!$I$3:$I$7,MATCH(B22,Tabelle1!$J$3:$J$7,0)),IFERROR(INDEX(Tabelle1!$K$3:$K$7,MATCH(B22,Tabelle1!$L$3:$L$7,0)),IFERROR(INDEX(Tabelle1!$F$3:$F$7,MATCH(B22,Tabelle1!$G$3:$G$7,0)),IFERROR(INDEX(Tabelle1!$D$3:$D$7,MATCH(B22,Tabelle1!$E$3:$E$7,0)),\"Nicht gefunden\"))))","v":"Sören"},{"$f":"LARGE(Tabelle1!$D$3:$L$7,ROW()-2)","v":0.02}]

{"sheet":"Tabelle3","index":2,"n_rows":22,"n_cols":15,"rows_kept":22,"cut":false,"hidden":false,"merged":[[26,0,26,1]]}
["Spielernamen (Reihenfolge wird ausgelost)","Wert aus bisher gespielten Spielen",null,"Team 1","Punktevergabe nach dem Spiel","Team 1","Punktevergabe nach dem Spiel","gegen","Team 2","Punktevergabe nach dem Spiel","Team 2","Punktevergabe nach dem Spiel","Ergebnis per Hand – nur Statistik","Punkte TEAM1","Punkte TEAM2"]
[]
[{"$f":"IFERROR(INDEX(Tabelle2!$I$3:$I$7,MATCH(B3,Tabelle2!$J$3:$J$7,0)),IFERROR(INDEX(Tabelle2!$K$3:$K$7,MATCH(B3,Tabelle2!$L$3:$L$7,0)),IFERROR(INDEX(Tabelle2!$F$3:$F$7,MATCH(B3,Tabelle2!$G$3:$G$7,0)),IFERROR(INDEX(Tabelle2!$D$3:$D$7,MATCH(B3,Tabelle2!$E$3:$E$7,0)),\"Nicht gefunden\"))))","v":"Rudi"},{"$f":"LARGE(Tabelle2!$D$3:$L$7,ROW()-2)","v":3.04},null,{"$f":"INDEX($A$3:$A$22,MATCH(LARGE($B$3:$B$22,1),$B$3:$B$22,0))","v":"Rudi"},{"$f":"VLOOKUP(D3,$A$3:$B$22,2,0)+$N3","v":4.04},{"$f":"INDEX($A$3:$A$22,MATCH(SMALL($B$3:$B$22,1),$B$3:$B$22,0))","v":"Christoph"},{"$f":"VLOOKUP(F3,$A$3:$B$22,2,0)+$N3","v":1.03},null,{"$f":"INDEX($A$3:$A$22,MATCH(LARGE($B$3:$B$22,2),$B$3:$B$22,0))","v":"Günther"},{"$f":"VLOOKUP(I3,$A$3:$B$22,2,0)+$O3","v":2.67},{"$f":"INDEX($A$3:$A$22,MATCH(SMALL($B$3:$B$22,2),$B$3:$B$22,0))","v":"Peter"},{"$f":"VLOOKUP(K3,$A$3:$B$22,2,0)+$O3","v":0.05},"21 zu 12",1,0]
[{"$f":"IFERROR(INDEX(Tabelle2!$I$3:$I$7,MATCH(B4,Tabelle2!$J$3:$J$7,0)),IFERROR(INDEX(Tabelle2!$K$3:$K$7,MATCH(B4,Tabelle2!$L$3:$L$7,0)),IFERROR(INDEX(Tabelle2!$F$3:$F$7,MATCH(B4,Tabelle2!$G$3:$G$7,0)),IFERROR(INDEX(Tabelle2!$D$3:$D$7,MATCH(B4,Tabelle2!$E$3:$E$7,0)),\"Nicht gefunden\"))))","v":"Günther"},{"$f":"LARGE(Tabelle2!$D$3:$L$7,ROW()-2)","v":2.67},null,{"$f":"INDEX($A$3:$A$22,MATCH(LARGE($B$3:$B$22,3),$B$3:$B$22,0))","v":"Wolfgang"},{"$f":"VLOOKUP(D4,$A$3:$B$22,2,0)+$N4","v":2.12},{"$f":"INDEX($A$3:$A$22,MATCH(SMALL($B$3:$B$22,3),$B$3:$B$22,0))","v":"Dieter"},0.1,null,{"$f":"INDEX($A$3:$A$22,MATCH(LARGE($B$3:$B$22,4),$B$3:$B$22,0))","v":"Bernd"},{"$f":"VLOOKUP(I4,$A$3:$B$22,2,0)+$O4","v":3.16},{"$f":"INDEX($A$3:$A$22,MATCH(SMALL($B$3:$B$22,4),$B$3:$B$22,0))","v":"Georg"},1.6400000000000001,"6 zu 21",0,1.5]
[{"$f":"IFERROR(INDEX(Tabelle2!$I$3:$I$7,MATCH(B5,Tabelle2!$J$3:$J$7,0)),IFERROR(INDEX(Tabelle2!$K$3:$K$7,MATCH(B5,Tabelle2!$L$3:$L$7,0)),IFERROR(INDEX(Tabelle2!$F$3:$F$7,MATCH(B5,Tabelle2!$G$3:$G$7,0)),IFERROR(INDEX(Tabelle2!$D$3:$D$7,MATCH(B5,Tabelle2!$E$3:$E$7,0)),\"Nicht gefunden\"))))","v":"Wolfgang"},{"$f":"LARGE(Tabelle2!$D$3:$L$7,ROW()-2)","v":2.12},null,{"$f":"INDEX($A$3:$A$22,MATCH(LARGE($B$3:$B$22,5),$B$3:$B$22,0))","v":"Henrik"},1.63,{"$f":"INDEX($A$3:$A$22,MATCH(SMALL($B$3:$B$22,5),$B$3:$B$22,0))","v":"Kurt"},0.19,null,{"$f":"INDEX($A$3:$A$22,MATCH(LARGE($B$3:$B$22,6),$B$3:$B$22,0))","v":"Timo"},2.08,{"$f":"INDEX($A$3:$A$22,MATCH(SMALL($B$3:$B$22,6),$B$3:$B$22,0))","v":"Marec"},1.06,"19 zu 21",0,0.5]
[{"$f":"IFERROR(INDEX(Tabelle2!$I$3:$I$7,MATCH(B6,Tabelle2!$J$3:$J$7,0)),IFERROR(INDEX(Tabelle2!$K$3:$K$7,MATCH(B6,Tabelle2!$L$3:$L$7,0)),IFERROR(INDEX(Tabelle2!$F$3:$F$7,MATCH(B6,Tabelle2!$G$3:$G$7,0)),IFERROR(INDEX(Tabelle2!$D$3:$D$7,MATCH(B6,Tabelle2!$E$3:$E$7,0)),\"Nicht gefunden\"))))","v":"Bernd"},{"$f":"LARGE(Tabelle2!$D$3:$L$7,ROW()-2)","v":1.66},null,{"$f":"INDEX($A$3:$A$22,MATCH(LARGE($B$3:$B$22,7),$B$3:$B$22,0))","v":"Mario"},1.57,{"$f":"INDEX($A$3:$A$22,MATCH(SMALL($B$3:$B$22,7),$B$3:$B$22,0))","v":"Jens"},0.61,null,{"$f":"INDEX($A$3:$A$22,MATCH(LARGE($B$3:$B$22,8),$B$3:$B$22,0))","v":"Manfred"},3.01,{"$f":"INDEX($A$3:$A$22,MATCH(SMALL($B$3:$B$22,8),$B$3:$B$22,0))","v":"Ralf"},2.15,"8 zu 21",0,1.5]
[{"$f":"IFERROR(INDEX(Tabelle2!$I$3:$I$7,MATCH(B7,Tabelle2!$J$3:$J$7,0)),IFERROR(INDEX(Tabelle2!$K$3:$K$7,MATCH(B7,Tabelle2!$L$3:$L$7,0)),IFERROR(INDEX(Tabelle2!$F$3:$F$7,MATCH(B7,Tabelle2!$G$3:$G$7,0)),IFERROR(INDEX(Tabelle2!$D$3:$D$7,MATCH(B7,Tabelle2!$E$3:$E$7,0)),\"Nicht gefunden\"))))","v":"Henrik"},{"$f":"LARGE(Tabelle2!$D$3:$L$7,ROW()-2)","v":1.63},null,{"$f":"INDEX($A$3:$A$22,MATCH(LARGE($B$3:$B$22,9),$B$3:$B$22,0))","v":"Henry"},1.7,{"$f":"INDEX($A$3:$A$22,MATCH(SMALL($B$3:$B$22,9),$B$3:$B$22,0))","v":"Franz"},1.18,null,{"$f":"INDEX($A$3:$A$22,MATCH(LARGE($B$3:$B$22,10),$B$3:$B$22,0))","v":"Willi"},1.0899999999999999,{"$f":"INDEX($A$3:$A$22,MATCH(SMALL($B$3:$B$22,10),$B$3:$B$22,0))","v":"Sören"},1.02,"21 zu 19",0.5,0]
[{"$f":"IFERROR(INDEX(Tabelle2!$I$3:$I$7,MATCH(B8,Tabelle2!$J$3:$J$7,0)),IFERROR(INDEX(Tabelle2!$K$3:$K$7,MATCH(B8,Tabelle2!$L$3:$L$7,0)),IFERROR(INDEX(Tabelle2!$F$3:$F$7,MATCH(B8,Tabelle2!$G$3:$G$7,0)),IFERROR(INDEX(Tabelle2!$D$3:$D$7,MATCH(B8,Tabelle2!$E$3:$E$7,0)),\"Nicht gefunden\"))))","v":"Timo"},{"$f":"LARGE(Tabelle2!$D$3:$L$7,ROW()-2)","v":1.58}]
[{"$f":"IFERROR(INDEX(Tabelle2!$I$3:$I$7,MATCH(B9,Tabelle2!$J$3:$J$7,0)),IFERROR(INDEX(Tabelle2!$K$3:$K$7,MATCH(B9,Tabelle2!$L$3:$L$7,0)),IFERROR(INDEX(Tabelle2!$F$3:$F$7,MATCH(B9,Tabelle2!$G$3:$G$7,0)),IFERROR(INDEX(Tabelle2!$D$3:$D$7,MATCH(B9,Tabelle2!$E$3:$E$7,0)),\"Nicht gefunden\"))))","v":"Mario"},{"$f":"LARGE(Tabelle2!$D$3:$L$7,ROW()-2)","v":1.57}]
[{"$f":"IFERROR(INDEX(Tabelle2!$I$3:$I$7,MATCH(B10,Tabelle2!$J$3:$J$7,0)),IFERROR(INDEX(Tabelle2!$K$3:$K$7,MATCH(B10,Tabelle2!$L$3:$L$7,0)),IFERROR(INDEX(Tabelle2!$F$3:$F$7,MATCH(B10,Tabelle2!$G$3:$G$7,0)),IFERROR(INDEX(Tabelle2!$D$3:$D$7,MATCH(B10,Tabelle2!$E$3:$E$7,0)),\"Nicht gefunden\"))))","v":"Manfred"},{"$f":"LARGE(Tabelle2!$D$3:$L$7,ROW()-2)","v":1.51}]
[{"$f":"IFERROR(INDEX(Tabelle2!$I$3:$I$7,MATCH(B11,Tabelle2!$J$3:$J$7,0)),IFERROR(INDEX(Tabelle2!$K$3:$K$7,MATCH(B11,Tabelle2!$L$3:$L$7,0)),IFERROR(INDEX(Tabelle2!$F$3:$F$7,MATCH(B11,Tabelle2!$G$3:$G$7,0)),IFERROR(INDEX(Tabelle2!$D$3:$D$7,MATCH(B11,Tabelle2!$E$3:$E$7,0)),\"Nicht gefunden\"))))","v":"Henry"},{"$f":"LARGE(Tabelle2!$D$3:$L$7,ROW()-2)","v":1.2}]
[{"$f":"IFERROR(INDEX(Tabelle2!$I$3:$I$7,MATCH(B12,Tabelle2!$J$3:$J$7,0)),IFERROR(INDEX(Tabelle2!$K$3:$K$7,MATCH(B12,Tabelle2!$L$3:$L$7,0)),IFERROR(INDEX(Tabelle2!$F$3:$F$7,MATCH(B12,Tabelle2!$G$3:$G$7,0)),IFERROR(INDEX(Tabelle2!$D$3:$D$7,MATCH(B12,Tabelle2!$E$3:$E$7,0)),\"Nicht gefunden\"))))","v":"Willi"},{"$f":"LARGE(Tabelle2!$D$3:$L$7,ROW()-2)","v":1.0899999999999999}]
[{"$f":"IFERROR(INDEX(Tabelle2!$I$3:$I$7,MATCH(B13,Tabelle2!$J$3:$J$7,0)),IFERROR(INDEX(Tabelle2!$K$3:$K$7,MATCH(B13,Tabelle2!$L$3:$L$7,0)),IFERROR(INDEX(Tabelle2!$F$3:$F$7,MATCH(B13,Tabelle2!$G$3:$G$7,0)),IFERROR(INDEX(Tabelle2!$D$3:$D$7,MATCH(B13,Tabelle2!$E$3:$E$7,0)),\"Nicht gefunden\"))))","v":"Sören"},{"$f":"LARGE(Tabelle2!$D$3:$L$7,ROW()-2)","v":1.02}]
[{"$f":"IFERROR(INDEX(Tabelle2!$I$3:$I$7,MATCH(B14,Tabelle2!$J$3:$J$7,0)),IFERROR(INDEX(Tabelle2!$K$3:$K$7,MATCH(B14,Tabelle2!$L$3:$L$7,0)),IFERROR(INDEX(Tabelle2!$F$3:$F$7,MATCH(B14,Tabelle2!$G$3:$G$7,0)),IFERROR(INDEX(Tabelle2!$D$3:$D$7,MATCH(B14,Tabelle2!$E$3:$E$7,0)),\"Nicht gefunden\"))))","v":"Franz"},{"$f":"LARGE(Tabelle2!$D$3:$L$7,ROW()-2)","v":0.67999999999999994}]
[{"$f":"IFERROR(INDEX(Tabelle2!$I$3:$I$7,MATCH(B15,Tabelle2!$J$3:$J$7,0)),IFERROR(INDEX(Tabelle2!$K$3:$K$7,MATCH(B15,Tabelle2!$L$3:$L$7,0)),IFERROR(INDEX(Tabelle2!$F$3:$F$7,MATCH(B15,Tabelle2!$G$3:$G$7,0)),IFERROR(INDEX(Tabelle2!$D$3:$D$7,MATCH(B15,Tabelle2!$E$3:$E$7,0)),\"Nicht gefunden\"))))","v":"Ralf"},{"$f":"LARGE(Tabelle2!$D$3:$L$7,ROW()-2)","v":0.65}]
[{"$f":"IFERROR(INDEX(Tabelle2!$I$3:$I$7,MATCH(B16,Tabelle2!$J$3:$J$7,0)),IFERROR(INDEX(Tabelle2!$K$3:$K$7,MATCH(B16,Tabelle2!$L$3:$L$7,0)),IFERROR(INDEX(Tabelle2!$F$3:$F$7,MATCH(B16,Tabelle2!$G$3:$G$7,0)),IFERROR(INDEX(Tabelle2!$D$3:$D$7,MATCH(B16,Tabelle2!$E$3:$E$7,0)),\"Nicht gefunden\"))))","v":"Jens"},{"$f":"LARGE(Tabelle2!$D$3:$L$7,ROW()-2)","v":0.61}]
[{"$f":"IFERROR(INDEX(Tabelle2!$I$3:$I$7,MATCH(B17,Tabelle2!$J$3:$J$7,0)),IFERROR(INDEX(Tabelle2!$K$3:$K$7,MATCH(B17,Tabelle2!$L$3:$L$7,0)),IFERROR(INDEX(Tabelle2!$F$3:$F$7,MATCH(B17,Tabelle2!$G$3:$G$7,0)),IFERROR(INDEX(Tabelle2!$D$3:$D$7,MATCH(B17,Tabelle2!$E$3:$E$7,0)),\"Nicht gefunden\"))))","v":"Marec"},{"$f":"LARGE(Tabelle2!$D$3:$L$7,ROW()-2)","v":0.56000000000000005}]
[{"$f":"IFERROR(INDEX(Tabelle2!$I$3:$I$7,MATCH(B18,Tabelle2!$J$3:$J$7,0)),IFERROR(INDEX(Tabelle2!$K$3:$K$7,MATCH(B18,Tabelle2!$L$3:$L$7,0)),IFERROR(INDEX(Tabelle2!$F$3:$F$7,MATCH(B18,Tabelle2!$G$3:$G$7,0)),IFERROR(INDEX(Tabelle2!$D$3:$D$7,MATCH(B18,Tabelle2!$E$3:$E$7,0)),\"Nicht gefunden\"))))","v":"Kurt"},{"$f":"LARGE(Tabelle2!$D$3:$L$7,ROW()-2)","v":0.19}]
[{"$f":"IFERROR(INDEX(Tabelle2!$I$3:$I$7,MATCH(B19,Tabelle2!$J$3:$J$7,0)),IFERROR(INDEX(Tabelle2!$K$3:$K$7,MATCH(B19,Tabelle2!$L$3:$L$7,0)),IFERROR(INDEX(Tabelle2!$F$3:$F$7,MATCH(B19,Tabelle2!$G$3:$G$7,0)),IFERROR(INDEX(Tabelle2!$D$3:$D$7,MATCH(B19,Tabelle2!$E$3:$E$7,0)),\"Nicht gefunden\"))))","v":"Georg"},{"$f":"LARGE(Tabelle2!$D$3:$L$7,ROW()-2)","v":0.14000000000000001}]
[{"$f":"IFERROR(INDEX(Tabelle2!$I$3:$I$7,MATCH(B20,Tabelle2!$J$3:$J$7,0)),IFERROR(INDEX(Tabelle2!$K$3:$K$7,MATCH(B20,Tabelle2!$L$3:$L$7,0)),IFERROR(INDEX(Tabelle2!$F$3:$F$7,MATCH(B20,Tabelle2!$G$3:$G$7,0)),IFERROR(INDEX(Tabelle2!$D$3:$D$7,MATCH(B20,Tabelle2!$E$3:$E$7,0)),\"Nicht gefunden\"))))","v":"Dieter"},{"$f":"LARGE(Tabelle2!$D$3:$L$7,ROW()-2)","v":0.1}]
[{"$f":"IFERROR(INDEX(Tabelle2!$I$3:$I$7,MATCH(B21,Tabelle2!$J$3:$J$7,0)),IFERROR(INDEX(Tabelle2!$K$3:$K$7,MATCH(B21,Tabelle2!$L$3:$L$7,0)),IFERROR(INDEX(Tabelle2!$F$3:$F$7,MATCH(B21,Tabelle2!$G$3:$G$7,0)),IFERROR(INDEX(Tabelle2!$D$3:$D$7,MATCH(B21,Tabelle2!$E$3:$E$7,0)),\"Nicht gefunden\"))))","v":"Peter"},{"$f":"LARGE(Tabelle2!$D$3:$L$7,ROW()-2)","v":0.05}]
[{"$f":"IFERROR(INDEX(Tabelle2!$I$3:$I$7,MATCH(B22,Tabelle2!$J$3:$J$7,0)),IFERROR(INDEX(Tabelle2!$K$3:$K$7,MATCH(B22,Tabelle2!$L$3:$L$7,0)),IFERROR(INDEX(Tabelle2!$F$3:$F$7,MATCH(B22,Tabelle2!$G$3:$G$7,0)),IFERROR(INDEX(Tabelle2!$D$3:$D$7,MATCH(B22,Tabelle2!$E$3:$E$7,0)),\"Nicht gefunden\"))))","v":"Christoph"},{"$f":"LARGE(Tabelle2!$D$3:$L$7,ROW()-2)","v":0.03}]

{"sheet":"Tabelle4","index":3,"n_rows":22,"n_cols":15,"rows_kept":22,"cut":false,"hidden":false,"merged":[[26,0,26,1]]}
["Spielernamen (Reihenfolge wird ausgelost)","Wert aus bisher gespielten Spielen",null,"Team 1","Punktevergabe nach dem Spiel","Team 1","Punktevergabe nach dem Spiel","gegen","Team 2","Punktevergabe nach dem Spiel","Team 2","Punktevergabe nach dem Spiel","Ergebnis per Hand – nur Statistik","Punkte TEAM1","Punkte TEAM2"]
[]
[{"$f":"IFERROR(INDEX(Tabelle3!$I$3:$I$7,MATCH(B3,Tabelle3!$J$3:$J$7,0)),IFERROR(INDEX(Tabelle3!$K$3:$K$7,MATCH(B3,Tabelle3!$L$3:$L$7,0)),IFERROR(INDEX(Tabelle3!$F$3:$F$7,MATCH(B3,Tabelle3!$G$3:$G$7,0)),IFERROR(INDEX(Tabelle3!$D$3:$D$7,MATCH(B3,Tabelle3!$E$3:$E$7,0)),\"Nicht gefunden\"))))","v":"Rudi"},{"$f":"LARGE(Tabelle3!$D$3:$L$7,ROW()-2)","v":4.04},null,{"$f":"INDEX($A$3:$A$22,MATCH(LARGE($B$3:$B$22,1),$B$3:$B$22,0))","v":"Rudi"},{"$f":"VLOOKUP(D3,$A$3:$B$22,2,0)+$N3","v":5.04},{"$f":"INDEX($A$3:$A$22,MATCH(SMALL($B$3:$B$22,1),$B$3:$B$22,0))","v":"Peter"},{"$f":"VLOOKUP(F3,$A$3:$B$22,2,0)+$N3","v":1.05},null,{"$f":"INDEX($A$3:$A$22,MATCH(LARGE($B$3:$B$22,2),$B$3:$B$22,0))","v":"Bernd"},{"$f":"VLOOKUP(I3,$A$3:$B$22,2,0)+$O3","v":3.16},{"$f":"INDEX($A$3:$A$22,MATCH(SMALL($B$3:$B$22,2),$B$3:$B$22,0))","v":"Dieter"},{"$f":"VLOOKUP(K3,$A$3:$B$22,2,0)+$O3","v":0.1},"21 zu 12",1,0]
[{"$f":"IFERROR(INDEX(Tabelle3!$I$3:$I$7,MATCH(B4,Tabelle3!$J$3:$J$7,0)),IFERROR(INDEX(Tabelle3!$K$3:$K$7,MATCH(B4,Tabelle3!$L$3:$L$7,0)),IFERROR(INDEX(Tabelle3!$F$3:$F$7,MATCH(B4,Tabelle3!$G$3:$G$7,0)),IFERROR(INDEX(Tabelle3!$D$3:$D$7,MATCH(B4,Tabelle3!$E$3:$E$7,0)),\"Nicht gefunden\"))))","v":"Bernd"},{"$f":"LARGE(Tabelle3!$D$3:$L$7,ROW()-2)","v":3.16},null,{"$f":"INDEX($A$3:$A$22,MATCH(LARGE($B$3:$B$22,3),$B$3:$B$22,0))","v":"Manfred"},{"$f":"VLOOKUP(D4,$A$3:$B$22,2,0)+$N4","v":3.01},{"$f":"INDEX($A$3:$A$22,MATCH(SMALL($B$3:$B$22,3),$B$3:$B$22,0))","v":"Kurt"},0.19,null,{"$f":"INDEX($A$3:$A$22,MATCH(LARGE($B$3:$B$22,4),$B$3:$B$22,0))","v":"Günther"},{"$f":"VLOOKUP(I4,$A$3:$B$22,2,0)+$O4","v":4.17},{"$f":"INDEX($A$3:$A$22,MATCH(SMALL($B$3:$B$22,4),$B$3:$B$22,0))","v":"Jens"},2.11,"6 zu 21",0,1.5]
[{"$f":"IFERROR(INDEX(Tabelle3!$I$3:$I$7,MATCH(B5,Tabelle3!$J$3:$J$7,0)),IFERROR(INDEX(Tabelle3!$K$3:$K$7,MATCH(B5,Tabelle3!$L$3:$L$7,0)),IFERROR(INDEX(Tabelle3!$F$3:$F$7,MATCH(B5,Tabelle3!$G$3:$G$7,0)),IFERROR(INDEX(Tabelle3!$D$3:$D$7,MATCH(B5,Tabelle3!$E$3:$E$7,0)),\"Nicht gefunden\"))))","v":"Manfred"},{"$f":"LARGE(Tabelle3!$D$3:$L$7,ROW()-2)","v":3.01},null,{"$f":"INDEX($A$3:$A$22,MATCH(LARGE($B$3:$B$22,5),$B$3:$B$22,0))","v":"Ralf"},2.15,{"$f":"INDEX($A$3:$A$22,MATCH(SMALL($B$3:$B$22,5),$B$3:$B$22,0))","v":"Sören"},1.02,null,{"$f":"INDEX($A$3:$A$22,MATCH(LARGE($B$3:$B$22,6),$B$3:$B$22,0))","v":"Wolfgang"},2.62,{"$f":"INDEX($A$3:$A$22,MATCH(SMALL($B$3:$B$22,6),$B$3:$B$22,0))","v":"Christoph"},1.53,"19 zu 21",0,0.5]
[{"$f":"IFERROR(INDEX(Tabelle3!$I$3:$I$7,MATCH(B6,Tabelle3!$J$3:$J$7,0)),IFERROR(INDEX(Tabelle3!$K$3:$K$7,MATCH(B6,Tabelle3!$L$3:$L$7,0)),IFERROR(INDEX(Tabelle3!$F$3:$F$7,MATCH(B6,Tabelle3!$G$3:$G$7,0)),IFERROR(INDEX(Tabelle3!$D$3:$D$7,MATCH(B6,Tabelle3!$E$3:$E$7,0)),\"Nicht gefunden\"))))","v":"Günther"},{"$f":"LARGE(Tabelle3!$D$3:$L$7,ROW()-2)","v":2.67},null,{"$f":"INDEX($A$3:$A$22,MATCH(LARGE($B$3:$B$22,7),$B$3:$B$22,0))","v":"Timo"},2.08,{"$f":"INDEX($A$3:$A$22,MATCH(SMALL($B$3:$B$22,7),$B$3:$B$22,0))","v":"Marec"},1.06,null,{"$f":"INDEX($A$3:$A$22,MATCH(LARGE($B$3:$B$22,8),$B$3:$B$22,0))","v":"Henry"},3.2,{"$f":"INDEX($A$3:$A$22,MATCH(SMALL($B$3:$B$22,8),$B$3:$B$22,0))","v":"Willi"},2.59,"8 zu 21",0,1.5]
[{"$f":"IFERROR(INDEX(Tabelle3!$I$3:$I$7,MATCH(B7,Tabelle3!$J$3:$J$7,0)),IFERROR(INDEX(Tabelle3!$K$3:$K$7,MATCH(B7,Tabelle3!$L$3:$L$7,0)),IFERROR(INDEX(Tabelle3!$F$3:$F$7,MATCH(B7,Tabelle3!$G$3:$G$7,0)),IFERROR(INDEX(Tabelle3!$D$3:$D$7,MATCH(B7,Tabelle3!$E$3:$E$7,0)),\"Nicht gefunden\"))))","v":"Ralf"},{"$f":"LARGE(Tabelle3!$D$3:$L$7,ROW()-2)","v":2.15},null,{"$f":"INDEX($A$3:$A$22,MATCH(LARGE($B$3:$B$22,9),$B$3:$B$22,0))","v":"Georg"},2.14,{"$f":"INDEX($A$3:$A$22,MATCH(SMALL($B$3:$B$22,9),$B$3:$B$22,0))","v":"Franz"},1.68,null,{"$f":"INDEX($A$3:$A$22,MATCH(LARGE($B$3:$B$22,10),$B$3:$B$22,0))","v":"Henrik"},1.63,{"$f":"INDEX($A$3:$A$22,MATCH(SMALL($B$3:$B$22,10),$B$3:$B$22,0))","v":"Mario"},1.57,"21 zu 19",0.5,0]
[{"$f":"IFERROR(INDEX(Tabelle3!$I$3:$I$7,MATCH(B8,Tabelle3!$J$3:$J$7,0)),IFERROR(INDEX(Tabelle3!$K$3:$K$7,MATCH(B8,Tabelle3!$L$3:$L$7,0)),IFERROR(INDEX(Tabelle3!$F$3:$F$7,MATCH(B8,Tabelle3!$G$3:$G$7,0)),IFERROR(INDEX(Tabelle3!$D$3:$D$7,MATCH(B8,Tabelle3!$E$3:$E$7,0)),\"Nicht gefunden\"))))","v":"Wolfgang"},{"$f":"LARGE(Tabelle3!$D$3:$L$7,ROW()-2)","v":2.12}]
[{"$f":"IFERROR(INDEX(Tabelle3!$I$3:$I$7,MATCH(B9,Tabelle3!$J$3:$J$7,0)),IFERROR(INDEX(Tabelle3!$K$3:$K$7,MATCH(B9,Tabelle3!$L$3:$L$7,0)),IFERROR(INDEX(Tabelle3!$F$3:$F$7,MATCH(B9,Tabelle3!$G$3:$G$7,0)),IFERROR(INDEX(Tabelle3!$D$3:$D$7,MATCH(B9,Tabelle3!$E$3:$E$7,0)),\"Nicht gefunden\"))))","v":"Timo"},{"$f":"LARGE(Tabelle3!$D$3:$L$7,ROW()-2)","v":2.08}]
[{"$f":"IFERROR(INDEX(Tabelle3!$I$3:$I$7,MATCH(B10,Tabelle3!$J$3:$J$7,0)),IFERROR(INDEX(Tabelle3!$K$3:$K$7,MATCH(B10,Tabelle3!$L$3:$L$7,0)),IFERROR(INDEX(Tabelle3!$F$3:$F$7,MATCH(B10,Tabelle3!$G$3:$G$7,0)),IFERROR(INDEX(Tabelle3!$D$3:$D$7,MATCH(B10,Tabelle3!$E$3:$E$7,0)),\"Nicht gefunden\"))))","v":"Henry"},{"$f":"LARGE(Tabelle3!$D$3:$L$7,ROW()-2)","v":1.7}]
[{"$f":"IFERROR(INDEX(Tabelle3!$I$3:$I$7,MATCH(B11,Tabelle3!$J$3:$J$7,0)),IFERROR(INDEX(Tabelle3!$K$3:$K$7,MATCH(B11,Tabelle3!$L$3:$L$7,0)),IFERROR(INDEX(Tabelle3!$F$3:$F$7,MATCH(B11,Tabelle3!$G$3:$G$7,0)),IFERROR(INDEX(Tabelle3!$D$3:$D$7,MATCH(B11,Tabelle3!$E$3:$E$7,0)),\"Nicht gefunden\"))))","v":"Georg"},{"$f":"LARGE(Tabelle3!$D$3:$L$7,ROW()-2)","v":1.6400000000000001}]
[{"$f":"IFERROR(INDEX(Tabelle3!$I$3:$I$7,MATCH(B12,Tabelle3!$J$3:$J$7,0)),IFERROR(INDEX(Tabelle3!$K$3:$K$7,MATCH(B12,Tabelle3!$L$3:$L$7,0)),IFERROR(INDEX(Tabelle3!$F$3:$F$7,MATCH(B12,Tabelle3!$G$3:$G$7,0)),IFERROR(INDEX(Tabelle3!$D$3:$D$7,MATCH(B12,Tabelle3!$E$3:$E$7,0)),\"Nicht gefunden\"))))","v":"Henrik"},{"$f":"LARGE(Tabelle3!$D$3:$L$7,ROW()-2)","v":1.63}]
[{"$f":"IFERROR(INDEX(Tabelle3!$I$3:$I$7,MATCH(B13,Tabelle3!$J$3:$J$7,0)),IFERROR(INDEX(Tabelle3!$K$3:$K$7,MATCH(B13,Tabelle3!$L$3:$L$7,0)),IFERROR(INDEX(Tabelle3!$F$3:$F$7,MATCH(B13,Tabelle3!$G$3:$G$7,0)),IFERROR(INDEX(Tabelle3!$D$3:$D$7,MATCH(B13,Tabelle3!$E$3:$E$7,0)),\"Nicht gefunden\"))))","v":"Mario"},{"$f":"LARGE(Tabelle3!$D$3:$L$7,ROW()-2)","v":1.57}]
[{"$f":"IFERROR(INDEX(Tabelle3!$I$3:$I$7,MATCH(B14,Tabelle3!$J$3:$J$7,0)),IFERROR(INDEX(Tabelle3!$K$3:$K$7,MATCH(B14,Tabelle3!$L$3:$L$7,0)),IFERROR(INDEX(Tabelle3!$F$3:$F$7,MATCH(B14,Tabelle3!$G$3:$G$7,0)),IFERROR(INDEX(Tabelle3!$D$3:$D$7,MATCH(B14,Tabelle3!$E$3:$E$7,0)),\"Nicht gefunden\"))))","v":"Franz"},{"$f":"LARGE(Tabelle3!$D$3:$L$7,ROW()-2)","v":1.18}]
[{"$f":"IFERROR(INDEX(Tabelle3!$I$3:$I$7,MATCH(B15,Tabelle3!$J$3:$J$7,0)),IFERROR(INDEX(Tabelle3!$K$3:$K$7,MATCH(B15,Tabelle3!$L$3:$L$7,0)),IFERROR(INDEX(Tabelle3!$F$3:$F$7,MATCH(B15,Tabelle3!$G$3:$G$7,0)),IFERROR(INDEX(Tabelle3!$D$3:$D$7,MATCH(B15,Tabelle3!$E$3:$E$7,0)),\"Nicht gefunden\"))))","v":"Willi"},{"$f":"LARGE(Tabelle3!$D$3:$L$7,ROW()-2)","v":1.0899999999999999}]
[{"$f":"IFERROR(INDEX(Tabelle3!$I$3:$I$7,MATCH(B16,Tabelle3!$J$3:$J$7,0)),IFERROR(INDEX(Tabelle3!$K$3:$K$7,MATCH(B16,Tabelle3!$L$3:$L$7,0)),IFERROR(INDEX(Tabelle3!$F$3:$F$7,MATCH(B16,Tabelle3!$G$3:$G$7,0)),IFERROR(INDEX(Tabelle3!$D$3:$D$7,MATCH(B16,Tabelle3!$E$3:$E$7,0)),\"Nicht gefunden\"))))","v":"Marec"},{"$f":"LARGE(Tabelle3!$D$3:$L$7,ROW()-2)","v":1.06}]
[{"$f":"IFERROR(INDEX(Tabelle3!$I$3:$I$7,MATCH(B17,Tabelle3!$J$3:$J$7,0)),IFERROR(INDEX(Tabelle3!$K$3:$K$7,MATCH(B17,Tabelle3!$L$3:$L$7,0)),IFERROR(INDEX(Tabelle3!$F$3:$F$7,MATCH(B17,Tabelle3!$G$3:$G$7,0)),IFERROR(INDEX(Tabelle3!$D$3:$D$7,MATCH(B17,Tabelle3!$E$3:$E$7,0)),\"Nicht gefunden\"))))","v":"Christoph"},{"$f":"LARGE(Tabelle3!$D$3:$L$7,ROW()-2)","v":1.03}]
[{"$f":"IFERROR(INDEX(Tabelle3!$I$3:$I$7,MATCH(B18,Tabelle3!$J$3:$J$7,0)),IFERROR(INDEX(Tabelle3!$K$3:$K$7,MATCH(B18,Tabelle3!$L$3:$L$7,0)),IFERROR(INDEX(Tabelle3!$F$3:$F$7,MATCH(B18,Tabelle3!$G$3:$G$7,0)),IFERROR(INDEX(Tabelle3!$D$3:$D$7,MATCH(B18,Tabelle3!$E$3:$E$7,0)),\"Nicht gefunden\"))))","v":"Sören"},{"$f":"LARGE(Tabelle3!$D$3:$L$7,ROW()-2)","v":1.02}]
[{"$f":"IFERROR(INDEX(Tabelle3!$I$3:$I$7,MATCH(B19,Tabelle3!$J$3:$J$7,0)),IFERROR(INDEX(Tabelle3!$K$3:$K$7,MATCH(B19,Tabelle3!$L$3:$L$7,0)),IFERROR(INDEX(Tabelle3!$F$3:$F$7,MATCH(B19,Tabelle3!$G$3:$G$7,0)),IFERROR(INDEX(Tabelle3!$D$3:$D$7,MATCH(B19,Tabelle3!$E$3:$E$7,0)),\"Nicht gefunden\"))))","v":"Jens"},{"$f":"LARGE(Tabelle3!$D$3:$L$7,ROW()-2)","v":0.61}]
[{"$f":"IFERROR(INDEX(Tabelle3!$I$3:$I$7,MATCH(B20,Tabelle3!$J$3:$J$7,0)),IFERROR(INDEX(Tabelle3!$K$3:$K$7,MATCH(B20,Tabelle3!$L$3:$L$7,0)),IFERROR(INDEX(Tabelle3!$F$3:$F$7,MATCH(B20,Tabelle3!$G$3:$G$7,0)),IFERROR(INDEX(Tabelle3!$D$3:$D$7,MATCH(B20,Tabelle3!$E$3:$E$7,0)),\"Nicht gefunden\"))))","v":"Kurt"},{"$f":"LARGE(Tabelle3!$D$3:$L$7,ROW()-2)","v":0.19}]
[{"$f":"IFERROR(INDEX(Tabelle3!$I$3:$I$7,MATCH(B21,Tabelle3!$J$3:$J$7,0)),IFERROR(INDEX(Tabelle3!$K$3:$K$7,MATCH(B21,Tabelle3!$L$3:$L$7,0)),IFERROR(INDEX(Tabelle3!$F$3:$F$7,MATCH(B21,Tabelle3!$G$3:$G$7,0)),IFERROR(INDEX(Tabelle3!$D$3:$D$7,MATCH(B21,Tabelle3!$E$3:$E$7,0)),\"Nicht gefunden\"))))","v":"Dieter"},{"$f":"LARGE(Tabelle3!$D$3:$L$7,ROW()-2)","v":0.1}]
[{"$f":"IFERROR(INDEX(Tabelle3!$I$3:$I$7,MATCH(B22,Tabelle3!$J$3:$J$7,0)),IFERROR(INDEX(Tabelle3!$K$3:$K$7,MATCH(B22,Tabelle3!$L$3:$L$7,0)),IFERROR(INDEX(Tabelle3!$F$3:$F$7,MATCH(B22,Tabelle3!$G$3:$G$7,0)),IFERROR(INDEX(Tabelle3!$D$3:$D$7,MATCH(B22,Tabelle3!$E$3:$E$7,0)),\"Nicht gefunden\"))))","v":"Peter"},{"$f":"LARGE(Tabelle3!$D$3:$L$7,ROW()-2)","v":0.05}]

{"sheet":"Tabelle5","index":4,"n_rows":22,"n_cols":15,"rows_kept":22,"cut":false,"hidden":false,"merged":[[26,0,26,1]]}
["Spielernamen (Reihenfolge wird ausgelost)","Wert aus bisher gespielten Spielen",null,"Team 1","Punktevergabe nach dem Spiel","Team 1","Punktevergabe nach dem Spiel","gegen","Team 2","Punktevergabe nach dem Spiel","Team 2","Punktevergabe nach dem Spiel","Ergebnis per Hand – nur Statistik","Punkte TEAM1","Punkte TEAM2"]
[]
[{"$f":"IFERROR(INDEX(Tabelle4!$I$3:$I$7,MATCH(B3,Tabelle4!$J$3:$J$7,0)),IFERROR(INDEX(Tabelle4!$K$3:$K$7,MATCH(B3,Tabelle4!$L$3:$L$7,0)),IFERROR(INDEX(Tabelle4!$F$3:$F$7,MATCH(B3,Tabelle4!$G$3:$G$7,0)),IFERROR(INDEX(Tabelle4!$D$3:$D$7,MATCH(B3,Tabelle4!$E$3:$E$7,0)),\"Nicht gefunden\"))))","v":"Rudi"},{"$f":"LARGE(Tabelle4!$D$3:$L$7,ROW()-2)","v":5.04},null,{"$f":"INDEX($A$3:$A$22,MATCH(LARGE($B$3:$B$22,1),$B$3:$B$22,0))","v":"Rudi"},{"$f":"VLOOKUP(D3,$A$3:$B$22,2,0)+$N3","v":5.04},{"$f":"INDEX($A$3:$A$22,MATCH(SMALL($B$3:$B$22,1),$B$3:$B$22,0))","v":"Dieter"},{"$f":"VLOOKUP(F3,$A$3:$B$22,2,0)+$N3","v":0.1},null,{"$f":"INDEX($A$3:$A$22,MATCH(LARGE($B$3:$B$22,2),$B$3:$B$22,0))","v":"Günther"},{"$f":"VLOOKUP(I3,$A$3:$B$22,2,0)+$O3","v":4.17},{"$f":"INDEX($A$3:$A$22,MATCH(SMALL($B$3:$B$22,2),$B$3:$B$22,0))","v":"Kurt"},{"$f":"VLOOKUP(K3,$A$3:$B$22,2,0)+$O3","v":0.19},"21 zu 12"]
[{"$f":"IFERROR(INDEX(Tabelle4!$I$3:$I$7,MATCH(B4,Tabelle4!$J$3:$J$7,0)),IFERROR(INDEX(Tabelle4!$K$3:$K$7,MATCH(B4,Tabelle4!$L$3:$L$7,0)),IFERROR(INDEX(Tabelle4!$F$3:$F$7,MATCH(B4,Tabelle4!$G$3:$G$7,0)),IFERROR(INDEX(Tabelle4!$D$3:$D$7,MATCH(B4,Tabelle4!$E$3:$E$7,0)),\"Nicht gefunden\"))))","v":"Günther"},{"$f":"LARGE(Tabelle4!$D$3:$L$7,ROW()-2)","v":4.17},null,{"$f":"INDEX($A$3:$A$22,MATCH(LARGE($B$3:$B$22,3),$B$3:$B$22,0))","v":"Henry"},{"$f":"VLOOKUP(D4,$A$3:$B$22,2,0)+$N4","v":3.2},{"$f":"INDEX($A$3:$A$22,MATCH(SMALL($B$3:$B$22,3),$B$3:$B$22,0))","v":"Sören"},1.02,null,{"$f":"INDEX($A$3:$A$22,MATCH(LARGE($B$3:$B$22,4),$B$3:$B$22,0))","v":"Bernd"},{"$f":"VLOOKUP(I4,$A$3:$B$22,2,0)+$O4","v":3.16},{"$f":"INDEX($A$3:$A$22,MATCH(SMALL($B$3:$B$22,4),$B$3:$B$22,0))","v":"Peter"},1.05,"6 zu 21"]
[{"$f":"IFERROR(INDEX(Tabelle4!$I$3:$I$7,MATCH(B5,Tabelle4!$J$3:$J$7,0)),IFERROR(INDEX(Tabelle4!$K$3:$K$7,MATCH(B5,Tabelle4!$L$3:$L$7,0)),IFERROR(INDEX(Tabelle4!$F$3:$F$7,MATCH(B5,Tabelle4!$G$3:$G$7,0)),IFERROR(INDEX(Tabelle4!$D$3:$D$7,MATCH(B5,Tabelle4!$E$3:$E$7,0)),\"Nicht gefunden\"))))","v":"Henry"},{"$f":"LARGE(Tabelle4!$D$3:$L$7,ROW()-2)","v":3.2},null,{"$f":"INDEX($A$3:$A$22,MATCH(LARGE($B$3:$B$22,5),$B$3:$B$22,0))","v":"Manfred"},3.01,{"$f":"INDEX($A$3:$A$22,MATCH(SMALL($B$3:$B$22,5),$B$3:$B$22,0))","v":"Marec"},1.06,null,{"$f":"INDEX($A$3:$A$22,MATCH(LARGE($B$3:$B$22,6),$B$3:$B$22,0))","v":"Wolfgang"},2.62,{"$f":"INDEX($A$3:$A$22,MATCH(SMALL($B$3:$B$22,6),$B$3:$B$22,0))","v":"Christoph"},1.53,"19 zu 21"]
[{"$f":"IFERROR(INDEX(Tabelle4!$I$3:$I$7,MATCH(B6,Tabelle4!$J$3:$J$7,0)),IFERROR(INDEX(Tabelle4!$K$3:$K$7,MATCH(B6,Tabelle4!$L$3:$L$7,0)),IFERROR(INDEX(Tabelle4!$F$3:$F$7,MATCH(B6,Tabelle4!$G$3:$G$7,0)),IFERROR(INDEX(Tabelle4!$D$3:$D$7,MATCH(B6,Tabelle4!$E$3:$E$7,0)),\"Nicht gefunden\"))))","v":"Bernd"},{"$f":"LARGE(Tabelle4!$D$3:$L$7,ROW()-2)","v":3.16},null,{"$f":"INDEX($A$3:$A$22,MATCH(LARGE($B$3:$B$22,7),$B$3:$B$22,0))","v":"Willi"},2.59,{"$f":"INDEX($A$3:$A$22,MATCH(SMALL($B$3:$B$22,7),$B$3:$B$22,0))","v":"Mario"},1.57,null,{"$f":"INDEX($A$3:$A$22,MATCH(LARGE($B$3:$B$22,8),$B$3:$B$22,0))","v":"Ralf"},2.15,{"$f":"INDEX($A$3:$A$22,MATCH(SMALL($B$3:$B$22,8),$B$3:$B$22,0))","v":"Henrik"},1.63,"8 zu 21"]
[{"$f":"IFERROR(INDEX(Tabelle4!$I$3:$I$7,MATCH(B7,Tabelle4!$J$3:$J$7,0)),IFERROR(INDEX(Tabelle4!$K$3:$K$7,MATCH(B7,Tabelle4!$L$3:$L$7,0)),IFERROR(INDEX(Tabelle4!$F$3:$F$7,MATCH(B7,Tabelle4!$G$3:$G$7,0)),IFERROR(INDEX(Tabelle4!$D$3:$D$7,MATCH(B7,Tabelle4!$E$3:$E$7,0)),\"Nicht gefunden\"))))","v":"Manfred"},{"$f":"LARGE(Tabelle4!$D$3:$L$7,ROW()-2)","v":3.01},null,{"$f":"INDEX($A$3:$A$22,MATCH(LARGE($B$3:$B$22,9),$B$3:$B$22,0))","v":"Georg"},2.14,{"$f":"INDEX($A$3:$A$22,MATCH(SMALL($B$3:$B$22,9),$B$3:$B$22,0))","v":"Franz"},1.68,null,{"$f":"INDEX($A$3:$A$22,MATCH(LARGE($B$3:$B$22,10),$B$3:$B$22,0))","v":"Jens"},2.11,{"$f":"INDEX($A$3:$A$22,MATCH(SMALL($B$3:$B$22,10),$B$3:$B$22,0))","v":"Timo"},2.08,"21 zu 19"]
[{"$f":"IFERROR(INDEX(Tabelle4!$I$3:$I$7,MATCH(B8,Tabelle4!$J$3:$J$7,0)),IFERROR(INDEX(Tabelle4!$K$3:$K$7,MATCH(B8,Tabelle4!$L$3:$L$7,0)),IFERROR(INDEX(Tabelle4!$F$3:$F$7,MATCH(B8,Tabelle4!$G$3:$G$7,0)),IFERROR(INDEX(Tabelle4!$D$3:$D$7,MATCH(B8,Tabelle4!$E$3:$E$7,0)),\"Nicht gefunden\"))))","v":"Wolfgang"},{"$f":"LARGE(Tabelle4!$D$3:$L$7,ROW()-2)","v":2.62}]
[{"$f":"IFERROR(INDEX(Tabelle4!$I$3:$I$7,MATCH(B9,Tabelle4!$J$3:$J$7,0)),IFERROR(INDEX(Tabelle4!$K$3:$K$7,MATCH(B9,Tabelle4!$L$3:$L$7,0)),IFERROR(INDEX(Tabelle4!$F$3:$F$7,MATCH(B9,Tabelle4!$G$3:$G$7,0)),IFERROR(INDEX(Tabelle4!$D$3:$D$7,MATCH(B9,Tabelle4!$E$3:$E$7,0)),\"Nicht gefunden\"))))","v":"Willi"},{"$f":"LARGE(Tabelle4!$D$3:$L$7,ROW()-2)","v":2.59}]
[{"$f":"IFERROR(INDEX(Tabelle4!$I$3:$I$7,MATCH(B10,Tabelle4!$J$3:$J$7,0)),IFERROR(INDEX(Tabelle4!$K$3:$K$7,MATCH(B10,Tabelle4!$L$3:$L$7,0)),IFERROR(INDEX(Tabelle4!$F$3:$F$7,MATCH(B10,Tabelle4!$G$3:$G$7,0)),IFERROR(INDEX(Tabelle4!$D$3:$D$7,MATCH(B10,Tabelle4!$E$3:$E$7,0)),\"Nicht gefunden\"))))","v":"Ralf"},{"$f":"LARGE(Tabelle4!$D$3:$L$7,ROW()-2)","v":2.15}]
[{"$f":"IFERROR(INDEX(Tabelle4!$I$3:$I$7,MATCH(B11,Tabelle4!$J$3:$J$7,0)),IFERROR(INDEX(Tabelle4!$K$3:$K$7,MATCH(B11,Tabelle4!$L$3:$L$7,0)),IFERROR(INDEX(Tabelle4!$F$3:$F$7,MATCH(B11,Tabelle4!$G$3:$G$7,0)),IFERROR(INDEX(Tabelle4!$D$3:$D$7,MATCH(B11,Tabelle4!$E$3:$E$7,0)),\"Nicht gefunden\"))))","v":"Georg"},{"$f":"LARGE(Tabelle4!$D$3:$L$7,ROW()-2)","v":2.14}]
[{"$f":"IFERROR(INDEX(Tabelle4!$I$3:$I$7,MATCH(B12,Tabelle4!$J$3:$J$7,0)),IFERROR(INDEX(Tabelle4!$K$3:$K$7,MATCH(B12,Tabelle4!$L$3:$L$7,0)),IFERROR(INDEX(Tabelle4!$F$3:$F$7,MATCH(B12,Tabelle4!$G$3:$G$7,0)),IFERROR(INDEX(Tabelle4!$D$3:$D$7,MATCH(B12,Tabelle4!$E$3:$E$7,0)),\"Nicht gefunden\"))))","v":"Jens"},{"$f":"LARGE(Tabelle4!$D$3:$L$7,ROW()-2)","v":2.11}]
[{"$f":"IFERROR(INDEX(Tabelle4!$I$3:$I$7,MATCH(B13,Tabelle4!$J$3:$J$7,0)),IFERROR(INDEX(Tabelle4!$K$3:$K$7,MATCH(B13,Tabelle4!$L$3:$L$7,0)),IFERROR(INDEX(Tabelle4!$F$3:$F$7,MATCH(B13,Tabelle4!$G$3:$G$7,0)),IFERROR(INDEX(Tabelle4!$D$3:$D$7,MATCH(B13,Tabelle4!$E$3:$E$7,0)),\"Nicht gefunden\"))))","v":"Timo"},{"$f":"LARGE(Tabelle4!$D$3:$L$7,ROW()-2)","v":2.08}]
[{"$f":"IFERROR(INDEX(Tabelle4!$I$3:$I$7,MATCH(B14,Tabelle4!$J$3:$J$7,0)),IFERROR(INDEX(Tabelle4!$K$3:$K$7,MATCH(B14,Tabelle4!$L$3:$L$7,0)),IFERROR(INDEX(Tabelle4!$F$3:$F$7,MATCH(B14,Tabelle4!$G$3:$G$7,0)),IFERROR(INDEX(Tabelle4!$D$3:$D$7,MATCH(B14,Tabelle4!$E$3:$E$7,0)),\"Nicht gefunden\"))))","v":"Franz"},{"$f":"LARGE(Tabelle4!$D$3:$L$7,ROW()-2)","v":1.68}]
[{"$f":"IFERROR(INDEX(Tabelle4!$I$3:$I$7,MATCH(B15,Tabelle4!$J$3:$J$7,0)),IFERROR(INDEX(Tabelle4!$K$3:$K$7,MATCH(B15,Tabelle4!$L$3:$L$7,0)),IFERROR(INDEX(Tabelle4!$F$3:$F$7,MATCH(B15,Tabelle4!$G$3:$G$7,0)),IFERROR(INDEX(Tabelle4!$D$3:$D$7,MATCH(B15,Tabelle4!$E$3:$E$7,0)),\"Nicht gefunden\"))))","v":"Henrik"},{"$f":"LARGE(Tabelle4!$D$3:$L$7,ROW()-2)","v":1.63}]
[{"$f":"IFERROR(INDEX(Tabelle4!$I$3:$I$7,MATCH(B16,Tabelle4!$J$3:$J$7,0)),IFERROR(INDEX(Tabelle4!$K$3:$K$7,MATCH(B16,Tabelle4!$L$3:$L$7,0)),IFERROR(INDEX(Tabelle4!$F$3:$F$7,MATCH(B16,Tabelle4!$G$3:$G$7,0)),IFERROR(INDEX(Tabelle4!$D$3:$D$7,MATCH(B16,Tabelle4!$E$3:$E$7,0)),\"Nicht gefunden\"))))","v":"Mario"},{"$f":"LARGE(Tabelle4!$D$3:$L$7,ROW()-2)","v":1.57}]
[{"$f":"IFERROR(INDEX(Tabelle4!$I$3:$I$7,MATCH(B17,Tabelle4!$J$3:$J$7,0)),IFERROR(INDEX(Tabelle4!$K$3:$K$7,MATCH(B17,Tabelle4!$L$3:$L$7,0)),IFERROR(INDEX(Tabelle4!$F$3:$F$7,MATCH(B17,Tabelle4!$G$3:$G$7,0)),IFERROR(INDEX(Tabelle4!$D$3:$D$7,MATCH(B17,Tabelle4!$E$3:$E$7,0)),\"Nicht gefunden\"))))","v":"Christoph"},{"$f":"LARGE(Tabelle4!$D$3:$L$7,ROW()-2)","v":1.53}]
[{"$f":"IFERROR(INDEX(Tabelle4!$I$3:$I$7,MATCH(B18,Tabelle4!$J$3:$J$7,0)),IFERROR(INDEX(Tabelle4!$K$3:$K$7,MATCH(B18,Tabelle4!$L$3:$L$7,0)),IFERROR(INDEX(Tabelle4!$F$3:$F$7,MATCH(B18,Tabelle4!$G$3:$G$7,0)),IFERROR(INDEX(Tabelle4!$D$3:$D$7,MATCH(B18,Tabelle4!$E$3:$E$7,0)),\"Nicht gefunden\"))))","v":"Marec"},{"$f":"LARGE(Tabelle4!$D$3:$L$7,ROW()-2)","v":1.06}]
[{"$f":"IFERROR(INDEX(Tabelle4!$I$3:$I$7,MATCH(B19,Tabelle4!$J$3:$J$7,0)),IFERROR(INDEX(Tabelle4!$K$3:$K$7,MATCH(B19,Tabelle4!$L$3:$L$7,0)),IFERROR(INDEX(Tabelle4!$F$3:$F$7,MATCH(B19,Tabelle4!$G$3:$G$7,0)),IFERROR(INDEX(Tabelle4!$D$3:$D$7,MATCH(B19,Tabelle4!$E$3:$E$7,0)),\"Nicht gefunden\"))))","v":"Peter"},{"$f":"LARGE(Tabelle4!$D$3:$L$7,ROW()-2)","v":1.05}]
[{"$f":"IFERROR(INDEX(Tabelle4!$I$3:$I$7,MATCH(B20,Tabelle4!$J$3:$J$7,0)),IFERROR(INDEX(Tabelle4!$K$3:$K$7,MATCH(B20,Tabelle4!$L$3:$L$7,0)),IFERROR(INDEX(Tabelle4!$F$3:$F$7,MATCH(B20,Tabelle4!$G$3:$G$7,0)),IFERROR(INDEX(Tabelle4!$D$3:$D$7,MATCH(B20,Tabelle4!$E$3:$E$7,0)),\"Nicht gefunden\"))))","v":"Sören"},{"$f":"LARGE(Tabelle4!$D$3:$L$7,ROW()-2)","v":1.02}]
[{"$f":"IFERROR(INDEX(Tabelle4!$I$3:$I$7,MATCH(B21,Tabelle4!$J$3:$J$7,0)),IFERROR(INDEX(Tabelle4!$K$3:$K$7,MATCH(B21,Tabelle4!$L$3:$L$7,0)),IFERROR(INDEX(Tabelle4!$F$3:$F$7,MATCH(B21,Tabelle4!$G$3:$G$7,0)),IFERROR(INDEX(Tabelle4!$D$3:$D$7,MATCH(B21,Tabelle4!$E$3:$E$7,0)),\"Nicht gefunden\"))))","v":"Kurt"},{"$f":"LARGE(Tabelle4!$D$3:$L$7,ROW()-2)","v":0.19}]
[{"$f":"IFERROR(INDEX(Tabelle4!$I$3:$I$7,MATCH(B22,Tabelle4!$J$3:$J$7,0)),IFERROR(INDEX(Tabelle4!$K$3:$K$7,MATCH(B22,Tabelle4!$L$3:$L$7,0)),IFERROR(INDEX(Tabelle4!$F$3:$F$7,MATCH(B22,Tabelle4!$G$3:$G$7,0)),IFERROR(INDEX(Tabelle4!$D$3:$D$7,MATCH(B22,Tabelle4!$E$3:$E$7,0)),\"Nicht gefunden\"))))","v":"Dieter"},{"$f":"LARGE(Tabelle4!$D$3:$L$7,ROW()-2)","v":0.1}]

{"sheet":"Tabelle6","index":5,"n_rows":22,"n_cols":15,"rows_kept":22,"cut":false,"hidden":false,"merged":[[26,0,26,1]]}
["Spielernamen (Reihenfolge wird ausgelost)","Wert aus bisher gespielten Spielen",null,"Team 1","Punktevergabe nach dem Spiel","Team 1","Punktevergabe nach dem Spiel","gegen","Team 2","Punktevergabe nach dem Spiel","Team 2","Punktevergabe nach dem Spiel","Ergebnis per Hand – nur Statistik","Punkte TEAM1","Punkte TEAM2"]
[]
[{"$f":"IFERROR(INDEX(Tabelle5!$I$3:$I$7,MATCH(B3,Tabelle5!$J$3:$J$7,0)),IFERROR(INDEX(Tabelle5!$K$3:$K$7,MATCH(B3,Tabelle5!$L$3:$L$7,0)),IFERROR(INDEX(Tabelle5!$F$3:$F$7,MATCH(B3,Tabelle5!$G$3:$G$7,0)),IFERROR(INDEX(Tabelle5!$D$3:$D$7,MATCH(B3,Tabelle5!$E$3:$E$7,0)),\"Nicht gefunden\"))))","v":"Rudi"},{"$f":"LARGE(Tabelle5!$D$3:$L$7,ROW()-2)","v":5.04},null,{"$f":"INDEX($A$3:$A$22,MATCH(LARGE($B$3:$B$22,1),$B$3:$B$22,0))","v":"Rudi"},{"$f":"VLOOKUP(D3,$A$3:$B$22,2,0)+$N3","v":5.04},{"$f":"INDEX($A$3:$A$22,MATCH(SMALL($B$3:$B$22,1),$B$3:$B$22,0))","v":"Dieter"},{"$f":"VLOOKUP(F3,$A$3:$B$22,2,0)+$N3","v":0.1},null,{"$f":"INDEX($A$3:$A$22,MATCH(LARGE($B$3:$B$22,2),$B$3:$B$22,0))","v":"Günther"},{"$f":"VLOOKUP(I3,$A$3:$B$22,2,0)+$O3","v":4.17},{"$f":"INDEX($A$3:$A$22,MATCH(SMALL($B$3:$B$22,2),$B$3:$B$22,0))","v":"Kurt"},{"$f":"VLOOKUP(K3,$A$3:$B$22,2,0)+$O3","v":0.19},"21 zu 12"]
[{"$f":"IFERROR(INDEX(Tabelle5!$I$3:$I$7,MATCH(B4,Tabelle5!$J$3:$J$7,0)),IFERROR(INDEX(Tabelle5!$K$3:$K$7,MATCH(B4,Tabelle5!$L$3:$L$7,0)),IFERROR(INDEX(Tabelle5!$F$3:$F$7,MATCH(B4,Tabelle5!$G$3:$G$7,0)),IFERROR(INDEX(Tabelle5!$D$3:$D$7,MATCH(B4,Tabelle5!$E$3:$E$7,0)),\"Nicht gefunden\"))))","v":"Günther"},{"$f":"LARGE(Tabelle5!$D$3:$L$7,ROW()-2)","v":4.17},null,{"$f":"INDEX($A$3:$A$22,MATCH(LARGE($B$3:$B$22,3),$B$3:$B$22,0))","v":"Henry"},{"$f":"VLOOKUP(D4,$A$3:$B$22,2,0)+$N4","v":3.2},{"$f":"INDEX($A$3:$A$22,MATCH(SMALL($B$3:$B$22,3),$B$3:$B$22,0))","v":"Sören"},1.02,null,{"$f":"INDEX($A$3:$A$22,MATCH(LARGE($B$3:$B$22,4),$B$3:$B$22,0))","v":"Bernd"},{"$f":"VLOOKUP(I4,$A$3:$B$22,2,0)+$O4","v":3.16},{"$f":"INDEX($A$3:$A$22,MATCH(SMALL($B$3:$B$22,4),$B$3:$B$22,0))","v":"Peter"},1.05,"6 zu 21"]
[{"$f":"IFERROR(INDEX(Tabelle5!$I$3:$I$7,MATCH(B5,Tabelle5!$J$3:$J$7,0)),IFERROR(INDEX(Tabelle5!$K$3:$K$7,MATCH(B5,Tabelle5!$L$3:$L$7,0)),IFERROR(INDEX(Tabelle5!$F$3:$F$7,MATCH(B5,Tabelle5!$G$3:$G$7,0)),IFERROR(INDEX(Tabelle5!$D$3:$D$7,MATCH(B5,Tabelle5!$E$3:$E$7,0)),\"Nicht gefunden\"))))","v":"Henry"},{"$f":"LARGE(Tabelle5!$D$3:$L$7,ROW()-2)","v":3.2},null,{"$f":"INDEX($A$3:$A$22,MATCH(LARGE($B$3:$B$22,5),$B$3:$B$22,0))","v":"Manfred"},3.01,{"$f":"INDEX($A$3:$A$22,MATCH(SMALL($B$3:$B$22,5),$B$3:$B$22,0))","v":"Marec"},1.06,null,{"$f":"INDEX($A$3:$A$22,MATCH(LARGE($B$3:$B$22,6),$B$3:$B$22,0))","v":"Wolfgang"},2.62,{"$f":"INDEX($A$3:$A$22,MATCH(SMALL($B$3:$B$22,6),$B$3:$B$22,0))","v":"Christoph"},1.53,"19 zu 21"]
[{"$f":"IFERROR(INDEX(Tabelle5!$I$3:$I$7,MATCH(B6,Tabelle5!$J$3:$J$7,0)),IFERROR(INDEX(Tabelle5!$K$3:$K$7,MATCH(B6,Tabelle5!$L$3:$L$7,0)),IFERROR(INDEX(Tabelle5!$F$3:$F$7,MATCH(B6,Tabelle5!$G$3:$G$7,0)),IFERROR(INDEX(Tabelle5!$D$3:$D$7,MATCH(B6,Tabelle5!$E$3:$E$7,0)),\"Nicht gefunden\"))))","v":"Bernd"},{"$f":"LARGE(Tabelle5!$D$3:$L$7,ROW()-2)","v":3.16},null,{"$f":"INDEX($A$3:$A$22,MATCH(LARGE($B$3:$B$22,7),$B$3:$B$22,0))","v":"Willi"},2.59,{"$f":"INDEX($A$3:$A$22,MATCH(SMALL($B$3:$B$22,7),$B$3:$B$22,0))","v":"Mario"},1.57,null,{"$f":"INDEX($A$3:$A$22,MATCH(LARGE($B$3:$B$22,8),$B$3:$B$22,0))","v":"Ralf"},2.15,{"$f":"INDEX($A$3:$A$22,MATCH(SMALL($B$3:$B$22,8),$B$3:$B$22,0))","v":"Henrik"},1.63,"8 zu 21"]
[{"$f":"IFERROR(INDEX(Tabelle5!$I$3:$I$7,MATCH(B7,Tabelle5!$J$3:$J$7,0)),IFERROR(INDEX(Tabelle5!$K$3:$K$7,MATCH(B7,Tabelle5!$L$3:$L$7,0)),IFERROR(INDEX(Tabelle5!$F$3:$F$7,MATCH(B7,Tabelle5!$G$3:$G$7,0)),IFERROR(INDEX(Tabelle5!$D$3:$D$7,MATCH(B7,Tabelle5!$E$3:$E$7,0)),\"Nicht gefunden\"))))","v":"Manfred"},{"$f":"LARGE(Tabelle5!$D$3:$L$7,ROW()-2)","v":3.01},null,{"$f":"INDEX($A$3:$A$22,MATCH(LARGE($B$3:$B$22,9),$B$3:$B$22,0))","v":"Georg"},2.14,{"$f":"INDEX($A$3:$A$22,MATCH(SMALL($B$3:$B$22,9),$B$3:$B$22,0))","v":"Franz"},1.68,null,{"$f":"INDEX($A$3:$A$22,MATCH(LARGE($B$3:$B$22,10),$B$3:$B$22,0))","v":"Jens"},2.11,{"$f":"INDEX($A$3:$A$22,MATCH(SMALL($B$3:$B$22,10),$B$3:$B$22,0))","v":"Timo"},2.08,"21 zu 19"]
[{"$f":"IFERROR(INDEX(Tabelle5!$I$3:$I$7,MATCH(B8,Tabelle5!$J$3:$J$7,0)),IFERROR(INDEX(Tabelle5!$K$3:$K$7,MATCH(B8,Tabelle5!$L$3:$L$7,0)),IFERROR(INDEX(Tabelle5!$F$3:$F$7,MATCH(B8,Tabelle5!$G$3:$G$7,0)),IFERROR(INDEX(Tabelle5!$D$3:$D$7,MATCH(B8,Tabelle5!$E$3:$E$7,0)),\"Nicht gefunden\"))))","v":"Wolfgang"},{"$f":"LARGE(Tabelle5!$D$3:$L$7,ROW()-2)","v":2.62}]
[{"$f":"IFERROR(INDEX(Tabelle5!$I$3:$I$7,MATCH(B9,Tabelle5!$J$3:$J$7,0)),IFERROR(INDEX(Tabelle5!$K$3:$K$7,MATCH(B9,Tabelle5!$L$3:$L$7,0)),IFERROR(INDEX(Tabelle5!$F$3:$F$7,MATCH(B9,Tabelle5!$G$3:$G$7,0)),IFERROR(INDEX(Tabelle5!$D$3:$D$7,MATCH(B9,Tabelle5!$E$3:$E$7,0)),\"Nicht gefunden\"))))","v":"Willi"},{"$f":"LARGE(Tabelle5!$D$3:$L$7,ROW()-2)","v":2.59}]
[{"$f":"IFERROR(INDEX(Tabelle5!$I$3:$I$7,MATCH(B10,Tabelle5!$J$3:$J$7,0)),IFERROR(INDEX(Tabelle5!$K$3:$K$7,MATCH(B10,Tabelle5!$L$3:$L$7,0)),IFERROR(INDEX(Tabelle5!$F$3:$F$7,MATCH(B10,Tabelle5!$G$3:$G$7,0)),IFERROR(INDEX(Tabelle5!$D$3:$D$7,MATCH(B10,Tabelle5!$E$3:$E$7,0)),\"Nicht gefunden\"))))","v":"Ralf"},{"$f":"LARGE(Tabelle5!$D$3:$L$7,ROW()-2)","v":2.15}]
[{"$f":"IFERROR(INDEX(Tabelle5!$I$3:$I$7,MATCH(B11,Tabelle5!$J$3:$J$7,0)),IFERROR(INDEX(Tabelle5!$K$3:$K$7,MATCH(B11,Tabelle5!$L$3:$L$7,0)),IFERROR(INDEX(Tabelle5!$F$3:$F$7,MATCH(B11,Tabelle5!$G$3:$G$7,0)),IFERROR(INDEX(Tabelle5!$D$3:$D$7,MATCH(B11,Tabelle5!$E$3:$E$7,0)),\"Nicht gefunden\"))))","v":"Georg"},{"$f":"LARGE(Tabelle5!$D$3:$L$7,ROW()-2)","v":2.14}]
[{"$f":"IFERROR(INDEX(Tabelle5!$I$3:$I$7,MATCH(B12,Tabelle5!$J$3:$J$7,0)),IFERROR(INDEX(Tabelle5!$K$3:$K$7,MATCH(B12,Tabelle5!$L$3:$L$7,0)),IFERROR(INDEX(Tabelle5!$F$3:$F$7,MATCH(B12,Tabelle5!$G$3:$G$7,0)),IFERROR(INDEX(Tabelle5!$D$3:$D$7,MATCH(B12,Tabelle5!$E$3:$E$7,0)),\"Nicht gefunden\"))))","v":"Jens"},{"$f":"LARGE(Tabelle5!$D$3:$L$7,ROW()-2)","v":2.11}]
[{"$f":"IFERROR(INDEX(Tabelle5!$I$3:$I$7,MATCH(B13,Tabelle5!$J$3:$J$7,0)),IFERROR(INDEX(Tabelle5!$K$3:$K$7,MATCH(B13,Tabelle5!$L$3:$L$7,0)),IFERROR(INDEX(Tabelle5!$F$3:$F$7,MATCH(B13,Tabelle5!$G$3:$G$7,0)),IFERROR(INDEX(Tabelle5!$D$3:$D$7,MATCH(B13,Tabelle5!$E$3:$E$7,0)),\"Nicht gefunden\"))))","v":"Timo"},{"$f":"LARGE(Tabelle5!$D$3:$L$7,ROW()-2)","v":2.08}]
[{"$f":"IFERROR(INDEX(Tabelle5!$I$3:$I$7,MATCH(B14,Tabelle5!$J$3:$J$7,0)),IFERROR(INDEX(Tabelle5!$K$3:$K$7,MATCH(B14,Tabelle5!$L$3:$L$7,0)),IFERROR(INDEX(Tabelle5!$F$3:$F$7,MATCH(B14,Tabelle5!$G$3:$G$7,0)),IFERROR(INDEX(Tabelle5!$D$3:$D$7,MATCH(B14,Tabelle5!$E$3:$E$7,0)),\"Nicht gefunden\"))))","v":"Franz"},{"$f":"LARGE(Tabelle5!$D$3:$L$7,ROW()-2)","v":1.68}]
[{"$f":"IFERROR(INDEX(Tabelle5!$I$3:$I$7,MATCH(B15,Tabelle5!$J$3:$J$7,0)),IFERROR(INDEX(Tabelle5!$K$3:$K$7,MATCH(B15,Tabelle5!$L$3:$L$7,0)),IFERROR(INDEX(Tabelle5!$F$3:$F$7,MATCH(B15,Tabelle5!$G$3:$G$7,0)),IFERROR(INDEX(Tabelle5!$D$3:$D$7,MATCH(B15,Tabelle5!$E$3:$E$7,0)),\"Nicht gefunden\"))))","v":"Henrik"},{"$f":"LARGE(Tabelle5!$D$3:$L$7,ROW()-2)","v":1.63}]
[{"$f":"IFERROR(INDEX(Tabelle5!$I$3:$I$7,MATCH(B16,Tabelle5!$J$3:$J$7,0)),IFERROR(INDEX(Tabelle5!$K$3:$K$7,MATCH(B16,Tabelle5!$L$3:$L$7,0)),IFERROR(INDEX(Tabelle5!$F$3:$F$7,MATCH(B16,Tabelle5!$G$3:$G$7,0)),IFERROR(INDEX(Tabelle5!$D$3:$D$7,MATCH(B16,Tabelle5!$E$3:$E$7,0)),\"Nicht gefunden\"))))","v":"Mario"},{"$f":"LARGE(Tabelle5!$D$3:$L$7,ROW()-2)","v":1.57}]
[{"$f":"IFERROR(INDEX(Tabelle5!$I$3:$I$7,MATCH(B17,Tabelle5!$J$3:$J$7,0)),IFERROR(INDEX(Tabelle5!$K$3:$K$7,MATCH(B17,Tabelle5!$L$3:$L$7,0)),IFERROR(INDEX(Tabelle5!$F$3:$F$7,MATCH(B17,Tabelle5!$G$3:$G$7,0)),IFERROR(INDEX(Tabelle5!$D$3:$D$7,MATCH(B17,Tabelle5!$E$3:$E$7,0)),\"Nicht gefunden\"))))","v":"Christoph"},{"$f":"LARGE(Tabelle5!$D$3:$L$7,ROW()-2)","v":1.53}]
[{"$f":"IFERROR(INDEX(Tabelle5!$I$3:$I$7,MATCH(B18,Tabelle5!$J$3:$J$7,0)),IFERROR(INDEX(Tabelle5!$K$3:$K$7,MATCH(B18,Tabelle5!$L$3:$L$7,0)),IFERROR(INDEX(Tabelle5!$F$3:$F$7,MATCH(B18,Tabelle5!$G$3:$G$7,0)),IFERROR(INDEX(Tabelle5!$D$3:$D$7,MATCH(B18,Tabelle5!$E$3:$E$7,0)),\"Nicht gefunden\"))))","v":"Marec"},{"$f":"LARGE(Tabelle5!$D$3:$L$7,ROW()-2)","v":1.06}]
[{"$f":"IFERROR(INDEX(Tabelle5!$I$3:$I$7,MATCH(B19,Tabelle5!$J$3:$J$7,0)),IFERROR(INDEX(Tabelle5!$K$3:$K$7,MATCH(B19,Tabelle5!$L$3:$L$7,0)),IFERROR(INDEX(Tabelle5!$F$3:$F$7,MATCH(B19,Tabelle5!$G$3:$G$7,0)),IFERROR(INDEX(Tabelle5!$D$3:$D$7,MATCH(B19,Tabelle5!$E$3:$E$7,0)),\"Nicht gefunden\"))))","v":"Peter"},{"$f":"LARGE(Tabelle5!$D$3:$L$7,ROW()-2)","v":1.05}]
[{"$f":"IFERROR(INDEX(Tabelle5!$I$3:$I$7,MATCH(B20,Tabelle5!$J$3:$J$7,0)),IFERROR(INDEX(Tabelle5!$K$3:$K$7,MATCH(B20,Tabelle5!$L$3:$L$7,0)),IFERROR(INDEX(Tabelle5!$F$3:$F$7,MATCH(B20,Tabelle5!$G$3:$G$7,0)),IFERROR(INDEX(Tabelle5!$D$3:$D$7,MATCH(B20,Tabelle5!$E$3:$E$7,0)),\"Nicht gefunden\"))))","v":"Sören"},{"$f":"LARGE(Tabelle5!$D$3:$L$7,ROW()-2)","v":1.02}]
[{"$f":"IFERROR(INDEX(Tabelle5!$I$3:$I$7,MATCH(B21,Tabelle5!$J$3:$J$7,0)),IFERROR(INDEX(Tabelle5!$K$3:$K$7,MATCH(B21,Tabelle5!$L$3:$L$7,0)),IFERROR(INDEX(Tabelle5!$F$3:$F$7,MATCH(B21,Tabelle5!$G$3:$G$7,0)),IFERROR(INDEX(Tabelle5!$D$3:$D$7,MATCH(B21,Tabelle5!$E$3:$E$7,0)),\"Nicht gefunden\"))))","v":"Kurt"},{"$f":"LARGE(Tabelle5!$D$3:$L$7,ROW()-2)","v":0.19}]
[{"$f":"IFERROR(INDEX(Tabelle5!$I$3:$I$7,MATCH(B22,Tabelle5!$J$3:$J$7,0)),IFERROR(INDEX(Tabelle5!$K$3:$K$7,MATCH(B22,Tabelle5!$L$3:$L$7,0)),IFERROR(INDEX(Tabelle5!$F$3:$F$7,MATCH(B22,Tabelle5!$G$3:$G$7,0)),IFERROR(INDEX(Tabelle5!$D$3:$D$7,MATCH(B22,Tabelle5!$E$3:$E$7,0)),\"Nicht gefunden\"))))","v":"Dieter"},{"$f":"LARGE(Tabelle5!$D$3:$L$7,ROW()-2)","v":0.1}]

{"sheet":"Halbfinale","index":6,"n_rows":10,"n_cols":15,"rows_kept":10,"cut":false,"hidden":false,"merged":[[26,0,26,1]]}
["Spielernamen (Reihenfolge wird ausgelost)","Wert aus bisher gespielten Spielen",null,"Team 1","Punktevergabe nach dem Spiel","Team 1","Punktevergabe nach dem Spiel","gegen","Team 2","Punktevergabe nach dem Spiel","Team 2","Punktevergabe nach dem Spiel","Ergebnis per Hand – nur Statistik","Punkte TEAM1","Punkte TEAM2"]
[]
[{"$f":"IFERROR(INDEX(Tabelle6!$I$3:$I$7,MATCH(B3,Tabelle6!$J$3:$J$7,0)),IFERROR(INDEX(Tabelle6!$K$3:$K$7,MATCH(B3,Tabelle6!$L$3:$L$7,0)),IFERROR(INDEX(Tabelle6!$F$3:$F$7,MATCH(B3,Tabelle6!$G$3:$G$7,0)),IFERROR(INDEX(Tabelle6!$D$3:$D$7,MATCH(B3,Tabelle6!$E$3:$E$7,0)),\"Nicht gefunden\"))))","v":"Rudi"},{"$f":"LARGE(Tabelle6!$D$3:$L$7,ROW()-2)","v":5.04},null,{"$f":"INDEX($A$3:$A$22,MATCH(LARGE($B$3:$B$22,1),$B$3:$B$22,0))","v":"Rudi"},{"$f":"VLOOKUP(D3,$A$3:$B$22,2,0)+$N3","v":6.04},{"$f":"INDEX($A$3:$A$22,MATCH(SMALL($B$3:$B$22,1),$B$3:$B$22,0))","v":"Ralf"},{"$f":"VLOOKUP(F3,$A$3:$B$22,2,0)+$N3","v":3.15},null,{"$f":"INDEX($A$3:$A$22,MATCH(LARGE($B$3:$B$22,2),$B$3:$B$22,0))","v":"Günther"},{"$f":"VLOOKUP(I3,$A$3:$B$22,2,0)+$O3","v":4.17},{"$f":"INDEX($A$3:$A$22,MATCH(SMALL($B$3:$B$22,2),$B$3:$B$22,0))","v":"Willi"},{"$f":"VLOOKUP(K3,$A$3:$B$22,2,0)+$O3","v":2.59},"21 zu 12",1,0]
[{"$f":"IFERROR(INDEX(Tabelle6!$I$3:$I$7,MATCH(B4,Tabelle6!$J$3:$J$7,0)),IFERROR(INDEX(Tabelle6!$K$3:$K$7,MATCH(B4,Tabelle6!$L$3:$L$7,0)),IFERROR(INDEX(Tabelle6!$F$3:$F$7,MATCH(B4,Tabelle6!$G$3:$G$7,0)),IFERROR(INDEX(Tabelle6!$D$3:$D$7,MATCH(B4,Tabelle6!$E$3:$E$7,0)),\"Nicht gefunden\"))))","v":"Günther"},{"$f":"LARGE(Tabelle6!$D$3:$L$7,ROW()-2)","v":4.17},null,{"$f":"INDEX($A$3:$A$22,MATCH(LARGE($B$3:$B$22,3),$B$3:$B$22,0))","v":"Henry"},{"$f":"VLOOKUP(D4,$A$3:$B$22,2,0)+$N4","v":3.2},{"$f":"INDEX($A$3:$A$22,MATCH(SMALL($B$3:$B$22,3),$B$3:$B$22,0))","v":"Wolfgang"},{"$f":"VLOOKUP(F4,$A$3:$B$22,2,0)+$N4","v":2.62},null,{"$f":"INDEX($A$3:$A$22,MATCH(LARGE($B$3:$B$22,4),$B$3:$B$22,0))","v":"Bernd"},{"$f":"VLOOKUP(I4,$A$3:$B$22,2,0)+$O4","v":4.66},{"$f":"INDEX($A$3:$A$22,MATCH(SMALL($B$3:$B$22,4),$B$3:$B$22,0))","v":"Manfred"},4.51,"6 zu 21",0,1.5]
[{"$f":"IFERROR(INDEX(Tabelle6!$I$3:$I$7,MATCH(B5,Tabelle6!$J$3:$J$7,0)),IFERROR(INDEX(Tabelle6!$K$3:$K$7,MATCH(B5,Tabelle6!$L$3:$L$7,0)),IFERROR(INDEX(Tabelle6!$F$3:$F$7,MATCH(B5,Tabelle6!$G$3:$G$7,0)),IFERROR(INDEX(Tabelle6!$D$3:$D$7,MATCH(B5,Tabelle6!$E$3:$E$7,0)),\"Nicht gefunden\"))))","v":"Henry"},{"$f":"LARGE(Tabelle6!$D$3:$L$7,ROW()-2)","v":3.2}]
[{"$f":"IFERROR(INDEX(Tabelle6!$I$3:$I$7,MATCH(B6,Tabelle6!$J$3:$J$7,0)),IFERROR(INDEX(Tabelle6!$K$3:$K$7,MATCH(B6,Tabelle6!$L$3:$L$7,0)),IFERROR(INDEX(Tabelle6!$F$3:$F$7,MATCH(B6,Tabelle6!$G$3:$G$7,0)),IFERROR(INDEX(Tabelle6!$D$3:$D$7,MATCH(B6,Tabelle6!$E$3:$E$7,0)),\"Nicht gefunden\"))))","v":"Bernd"},{"$f":"LARGE(Tabelle6!$D$3:$L$7,ROW()-2)","v":3.16}]
[{"$f":"IFERROR(INDEX(Tabelle6!$I$3:$I$7,MATCH(B7,Tabelle6!$J$3:$J$7,0)),IFERROR(INDEX(Tabelle6!$K$3:$K$7,MATCH(B7,Tabelle6!$L$3:$L$7,0)),IFERROR(INDEX(Tabelle6!$F$3:$F$7,MATCH(B7,Tabelle6!$G$3:$G$7,0)),IFERROR(INDEX(Tabelle6!$D$3:$D$7,MATCH(B7,Tabelle6!$E$3:$E$7,0)),\"Nicht gefunden\"))))","v":"Manfred"},{"$f":"LARGE(Tabelle6!$D$3:$L$7,ROW()-2)","v":3.01}]
[{"$f":"IFERROR(INDEX(Tabelle6!$I$3:$I$7,MATCH(B8,Tabelle6!$J$3:$J$7,0)),IFERROR(INDEX(Tabelle6!$K$3:$K$7,MATCH(B8,Tabelle6!$L$3:$L$7,0)),IFERROR(INDEX(Tabelle6!$F$3:$F$7,MATCH(B8,Tabelle6!$G$3:$G$7,0)),IFERROR(INDEX(Tabelle6!$D$3:$D$7,MATCH(B8,Tabelle6!$E$3:$E$7,0)),\"Nicht gefunden\"))))","v":"Wolfgang"},{"$f":"LARGE(Tabelle6!$D$3:$L$7,ROW()-2)","v":2.62}]
[{"$f":"IFERROR(INDEX(Tabelle6!$I$3:$I$7,MATCH(B9,Tabelle6!$J$3:$J$7,0)),IFERROR(INDEX(Tabelle6!$K$3:$K$7,MATCH(B9,Tabelle6!$L$3:$L$7,0)),IFERROR(INDEX(Tabelle6!$F$3:$F$7,MATCH(B9,Tabelle6!$G$3:$G$7,0)),IFERROR(INDEX(Tabelle6!$D$3:$D$7,MATCH(B9,Tabelle6!$E$3:$E$7,0)),\"Nicht gefunden\"))))","v":"Willi"},{"$f":"LARGE(Tabelle6!$D$3:$L$7,ROW()-2)","v":2.59}]
[{"$f":"IFERROR(INDEX(Tabelle6!$I$3:$I$7,MATCH(B10,Tabelle6!$J$3:$J$7,0)),IFERROR(INDEX(Tabelle6!$K$3:$K$7,MATCH(B10,Tabelle6!$L$3:$L$7,0)),IFERROR(INDEX(Tabelle6!$F$3:$F$7,MATCH(B10,Tabelle6!$G$3:$G$7,0)),IFERROR(INDEX(Tabelle6!$D$3:$D$7,MATCH(B10,Tabelle6!$E$3:$E$7,0)),\"Nicht gefunden\"))))","v":"Ralf"},{"$f":"LARGE(Tabelle6!$D$3:$L$7,ROW()-2)","v":2.15}]

{"sheet":"Finale","index":7,"n_rows":6,"n_cols":15,"rows_kept":6,"cut":false,"hidden":false,"merged":[[26,0,26,1]]}
["Spielernamen (Reihenfolge wird ausgelost)","Wert aus bisher gespielten Spielen",null,"Team 1","Punktevergabe nach dem Spiel","Team 1","Punktevergabe nach dem Spiel","gegen","Team 2","Punktevergabe nach dem Spiel","Team 2","Punktevergabe nach dem Spiel","Ergebnis per Hand – nur Statistik","Punkte TEAM1","Punkte TEAM2"]
[]
[{"$f":"IFERROR(INDEX(Halbfinale!$I$3:$I$7,MATCH(B3,Halbfinale!$J$3:$J$7,0)),IFERROR(INDEX(Halbfinale!$K$3:$K$7,MATCH(B3,Halbfinale!$L$3:$L$7,0)),IFERROR(INDEX(Halbfinale!$F$3:$F$7,MATCH(B3,Halbfinale!$G$3:$G$7,0)),IFERROR(INDEX(Halbfinale!$D$3:$D$7,MATCH(B3,Halbfinale!$E$3:$E$7,0)),\"Nicht gefunden\"))))","v":"Rudi"},{"$f":"LARGE(Halbfinale!$D$3:$L$7,ROW()-2)","v":6.04},null,{"$f":"INDEX($A$3:$A$22,MATCH(LARGE($B$3:$B$22,1),$B$3:$B$22,0))","v":"Rudi"},{"$f":"VLOOKUP(D3,$A$3:$B$22,2,0)+$N3","v":6.04},{"$f":"INDEX($A$3:$A$22,MATCH(SMALL($B$3:$B$22,1),$B$3:$B$22,0))","v":"Günther"},{"$f":"VLOOKUP(F3,$A$3:$B$22,2,0)+$N3","v":4.17},null,{"$f":"INDEX($A$3:$A$22,MATCH(LARGE($B$3:$B$22,2),$B$3:$B$22,0))","v":"Bernd"},{"$f":"VLOOKUP(I3,$A$3:$B$22,2,0)+$O3","v":4.66},{"$f":"INDEX($A$3:$A$22,MATCH(SMALL($B$3:$B$22,2),$B$3:$B$22,0))","v":"Manfred"},{"$f":"VLOOKUP(K3,$A$3:$B$22,2,0)+$O3","v":4.51},"21 zu 12"]
[{"$f":"IFERROR(INDEX(Halbfinale!$I$3:$I$7,MATCH(B4,Halbfinale!$J$3:$J$7,0)),IFERROR(INDEX(Halbfinale!$K$3:$K$7,MATCH(B4,Halbfinale!$L$3:$L$7,0)),IFERROR(INDEX(Halbfinale!$F$3:$F$7,MATCH(B4,Halbfinale!$G$3:$G$7,0)),IFERROR(INDEX(Halbfinale!$D$3:$D$7,MATCH(B4,Halbfinale!$E$3:$E$7,0)),\"Nicht gefunden\"))))","v":"Bernd"},{"$f":"LARGE(Halbfinale!$D$3:$L$7,ROW()-2)","v":4.66}]
[{"$f":"IFERROR(INDEX(Halbfinale!$I$3:$I$7,MATCH(B5,Halbfinale!$J$3:$J$7,0)),IFERROR(INDEX(Halbfinale!$K$3:$K$7,MATCH(B5,Halbfinale!$L$3:$L$7,0)),IFERROR(INDEX(Halbfinale!$F$3:$F$7,MATCH(B5,Halbfinale!$G$3:$G$7,0)),IFERROR(INDEX(Halbfinale!$D$3:$D$7,MATCH(B5,Halbfinale!$E$3:$E$7,0)),\"Nicht gefunden\"))))","v":"Manfred"},{"$f":"LARGE(Halbfinale!$D$3:$L$7,ROW()-2)","v":4.51}]
[{"$f":"IFERROR(INDEX(Halbfinale!$I$3:$I$7,MATCH(B6,Halbfinale!$J$3:$J$7,0)),IFERROR(INDEX(Halbfinale!$K$3:$K$7,MATCH(B6,Halbfinale!$L$3:$L$7,0)),IFERROR(INDEX(Halbfinale!$F$3:$F$7,MATCH(B6,Halbfinale!$G$3:$G$7,0)),IFERROR(INDEX(Halbfinale!$D$3:$D$7,MATCH(B6,Halbfinale!$E$3:$E$7,0)),\"Nicht gefunden\"))))","v":"Günther"},{"$f":"LARGE(Halbfinale!$D$3:$L$7,ROW()-2)","v":4.17}]