{"text_format":"1","workbook":"xlsx","n_sheets":5,"sheets":["Inhalt","Start","Ablaufplan","Feiertage","Kalender"],"not_rendered":{"charts":0,"images":5,"macros":1,"external_links":0,"defined_names":6,"comments":1,"pivot_tables":0},"unopened":[],"bounds":{"document_bytes":16777216,"sheet_cells":100000,"rows_first":2000,"rows_last":500,"rows_between":2000,"halvings":0,"cell_chars":16384,"cell_head_chars":4096},"cells_cut":0,"cells_raw":0,"read":"whole","date_system":"1904"}

{"sheet":"Inhalt","index":0,"n_rows":7,"n_cols":5,"rows_kept":7,"cut":false,"hidden":false,"merged":[]}
[]
[null,"Übersicht",null,null,{"$f":"gewJahr","v":2025}]
[]
[null,"Start"]
[null,"Ablaufplan"]
[null,"Feiertage"]
{"$rows_left_out":2}
{"sheet":"Start","index":1,"n_rows":13,"n_cols":6,"rows_kept":13,"cut":false,"hidden":false,"merged":[]}
["Inhalt",null,null,{"$f":"gewJahr","v":2025}]
[]
[null,null,null,null,null,"Ok"]
[]
[]
[]
{"$rows_left_out":8}
{"sheet":"Ablaufplan","index":2,"n_rows":97,"n_cols":152,"rows_kept":97,"cut":false,"hidden":false,"merged":[[72,3,72,7],[73,3,73,7],[74,3,74,7],[52,3,52,7],[53,3,53,7],[54,3,54,7],[55,3,55,7],[56,3,56,7],[57,3,57,7],[58,3,58,7],[59,3,59,7],[60,3,60,7],[61,3,61,7],[62,3,62,7],[63,3,63,7],[64,3,64,7],[67,3,67,7],[68,3,68,7],[69,3,69,7],[70,3,70,7],[71,3,71,7],[65,3,65,7],[66,3,66,7],[40,2,40,7],[41,2,41,7],[42,2,42,7],[43,2,43,7],[44,2,44,7],[4,50,4,63],[4,64,4,77],[8,0,8,7],[4,0,4,7],[5,0,5,7],[4,8,4,21],[4,22,4,35],[4,36,4,49],[1,4,1,5],[1,6,1,49],[1,1,1,3],[39,2,39,7],[38,2,38,7],[2,0,2,6],[2,7,2,49],[3,10,3,15],[3,16,3,23],[3,24,3,29],[3,30,3,46],[6,0,6,7],[3,0,3,7],[3,8,3,9],[37,2,37,3],[36,2,36,7]]}
["Inhalt"]
[null,{"$f":"gewJahr","v":2025},null,null,null,null,"Ablaufplan: Dockung Sep.2025"]
["Ablaufplan Gewährleistungsdockung ",null,null,null,null,null,null,"Ansprechpartner:             Projektleitung:                                       Qualität:                   Crew Zoll: \nBaustellen- und UAN Betreuung:                 Planung: "]
["(Taucher im Hebewerk) '->",null,null,null,null,null,null,null,null,null,"(Taucher im Hebewerk)",null,null,null,null,null,null,null,null,null,null,null,null,null,"(Taucher im Hebewerk)"]
["Kalenderwoche (Auto)",null,null,null,null,null,null,null,{"$f":"\"KW\"&WEEKNUM(I6,21)","v":"KW38"},null,null,null,null,null,null,null,null,null,null,null,null,null,{"$f":"\"KW\"&WEEKNUM(W6,21)","v":"KW39"},null,null,null,null,null,null,null,null,null,null,null,null,null,{"$f":"\"KW\"&WEEKNUM(AK6,21)","v":"KW40"},null,null,null,null,null,null,null,null,null,null,null,null,null,{"$f":"\"KW\"&WEEKNUM(AY6,21)","v":"KW41"},null,null,null,null,null,null,null,null,null,null,null,null,null,{"$f":"\"KW\"&WEEKNUM(BM6,21)","v":"KW42"}]
["Datum (Auto)",null,null,null,null,null,null,null,{"$f":"C13","v":"2025-09-15"},{"$f":"I6","v":"2025-09-15"},{"$f":"I6+1","v":"2025-09-16"},{"$f":"J6+1","v":"2025-09-16"},"2025-09-17","2025-09-17","2025-09-18","2025-09-18","2025-09-19","2025-09-19","2025-09-20",{"$f":"R6+1","v":"2025-09-20"},{"$f":"S6+1","v":"2025-09-21"},{"$f":"T6+1","v":"2025-09-21"},{"$f":"U6+1","v":"2025-09-22"},"2025-09-22","2025-09-23","2025-09-23","2025-09-24","2025-09-24","2025-09-25","2025-09-25","2025-09-26","2025-09-26","2025-09-27","2025-09-27",{"$f":"AG6+1","v":"2025-09-28"},"2025-09-28","2025-09-29","2025-09-29","2025-09-30","2025-09-30","2025-10-01","2025-10-01","2025-10-02","2025-10-02","2025-10-03","2025-10-03","2025-10-04","2025-10-04","2025-10-05","2025-10-05","2025-10-06","2025-10-06","2025-10-07","2025-10-07","2025-10-08","2025-10-08",{"$f":"BC6+1","v":"2025-10-09"},"2025-10-09","2025-10-10","2025-10-10","2025-10-11",{"$f":"BH6+1","v":"2025-10-11"},{"$f":"BI6+1","v":"2025-10-12"},{"$f":"BJ6+1","v":"2025-10-12"},{"$f":"BK6+1","v":"2025-10-13"},{"$f":"BL6+1","v":"2025-10-13"},{"$f":"BM6+1","v":"2025-10-14"},{"$f":"BN6+1","v":"2025-10-14"},{"$f":"BO6+1","v":"2025-10-15"},{"$f":"BP6+1","v":"2025-10-15"},{"$f":"BQ6+1","v":"2025-10-16"},{"$f":"BR6+1","v":"2025-10-16"},{"$f":"BS6+1","v":"2025-10-17"},{"$f":"BT6+1","v":"2025-10-17"},{"$f":"BU6+1","v":"2025-10-18"},{"$f":"BV6+1","v":"2025-10-18"},{"$f":"BW6+1","v":"2025-10-19"},{"$f":"BX6+1","v":"2025-10-19"}]
{"$rows_left_out":92}
{"sheet":"Feiertage","index":3,"n_rows":66,"n_cols":98,"rows_kept":66,"cut":false,"hidden":false,"merged":[[5,71,7,71],[6,2,6,4],[9,0,10,0],[1,5,1,9],[3,1,3,10],[4,0,6,0],[5,64,7,64]]}
["Inhalt",null,null,null,null,null,null,null,null,null,{"$f":"VLOOKUP(L1,N1:O8,2,FALSE)","v":"Freitag"},6,{"$f":"IF(P1=TRUE,N1,\"\")","v":""},1,"Sonntag",{"$f":"IF($K$1=O1,WEEKDAY(N1,1)=7,\"\")","v":""},null,null,null,null,null,null,null,null,null,null,null,null,null,null,null,"Stammdaten","Stammdaten","Stammdaten","Stammdaten",{"$f":"SUM(AJ2:AJ8)","v":10},{"$f":"SUM(AK2:AK8)","v":{"$error":"#REF!"}},null,"Stammdaten",null,null,null,null,"https://kalender-365.de/wochentage.php","Wochentagsberechnung: 2024",null,null,null,null,"Typ2"]
[null,null,null,null,null,null,null,null,null,null,null,{"$f":"IF(M9=1,1,MAX(M1:M8)+2)","v":7},{"$f":"IF(P2=TRUE,N2-1,\"\")","v":""},2,"Montag",{"$f":"IF($K$1=O2,WEEKDAY(N2,1)=1,\"\")","v":""},null,null,null,null,null,null,null,null,null,null,null,null,null,"Inhalt",null,{"$f":"IF(#REF!>0,#REF!,\"\")","v":{"$error":"#REF!"}},{"$f":"IF(#REF!>0,\"x\",\"\")","v":{"$error":"#REF!"}},"Sonntag",{"$f":"AG2","v":{"$error":"#REF!"}},{"$f":"COUNTIF($AG$12:$AG$31,AH2)","v":0},{"$f":"IF(AI2=\"X\",AJ2,\"\")","v":{"$error":"#REF!"}},null,{"$f":"IF(#REF!>0,\"x\",\"\")","v":{"$error":"#REF!"}},7,{"$f":"IF(AI2=\"X\",AN2,\"\")","v":{"$error":"#REF!"}},{"$f":"SUM((WEEKDAY(ROW(INDIRECT($Y$12&\":\"&$Z$23)),2)=AO2)*1)","v":{"$error":"#REF!"}},{"$f":"SUM((WEEKDAY(ROW(INDIRECT($Y$12&\":\"&$Z$23)),2)=AN2)*1)","v":52},null,null,"Sonntage: 52",null,null,7,"Sonntag",null,null,null,null,null,null,null,null,null,null,null,null,null,null,null,null,null,null,null,null,null,null,null,null,null,null,null,"Januar","Februar","März","April","Mai","Juni","Juli","August","September","Oktober","November","Dezember"]
["Negativ","Positiv",null,null,{"$f":"gewJahr","v":2025},{"$f":"YEAR(Ablaufplan!C13)","v":2025},null,null,null,null,null,null,"",3,"Dienstag",{"$f":"IF($K$1=O3,WEEKDAY(N3,1)=2,\"\")","v":""},null,null,null,null,null,null,null,null,null,null,null,null,null,null,null,{"$f":"IF(#REF!>0,#REF!,\"\")","v":{"$error":"#REF!"}},{"$f":"IF(#REF!>0,\"x\",\"\")","v":{"$error":"#REF!"}},"Montag",{"$f":"AG3","v":{"$error":"#REF!"}},{"$f":"COUNTIF($AG$12:$AG$31,AH3)","v":2},{"$f":"IF(AI3=\"X\",AJ3,\"\")","v":{"$error":"#REF!"}},null,{"$f":"IF(#REF!>0,\"x\",\"\")","v":{"$error":"#REF!"}},1,{"$f":"IF(AI3=\"X\",AN3,\"\")","v":{"$error":"#REF!"}},{"$f":"SUM((WEEKDAY(ROW(INDIRECT($Y$12&\":\"&$Z$23)),2)=AO3)*1)","v":{"$error":"#REF!"}},{"$f":"SUM((WEEKDAY(ROW(INDIRECT($Y$12&\":\"&$Z$23)),2)=AN3)*1)","v":52},null,null,"Montage: 53",null,null,1,"Montag ",null,null,{"$f":"SUM(AQ3:AQ7)","v":261},null,null,null,null,null,null,null,null,null,null,null,null,null,null,null,null,null,null,null,null,null,null,null,{"$f":"SUM(BZ3:CK3)","v":0},0,0,0,0,0,0,0,0,0,0,0,0,"Sonntagsarbeitszeiten"]
[null,{"$f":"YEAR(Ablaufplan!C13)","v":2025},null,null,null,null,null,null,null,null,null,null,"",4,"Mittwoch",{"$f":"IF($K$1=O4,WEEKDAY(N4,1)=3,\"\")","v":""},null,null,null,null,null,null,null,null,null,null,null,null,null,null,null,{"$f":"IF(#REF!>0,#REF!,\"\")","v":{"$error":"#REF!"}},{"$f":"IF(#REF!>0,\"x\",\"\")","v":{"$error":"#REF!"}},"Dienstag",{"$f":"AG4","v":{"$error":"#REF!"}},0,{"$error":"#REF!"},null,{"$f":"IF(#REF!>0,\"x\",\"\")","v":{"$error":"#REF!"}},2,{"$error":"#REF!"},{"$f":"SUM((WEEKDAY(ROW(INDIRECT($Y$12&\":\"&$Z$23)),2)=AO4)*1)","v":{"$error":"#REF!"}},{"$f":"SUM((WEEKDAY(ROW(INDIRECT($Y$12&\":\"&$Z$23)),2)=AN4)*1)","v":52},null,null,"Dienstage: 53",null,null,2,"Dienstag",null,null,{"$f":"SUM(AQ3:AQ6)","v":209},null,null,null,null,null,null,null,null,null,null,null,null,null,null,null,null,null,null,null,{"$f":"IF((CH9*24)>0,6,IF(CH9<0,7,5))","v":{"$error":"#REF!"}},{"$f":"#REF!","v":{"$error":"#REF!"}},{"$f":"#REF!","v":{"$error":"#REF!"}},null,{"$f":"IF((CH9*24)>0,6,IF(CH9<0,7,5))","v":{"$error":"#REF!"}},{"$f":"VLOOKUP(BZ2,$BS$11:$BT$22,2,FALSE)","v":1},{"$f":"VLOOKUP(CA2,$BS$11:$BT$22,2,FALSE)","v":0},0,2,2,1,0,0,0,2,0,2,{"$f":"SUM(BZ4:CK4)","v":10},{"$f":"CL4*(#REF!*24)","v":{"$error":"#REF!"}},{"$f":"CM4/24","v":{"$error":"#REF!"}},null,null,null,"herleitung"]
["Auswirkung auf Soll-\nMonatsstunden Kalender","Auswahl","Ja",null," Sa","Werktage Mo-Sa =7","Arbeitstage Mo-Fr=>6",null,null,null,null,null,"",5,"Donnerstag",{"$f":"IF($K$1=O5,WEEKDAY(N5,1)=4,\"\")","v":""},null,null,null,null,null,null,null,null,null,null,null,null,null,null,null,{"$f":"IF(#REF!>0,#REF!,\"\")","v":{"$error":"#REF!"}},{"$f":"IF(#REF!>0,\"x\",\"\")","v":{"$error":"#REF!"}},"Mittwoch",{"$error":"#REF!"},1,{"$error":"#REF!"},null,{"$f":"IF(#REF!>0,\"x\",\"\")","v":{"$error":"#REF!"}},3,{"$error":"#REF!"},{"$f":"SUM((WEEKDAY(ROW(INDIRECT($Y$12&\":\"&$Z$23)),2)=AO5)*1)","v":{"$error":"#REF!"}},{"$f":"SUM((WEEKDAY(ROW(INDIRECT($Y$12&\":\"&$Z$23)),2)=AN5)*1)","v":53},null,null,"Mittwoche: 52",null,null,3,"Mittwoch",null,null,null,null,null,null,null,null,null,null,null,null,null,null,null,null,null,null,null,null,null,null,{"$f":"IF(BU4>BV4,\">=1\",\">\")","v":{"$error":"#REF!"}},null,null,null,{"$f":"(BY3*24)/(#REF!*24)","v":{"$error":"#REF!"}},null,null,null,null,null,null,null,null,null,null,null,"summ",{"$f":"SUM(CM5:CN5)","v":{"$error":"#REF!"}},{"$f":"CO8-CN5","v":{"$error":"#REF!"}},{"$f":"BY5/24","v":{"$error":"#REF!"}},"ist",null,6,{"$f":"IF($CQ$7=5,IFERROR(WEEKDAY(BY17,2)<6,\"\"))","v":true}]
[null,"Auswahl","Nein",null," So","Wochentage Mo-So =8",null,null,null,null,null,null,5,6,"Freitag",{"$f":"IF($K$1=O6,WEEKDAY(N6,1)=5,\"\")","v":true},null,"Sonntag Kein Feiertag 5 Tage/Woche",null,null,null,null,null,null,null,null,null,null,null,null,null,{"$f":"IF(#REF!>0,#REF!,\"\")","v":{"$error":"#REF!"}},{"$f":"IF(#REF!>0,\"x\",\"\")","v":{"$error":"#REF!"}},"Donnerstag",{"$error":"#REF!"},3,{"$error":"#REF!"},null,{"$f":"IF(#REF!>0,\"x\",\"\")","v":{"$error":"#REF!"}},4,{"$error":"#REF!"},{"$f":"SUM((WEEKDAY(ROW(INDIRECT($Y$12&\":\"&$Z$23)),2)=AO6)*1)","v":{"$error":"#REF!"}},{"$f":"SUM((WEEKDAY(ROW(INDIRECT($Y$12&\":\"&$Z$23)),2)=AN6)*1)","v":52},null,null,"Donnerstage: 52",null,null,4,"Donnerstag",null,null,null,null,null,null,null,null,null,null,null,null,null,null,"Auswirkung auf Soll-\nMonatsstunden Kalender",null,null,null,null,null,null,"Auswirkung auf Soll-\nMonatsstunden Kalender",null,null,null,null,15,"Feiertagsarbeit im Jahr müssen frei beiben ArbzG",null,null,null,null,null,null,null,null,null,null,null,{"$f":"CM6*9/12","v":{"$error":"#REF!"}},{"$f":"BY6*(#REF!*24)","v":{"$error":"#REF!"}},{"$f":"CM6/24","v":{"$error":"#REF!"}},"soll frei bleben Jahr",null,5,{"$f":"IF($CQ$7=5,IFERROR(WEEKDAY(BY18,2)<6,\"\"))","v":true},null,"Arbeitszeitgesetz"]
{"$rows_left_out":61}
{"sheet":"Kalender","index":4,"n_rows":35,"n_cols":24,"rows_kept":35,"cut":false,"hidden":false,"merged":[[3,0,3,1],[3,2,3,3],[3,4,3,5],[3,6,3,7],[3,8,3,9],[3,22,3,23],[1,2,1,3],[1,6,1,7],[1,15,1,16],[1,21,1,22],[3,10,3,11],[3,12,3,13],[3,14,3,15],[3,16,3,17],[3,18,3,19],[3,20,3,21]]}
["Inhalt",null,null,null,null,"Feiertage"]
[null,null,{"$f":"\"Kalender \" &gewJahr","v":"Kalender 2025"},null,null,null,"Rechnungslauf",null,null,null,null,null,null,null,null,{"$f":"\"Kalender \" &gewJahr","v":"Kalender 2025"}]
[]
["Januar",null,"Februar",null,"März",null,"April",null,"Mai",null,"Juni",null,"Juli",null,"August",null,"September",null,"Oktober",null,"November",null,"Dezember"]
[{"$f":"DATE(gewJahr,1,1)","v":"2025-01-01"},{"$f":"IFERROR(IF(ISNA(VLOOKUP(A5,Feiertage!$C$12:$D$53,1,0)),VLOOKUP(A5,Feiertage!$C$12:$D$53,2,0),VLOOKUP(A5,Feiertage!$C$12:$D$53,2)),\"\")","v":"Neujahr"},{"$f":"DATE(gewJahr,2,1)","v":"2025-02-01"},{"$f":"IFERROR(IF(ISNA(VLOOKUP(C5,Feiertage!$C$12:$D$53,1,0)),VLOOKUP(C5,Feiertage!$C$12:$D$53,2,0),VLOOKUP(C5,Feiertage!$C$12:$D$53,2)),\"\")","v":""},{"$f":"DATE(gewJahr,3,1)","v":"2025-03-01"},{"$f":"IFERROR(IF(ISNA(VLOOKUP(E5,Feiertage!$C$12:$D$53,1,0)),VLOOKUP(E5,Feiertage!$C$12:$D$53,2,0),VLOOKUP(E5,Feiertage!$C$12:$D$53,2)),\"\")","v":""},{"$f":"DATE(gewJahr,4,1)","v":"2025-04-01"},{"$f":"IFERROR(IF(ISNA(VLOOKUP(G5,Feiertage!$C$12:$D$53,1,0)),VLOOKUP(G5,Feiertage!$C$12:$D$53,2,0),VLOOKUP(G5,Feiertage!$C$12:$D$53,2)),\"\")","v":""},{"$f":"DATE(gewJahr,5,1)","v":"2025-05-01"},{"$f":"IFERROR(IF(ISNA(VLOOKUP(I5,Feiertage!$C$12:$D$53,1,0)),VLOOKUP(I5,Feiertage!$C$12:$D$53,2,0),VLOOKUP(I5,Feiertage!$C$12:$D$53,2)),\"\")","v":"Tag der Arbeit"},{"$f":"DATE(gewJahr,6,1)","v":"2025-06-01"},{"$f":"IFERROR(IF(ISNA(VLOOKUP(K5,Feiertage!$C$12:$D$53,1,0)),VLOOKUP(K5,Feiertage!$C$12:$D$53,2,0),VLOOKUP(K5,Feiertage!$C$12:$D$53,2)),\"\")","v":""},{"$f":"DATE(gewJahr,7,1)","v":"2025-07-01"},{"$f":"IFERROR(IF(ISNA(VLOOKUP(M5,Feiertage!$C$12:$D$53,1,0)),VLOOKUP(M5,Feiertage!$C$12:$D$53,2,0),VLOOKUP(M5,Feiertage!$C$12:$D$53,2)),\"\")","v":""},{"$f":"DATE(gewJahr,8,1)","v":"2025-08-01"},{"$f":"IFERROR(IF(ISNA(VLOOKUP(O5,Feiertage!$C$12:$D$53,1,0)),VLOOKUP(O5,Feiertage!$C$12:$D$53,2,0),VLOOKUP(O5,Feiertage!$C$12:$D$53,2)),\"\")","v":""},{"$f":"DATE(gewJahr,9,1)","v":"2025-09-01"},{"$f":"IFERROR(IF(ISNA(VLOOKUP(Q5,Feiertage!$C$12:$D$53,1,0)),VLOOKUP(Q5,Feiertage!$C$12:$D$53,2,0),VLOOKUP(Q5,Feiertage!$C$12:$D$53,2)),\"\")","v":""},{"$f":"DATE(gewJahr,10,1)","v":"2025-10-01"},{"$f":"IFERROR(IF(ISNA(VLOOKUP(S5,Feiertage!$C$12:$D$53,1,0)),VLOOKUP(S5,Feiertage!$C$12:$D$53,2,0),VLOOKUP(S5,Feiertage!$C$12:$D$53,2)),\"\")","v":""},{"$f":"DATE(gewJahr,11,1)","v":"2025-11-01"},{"$f":"IFERROR(IF(ISNA(VLOOKUP(U5,Feiertage!$C$12:$D$53,1,0)),VLOOKUP(U5,Feiertage!$C$12:$D$53,2,0),VLOOKUP(U5,Feiertage!$C$12:$D$53,2)),\"\")","v":""},{"$f":"DATE(gewJahr,12,1)","v":"2025-12-01"},{"$f":"IFERROR(IF(ISNA(VLOOKUP(W5,Feiertage!$C$12:$D$53,1,0)),VLOOKUP(W5,Feiertage!$C$12:$D$53,2,0),VLOOKUP(W5,Feiertage!$C$12:$D$53,2)),\"\")","v":""}]
[{"$f":"A5+1","v":"2025-01-02"},{"$f":"IFERROR(IF(ISNA(VLOOKUP(A6,Feiertage!$C$12:$D$53,1,0)),VLOOKUP(A6,Feiertage!$C$12:$D$53,2,0),VLOOKUP(A6,Feiertage!$C$12:$D$53,2)),\"\")","v":""},{"$f":"C5+1","v":"2025-02-02"},{"$f":"IFERROR(IF(ISNA(VLOOKUP(C6,Feiertage!$C$12:$D$53,1,0)),VLOOKUP(C6,Feiertage!$C$12:$D$53,2,0),VLOOKUP(C6,Feiertage!$C$12:$D$53,2)),\"\")","v":""},{"$f":"E5+1","v":"2025-03-02"},{"$f":"IFERROR(IF(ISNA(VLOOKUP(E6,Feiertage!$C$12:$D$53,1,0)),VLOOKUP(E6,Feiertage!$C$12:$D$53,2,0),VLOOKUP(E6,Feiertage!$C$12:$D$53,2)),\"\")","v":""},{"$f":"G5+1","v":"2025-04-02"},{"$f":"IFERROR(IF(ISNA(VLOOKUP(G6,Feiertage!$C$12:$D$53,1,0)),VLOOKUP(G6,Feiertage!$C$12:$D$53,2,0),VLOOKUP(G6,Feiertage!$C$12:$D$53,2)),\"\")","v":""},{"$f":"I5+1","v":"2025-05-02"},{"$f":"IFERROR(IF(ISNA(VLOOKUP(I6,Feiertage!$C$12:$D$53,1,0)),VLOOKUP(I6,Feiertage!$C$12:$D$53,2,0),VLOOKUP(I6,Feiertage!$C$12:$D$53,2)),\"\")","v":""},{"$f":"K5+1","v":"2025-06-02"},{"$f":"IFERROR(IF(ISNA(VLOOKUP(K6,Feiertage!$C$12:$D$53,1,0)),VLOOKUP(K6,Feiertage!$C$12:$D$53,2,0),VLOOKUP(K6,Feiertage!$C$12:$D$53,2)),\"\")","v":""},{"$f":"M5+1","v":"2025-07-02"},{"$f":"IFERROR(IF(ISNA(VLOOKUP(M6,Feiertage!$C$12:$D$53,1,0)),VLOOKUP(M6,Feiertage!$C$12:$D$53,2,0),VLOOKUP(M6,Feiertage!$C$12:$D$53,2)),\"\")","v":""},{"$f":"O5+1","v":"2025-08-02"},{"$f":"IFERROR(IF(ISNA(VLOOKUP(O6,Feiertage!$C$12:$D$53,1,0)),VLOOKUP(O6,Feiertage!$C$12:$D$53,2,0),VLOOKUP(O6,Feiertage!$C$12:$D$53,2)),\"\")","v":""},{"$f":"Q5+1","v":"2025-09-02"},{"$f":"IFERROR(IF(ISNA(VLOOKUP(Q6,Feiertage!$C$12:$D$53,1,0)),VLOOKUP(Q6,Feiertage!$C$12:$D$53,2,0),VLOOKUP(Q6,Feiertage!$C$12:$D$53,2)),\"\")","v":""},{"$f":"S5+1","v":"2025-10-02"},{"$f":"IFERROR(IF(ISNA(VLOOKUP(S6,Feiertage!$C$12:$D$53,1,0)),VLOOKUP(S6,Feiertage!$C$12:$D$53,2,0),VLOOKUP(S6,Feiertage!$C$12:$D$53,2)),\"\")","v":""},{"$f":"U5+1","v":"2025-11-02"},{"$f":"IFERROR(IF(ISNA(VLOOKUP(U6,Feiertage!$C$12:$D$53,1,0)),VLOOKUP(U6,Feiertage!$C$12:$D$53,2,0),VLOOKUP(U6,Feiertage!$C$12:$D$53,2)),\"\")","v":""},{"$f":"W5+1","v":"2025-12-02"},{"$f":"IFERROR(IF(ISNA(VLOOKUP(W6,Feiertage!$C$12:$D$53,1,0)),VLOOKUP(W6,Feiertage!$C$12:$D$53,2,0),VLOOKUP(W6,Feiertage!$C$12:$D$53,2)),\"\")","v":""}]
{"$rows_left_out":29}