{"text_format":"1","workbook":"xlsx","n_sheets":5,"sheets":["Inhalt","Start","Ablaufplan","Feiertage","Kalender"],"not_rendered":{"charts":0,"images":5,"macros":1,"external_links":0,"defined_names":6,"comments":1,"pivot_tables":0},"unopened":[],"bounds":{"document_bytes":16777216,"sheet_cells":100000,"rows_first":2000,"rows_last":500,"rows_between":2000,"halvings":0,"cell_chars":16384,"cell_head_chars":4096},"cells_cut":0,"cells_raw":0,"read":"whole","date_system":"1904"}

{"sheet":"Inhalt","index":0,"n_rows":7,"n_cols":5,"rows_kept":7,"cut":false,"hidden":false,"merged":[]}
[]
[null,"Übersicht",null,null,{"$f":"gewJahr","v":2025}]
[]
[null,"Start"]
[null,"Ablaufplan"]
[null,"Feiertage"]
[null,"Kalender"]

{"sheet":"Start","index":1,"n_rows":13,"n_cols":6,"rows_kept":13,"cut":false,"hidden":false,"merged":[]}
["Inhalt",null,null,{"$f":"gewJahr","v":2025}]
[]
[null,null,null,null,null,"Ok"]
[]
[]
[]
[]
[]
[null,null,null,"Ablaufplan "]
[null,null,null,"Rahmenterminplan "]
[null,null,null,"Masterplan"]
[]
[null,null,null,null,null,"Wählen Sie Start > den Pfeil Füllfarbe"]

{"sheet":"Ablaufplan","index":2,"n_rows":97,"n_cols":152,"rows_kept":97,"cut":false,"hidden":false,"merged":[[72,3,72,7],[73,3,73,7],[74,3,74,7],[52,3,52,7],[53,3,53,7],[54,3,54,7],[55,3,55,7],[56,3,56,7],[57,3,57,7],[58,3,58,7],[59,3,59,7],[60,3,60,7],[61,3,61,7],[62,3,62,7],[63,3,63,7],[64,3,64,7],[67,3,67,7],[68,3,68,7],[69,3,69,7],[70,3,70,7],[71,3,71,7],[65,3,65,7],[66,3,66,7],[40,2,40,7],[41,2,41,7],[42,2,42,7],[43,2,43,7],[44,2,44,7],[4,50,4,63],[4,64,4,77],[8,0,8,7],[4,0,4,7],[5,0,5,7],[4,8,4,21],[4,22,4,35],[4,36,4,49],[1,4,1,5],[1,6,1,49],[1,1,1,3],[39,2,39,7],[38,2,38,7],[2,0,2,6],[2,7,2,49],[3,10,3,15],[3,16,3,23],[3,24,3,29],[3,30,3,46],[6,0,6,7],[3,0,3,7],[3,8,3,9],[37,2,37,3],[36,2,36,7]]}
["Inhalt"]
[null,{"$f":"gewJahr","v":2025},null,null,null,null,"Ablaufplan: Dockung Sep.2025"]
["Ablaufplan Gewährleistungsdockung ",null,null,null,null,null,null,"Ansprechpartner:             Projektleitung:                                       Qualität:                   Crew Zoll: \nBaustellen- und UAN Betreuung:                 Planung: "]
["(Taucher im Hebewerk) '->",null,null,null,null,null,null,null,null,null,"(Taucher im Hebewerk)",null,null,null,null,null,null,null,null,null,null,null,null,null,"(Taucher im Hebewerk)"]
["Kalenderwoche (Auto)",null,null,null,null,null,null,null,{"$f":"\"KW\"&WEEKNUM(I6,21)","v":"KW38"},null,null,null,null,null,null,null,null,null,null,null,null,null,{"$f":"\"KW\"&WEEKNUM(W6,21)","v":"KW39"},null,null,null,null,null,null,null,null,null,null,null,null,null,{"$f":"\"KW\"&WEEKNUM(AK6,21)","v":"KW40"},null,null,null,null,null,null,null,null,null,null,null,null,null,{"$f":"\"KW\"&WEEKNUM(AY6,21)","v":"KW41"},null,null,null,null,null,null,null,null,null,null,null,null,null,{"$f":"\"KW\"&WEEKNUM(BM6,21)","v":"KW42"}]
["Datum (Auto)",null,null,null,null,null,null,null,{"$f":"C13","v":"2025-09-15"},{"$f":"I6","v":"2025-09-15"},{"$f":"I6+1","v":"2025-09-16"},{"$f":"J6+1","v":"2025-09-16"},"2025-09-17","2025-09-17","2025-09-18","2025-09-18","2025-09-19","2025-09-19","2025-09-20",{"$f":"R6+1","v":"2025-09-20"},{"$f":"S6+1","v":"2025-09-21"},{"$f":"T6+1","v":"2025-09-21"},{"$f":"U6+1","v":"2025-09-22"},"2025-09-22","2025-09-23","2025-09-23","2025-09-24","2025-09-24","2025-09-25","2025-09-25","2025-09-26","2025-09-26","2025-09-27","2025-09-27",{"$f":"AG6+1","v":"2025-09-28"},"2025-09-28","2025-09-29","2025-09-29","2025-09-30","2025-09-30","2025-10-01","2025-10-01","2025-10-02","2025-10-02","2025-10-03","2025-10-03","2025-10-04","2025-10-04","2025-10-05","2025-10-05","2025-10-06","2025-10-06","2025-10-07","2025-10-07","2025-10-08","2025-10-08",{"$f":"BC6+1","v":"2025-10-09"},"2025-10-09","2025-10-10","2025-10-10","2025-10-11",{"$f":"BH6+1","v":"2025-10-11"},{"$f":"BI6+1","v":"2025-10-12"},{"$f":"BJ6+1","v":"2025-10-12"},{"$f":"BK6+1","v":"2025-10-13"},{"$f":"BL6+1","v":"2025-10-13"},{"$f":"BM6+1","v":"2025-10-14"},{"$f":"BN6+1","v":"2025-10-14"},{"$f":"BO6+1","v":"2025-10-15"},{"$f":"BP6+1","v":"2025-10-15"},{"$f":"BQ6+1","v":"2025-10-16"},{"$f":"BR6+1","v":"2025-10-16"},{"$f":"BS6+1","v":"2025-10-17"},{"$f":"BT6+1","v":"2025-10-17"},{"$f":"BU6+1","v":"2025-10-18"},{"$f":"BV6+1","v":"2025-10-18"},{"$f":"BW6+1","v":"2025-10-19"},{"$f":"BX6+1","v":"2025-10-19"}]
["Feiertag ->",null,null,null,null,null,null,null,{"$f":"IF(I8<>\"\",\"Feiertag\",\"\")","v":""},"","","","","","","","","","","","","","","","","","","","","","","","","","","","","","","","","","","","Feiertag",{"$f":"IF(AT8<>\"\",\"Feiertag\",\"\")","v":"Feiertag"},{"$f":"IF(AU8<>\"\",\"Feiertag\",\"\")","v":""},"","","","","","","","","","","","","","","","","","","","","","","","","","","","","","",""]
[null,null,null,null,null,null,null,null,null,{"$f":"IFERROR(VLOOKUP(J6,Feiertage!$F$12:$F$52,1,FALSE),\"\")","v":""},{"$f":"IFERROR(VLOOKUP(K6,Feiertage!$F$12:$F$52,1,FALSE),\"\")","v":""},{"$f":"IFERROR(VLOOKUP(L6,Feiertage!$F$12:$F$52,1,FALSE),\"\")","v":""},{"$f":"IFERROR(VLOOKUP(M6,Feiertage!$F$12:$F$52,1,FALSE),\"\")","v":""},{"$f":"IFERROR(VLOOKUP(N6,Feiertage!$F$12:$F$52,1,FALSE),\"\")","v":""},{"$f":"IFERROR(VLOOKUP(O6,Feiertage!$F$12:$F$52,1,FALSE),\"\")","v":""},{"$f":"IFERROR(VLOOKUP(P6,Feiertage!$F$12:$F$52,1,FALSE),\"\")","v":""},{"$f":"IFERROR(VLOOKUP(Q6,Feiertage!$F$12:$F$52,1,FALSE),\"\")","v":""},{"$f":"IFERROR(VLOOKUP(R6,Feiertage!$F$12:$F$52,1,FALSE),\"\")","v":""},{"$f":"IFERROR(VLOOKUP(S6,Feiertage!$F$12:$F$52,1,FALSE),\"\")","v":""},{"$f":"IFERROR(VLOOKUP(T6,Feiertage!$F$12:$F$52,1,FALSE),\"\")","v":""},{"$f":"IFERROR(VLOOKUP(U6,Feiertage!$F$12:$F$52,1,FALSE),\"\")","v":""},{"$f":"IFERROR(VLOOKUP(V6,Feiertage!$F$12:$F$52,1,FALSE),\"\")","v":""},{"$f":"IFERROR(VLOOKUP(W6,Feiertage!$F$12:$F$52,1,FALSE),\"\")","v":""},{"$f":"IFERROR(VLOOKUP(X6,Feiertage!$F$12:$F$52,1,FALSE),\"\")","v":""},{"$f":"IFERROR(VLOOKUP(Y6,Feiertage!$F$12:$F$52,1,FALSE),\"\")","v":""},{"$f":"IFERROR(VLOOKUP(Z6,Feiertage!$F$12:$F$52,1,FALSE),\"\")","v":""},{"$f":"IFERROR(VLOOKUP(AA6,Feiertage!$F$12:$F$52,1,FALSE),\"\")","v":""},{"$f":"IFERROR(VLOOKUP(AB6,Feiertage!$F$12:$F$52,1,FALSE),\"\")","v":""},{"$f":"IFERROR(VLOOKUP(AC6,Feiertage!$F$12:$F$52,1,FALSE),\"\")","v":""},{"$f":"IFERROR(VLOOKUP(AD6,Feiertage!$F$12:$F$52,1,FALSE),\"\")","v":""},{"$f":"IFERROR(VLOOKUP(AE6,Feiertage!$F$12:$F$52,1,FALSE),\"\")","v":""},{"$f":"IFERROR(VLOOKUP(AF6,Feiertage!$F$12:$F$52,1,FALSE),\"\")","v":""},{"$f":"IFERROR(VLOOKUP(AG6,Feiertage!$F$12:$F$52,1,FALSE),\"\")","v":""},{"$f":"IFERROR(VLOOKUP(AH6,Feiertage!$F$12:$F$52,1,FALSE),\"\")","v":""},{"$f":"IFERROR(VLOOKUP(AI6,Feiertage!$F$12:$F$52,1,FALSE),\"\")","v":""},{"$f":"IFERROR(VLOOKUP(AJ6,Feiertage!$F$12:$F$52,1,FALSE),\"\")","v":""},{"$f":"IFERROR(VLOOKUP(AK6,Feiertage!$F$12:$F$52,1,FALSE),\"\")","v":""},{"$f":"IFERROR(VLOOKUP(AL6,Feiertage!$F$12:$F$52,1,FALSE),\"\")","v":""},{"$f":"IFERROR(VLOOKUP(AM6,Feiertage!$F$12:$F$52,1,FALSE),\"\")","v":""},{"$f":"IFERROR(VLOOKUP(AN6,Feiertage!$F$12:$F$52,1,FALSE),\"\")","v":""},{"$f":"IFERROR(VLOOKUP(AO6,Feiertage!$F$12:$F$52,1,FALSE),\"\")","v":""},{"$f":"IFERROR(VLOOKUP(AP6,Feiertage!$F$12:$F$52,1,FALSE),\"\")","v":""},{"$f":"IFERROR(VLOOKUP(AQ6,Feiertage!$F$12:$F$52,1,FALSE),\"\")","v":""},{"$f":"IFERROR(VLOOKUP(AR6,Feiertage!$F$12:$F$52,1,FALSE),\"\")","v":""},{"$f":"IFERROR(VLOOKUP(AS6,Feiertage!$F$12:$F$52,1,FALSE),\"\")","v":"2025-10-03"},{"$f":"IFERROR(VLOOKUP(AT6,Feiertage!$F$12:$F$52,1,FALSE),\"\")","v":"2025-10-03"},{"$f":"IFERROR(VLOOKUP(AU6,Feiertage!$F$12:$F$52,1,FALSE),\"\")","v":""},{"$f":"IFERROR(VLOOKUP(AV6,Feiertage!$F$12:$F$52,1,FALSE),\"\")","v":""},{"$f":"IFERROR(VLOOKUP(AW6,Feiertage!$F$12:$F$52,1,FALSE),\"\")","v":""},{"$f":"IFERROR(VLOOKUP(AX6,Feiertage!$F$12:$F$52,1,FALSE),\"\")","v":""},{"$f":"IFERROR(VLOOKUP(AY6,Feiertage!$F$12:$F$52,1,FALSE),\"\")","v":""},{"$f":"IFERROR(VLOOKUP(AZ6,Feiertage!$F$12:$F$52,1,FALSE),\"\")","v":""},{"$f":"IFERROR(VLOOKUP(BA6,Feiertage!$F$12:$F$52,1,FALSE),\"\")","v":""},{"$f":"IFERROR(VLOOKUP(BB6,Feiertage!$F$12:$F$52,1,FALSE),\"\")","v":""},{"$f":"IFERROR(VLOOKUP(BC6,Feiertage!$F$12:$F$52,1,FALSE),\"\")","v":""},{"$f":"IFERROR(VLOOKUP(BD6,Feiertage!$F$12:$F$52,1,FALSE),\"\")","v":""},{"$f":"IFERROR(VLOOKUP(BE6,Feiertage!$F$12:$F$52,1,FALSE),\"\")","v":""},{"$f":"IFERROR(VLOOKUP(BF6,Feiertage!$F$12:$F$52,1,FALSE),\"\")","v":""},{"$f":"IFERROR(VLOOKUP(BG6,Feiertage!$F$12:$F$52,1,FALSE),\"\")","v":""},{"$f":"IFERROR(VLOOKUP(BH6,Feiertage!$F$12:$F$52,1,FALSE),\"\")","v":""},{"$f":"IFERROR(VLOOKUP(BI6,Feiertage!$F$12:$F$52,1,FALSE),\"\")","v":""},{"$f":"IFERROR(VLOOKUP(BJ6,Feiertage!$F$12:$F$52,1,FALSE),\"\")","v":""},{"$f":"IFERROR(VLOOKUP(BK6,Feiertage!$F$12:$F$52,1,FALSE),\"\")","v":""},{"$f":"IFERROR(VLOOKUP(BL6,Feiertage!$F$12:$F$52,1,FALSE),\"\")","v":""},{"$f":"IFERROR(VLOOKUP(BM6,Feiertage!$F$12:$F$52,1,FALSE),\"\")","v":""},{"$f":"IFERROR(VLOOKUP(BN6,Feiertage!$F$12:$F$52,1,FALSE),\"\")","v":""},{"$f":"IFERROR(VLOOKUP(BO6,Feiertage!$F$12:$F$52,1,FALSE),\"\")","v":""},{"$f":"IFERROR(VLOOKUP(BP6,Feiertage!$F$12:$F$52,1,FALSE),\"\")","v":""},{"$f":"IFERROR(VLOOKUP(BQ6,Feiertage!$F$12:$F$52,1,FALSE),\"\")","v":""},{"$f":"IFERROR(VLOOKUP(BR6,Feiertage!$F$12:$F$52,1,FALSE),\"\")","v":""},{"$f":"IFERROR(VLOOKUP(BS6,Feiertage!$F$12:$F$52,1,FALSE),\"\")","v":""},{"$f":"IFERROR(VLOOKUP(BT6,Feiertage!$F$12:$F$52,1,FALSE),\"\")","v":""},{"$f":"IFERROR(VLOOKUP(BU6,Feiertage!$F$12:$F$52,1,FALSE),\"\")","v":""},{"$f":"IFERROR(VLOOKUP(BV6,Feiertage!$F$12:$F$52,1,FALSE),\"\")","v":""},{"$f":"IFERROR(VLOOKUP(BW6,Feiertage!$F$12:$F$52,1,FALSE),\"\")","v":""},{"$f":"IFERROR(VLOOKUP(BX6,Feiertage!$F$12:$F$52,1,FALSE),\"\")","v":""},{"$f":"IFERROR(VLOOKUP(BY6,Feiertage!$F$12:$F$52,1,FALSE),\"\")","v":""},{"$f":"IFERROR(VLOOKUP(BZ6,Feiertage!$F$12:$F$52,1,FALSE),\"\")","v":""}]
["Arbeitszeiträume (I: 06:00 - 12:00 und II: 12:00 - 18:00)",null,null,null,null,null,null,null,"I.","II.","I.","II.","I.","II.","I.","II.","I.","II.","I.","II.","I.","II.","I.","II.","I.","II.","I.","II.","I.","II.","I.","II.","I.","II.","I.","II.","I.","II.","I.","II.","I.","II.","I.","II.","I.","II.","I.","II.","I.","II.","I.","II.","I.","II.","I.","II.","I.","II.","I.","II.","I.","II.","I.","II.","I.","II.","I.","II.","I.","II.","I.","II.","I.","II.","I.","II.","I.","II."]
[null,null,null,null,null,null,null,null,{"$f":"CONCATENATE(I6,I9)","v":"44453I."},{"$f":"CONCATENATE(J6,J9)","v":"44453II."},{"$f":"CONCATENATE(K6,K9)","v":"44454I."},"44454II.","44455I.","44455II.","44456I.","44456II.","44457I.","44457II.","44458I.","44458II.","44459I.","44459II.","44460I.","44460II.","44461I.","44461II.","44462I.","44462II.","44463I.","44463II.","44464I.","44464II.","44465I.","44465II.","44466I.","44466II.","44467I.","44467II.","44468I.","44468II.","44469I.","44469II.","44470I.","44470II.","44471I.","44471II.","44472I.","44472II.","44473I.","44473II.","44474I.","44474II.","44475I.","44475II.","44476I.","44476II.","44477I.","44477II.","44478I.","44478II.","44479I.","44479II.","44480I.","44480II.","44481I.","44481II.","44482I.","44482II.","44483I.","44483II.","44484I.","44484II.","44485I.","44485II.",null,null,null,null,{"$f":"E48","v":0.25},{"$f":"E49","v":0.25}]
[null,null,null,null,null,null,null,null,"6:00 -12:00","12:00-18:00","6:00 -12:00","12:00-18:00","6:00 -12:00","12:00-18:00","6:00 -12:00","12:00-18:00","6:00 -12:00","12:00-18:00","6:00 -12:02","12:00-18:00","6:00 -12:00","12:00-18:00","6:00 -12:00","12:00-18:00","6:00 -12:00","12:00-18:00","6:00 -12:00","12:00-18:00","6:00 -12:00","12:00-18:00","6:00 -12:00","12:00-18:00","6:00 -12:00","12:00-18:00","6:00 -12:02","12:00-18:00","6:00 -12:00","12:00-18:00","6:00 -12:02","12:00-18:00","6:00 -12:00","12:00-18:00","6:00 -12:02","12:00-18:00","6:00 -12:00","12:00-18:00","6:00 -12:02","12:00-18:00","6:00 -12:00","12:00-18:00","6:00 -12:02","12:00-18:00","6:00 -12:00","12:00-18:00","6:00 -12:02","12:00-18:00","6:00 -12:00","12:00-18:00","6:00 -12:02","12:00-18:00","6:00 -12:00","12:00-18:00","6:00 -12:02","12:00-18:00","6:00 -12:00","12:00-18:00","6:00 -12:02","12:00-18:00","6:00 -12:00","12:00-18:00","6:00 -12:02","12:00-18:00","6:00 -12:00","12:00-18:00","6:00 -12:02","12:00-18:00","6:00 -12:00","12:00-18:00","I.","II.","Hilfsspalte","Hilfsspalte"]
["Aktivität","Verantw.","Anfang","Ende","I.","II.","Dauer Std.","Dauer",null,null,null,null,null,null,null,null,null,null,null,null,null,null,null,null,null,null,null,null,null,null,null,null,null,null,null,null,null,null,null,null,null,null,null,null,null,null,null,null,null,null,null,null,null,null,null,null,null,null,null,null,null,null,null,null,null,null,null,null,null,null,null,null,null,null,{"$f":"IF(WEEKDAY(BW$6,2)>5,BW6,\"\")","v":"2025-10-18"},"2025-10-18","2025-10-19","2025-10-19","Std.","Std."]
["Überführung  (16.09.-7:30) ","Zoll","2025-09-15","2025-09-16","I.","II.",null,null,null,null,null,null,null,null,null,null,null,null,null,null,null,null,null,null,null,null,null,null,null,null,null,null,null,null,null,null,null,null,null,null,null,null,null,null,null,null,null,null,null,null,null,null,null,null,null,null,null,null,null,null,null,null,null,null,null,null,null,null,null,null,null,null,null,null,null,null,null,null,{"$f":"IF(E13=\"\",\"\",$CA$10)","v":"06:00:00"},{"$f":"IF(F13=\"\",\"\",$CA$10)","v":"06:00:00"},{"$f":"IF(E13=\"\",FALSE,TRUE)","v":true},{"$f":"IF(F13=\"\",FALSE,TRUE)","v":true},{"$f":"AND($B13=$A$38,I$6>=$C13,I$6<=$D13)","v":false},{"$f":"AND($B13=$A$38,J$6>=$C13,J$6<=$D13)","v":false},false,false,false,false,false,false,false,false,false,false,false,false,false,false,false,false,false,false,false,false,false,false,false,false,false,false,false,false,false,false,false,false,false,false,false,false,false,false,false,false,false,false,false,false,false,false,false,false,false,false,false,false,false,false,false,false,false,false,false,false,false,false,false,{"$f":"AND($B13=$A$38,BV$6>=$C13,BV$6<=$D13)","v":false},false,false,false,false]
["Eintreffen (ca. 18:00) Festmachen und Landanschluss ","TI/Zoll","2025-09-16","2025-09-16",null,"II.",4.1666666666666664E-2,"1h",null,null,null,null,null,null,null,null,null,null,null,null,null,null,null,null,null,null,null,null,null,null,null,null,null,null,null,null,null,null,null,null,null,null,null,null,null,null,null,null,null,null,null,null,null,null,null,null,null,null,null,null,null,null,null,null,null,null,null,null,null,null,null,null,null,null,null,null,null,null,{"$f":"IF(E14=\"\",\"\",$CA$10)","v":""},{"$f":"IF(F14=\"\",\"\",$CA$10)","v":"06:00:00"},{"$f":"IF(E14=\"\",FALSE,TRUE)","v":false},{"$f":"IF(F14=\"\",FALSE,TRUE)","v":true},{"$f":"AND($B14=$A$38,I$6>=$C14,I$6<=$D14)","v":false},{"$f":"AND($B14=$A$38,J$6>=$C14,J$6<=$D14)","v":false},{"$f":"AND($B14=$A$38,K$6>=$C14,K$6<=$D14)","v":false},{"$f":"AND($B14=$A$38,L$6>=$C14,L$6<=$D14)","v":false},{"$f":"AND($B14=$A$38,M$6>=$C14,M$6<=$D14)","v":false},{"$f":"AND($B14=$A$38,N$6>=$C14,N$6<=$D14)","v":false},{"$f":"AND($B14=$A$38,O$6>=$C14,O$6<=$D14)","v":false},{"$f":"AND($B14=$A$38,P$6>=$C14,P$6<=$D14)","v":false},{"$f":"AND($B14=$A$38,Q$6>=$C14,Q$6<=$D14)","v":false},{"$f":"AND($B14=$A$38,R$6>=$C14,R$6<=$D14)","v":false},{"$f":"AND($B14=$A$38,S$6>=$C14,S$6<=$D14)","v":false},{"$f":"AND($B14=$A$38,T$6>=$C14,T$6<=$D14)","v":false},{"$f":"AND($B14=$A$38,U$6>=$C14,U$6<=$D14)","v":false},{"$f":"AND($B14=$A$38,V$6>=$C14,V$6<=$D14)","v":false},{"$f":"AND($B14=$A$38,W$6>=$C14,W$6<=$D14)","v":false},{"$f":"AND($B14=$A$38,X$6>=$C14,X$6<=$D14)","v":false},{"$f":"AND($B14=$A$38,Y$6>=$C14,Y$6<=$D14)","v":false},{"$f":"AND($B14=$A$38,Z$6>=$C14,Z$6<=$D14)","v":false},{"$f":"AND($B14=$A$38,AA$6>=$C14,AA$6<=$D14)","v":false},{"$f":"AND($B14=$A$38,AB$6>=$C14,AB$6<=$D14)","v":false},{"$f":"AND($B14=$A$38,AC$6>=$C14,AC$6<=$D14)","v":false},{"$f":"AND($B14=$A$38,AD$6>=$C14,AD$6<=$D14)","v":false},{"$f":"AND($B14=$A$38,AE$6>=$C14,AE$6<=$D14)","v":false},{"$f":"AND($B14=$A$38,AF$6>=$C14,AF$6<=$D14)","v":false},{"$f":"AND($B14=$A$38,AG$6>=$C14,AG$6<=$D14)","v":false},{"$f":"AND($B14=$A$38,AH$6>=$C14,AH$6<=$D14)","v":false},{"$f":"AND($B14=$A$38,AI$6>=$C14,AI$6<=$D14)","v":false},{"$f":"AND($B14=$A$38,AJ$6>=$C14,AJ$6<=$D14)","v":false},{"$f":"AND($B14=$A$38,AK$6>=$C14,AK$6<=$D14)","v":false},{"$f":"AND($B14=$A$38,AL$6>=$C14,AL$6<=$D14)","v":false},{"$f":"AND($B14=$A$38,AM$6>=$C14,AM$6<=$D14)","v":false},{"$f":"AND($B14=$A$38,AN$6>=$C14,AN$6<=$D14)","v":false},{"$f":"AND($B14=$A$38,AO$6>=$C14,AO$6<=$D14)","v":false},{"$f":"AND($B14=$A$38,AP$6>=$C14,AP$6<=$D14)","v":false},{"$f":"AND($B14=$A$38,AQ$6>=$C14,AQ$6<=$D14)","v":false},{"$f":"AND($B14=$A$38,AR$6>=$C14,AR$6<=$D14)","v":false},{"$f":"AND($B14=$A$38,AS$6>=$C14,AS$6<=$D14)","v":false},{"$f":"AND($B14=$A$38,AT$6>=$C14,AT$6<=$D14)","v":false},{"$f":"AND($B14=$A$38,AU$6>=$C14,AU$6<=$D14)","v":false},{"$f":"AND($B14=$A$38,AV$6>=$C14,AV$6<=$D14)","v":false},{"$f":"AND($B14=$A$38,AW$6>=$C14,AW$6<=$D14)","v":false},{"$f":"AND($B14=$A$38,AX$6>=$C14,AX$6<=$D14)","v":false},{"$f":"AND($B14=$A$38,AY$6>=$C14,AY$6<=$D14)","v":false},{"$f":"AND($B14=$A$38,AZ$6>=$C14,AZ$6<=$D14)","v":false},{"$f":"AND($B14=$A$38,BA$6>=$C14,BA$6<=$D14)","v":false},{"$f":"AND($B14=$A$38,BB$6>=$C14,BB$6<=$D14)","v":false},{"$f":"AND($B14=$A$38,BC$6>=$C14,BC$6<=$D14)","v":false},{"$f":"AND($B14=$A$38,BD$6>=$C14,BD$6<=$D14)","v":false},{"$f":"AND($B14=$A$38,BE$6>=$C14,BE$6<=$D14)","v":false},{"$f":"AND($B14=$A$38,BF$6>=$C14,BF$6<=$D14)","v":false},{"$f":"AND($B14=$A$38,BG$6>=$C14,BG$6<=$D14)","v":false},{"$f":"AND($B14=$A$38,BH$6>=$C14,BH$6<=$D14)","v":false},{"$f":"AND($B14=$A$38,BI$6>=$C14,BI$6<=$D14)","v":false},{"$f":"AND($B14=$A$38,BJ$6>=$C14,BJ$6<=$D14)","v":false},{"$f":"AND($B14=$A$38,BK$6>=$C14,BK$6<=$D14)","v":false},{"$f":"AND($B14=$A$38,BL$6>=$C14,BL$6<=$D14)","v":false},{"$f":"AND($B14=$A$38,BM$6>=$C14,BM$6<=$D14)","v":false},{"$f":"AND($B14=$A$38,BN$6>=$C14,BN$6<=$D14)","v":false},{"$f":"AND($B14=$A$38,BO$6>=$C14,BO$6<=$D14)","v":false},{"$f":"AND($B14=$A$38,BP$6>=$C14,BP$6<=$D14)","v":false},{"$f":"AND($B14=$A$38,BQ$6>=$C14,BQ$6<=$D14)","v":false},{"$f":"AND($B14=$A$38,BR$6>=$C14,BR$6<=$D14)","v":false},{"$f":"AND($B14=$A$38,BS$6>=$C14,BS$6<=$D14)","v":false},{"$f":"AND($B14=$A$38,BT$6>=$C14,BT$6<=$D14)","v":false},{"$f":"AND($B14=$A$38,BU$6>=$C14,BU$6<=$D14)","v":false},{"$f":"AND($B14=$A$38,BV$6>=$C14,BV$6<=$D14)","v":false},{"$f":"AND($B14=$A$38,BW$6>=$C14,BW$6<=$D14)","v":false},{"$f":"AND($B14=$A$38,BX$6>=$C14,BX$6<=$D14)","v":false},{"$f":"AND($B14=$A$38,BY$6>=$C14,BY$6<=$D14)","v":false},{"$f":"AND($B14=$A$38,BZ$6>=$C14,BZ$6<=$D14)","v":false}]
["Zeitfenster Abarbeitung Schadensmeldungen Innenbereiche (siehe Liste)","PW/UAN","2025-09-17","2025-09-18","I.","II.",{"$f":"7*11/24","v":3.2083333333333335},"7d",null,null,null,null,null,null,null,null,"Dockung",null,null,null,null,null,null,null,null,null,null,null,null,null,null,null,null,null,null,null,null,null,null,null,null,null,null,null,null,null,null,null,null,null,null,null,null,null,null,null,null,null,null,null,null,null,null,null,null,null,null,null,null,null,null,null,null,null,null,null,null,null,"06:00:00","06:00:00",true,true,false,false,false,false,false,false,false,false,false,false,false,false,false,false,false,false,false,false,false,false,false,false,false,false,false,false,false,false,false,false,false,false,false,false,false,false,false,false,false,false,false,false,false,false,false,false,false,false,false,false,false,false,false,false,false,false,false,false,false,false,false,false,false,false,false,false,false,false,false,false]
["Eindocken und Verholen auf Nordhelling Richtung Halle 4.2","TI","2025-09-19","2025-09-19","I.",null,{"$f":"4*11/24","v":1.8333333333333333},"4h",null,null,null,null,null,null,null,null,{"$f":"IF(WEEKDAY(Q$6,2)>6,\"So\",\"\")","v":""},"","","","So","So","","",{"$f":"IF(WEEKDAY(Y$6,2)>6,\"So\",\"\")","v":""},"","","","","","","","","","So","So","","","","","","","","","","","","","So","So","","","","","","","","","","","","","So","So","","","","","","","","","","",null,null,null,null,"06:00:00","",true,false,false,false,false,false,false,false,false,false,false,false,false,false,false,false,false,false,false,false,false,false,false,false,false,false,false,false,false,false,false,false,false,false,false,false,false,false,false,false,false,false,false,false,false,false,false,false,false,false,false,false,false,false,false,false,false,false,false,false,false,false,false,false,false,false,false,false,false,false,false,false]
["Treppenturm stellen (Bb achtern) und Herstellen Landanschluss","TI/Zoll","2025-09-19","2025-09-19","I.",null,2.0833333333333332E-2,"0,5h",null,null,null,null,null,null,null,null,null,null,null,null,null,null,null,null,null,null,null,null,null,null,null,null,null,null,null,null,null,null,null,null,null,null,null,null,null,null,null,null,null,null,null,null,null,null,null,null,null,null,null,null,null,null,null,null,null,null,null,null,null,null,null,null,null,null,null,null,null,null,"06:00:00","",true,false,false,false,false,false,false,false,false,false,false,false,false,false,false,false,false,false,false,false,false,false,false,false,false,false,false,false,false,false,false,false,false,false,false,false,false,false,false,false,false,false,false,false,false,false,false,false,false,false,false,false,false,false,false,false,false,false,false,false,false,false,false,false,false,false,false,false,false,false,false,false]
["Sicherung und ggf. Ausserbetriebnahme Schiffsbestriebssysteme","TI/Zoll","2025-09-19","2025-09-19","I.",null,4.1666666666666664E-2,"1h",null,null,null,null,null,null,null,null,null,null,null,null,null,null,null,null,null,null,null,null,null,null,null,null,null,null,null,null,null,null,null,null,null,null,null,null,null,null,null,null,null,null,null,null,null,null,null,null,null,null,null,null,null,null,null,null,null,null,null,null,null,null,null,null,null,null,null,null,null,null,"06:00:00","",true,false,false,false,false,false,false,false,false,false,false,false,false,false,false,false,false,false,false,false,false,false,false,false,false,false,false,false,false,false,false,false,false,false,false,false,false,false,false,false,false,false,false,false,false,false,false,false,false,false,false,false,false,false,false,false,false,false,false,false,false,false,false,false,false,false,false,false,false,false,false,false]
["Einrüsten UW-Schiff  ","Icke","2025-09-19","2025-09-19","I.",null,8.3333333333333329E-2,"2h",null,null,null,null,null,null,null,null,null,null,null,null,null,null,null,null,null,null,null,null,null,null,null,null,null,null,null,null,null,null,null,null,null,null,null,null,null,null,null,null,null,null,null,null,null,null,null,null,null,null,null,null,null,null,null,null,null,null,null,null,null,null,null,null,null,null,null,null,null,null,"06:00:00","",true,false,false,false,false,false,false,false,false,false,false,false,false,false,false,false,false,false,false,false,false,false,false,false,false,false,false,false,false,false,false,false,false,false,false,false,false,false,false,false,false,false,false,false,false,false,false,false,false,false,false,false,false,false,false,false,false,false,false,false,false,false,false,false,false,false,false,false,false,false,false,false]
["Installation der temporären Seekühlwasserversorgung","TA/ TI","2025-09-19","2025-09-19","I.",null,0.16666666666666666,"4h",null,null,null,null,null,null,null,null,null,null,null,null,null,null,null,null,null,null,null,null,null,null,null,null,null,null,null,null,null,null,null,null,null,null,null,null,null,null,null,null,null,null,null,null,null,null,null,null,null,null,null,null,null,null,null,null,null,null,null,null,null,null,null,null,null,null,null,null,null,null,"06:00:00","",true,false,false,false,false,false,false,false,false,false,false,false,false,false,false,false,false,false,false,false,false,false,false,false,false,false,false,false,false,false,false,false,false,false,false,false,false,false,false,false,false,false,false,false,false,false,false,false,false,false,false,false,false,false,false,false,false,false,false,false,false,false,false,false,false,false,false,false,false,false,false,false]
["Schiff waschen","Korr. UAN","2025-09-19","2025-09-19","I.","II.",0.125,"3h",null,null,null,null,null,null,null,null,null,null,null,null,null,null,null,null,null,null,null,null,null,null,null,null,null,null,null,null,null,null,null,null,null,null,null,null,null,null,null,null,null,null,null,null,null,null,null,null,null,null,null,null,null,null,null,null,null,null,null,null,null,null,null,null,null,null,null,null,null,null,"06:00:00","06:00:00",true,true,false,false,false,false,false,false,false,false,true,true,false,false,false,false,false,false,false,false,false,false,false,false,false,false,false,false,false,false,false,false,false,false,false,false,false,false,false,false,false,false,false,false,false,false,false,false,false,false,false,false,false,false,false,false,false,false,false,false,false,false,false,false,false,false,false,false,false,false,false,false]
["Zeitfenster für Befundung Schäden UW Schiff (QSR & ICCP)","TQ/Zoll/UAN","2025-09-22","2025-09-22","I.",null,8.3333333333333329E-2,"2h",null,"","","","","","","","","","","","So","So","Befundung",null,null,null,null,null,null,null,null,null,null,null,null,null,null,null,null,null,null,null,null,null,null,null,null,null,null,null,null,null,null,null,null,null,null,null,null,null,null,null,null,null,null,null,null,null,null,null,null,null,null,null,null,null,null,null,"06:00:00","",true,false,false,false,false,false,false,false,false,false,false,false,false,false,false,false,false,false,false,false,false,false,false,false,false,false,false,false,false,false,false,false,false,false,false,false,false,false,false,false,false,false,false,false,false,false,false,false,false,false,false,false,false,false,false,false,false,false,false,false,false,false,false,false,false,false,false,false,false,false,false,false]
["Zeitfenster heisse Arbeiten UW Schiff (QSR-Anlage)","PW/UAN","2025-09-22","2025-09-23","I.","II.",0.83333333333333337,"20h",null,"","","","","","","","","","","","So","So","","",{"$f":"IF(WEEKDAY(Y$6,2)>6,\"So\",\"\")","v":""},"","","","","","","","","","So","So","","","","","","","","","","","","","So","So","","","","","","","","","","","","","So","So","","","","","","","","","","",null,null,null,null,"06:00:00","06:00:00",true,true,false,false,false,false,false,false,false,false,false,false,false,false,false,false,false,false,false,false,false,false,false,false,false,false,false,false,false,false,false,false,false,false,false,false,false,false,false,false,false,false,false,false,false,false,false,false,false,false,false,false,false,false,false,false,false,false,false,false,false,false,false,false,false,false,false,false,false,false,false,false]
["Zeitfenster Beschichtung UW Schiff (QSR-Anlage)","Korr. UAN","2025-09-24","2025-09-27","I.","II.",{"$f":"4*11/24","v":1.8333333333333333},"4 Tage",null,null,null,null,null,null,null,null,null,null,null,null,null,null,null,null,null,null,null,null,null,null,null,null,null,null,null,null,null,null,null,null,null,null,null,null,null,null,null,null,null,null,null,null,null,null,null,null,null,null,null,null,null,null,null,null,null,null,null,null,null,null,null,null,null,null,{"$f":"IF(WEEKDAY(BW$6,2)>6,\"So\",\"\")","v":""},"","So","So","06:00:00","06:00:00",true,true,false,false,false,false,false,false,false,false,false,false,false,false,false,false,false,false,false,false,true,true,true,true,true,true,true,true,false,false,false,false,false,false,false,false,false,false,false,false,false,false,false,false,false,false,false,false,false,false,false,false,false,false,false,false,false,false,false,false,false,false,false,false,false,false,false,false,false,false,false,false]
["Strahlen im Bereich ICCP Anoden","Korr. UAN","2025-09-22","2025-09-22","I.","II.",0.14583333333333334,"3-4h",null,null,null,null,null,null,null,null,null,null,null,null,null,null,null,null,null,null,null,null,null,null,null,null,null,null,null,null,null,null,null,null,null,null,null,null,null,null,null,null,null,null,null,null,null,null,null,null,null,null,null,null,null,null,null,null,null,null,null,null,null,null,null,null,null,null,null,null,null,null,"06:00:00","06:00:00",true,true,false,false,false,false,false,false,false,false,false,false,false,false,false,false,true,true,false,false,false,false,false,false,false,false,false,false,false,false,false,false,false,false,false,false,false,false,false,false,false,false,false,false,false,false,false,false,false,false,false,false,false,false,false,false,false,false,false,false,false,false,false,false,false,false,false,false,false,false,false,false]
["Zeitfenster Arbeiten an ICCP Anlage in Beisein Cathelco","TA / Cathleco","2025-09-30","2025-09-30","I.","II.",1.25,"30h+?",null,null,null,null,null,null,null,null,null,null,null,null,null,null,null,null,null,null,null,null,null,null,null,null,null,null,null,null,null,null,null,null,null,null,null,null,null,null,null,null,null,null,null,null,null,null,null,null,null,null,null,null,null,null,null,null,null,null,null,null,null,null,null,null,null,null,null,null,null,null,"06:00:00","06:00:00",true,true,false,false,false,false,false,false,false,false,false,false,false,false,false,false,false,false,false,false,false,false,false,false,false,false,false,false,false,false,false,false,false,false,false,false,false,false,false,false,false,false,false,false,false,false,false,false,false,false,false,false,false,false,false,false,false,false,false,false,false,false,false,false,false,false,false,false,false,false,false,false]
["Zeitfenster BeschichtungUW Schiff (ICCP Anlage inkl. Anspachteln)","Korr. UAN","2025-09-25","2025-09-27","I.","II.",{"$f":"4*11/24","v":1.8333333333333333},"4 Tage",null,null,null,null,null,null,null,null,null,null,null,null,null,null,null,null,null,null,null,null,null,null,null,null,null,null,null,null,null,null,null,null,null,null,null,null,null,null,null,null,null,null,null,null,null,null,null,null,null,null,null,null,null,null,null,null,null,null,null,null,null,null,null,null,null,null,{"$f":"IF(WEEKDAY(BW$6,2)>6,\"So\",\"\")","v":""},"","So","So","06:00:00","06:00:00",true,true,false,false,false,false,false,false,false,false,false,false,false,false,false,false,false,false,false,false,false,false,true,true,true,true,true,true,false,false,false,false,false,false,false,false,false,false,false,false,false,false,false,false,false,false,false,false,false,false,false,false,false,false,false,false,false,false,false,false,false,false,false,false,false,false,false,false,false,false,false,false]
["Zeitfenster Beschichtung Decksbereiche","Korr. UAN","2025-09-26","2025-09-26","I.","II.",0.45833333333333331,"1 Tag",null,null,null,null,null,null,null,null,null,null,null,null,null,null,null,null,null,null,null,null,null,null,null,null,null,null,null,null,null,null,null,null,null,null,null,null,null,null,null,null,null,null,null,null,null,null,null,null,null,null,null,null,null,null,null,null,null,null,null,null,null,null,null,null,null,null,"","","So","So","06:00:00","06:00:00",true,true,false,false,false,false,false,false,false,false,false,false,false,false,false,false,false,false,false,false,false,false,false,false,true,true,false,false,false,false,false,false,false,false,false,false,false,false,false,false,false,false,false,false,false,false,false,false,false,false,false,false,false,false,false,false,false,false,false,false,false,false,false,false,false,false,false,false,false,false,false,false]
["Abnahmen und Nacharbeiten","TQ/PW/Zoll","2025-09-30","2025-09-30","I.",null,0.45833333333333331,"1 Tag",null,null,null,null,null,null,null,null,null,null,null,null,null,null,null,null,null,null,null,null,null,null,null,null,null,null,null,null,null,null,null,null,null,null,null,null,null,null,null,null,null,null,null,null,null,null,null,null,null,null,null,null,null,null,null,null,null,null,null,null,null,null,null,null,null,null,null,null,null,null,"06:00:00","",true,false,false,false,false,false,false,false,false,false,false,false,false,false,false,false,false,false,false,false,false,false,false,false,false,false,false,false,false,false,false,false,false,false,false,false,false,false,false,false,false,false,false,false,false,false,false,false,false,false,false,false,false,false,false,false,false,false,false,false,false,false,false,false,false,false,false,false,false,false,false,false]
["Rückbau temporäre SW-Versorgung und Abrüsten","TA/TI / Schubeck","2025-09-30","2025-09-30",null,"II.",0.16666666666666666,"4h",null,null,null,null,null,null,null,null,null,null,null,null,null,null,null,null,null,null,null,null,null,null,null,null,null,null,null,null,null,null,null,null,null,null,null,null,null,null,null,null,null,null,null,null,null,null,null,null,null,null,null,null,null,null,null,null,null,null,null,null,null,null,null,null,null,null,null,null,null,null,"","06:00:00",false,true,false,false,false,false,false,false,false,false,false,false,false,false,false,false,false,false,false,false,false,false,false,false,false,false,false,false,false,false,false,false,false,false,false,false,false,false,false,false,false,false,false,false,false,false,false,false,false,false,false,false,false,false,false,false,false,false,false,false,false,false,false,false,false,false,false,false,false,false,false,false]
["Absenken und Verholen  Kai III oder IV  und Herstellen Landanschluss","TI/ Zoll","2025-10-01","2025-10-01","I.",null,0.16666666666666666,"4h",null,null,null,null,null,null,null,null,null,null,null,null,null,null,null,null,null,null,null,null,null,null,null,null,null,null,null,null,null,null,null,null,null,null,null,null,null,null,null,null,null,null,null,null,null,null,null,null,null,null,null,null,null,null,null,null,null,null,null,null,null,null,null,null,null,null,null,null,null,null,"06:00:00","",true,false,false,false,false,false,false,false,false,false,false,false,false,false,false,false,false,false,false,false,false,false,false,false,false,false,false,false,false,false,false,false,false,false,false,false,false,false,false,false,false,false,false,false,false,false,false,false,false,false,false,false,false,false,false,false,false,false,false,false,false,false,false,false,false,false,false,false,false,false,false,false]
["Wiederinbetriebnahme Systeme","TI/Zoll","2025-10-01","2025-10-01","I.","II.",4.1666666666666664E-2,"1h",null,null,null,null,null,null,null,null,null,null,null,null,null,null,null,null,null,null,null,null,null,null,null,null,null,null,null,null,null,null,null,null,null,null,null,null,null,null,null,null,null,null,null,null,null,null,null,null,null,null,null,null,null,null,null,null,null,null,null,null,null,null,null,null,null,null,null,null,null,null,"06:00:00","06:00:00",true,true,false,false,false,false,false,false,false,false,false,false,false,false,false,false,false,false,false,false,false,false,false,false,false,false,false,false,false,false,false,false,false,false,false,false,false,false,false,false,false,false,false,false,false,false,false,false,false,false,false,false,false,false,false,false,false,false,false,false,false,false,false,false,false,false,false,false,false,false,false,false]
["Abfahrt ZS \"Fehmarn\"","Zoll","2025-10-02","2025-10-02",null,"II.",null,null,null,null,null,null,null,null,null,null,null,null,null,null,null,null,null,null,null,null,null,null,null,null,null,null,null,null,null,null,null,null,null,null,null,null,null,null,null,null,null,null,null,null,null,null,null,null,null,null,null,null,null,null,null,null,null,null,null,null,null,null,null,null,null,null,null,null,null,null,null,null,"","06:00:00",false,true,false,false,false,false,false,false,false,false,false,false,false,false,false,false,false,false,false,false,false,false,false,false,false,false,false,false,false,false,false,false,false,false,false,false,false,false,false,false,false,false,false,false,false,false,false,false,false,false,false,false,false,false,false,false,false,false,false,false,false,false,false,false,false,false,false,false,false,false,false,false]
[null,null,null,null,null,null,null,null,null,null,null,null,null,null,null,null,null,null,null,null,null,null,null,null,null,null,null,null,null,null,null,null,null,null,null,null,null,null,null,null,null,null,null,null,null,null,null,null,null,null,null,null,null,null,null,null,null,null,null,null,null,null,null,null,null,null,null,null,null,null,null,null,null,null,null,null,null,null,"","",false,false,false,false,false,false,false,false,false,false,false,false,false,false,false,false,false,false,false,false,false,false,false,false,false,false,false,false,false,false,false,false,false,false,false,false,false,false,false,false,false,false,false,false,false,false,false,false,false,false,false,false,false,false,false,false,false,false,false,false,false,false,false,false,false,false,false,false,false,false,false,false]
[{"$f":"IFERROR(VLOOKUP(A6,Feiertage!$F$12:$F$52,1,FALSE),\"\")","v":""},{"$f":"IFERROR(VLOOKUP(B6,Feiertage!$F$12:$F$52,1,FALSE),\"\")","v":""},{"$f":"IFERROR(VLOOKUP(C6,Feiertage!$F$12:$F$52,1,FALSE),\"\")","v":""},{"$f":"IFERROR(VLOOKUP(D6,Feiertage!$F$12:$F$52,1,FALSE),\"\")","v":""},null,null,{"$f":"SUM(G13:G34)","v":12.791666666666666},null,{"$f":"IFERROR(VLOOKUP(I6,Feiertage!$F$12:$F$52,1,FALSE),\"\")","v":""},{"$f":"IFERROR(VLOOKUP(J6,Feiertage!$F$12:$F$52,1,FALSE),\"\")","v":""},{"$f":"IFERROR(VLOOKUP(K6,Feiertage!$F$12:$F$52,1,FALSE),\"\")","v":""},{"$f":"IFERROR(VLOOKUP(L6,Feiertage!$F$12:$F$52,1,FALSE),\"\")","v":""},{"$f":"IFERROR(VLOOKUP(M6,Feiertage!$F$12:$F$52,1,FALSE),\"\")","v":""},{"$f":"IFERROR(VLOOKUP(N6,Feiertage!$F$12:$F$52,1,FALSE),\"\")","v":""},{"$f":"IFERROR(VLOOKUP(O6,Feiertage!$F$12:$F$52,1,FALSE),\"\")","v":""},{"$f":"IFERROR(VLOOKUP(P6,Feiertage!$F$12:$F$52,1,FALSE),\"\")","v":""},{"$f":"IFERROR(VLOOKUP(Q6,Feiertage!$F$12:$F$52,1,FALSE),\"\")","v":""},{"$f":"IFERROR(VLOOKUP(R6,Feiertage!$F$12:$F$52,1,FALSE),\"\")","v":""},{"$f":"IFERROR(VLOOKUP(S6,Feiertage!$F$12:$F$52,1,FALSE),\"\")","v":""},{"$f":"IFERROR(VLOOKUP(T6,Feiertage!$F$12:$F$52,1,FALSE),\"\")","v":""},{"$f":"IFERROR(VLOOKUP(U6,Feiertage!$F$12:$F$52,1,FALSE),\"\")","v":""},{"$f":"IFERROR(VLOOKUP(V6,Feiertage!$F$12:$F$52,1,FALSE),\"\")","v":""},{"$f":"IFERROR(VLOOKUP(W6,Feiertage!$F$12:$F$52,1,FALSE),\"\")","v":""},{"$f":"IFERROR(VLOOKUP(X6,Feiertage!$F$12:$F$52,1,FALSE),\"\")","v":""},{"$f":"IFERROR(VLOOKUP(Y6,Feiertage!$F$12:$F$52,1,FALSE),\"\")","v":""},{"$f":"IFERROR(VLOOKUP(Z6,Feiertage!$F$12:$F$52,1,FALSE),\"\")","v":""},{"$f":"IFERROR(VLOOKUP(AA6,Feiertage!$F$12:$F$52,1,FALSE),\"\")","v":""},{"$f":"IFERROR(VLOOKUP(AB6,Feiertage!$F$12:$F$52,1,FALSE),\"\")","v":""},{"$f":"IFERROR(VLOOKUP(AC6,Feiertage!$F$12:$F$52,1,FALSE),\"\")","v":""},{"$f":"IFERROR(VLOOKUP(AD6,Feiertage!$F$12:$F$52,1,FALSE),\"\")","v":""},{"$f":"IFERROR(VLOOKUP(AE6,Feiertage!$F$12:$F$52,1,FALSE),\"\")","v":""},{"$f":"IFERROR(VLOOKUP(AF6,Feiertage!$F$12:$F$52,1,FALSE),\"\")","v":""},{"$f":"IFERROR(VLOOKUP(AG6,Feiertage!$F$12:$F$52,1,FALSE),\"\")","v":""},{"$f":"IFERROR(VLOOKUP(AH6,Feiertage!$F$12:$F$52,1,FALSE),\"\")","v":""},{"$f":"IFERROR(VLOOKUP(AI6,Feiertage!$F$12:$F$52,1,FALSE),\"\")","v":""},{"$f":"IFERROR(VLOOKUP(AJ6,Feiertage!$F$12:$F$52,1,FALSE),\"\")","v":""},{"$f":"IFERROR(VLOOKUP(AK6,Feiertage!$F$12:$F$52,1,FALSE),\"\")","v":""},{"$f":"IFERROR(VLOOKUP(AL6,Feiertage!$F$12:$F$52,1,FALSE),\"\")","v":""},{"$f":"IFERROR(VLOOKUP(AM6,Feiertage!$F$12:$F$52,1,FALSE),\"\")","v":""},{"$f":"IFERROR(VLOOKUP(AN6,Feiertage!$F$12:$F$52,1,FALSE),\"\")","v":""},{"$f":"IFERROR(VLOOKUP(AO6,Feiertage!$F$12:$F$52,1,FALSE),\"\")","v":""},{"$f":"IFERROR(VLOOKUP(AP6,Feiertage!$F$12:$F$52,1,FALSE),\"\")","v":""},{"$f":"IFERROR(VLOOKUP(AQ6,Feiertage!$F$12:$F$52,1,FALSE),\"\")","v":""},{"$f":"IFERROR(VLOOKUP(AR6,Feiertage!$F$12:$F$52,1,FALSE),\"\")","v":""},{"$f":"IFERROR(VLOOKUP(AS6,Feiertage!$F$12:$F$52,1,FALSE),\"\")","v":"2025-10-03"},{"$f":"IFERROR(VLOOKUP(AT6,Feiertage!$F$12:$F$52,1,FALSE),\"\")","v":"2025-10-03"},{"$f":"IFERROR(VLOOKUP(AU6,Feiertage!$F$12:$F$52,1,FALSE),\"\")","v":""},{"$f":"IFERROR(VLOOKUP(AV6,Feiertage!$F$12:$F$52,1,FALSE),\"\")","v":""},{"$f":"IFERROR(VLOOKUP(AW6,Feiertage!$F$12:$F$52,1,FALSE),\"\")","v":""},{"$f":"IFERROR(VLOOKUP(AX6,Feiertage!$F$12:$F$52,1,FALSE),\"\")","v":""},{"$f":"IFERROR(VLOOKUP(AY6,Feiertage!$F$12:$F$52,1,FALSE),\"\")","v":""},{"$f":"IFERROR(VLOOKUP(AZ6,Feiertage!$F$12:$F$52,1,FALSE),\"\")","v":""},{"$f":"IFERROR(VLOOKUP(BA6,Feiertage!$F$12:$F$52,1,FALSE),\"\")","v":""},{"$f":"IFERROR(VLOOKUP(BB6,Feiertage!$F$12:$F$52,1,FALSE),\"\")","v":""},{"$f":"IFERROR(VLOOKUP(BC6,Feiertage!$F$12:$F$52,1,FALSE),\"\")","v":""},{"$f":"IFERROR(VLOOKUP(BD6,Feiertage!$F$12:$F$52,1,FALSE),\"\")","v":""},{"$f":"IFERROR(VLOOKUP(BE6,Feiertage!$F$12:$F$52,1,FALSE),\"\")","v":""},{"$f":"IFERROR(VLOOKUP(BF6,Feiertage!$F$12:$F$52,1,FALSE),\"\")","v":""},{"$f":"IFERROR(VLOOKUP(BG6,Feiertage!$F$12:$F$52,1,FALSE),\"\")","v":""},{"$f":"IFERROR(VLOOKUP(BH6,Feiertage!$F$12:$F$52,1,FALSE),\"\")","v":""},{"$f":"IFERROR(VLOOKUP(BI6,Feiertage!$F$12:$F$52,1,FALSE),\"\")","v":""},{"$f":"IFERROR(VLOOKUP(BJ6,Feiertage!$F$12:$F$52,1,FALSE),\"\")","v":""},{"$f":"IFERROR(VLOOKUP(BK6,Feiertage!$F$12:$F$52,1,FALSE),\"\")","v":""},{"$f":"IFERROR(VLOOKUP(BL6,Feiertage!$F$12:$F$52,1,FALSE),\"\")","v":""},{"$f":"IFERROR(VLOOKUP(BM6,Feiertage!$F$12:$F$52,1,FALSE),\"\")","v":""},{"$f":"IFERROR(VLOOKUP(BN6,Feiertage!$F$12:$F$52,1,FALSE),\"\")","v":""},{"$f":"IFERROR(VLOOKUP(BO6,Feiertage!$F$12:$F$52,1,FALSE),\"\")","v":""},{"$f":"IFERROR(VLOOKUP(BP6,Feiertage!$F$12:$F$52,1,FALSE),\"\")","v":""},{"$f":"IFERROR(VLOOKUP(BQ6,Feiertage!$F$12:$F$52,1,FALSE),\"\")","v":""},{"$f":"IFERROR(VLOOKUP(BR6,Feiertage!$F$12:$F$52,1,FALSE),\"\")","v":""},{"$f":"IFERROR(VLOOKUP(BS6,Feiertage!$F$12:$F$52,1,FALSE),\"\")","v":""},{"$f":"IFERROR(VLOOKUP(BT6,Feiertage!$F$12:$F$52,1,FALSE),\"\")","v":""},{"$f":"IFERROR(VLOOKUP(BU6,Feiertage!$F$12:$F$52,1,FALSE),\"\")","v":""},{"$f":"IFERROR(VLOOKUP(BV6,Feiertage!$F$12:$F$52,1,FALSE),\"\")","v":""},{"$f":"IFERROR(VLOOKUP(BW6,Feiertage!$F$12:$F$52,1,FALSE),\"\")","v":""},{"$f":"IFERROR(VLOOKUP(BX6,Feiertage!$F$12:$F$52,1,FALSE),\"\")","v":""},{"$f":"IFERROR(VLOOKUP(BY6,Feiertage!$F$12:$F$52,1,FALSE),\"\")","v":""},{"$f":"IFERROR(VLOOKUP(BZ6,Feiertage!$F$12:$F$52,1,FALSE),\"\")","v":""},{"$f":"SUM(CA13:CA34)","v":4.5},{"$f":"SUM(CB13:CB34)","v":3.25},{"$f":"SUM(CA35:CB35)","v":7.75}]
["Transport",null,null,{"$f":"DATEDIF(C13-1,D33,\"d\")&\" Tage\"","v":"18 Tage"},null,null,{"$f":"ROUND(G35/E50,0)&\" Tage\"","v":"26 Tage"},null,null,"Farben nicht kopieren, da die Zellen Bedingte Formatierenungen enthalten! Also einzeln einfügen!"]
["Gerüstbau / Instandhaltung",null,null,null,null,null,null,null,null,null,"Wählen Sie Start > den Pfeil Füllfarbe",null,null,null,null,null,null,null,null,null,null,null,null,null,"Farben nicht kopieren, da die Zellen Bedingte Formatierenungen enthalten! Also einzeln einfügen!",null,null,null,null,null,null,null,null,null,null,null,null,"Farben nicht kopieren, da die Zellen Bedingte Formatierenungen enthalten! Also einzeln einfügen!",null,null,null,null,null,null,null,null,null,null,null,null,null,"Farben nicht kopieren, da die Zellen Bedingte Formatierenungen enthalten! Also einzeln einfügen!"]
["Korr. UAN","Auto",{"$f":"SUMIF(B13:B33,A38,G13:G33)","v":4.395833333333333},null,null,null,null,null,null,null,null,null,null,null,null,null,null,null,null,null,{"$error":"#VALUE!"}]
["UAN und PW Fertigung",null,null,null,null,null,null,null,null,null,null,null,null,null,null,null,null,null,{"$f":"C38/E50","v":8.7916666666666661}]
["Inbetriebnahme"]
["Überführung "]
["Samstag","Auto"]
["Sonntag","Auto"]
["hellgelb ausfüllen"]
["weiß ausfüllen"]
["Feierttage","Auto"]
[]
["Arbeitszeiträume: I: 06:00 - 12:00 ","06:00:00","12:00:00","00:00:00",{"$f":"MAX(IF(B48<=C48,C48-B48,\"24:00\"-B48+C48)-D48,0)","v":0.25}]
["Arbeitszeiträume: II: 12:00 - 18:00)","06:00:00","12:00:00","00:00:00",{"$f":"MAX(IF(B49<=C49,C49-B49,\"24:00\"-B49+C49)-D49,0)","v":0.25}]
[null,null,null,null,{"$f":"SUM(E48:E49)","v":0.5},"Nach Arbeitszeitgesetz Verboten"]
[]
[null,null,null,"Für Schulungszwecke",null,null,null,null,"Für Schulungszwecke",null,null,null,"Für Schulungszwecke",null,null,"Für Schulungszwecke",null,null,"Für Schulungszwecke",null,null,"Für Schulungszwecke",null,null,null,"Für Schulungszwecke",null,null,"Für Schulungszwecke",null,null,null,null,"Für Schulungszwecke",null,null,"Für Schulungszwecke",null,null,"Für Schulungszwecke",null,null,"Für Schulungszwecke",null,null,"Für Schulungszwecke",null,null,"Für Schulungszwecke",null,null,"Für Schulungszwecke",null,null,null,"Für Schulungszwecke",null,null,"Für Schulungszwecke",null,null,"Für Schulungszwecke",null,null,"Für Schulungszwecke",null,null,"Für Schulungszwecke",null,null,"Für Schulungszwecke",null,null,"Für Schulungszwecke",null,null,null,"Für Schulungszwecke"]
[null,null,1,{"$f":"B13","v":"Zoll"},null,null,null,null,{"$f":"AND($B13=$A$38,I$6>=$C13,I$6<=$D13)","v":false},false,false,false,false,false,false,false,false,false,false,false,false,false,false,false,false,false,false,false,false,false,false,false,false,false,false,false,false,false,false,false,false,false,false,false,false,false,false,false,false,false,false,false,false,false,false,false,false,false,false,false,false,false,false,false,false,false,false,false,false,false,false,false,false,{"$f":"AND($B13=$A$38,BV$6>=$C13,BV$6<=$D13)","v":false},false,false,false,false]
[null,null,2,{"$f":"B14","v":"TI/Zoll"}]
[null,null,3,"PW/UAN"]
[null,null,4,"TI"]
[null,null,5,"TI/Zoll"]
[null,null,6,"TI/Zoll"]
[null,null,7,"Icke"]
[null,null,8,"TA/ TI"]
[null,null,9,"Korr. UAN"]
[null,null,10,"TQ/Zoll/UAN"]
[null,null,11,"PW/UAN"]
[null,null,12,"Korr. UAN"]
[null,null,13,"Korr. UAN"]
[null,null,14,"TA / Cathleco"]
[null,null,15,"Korr. UAN"]
[null,null,16,"Korr. UAN"]
[null,null,17,"TQ/PW/Zoll"]
[null,null,18,"TA/TI / Schubeck"]
[null,null,19,"TI/ Zoll"]
[null,null,20,"TI/Zoll"]
[null,null,21,"Zoll"]
[null,null,22,0]
[]
[null,"Eindeutige Liste","Eindeutige Liste","Eindeutige Liste"]
[{"$f":"B13","v":"Zoll"},{"$f":"_xlfn.UNIQUE(_xlfn._xlws.FILTER(A77:A110,A77:A110<>\"\"))","v":"Zoll"},{"$f":"VLOOKUP(B77,B13:D34,2,FALSE)","v":"2025-09-15"},{"$f":"VLOOKUP(B77,B13:D34,3,FALSE)","v":"2025-09-16"},null,null,null,null,{"$f":"AND($B77=$B77,I$6>=$C77,I$6<=$D77)","v":true},{"$f":"AND($B77=$B77,J$6>=$C77,J$6<=$D77)","v":true},true,true,false,false,false,false,false,false,false,false,false,false,false,false,false,false,false,false,false,false,false,false,false,false,false,false,false,false,false,false,false,false,false,false,false,false,false,false,false,false,false,false,false,false,false,false,false,false,false,false,false,false,false,false,false,false,false,false,false,false,false,false,false,{"$f":"AND($B77=$B77,BV$6>=$C77,BV$6<=$D77)","v":false},false,false,false,false]
["TI/Zoll","TI/Zoll","2025-09-16","2025-09-16",null,null,null,null,{"$f":"AND($B78=$B78,I$6>=$C78,I$6<=$D78)","v":false},false,true,true,false,false,false,false,false,false,false,false,false,false,false,false,false,false,false,false,false,false,false,false,false,false,false,false,false,false,false,false,false,false,false,false,false,false,false,false,false,false,false,false,false,false,false,false,false,false,false,false,false,false,false,false,false,false,false,false,false,false,false,false,false,false,false,false,false,false]
["PW/UAN","PW/UAN","2025-09-17","2025-09-18",null,null,null,null,false,{"$f":"AND($B79=$B79,J$6>=$C79,J$6<=$D79)","v":false},false,false,true,true,true,true,false,false,false,false,false,false,false,false,false,false,false,false,false,false,false,false,false,false,false,false,false,false,false,false,false,false,false,false,false,false,false,false,false,false,false,false,false,false,false,false,false,false,false,false,false,false,false,false,false,false,false,false,false,false,false,false,false,false,false,false,false,false]
["TI","TI","2025-09-19","2025-09-19",null,null,null,null,false,false,false,false,false,false,false,false,true,true,false,false,false,false,false,false,false,false,false,false,false,false,false,false,false,false,false,false,false,false,false,false,false,false,false,false,false,false,false,false,false,false,false,false,false,false,false,false,false,false,false,false,false,false,false,false,false,false,false,false,false,false,false,false,false,false,false,false,false,false]
["TI/Zoll","Icke","2025-09-19","2025-09-19",null,null,null,null,false,false,false,false,false,false,false,false,true,true,false,false,false,false,false,false,false,false,false,false,false,false,false,false,false,false,false,false,false,false,false,false,false,false,false,false,false,false,false,false,false,false,false,false,false,false,false,false,false,false,false,false,false,false,false,false,false,false,false,false,false,false,false,false,false,false,false,false,false,false]
["TI/Zoll","TA/ TI","2025-09-19","2025-09-19",null,null,null,null,false,false,false,false,false,false,false,false,true,true,false,false,false,false,false,false,false,false,false,false,false,false,false,false,false,false,false,false,false,false,false,false,false,false,false,false,false,false,false,false,false,false,false,false,false,false,false,false,false,false,false,false,false,false,false,false,false,false,false,false,false,false,false,false,{"$f":"AND($B82=$B82,BU$6>=$C82,BU$6<=$D82)","v":false},false,false,false,false,false]
["Icke","Korr. UAN","2025-09-19","2025-09-19",null,null,null,null,false,{"$f":"AND($B83=$B83,J$6>=$C83,J$6<=$D83)","v":false},false,false,false,false,false,false,true,true,false,false,false,false,false,false,false,false,false,false,false,false,false,false,false,false,false,false,false,false,false,false,false,false,false,false,false,false,false,false,false,false,false,false,false,false,false,false,false,false,false,false,false,false,false,false,false,false,false,false,false,false,false,false,false,false,false,false,false,false]
["TA/ TI","TQ/Zoll/UAN","2025-09-22","2025-09-22",null,null,null,null,false,false,false,false,false,false,false,false,false,false,false,false,false,false,true,true,false,false,false,false,false,false,false,false,false,false,false,false,false,false,false,false,false,false,false,false,false,false,false,false,false,false,false,false,false,false,false,false,false,false,false,false,false,false,false,false,false,false,false,false,false,false,false,false,false,false,false,false,false,false]
["Korr. UAN","TA / Cathleco","2025-09-30","2025-09-30",null,null,null,null,false,false,false,false,false,false,false,false,false,false,false,false,false,false,false,false,false,false,false,false,false,false,false,false,false,false,false,false,false,false,true,true,false,false,false,false,false,false,false,false,false,false,false,false,false,false,false,false,false,false,false,false,false,false,false,false,false,false,false,false,false,false,false,false,false,false,false,false,false,false]
["TQ/Zoll/UAN","TQ/PW/Zoll","2025-09-30","2025-09-30",null,null,null,null,false,false,false,false,false,false,false,false,false,false,false,false,false,false,false,false,false,false,false,false,false,false,false,false,false,false,false,false,false,false,true,true,false,false,false,false,false,false,false,false,false,false,false,false,false,false,false,false,false,false,false,false,false,false,false,false,false,false,false,false,false,false,false,false,{"$f":"AND($B86=$B86,BU$6>=$C86,BU$6<=$D86)","v":false},false,false,false,false,false]
["PW/UAN","TA/TI / Schubeck","2025-09-30","2025-09-30",null,null,null,null,false,false,false,false,false,false,false,false,false,false,false,false,false,false,false,false,{"$f":"AND($B87=$B87,Y$6>=$C87,Y$6<=$D87)","v":false},false,false,false,false,false,false,false,false,false,false,false,false,false,true,true,false,false,false,false,false,false,false,false,false,false,false,false,false,false,false,false,false,false,false,false,false,false,false,false,false,false,false,false,false,false,false,false,false,false,false,false,false,false]
["Korr. UAN","TI/ Zoll","2025-10-01","2025-10-01",null,null,null,null,false,{"$f":"AND($B88=$B88,J$6>=$C88,J$6<=$D88)","v":false},false,false,false,false,false,false,false,false,false,false,false,false,false,false,false,false,false,false,false,false,false,false,false,false,false,false,false,false,false,false,true,true,false,false,false,false,false,false,false,false,false,false,false,false,false,false,false,false,false,false,false,false,false,false,false,false,false,false,false,false,false,false,false,false,false,false,false,false]
["Korr. UAN",null,null,null,null,null,null,null,false,false,false,false,false,false,false,false,false,false,false,false,false,false,false,false,false,false,false,false,false,false,false,false,false,false,false,false,false,false,false,false,false,false,false,false,false,false,false,false,false,false,false,false,false,false,false,false,false,false,false,false,false,false,false,false,false,false,false,false,false,false,false,false,false,false,false,false,false,false]
["TA / Cathleco"]
["Korr. UAN"]
["Korr. UAN"]
["TQ/PW/Zoll"]
["TA/TI / Schubeck"]
["TI/ Zoll"]
["TI/Zoll"]
["Zoll"]

{"sheet":"Feiertage","index":3,"n_rows":66,"n_cols":98,"rows_kept":66,"cut":false,"hidden":false,"merged":[[5,71,7,71],[6,2,6,4],[9,0,10,0],[1,5,1,9],[3,1,3,10],[4,0,6,0],[5,64,7,64]]}
["Inhalt",null,null,null,null,null,null,null,null,null,{"$f":"VLOOKUP(L1,N1:O8,2,FALSE)","v":"Freitag"},6,{"$f":"IF(P1=TRUE,N1,\"\")","v":""},1,"Sonntag",{"$f":"IF($K$1=O1,WEEKDAY(N1,1)=7,\"\")","v":""},null,null,null,null,null,null,null,null,null,null,null,null,null,null,null,"Stammdaten","Stammdaten","Stammdaten","Stammdaten",{"$f":"SUM(AJ2:AJ8)","v":10},{"$f":"SUM(AK2:AK8)","v":{"$error":"#REF!"}},null,"Stammdaten",null,null,null,null,"https://kalender-365.de/wochentage.php","Wochentagsberechnung: 2024",null,null,null,null,"Typ2"]
[null,null,null,null,null,null,null,null,null,null,null,{"$f":"IF(M9=1,1,MAX(M1:M8)+2)","v":7},{"$f":"IF(P2=TRUE,N2-1,\"\")","v":""},2,"Montag",{"$f":"IF($K$1=O2,WEEKDAY(N2,1)=1,\"\")","v":""},null,null,null,null,null,null,null,null,null,null,null,null,null,"Inhalt",null,{"$f":"IF(#REF!>0,#REF!,\"\")","v":{"$error":"#REF!"}},{"$f":"IF(#REF!>0,\"x\",\"\")","v":{"$error":"#REF!"}},"Sonntag",{"$f":"AG2","v":{"$error":"#REF!"}},{"$f":"COUNTIF($AG$12:$AG$31,AH2)","v":0},{"$f":"IF(AI2=\"X\",AJ2,\"\")","v":{"$error":"#REF!"}},null,{"$f":"IF(#REF!>0,\"x\",\"\")","v":{"$error":"#REF!"}},7,{"$f":"IF(AI2=\"X\",AN2,\"\")","v":{"$error":"#REF!"}},{"$f":"SUM((WEEKDAY(ROW(INDIRECT($Y$12&\":\"&$Z$23)),2)=AO2)*1)","v":{"$error":"#REF!"}},{"$f":"SUM((WEEKDAY(ROW(INDIRECT($Y$12&\":\"&$Z$23)),2)=AN2)*1)","v":52},null,null,"Sonntage: 52",null,null,7,"Sonntag",null,null,null,null,null,null,null,null,null,null,null,null,null,null,null,null,null,null,null,null,null,null,null,null,null,null,null,"Januar","Februar","März","April","Mai","Juni","Juli","August","September","Oktober","November","Dezember"]
["Negativ","Positiv",null,null,{"$f":"gewJahr","v":2025},{"$f":"YEAR(Ablaufplan!C13)","v":2025},null,null,null,null,null,null,"",3,"Dienstag",{"$f":"IF($K$1=O3,WEEKDAY(N3,1)=2,\"\")","v":""},null,null,null,null,null,null,null,null,null,null,null,null,null,null,null,{"$f":"IF(#REF!>0,#REF!,\"\")","v":{"$error":"#REF!"}},{"$f":"IF(#REF!>0,\"x\",\"\")","v":{"$error":"#REF!"}},"Montag",{"$f":"AG3","v":{"$error":"#REF!"}},{"$f":"COUNTIF($AG$12:$AG$31,AH3)","v":2},{"$f":"IF(AI3=\"X\",AJ3,\"\")","v":{"$error":"#REF!"}},null,{"$f":"IF(#REF!>0,\"x\",\"\")","v":{"$error":"#REF!"}},1,{"$f":"IF(AI3=\"X\",AN3,\"\")","v":{"$error":"#REF!"}},{"$f":"SUM((WEEKDAY(ROW(INDIRECT($Y$12&\":\"&$Z$23)),2)=AO3)*1)","v":{"$error":"#REF!"}},{"$f":"SUM((WEEKDAY(ROW(INDIRECT($Y$12&\":\"&$Z$23)),2)=AN3)*1)","v":52},null,null,"Montage: 53",null,null,1,"Montag ",null,null,{"$f":"SUM(AQ3:AQ7)","v":261},null,null,null,null,null,null,null,null,null,null,null,null,null,null,null,null,null,null,null,null,null,null,null,{"$f":"SUM(BZ3:CK3)","v":0},0,0,0,0,0,0,0,0,0,0,0,0,"Sonntagsarbeitszeiten"]
[null,{"$f":"YEAR(Ablaufplan!C13)","v":2025},null,null,null,null,null,null,null,null,null,null,"",4,"Mittwoch",{"$f":"IF($K$1=O4,WEEKDAY(N4,1)=3,\"\")","v":""},null,null,null,null,null,null,null,null,null,null,null,null,null,null,null,{"$f":"IF(#REF!>0,#REF!,\"\")","v":{"$error":"#REF!"}},{"$f":"IF(#REF!>0,\"x\",\"\")","v":{"$error":"#REF!"}},"Dienstag",{"$f":"AG4","v":{"$error":"#REF!"}},0,{"$error":"#REF!"},null,{"$f":"IF(#REF!>0,\"x\",\"\")","v":{"$error":"#REF!"}},2,{"$error":"#REF!"},{"$f":"SUM((WEEKDAY(ROW(INDIRECT($Y$12&\":\"&$Z$23)),2)=AO4)*1)","v":{"$error":"#REF!"}},{"$f":"SUM((WEEKDAY(ROW(INDIRECT($Y$12&\":\"&$Z$23)),2)=AN4)*1)","v":52},null,null,"Dienstage: 53",null,null,2,"Dienstag",null,null,{"$f":"SUM(AQ3:AQ6)","v":209},null,null,null,null,null,null,null,null,null,null,null,null,null,null,null,null,null,null,null,{"$f":"IF((CH9*24)>0,6,IF(CH9<0,7,5))","v":{"$error":"#REF!"}},{"$f":"#REF!","v":{"$error":"#REF!"}},{"$f":"#REF!","v":{"$error":"#REF!"}},null,{"$f":"IF((CH9*24)>0,6,IF(CH9<0,7,5))","v":{"$error":"#REF!"}},{"$f":"VLOOKUP(BZ2,$BS$11:$BT$22,2,FALSE)","v":1},{"$f":"VLOOKUP(CA2,$BS$11:$BT$22,2,FALSE)","v":0},0,2,2,1,0,0,0,2,0,2,{"$f":"SUM(BZ4:CK4)","v":10},{"$f":"CL4*(#REF!*24)","v":{"$error":"#REF!"}},{"$f":"CM4/24","v":{"$error":"#REF!"}},null,null,null,"herleitung"]
["Auswirkung auf Soll-\nMonatsstunden Kalender","Auswahl","Ja",null," Sa","Werktage Mo-Sa =7","Arbeitstage Mo-Fr=>6",null,null,null,null,null,"",5,"Donnerstag",{"$f":"IF($K$1=O5,WEEKDAY(N5,1)=4,\"\")","v":""},null,null,null,null,null,null,null,null,null,null,null,null,null,null,null,{"$f":"IF(#REF!>0,#REF!,\"\")","v":{"$error":"#REF!"}},{"$f":"IF(#REF!>0,\"x\",\"\")","v":{"$error":"#REF!"}},"Mittwoch",{"$error":"#REF!"},1,{"$error":"#REF!"},null,{"$f":"IF(#REF!>0,\"x\",\"\")","v":{"$error":"#REF!"}},3,{"$error":"#REF!"},{"$f":"SUM((WEEKDAY(ROW(INDIRECT($Y$12&\":\"&$Z$23)),2)=AO5)*1)","v":{"$error":"#REF!"}},{"$f":"SUM((WEEKDAY(ROW(INDIRECT($Y$12&\":\"&$Z$23)),2)=AN5)*1)","v":53},null,null,"Mittwoche: 52",null,null,3,"Mittwoch",null,null,null,null,null,null,null,null,null,null,null,null,null,null,null,null,null,null,null,null,null,null,{"$f":"IF(BU4>BV4,\">=1\",\">\")","v":{"$error":"#REF!"}},null,null,null,{"$f":"(BY3*24)/(#REF!*24)","v":{"$error":"#REF!"}},null,null,null,null,null,null,null,null,null,null,null,"summ",{"$f":"SUM(CM5:CN5)","v":{"$error":"#REF!"}},{"$f":"CO8-CN5","v":{"$error":"#REF!"}},{"$f":"BY5/24","v":{"$error":"#REF!"}},"ist",null,6,{"$f":"IF($CQ$7=5,IFERROR(WEEKDAY(BY17,2)<6,\"\"))","v":true}]
[null,"Auswahl","Nein",null," So","Wochentage Mo-So =8",null,null,null,null,null,null,5,6,"Freitag",{"$f":"IF($K$1=O6,WEEKDAY(N6,1)=5,\"\")","v":true},null,"Sonntag Kein Feiertag 5 Tage/Woche",null,null,null,null,null,null,null,null,null,null,null,null,null,{"$f":"IF(#REF!>0,#REF!,\"\")","v":{"$error":"#REF!"}},{"$f":"IF(#REF!>0,\"x\",\"\")","v":{"$error":"#REF!"}},"Donnerstag",{"$error":"#REF!"},3,{"$error":"#REF!"},null,{"$f":"IF(#REF!>0,\"x\",\"\")","v":{"$error":"#REF!"}},4,{"$error":"#REF!"},{"$f":"SUM((WEEKDAY(ROW(INDIRECT($Y$12&\":\"&$Z$23)),2)=AO6)*1)","v":{"$error":"#REF!"}},{"$f":"SUM((WEEKDAY(ROW(INDIRECT($Y$12&\":\"&$Z$23)),2)=AN6)*1)","v":52},null,null,"Donnerstage: 52",null,null,4,"Donnerstag",null,null,null,null,null,null,null,null,null,null,null,null,null,null,"Auswirkung auf Soll-\nMonatsstunden Kalender",null,null,null,null,null,null,"Auswirkung auf Soll-\nMonatsstunden Kalender",null,null,null,null,15,"Feiertagsarbeit im Jahr müssen frei beiben ArbzG",null,null,null,null,null,null,null,null,null,null,null,{"$f":"CM6*9/12","v":{"$error":"#REF!"}},{"$f":"BY6*(#REF!*24)","v":{"$error":"#REF!"}},{"$f":"CM6/24","v":{"$error":"#REF!"}},"soll frei bleben Jahr",null,5,{"$f":"IF($CQ$7=5,IFERROR(WEEKDAY(BY18,2)<6,\"\"))","v":true},null,"Arbeitszeitgesetz"]
[null,{"$f":"DATEVALUE(\"01.01.\"&B4)","v":"2025-01-01"},"Feiertage + Geburtstage + Adventssonntage",null,null,8,"←6 = 5 Tage/Woche 7 oder 8 hier eintragen!",null,null,null,null,null,"",7,"Samstag",{"$f":"IF($K$1=O7,WEEKDAY(N7,1)=6,\"\")","v":""},null,{"$f":"D15","v":"Sommerzeit 1h vor"},null,null,null,null,null,null,null,null,null,null,null,null,null,{"$f":"IF(#REF!>0,#REF!,\"\")","v":{"$error":"#REF!"}},{"$f":"IF(#REF!>0,\"x\",\"\")","v":{"$error":"#REF!"}},"Freitag",{"$error":"#REF!"},4,{"$error":"#REF!"},null,{"$f":"IF(#REF!>0,\"x\",\"\")","v":{"$error":"#REF!"}},5,{"$error":"#REF!"},{"$f":"SUM((WEEKDAY(ROW(INDIRECT($Y$12&\":\"&$Z$23)),2)=AO7)*1)","v":{"$error":"#REF!"}},{"$f":"SUM((WEEKDAY(ROW(INDIRECT($Y$12&\":\"&$Z$23)),2)=AN7)*1)","v":52},null,null,"Freitage: 52",null,null,5,"Freitag",null,null,null,null,null,null,null,null,null,null,null,null,null,null,null,null,null,null,null,null,null,null,null,null,null,null,null,"alle Tage dann >= sonst >1",null,null,null,null,"soll  freibleiben",{"$f":"IFERROR(CL7*BY6/CL8,\"0\")","v":"0"},{"$f":"CF7*(#REF!*24)","v":{"$error":"#REF!"}},{"$f":"CG7/24","v":{"$error":"#REF!"}},"Sonnage",{"$f":"#REF!","v":{"$error":"#REF!"}},{"$f":"#REF!","v":{"$error":"#REF!"}},{"$f":"SUM((WEEKDAY(ROW(INDIRECT(CJ7&\":\"&CK7)),2)=7)*1)","v":{"$error":"#REF!"}},{"$f":"CL7*(#REF!*24)","v":{"$error":"#REF!"}},{"$f":"CM7/24","v":{"$error":"#REF!"}},"soll frei bleiben ",null,5,{"$f":"IF($CQ$7=5,IFERROR(WEEKDAY(BY19,2)<6,\"\"))","v":true},null,"75:00 Stunden Sonntage müssen frei bleben im Jahr"]
["Auswahl","Ja  oder Nein",{"$f":"IF(AND(DAY(DATE(YEAR(B7),3,))=29,YEAR(B7)<>1900),\"Schaltjahr\",\"\")","v":""},null,null,null,null,null,null,null,null,null,{"$f":"IF(M1=1,\"\",IF(P8=TRUE,N8-1,\"\"))","v":""},8,"Sonntag",{"$f":"IF($K$1=O8,WEEKDAY(N8,1)=7,\"\")","v":""},null,{"$f":"D29","v":"Winterzeit 1h zurück"},null,null,null,null,null,null,null,null,null,"5 Tage/Woche",null,null,null,{"$f":"IF(#REF!>0,#REF!,\"\")","v":{"$error":"#REF!"}},{"$f":"IF(#REF!>0,\"x\",\"\")","v":{"$error":"#REF!"}},"Samstag",{"$error":"#REF!"},0,{"$error":"#REF!"},null,{"$f":"IF(#REF!>0,\"x\",\"\")","v":{"$error":"#REF!"}},6,{"$error":"#REF!"},{"$f":"SUM((WEEKDAY(ROW(INDIRECT($Y$12&\":\"&$Z$23)),2)=AO8)*1)","v":{"$error":"#REF!"}},{"$f":"SUM((WEEKDAY(ROW(INDIRECT($Y$12&\":\"&$Z$23)),2)=AN8)*1)","v":52},null,null,"Samstage: 52",null,null,6,"Samstag",null,null,null,null,null,null,null,null,null,null,null,null,null,null,null,null,null,null,null,null,null,null,null,null,"Ungleich",null,null,">=1",">1",null,null,null,"soll frei geblieben",null,null,{"$f":"CO8","v":{"$error":"#REF!"}},"Sonnage","2021-01-01",{"$f":"#REF!","v":{"$error":"#REF!"}},{"$f":"SUM((WEEKDAY(ROW(INDIRECT(CJ8&\":\"&CK8)),2)=7)*1)","v":{"$error":"#REF!"}},{"$f":"CL8*(#REF!*24)","v":{"$error":"#REF!"}},{"$f":"CM8/24","v":{"$error":"#REF!"}},{"$f":"CN8-CN7","v":{"$error":"#REF!"}}]
["Kein bezahlter FT","Feiertagsauswahl",{"$f":"IF(C8=\"\",\"\",DATE(YEAR(B7),MONTH(1),DAY(29))+30)","v":""},{"$f":"E9","v":2025},{"$f":"YEAR(B7)","v":2025},"6 = Ohne \nSa.& So.",{"$f":"COUNT(G10:G52)","v":10},"siehe Feiertage Bundesland","Buß- u. Bettag suchen",null,"Samstage =Feiertage",{"$f":"E9-1","v":2024},{"$f":"IF(M1=1,1,MAX(M1:M8)+1)","v":6},"Tage/Woche",null,null,null,null,null,null,null,null,null,null,null,null,null,"Feiertage",null,null,null,null,null,null,{"$f":"COUNTIF(AI2:AI8,\"x\")","v":0},null,null,null,null,null,null,{"$f":"SUM(AP2:AP8)","v":{"$error":"#REF!"}},{"$f":"SUM(AQ2:AQ8)","v":365},null,null,"Arbeitstage: 262",null,null,null,null,null,null,null,null,null,null,null,null,null,null,null,null,null,null,null,null,null,null,null,null,"für Kalender",null,null,null,{"$f":"YEAR(BX11)","v":2025},{"$f":"gewJahr","v":2025},{"$f":"IF(BW9<>BX9,\"X\",\"\")","v":""},"Wochentag",null,null,null,null,null,null,null,{"$f":"CH8-CH7","v":{"$error":"#REF!"}},null,null,null,null,null,null,"Arbeiten am Wochenende und an Feiertagen"]
["Keine Arbeit","Auswahl",null,"Bezeichnung","Vorgabe-Datum",{"$f":"COUNT(F12:F49)","v":10},"Feiertage am","Sonderfeiertage",{"$f":"DATEVALUE(\"16.11.\"&E9)","v":"2025-11-16"},{"$f":"IF(AND(WEEKDAY(I10)=4,DAY(I10)>7),I10,\"\")","v":""},{"$f":"COUNT(K12:K52)","v":0},null,null,null,null,"Jahr Nettoarbeitstage",null,"Datum","Datum",null,null,null,null,null,null,null,null,"ohne Sa/So",null,null,null,null,null,null,null,null,null,null,null,"Feiertage","G","Übertrag",null,null,null,"Std",null,null,"Std",null,null,null,null,null,null,null,null,null,null,null,null,null,null,{"$f":"A12","v":"Ja"},{"$f":"D12","v":"Neujahr"},{"$f":"IF(E12=\"\",\"\",IF(A12=\"ja\",E12,\"\"))","v":"2025-01-01"},{"$f":"BN10","v":"2025-01-01"},{"$f":"D12","v":"Neujahr"},{"$f":"Y11","v":"Datum"},"Datum",null,{"$f":"SUM(BT11:BT22)","v":10},"Eindeutige Liste",null,null,"Eindeutige Liste",null,null,null,"Datum","Datum",null,{"$f":"SUM(CE11:CE22)","v":0},"Sonntage  frei",null,null,{"$f":"E12","v":"2025-01-01"},{"$f":"D12","v":"Neujahr"}]
[null,"Nein",{"$f":"IF(E11=\"\",\"\",IF(B11=\"ja\",E11,\"\"))","v":""},"Silvester Vorjahr",{"$f":"E12-1","v":"2024-12-31"},{"$f":"IF(C11=\"\",\"\",IF(AND(B11=\"ja\",WEEKDAY(C11,2)<$F$7),C11,\"\"))","v":""},null,null,{"$f":"I10+1","v":"2025-11-17"},"",null,null,null,null,null,"Hilfstabelle",null,"Sonntag Feiertage","Sonntag Feiertage",null,{"$f":"COUNT(U12:U53)","v":10},null,null,null,"Datum","Datum","Feiertage",{"$f":"COUNT(AB12:AB53)","v":10},null,null,null,null,null,"Eindeutige Liste",null,null,null,null,"Feiertage Monat","Arbeitsblatt","Arbeitsblatt","Sonntag FT",null,null,null,"Inkl. Feiertage",null,null,"ohne Feiertage","Std.",null,null,null,null,null,null,null,null,null,null,null,null,null,{"$f":"A13","v":"Nein"},{"$f":"D13","v":"Hl. 3 Könige "},{"$f":"IF(E13=\"\",\"\",IF(A13=\"ja\",E13,\"\"))","v":""},{"$f":"BN11","v":""},{"$f":"D13","v":"Hl. 3 Könige "},"2025-01-01","2025-01-31","Januar",{"$f":"SUMPRODUCT(($BN$10:$BN$51>=BQ11)*($BN$10:$BN$51<=BR11))","v":1},{"$f":"IFERROR(INDEX($BN$10:$BN$50,MATCH(1,COUNTIF($BU10:BU$10,$BN$10:$BN$50)+($BN$10:$BN$50<>\"\")*1,0)),\"\")","v":"2025-01-01"},{"$f":"IF(BU11=\"\",\"\",VLOOKUP(BU11,BN10:BP50,3,FALSE))","v":"Neujahr"},null,{"$f":"IFERROR(INDEX($F$12:$F$52,MATCH(1,COUNTIF($BX10:BX$10,$F$12:$F$52)+($F$12:$F$52<>\"\")*1,0)),\"\")","v":"2025-01-01"},{"$f":"BX11","v":"2025-01-01"},{"$f":"IFERROR(IF($BU$4=7,IFERROR(WEEKDAY(BY11)>=1,\"\"),IF($BU$4=6,IFERROR(WEEKDAY(BY11)>1,\"\"),IF($BU$4=5,IFERROR(WEEKDAY(BY11,2)<6,\"\")))),\"\")","v":""},{"$f":"IF(BZ11=TRUE,BX11,\"\")","v":""},{"$f":"BQ11","v":"2025-01-01"},{"$f":"BR11","v":"2025-01-31"},"Januar",{"$f":"SUMPRODUCT(($CA$11:$CA$52>=CB11)*($CA$11:$CA$52<=CC11))","v":0},{"$f":"#REF!","v":{"$error":"#REF!"}},null,null,{"$f":"E13","v":"2025-01-06"},{"$f":"D13","v":"Hl. 3 Könige "},null,null,null,null,"https://www.arbeitszeit-klug-gestalten.de/alles-zu-arbeitszeitgestaltung/arbeitszeitrecht/wochenenden-und-feiertage"]
["Ja","Ja",{"$f":"IF(E12=\"\",\"\",IF(AND(B12=\"ja\",WEEKDAY(E12,2)<$F$7),E12,\"\"))","v":"2025-01-01"},"Neujahr",{"$f":"DATEVALUE(\"01.01.\"&E9)","v":"2025-01-01"},{"$f":"IF(C12=\"\",\"\",IF(AND(B12=\"ja\",WEEKDAY(C12,2)<$F$7),C12,\"\"))","v":"2025-01-01"},{"$f":"F12","v":"2025-01-01"},null,"2025-11-18","",{"$f":"IFERROR(IF(G12=\"\",\"\",IF(AND(B12=\"ja\",WEEKDAY(C12,2)=6),C12,\"\")),\"\")","v":""},{"$f":"DATEVALUE(\"01.01.\"&L9)","v":"2024-01-01"},{"$f":"L12","v":"2024-01-01"},null,null,{"$f":"IF(C12=\"\",1900,IF(AND(B12=\"ja\",WEEKDAY(C12,2)<7),C12,1900))","v":"2025-01-01"},null,{"$f":"IF(OR($R$8=D11,$R$7=D11,C11=\"\"),\"\",IF(WEEKDAY(C11,1)=1,C11,\"\"))","v":""},{"$f":"IF(OR($R$8=D11,$R$7=D11,C11=\"\"),\"\",IF(WEEKDAY(C11,1)=1,C11,\"\"))","v":""},null,{"$f":"IF(YEAR(P12)=$E$9,P12,\"\")","v":"2025-01-01"},{"$f":"IF(U12=\"\",\"\",EOMONTH(U12,0))","v":"2025-01-31"},{"$f":"IF(U12=\"\",\"\",SUMPRODUCT(($P$12:$P$53>=U12)*($P$12:$P$53<=V12)))","v":1},"Januar",{"$f":"B7","v":"2025-01-01"},{"$f":"EOMONTH(Y12,0)","v":"2025-01-31"},{"$f":"SUMPRODUCT(($P$12:$P$53>=Y12)*($P$12:$P$53<=Z12))","v":1},{"$f":"IF($E$9=YEAR(P12),IF(WEEKDAY(P12,2)=6,\"\",P12),\"\")","v":"2025-01-01"},"Januar",{"$f":"IF(C12=\"\",\"\",IF(AND(B12=\"ja\",WEEKDAY(C12,2)<$F$7),C12,\"\"))","v":"2025-01-01"},{"$f":"IF(C12=\"\",\"\",IF(AND(B12=\"ja\",WEEKDAY(C12,2)<$F$7),C12,\"\"))","v":"2025-01-01"},{"$f":"D12","v":"Neujahr"},{"$f":"IF(AH12=\"0\",\"\",TEXT(AH12,\"TTTT\"))","v":"Mittwoch"},{"$f":"IF(IFERROR(INDEX($AE$12:$AE$50,MATCH(1,COUNTIF($AH$11:AH11,$AE$12:$AE$50)+($AE$12:$AE$50<>\"\")*1,0)),\"\")=\"\",\"0\",IFERROR(INDEX($AE$12:$AE$50,MATCH(1,COUNTIF($AH$11:AH11,$AE$12:$AE$50)+($AE$12:$AE$50<>\"\")*1,0)),\"\"))","v":"2025-01-01"},{"$f":"IF(AH12=\"0\",\"\",VLOOKUP(AH12,$AE$12:$AF$52,2,FALSE))","v":"Neujahr"},{"$f":"IF(AH12<>\"0\",1,\"0\")","v":1},1,"Januar",{"$f":"SUMPRODUCT(((MONTH($AH$12:$AH$31)=AK12)*($AJ$12:$AJ$31)))","v":1},{"$f":"#REF!","v":{"$error":"#REF!"}},{"$f":"#REF!","v":{"$error":"#REF!"}},{"$f":"BD36","v":0},{"$f":"(AM12-AP12)*-1","v":-1},null,{"$f":"AQ12-AR12","v":-1},78,130,{"$f":"AH12","v":"2025-01-01"},{"$f":"AS12*$AW$9","v":0},{"$f":"IF(AT12=0,0,AT12+AW12)","v":78},null,null,null,null,null,null,null,null,null,null,null,null,null,"Nein","Rosenmontag","","","Rosenmontag","2025-02-01","2025-02-28","Februar",{"$f":"SUMPRODUCT(($BN$10:$BN$51>=BQ12)*($BN$10:$BN$51<=BR12))","v":0},{"$f":"IFERROR(INDEX($BN$10:$BN$50,MATCH(1,COUNTIF($BU$10:BU11,$BN$10:$BN$50)+($BN$10:$BN$50<>\"\")*1,0)),\"\")","v":"2025-04-18"},{"$f":"IF(BU12=\"\",\"\",VLOOKUP(BU12,BN11:BP51,3,FALSE))","v":"Karfreitag"},null,{"$f":"IFERROR(INDEX($F$12:$F$52,MATCH(1,COUNTIF($BX$10:BX11,$F$12:$F$52)+($F$12:$F$52<>\"\")*1,0)),\"\")","v":"2025-04-18"},{"$f":"BX12","v":"2025-04-18"},{"$f":"IFERROR(IF($BU$4=7,IFERROR(WEEKDAY(BY12)>=1,\"\"),IF($BU$4=6,IFERROR(WEEKDAY(BY12)>1,\"\"),IF($BU$4=5,IFERROR(WEEKDAY(BY12,2)<6,\"\")))),\"\")","v":""},{"$f":"IF(BZ12=TRUE,BX12,\"\")","v":""},{"$f":"BQ12","v":"2025-02-01"},"2025-02-28","Februar",0,{"$f":"#REF!","v":{"$error":"#REF!"}},null,null,"2025-03-03","Rosenmontag"]
["Nein","Nein",{"$f":"IF(E13=\"\",\"\",IF(AND(B13=\"ja\",WEEKDAY(E13,2)<$F$7),E13,\"\"))","v":""},"Hl. 3 Könige ",{"$f":"DATEVALUE(\"06.01.\"&E9)","v":"2025-01-06"},{"$f":"IF(C13=\"\",\"\",IF(AND(B13=\"ja\",WEEKDAY(C13,2)<$F$7),C13,\"\"))","v":""},{"$f":"F13","v":""},null,"2025-11-19","2025-11-19",{"$f":"IFERROR(IF(G13=\"\",\"\",IF(AND(B13=\"ja\",WEEKDAY(C13,2)=6),C13,\"\")),\"\")","v":""},{"$f":"DATEVALUE(\"06.01.\"&L9)","v":"2024-01-06"},{"$f":"L13","v":"2024-01-06"},null,null,"1909-03-15",null,"","",null,"",{"$f":"IF(U13=\"\",\"\",EOMONTH(U13,0))","v":""},{"$f":"IF(U13=\"\",\"\",SUMPRODUCT(($P$12:$P$53>=U13)*($P$12:$P$53<=V13)))","v":""},"Februar",{"$f":"Z12+1","v":"2025-02-01"},"2025-02-28",0,{"$f":"IF($E$9=YEAR(P13),IF(WEEKDAY(P13,2)=6,\"\",P13),\"\")","v":""},"Februar",null,{"$f":"IF(C13=\"\",\"\",IF(AND(B13=\"ja\",WEEKDAY(C13,2)<$F$7),C13,\"\"))","v":""},"Hl. 3 Könige ","Freitag",{"$f":"IF(IFERROR(INDEX($AE$12:$AE$50,MATCH(1,COUNTIF($AH$11:AH12,$AE$12:$AE$50)+($AE$12:$AE$50<>\"\")*1,0)),\"\")=\"\",\"0\",IFERROR(INDEX($AE$12:$AE$50,MATCH(1,COUNTIF($AH$11:AH12,$AE$12:$AE$50)+($AE$12:$AE$50<>\"\")*1,0)),\"\"))","v":"2025-04-18"},"Karfreitag",1,2,"Februar",{"$f":"SUMPRODUCT(((MONTH($AH$12:$AH$31)=AK13)*($AJ$12:$AJ$31)))","v":0},{"$f":"#REF!","v":{"$error":"#REF!"}},{"$f":"#REF!","v":{"$error":"#REF!"}},{"$f":"BD37","v":0},{"$f":"(AM13-AP13)*-1","v":0},null,{"$f":"AQ13-AR13","v":0},72,120,{"$f":"AH13","v":"2025-04-18"},0,{"$f":"IF(AT13=0,0,AT13+AW13)","v":72},null,null,null,null,null,null,null,null,null,null,null,null,null,"Nein","Sommerzeit 1h vor","","","Sommerzeit 1h vor","2025-03-01","2025-03-31","März",0,{"$f":"IFERROR(INDEX($BN$10:$BN$50,MATCH(1,COUNTIF($BU$10:BU12,$BN$10:$BN$50)+($BN$10:$BN$50<>\"\")*1,0)),\"\")","v":"2025-04-21"},"Ostermontag",null,{"$f":"IFERROR(INDEX($F$12:$F$52,MATCH(1,COUNTIF($BX$10:BX12,$F$12:$F$52)+($F$12:$F$52<>\"\")*1,0)),\"\")","v":"2025-04-21"},"2025-04-21","","","2025-03-01","2025-03-31","März",0,5,null,null,"2025-03-30","Sommerzeit 1h vor"]
["Nein","Nein",{"$f":"IF(E14=\"\",\"\",IF(B14=\"ja\",E14,\"\"))","v":""},"Rosenmontag",{"$f":"IF(E19,E19-48,)","v":"2025-03-03"},"","",null,"2025-11-20","","",{"$f":"G12","v":"2025-01-01"},"2025-01-01",null,null,"1909-03-15",null,"","",null,"","","","März","2025-03-01","2025-03-31",0,"","März",null,"","Rosenmontag","Montag",{"$f":"IF(IFERROR(INDEX($AE$12:$AE$50,MATCH(1,COUNTIF($AH$11:AH13,$AE$12:$AE$50)+($AE$12:$AE$50<>\"\")*1,0)),\"\")=\"\",\"0\",IFERROR(INDEX($AE$12:$AE$50,MATCH(1,COUNTIF($AH$11:AH13,$AE$12:$AE$50)+($AE$12:$AE$50<>\"\")*1,0)),\"\"))","v":"2025-04-21"},"Ostermontag",1,3,"März",0,0,0,{"$f":"BD38","v":0},0,null,{"$f":"AQ14-AR14","v":0},78,135,"2025-04-21",0,78,null,null,null,null,null,null,null,null,null,null,null,null,null,"Nein","Gründonnerstag","","","Gründonnerstag","2025-04-01","2025-04-30","April",2,{"$f":"IFERROR(INDEX($BN$10:$BN$50,MATCH(1,COUNTIF($BU$10:BU13,$BN$10:$BN$50)+($BN$10:$BN$50<>\"\")*1,0)),\"\")","v":"2025-05-01"},"Tag der Arbeit",null,{"$f":"IFERROR(INDEX($F$12:$F$52,MATCH(1,COUNTIF($BX$10:BX13,$F$12:$F$52)+($F$12:$F$52<>\"\")*1,0)),\"\")","v":"2025-05-01"},"2025-05-01","","","2025-04-01","2025-04-30","April",0,4,null,null,"2025-04-17","Gründonnerstag"]
["Nein","Nein",{"$f":"IF(E15=\"\",\"\",IF(AND(B15=\"ja\",WEEKDAY(E15,1)<$F$7),E15,\"\"))","v":""},"Sommerzeit 1h vor",{"$f":"DATE(E9,3,31)-(WEEKDAY(DATE(E9,3,31))-1)","v":"2025-03-30"},"","",null,"2025-11-21","","",{"$f":"G13","v":""},"",null,null,"1909-03-15",null,"","",null,"","","","April","2025-04-01","2025-04-30",2,"","April",null,"","Sommerzeit 1h vor","Donnerstag",{"$f":"IF(IFERROR(INDEX($AE$12:$AE$50,MATCH(1,COUNTIF($AH$11:AH14,$AE$12:$AE$50)+($AE$12:$AE$50<>\"\")*1,0)),\"\")=\"\",\"0\",IFERROR(INDEX($AE$12:$AE$50,MATCH(1,COUNTIF($AH$11:AH14,$AE$12:$AE$50)+($AE$12:$AE$50<>\"\")*1,0)),\"\"))","v":"2025-05-01"},"Tag der Arbeit",1,4,"April",2,1,0,{"$f":"BD39","v":0},-2,null,{"$f":"AQ15-AR15","v":-2},78,130,"2025-05-01",0,78,null,null,null,null,null,null,null,null,null,null,null,null,null,"Ja","Karfreitag","2025-04-18","2025-04-18","Karfreitag","2025-05-01","2025-05-31","Mai",2,{"$f":"IFERROR(INDEX($BN$10:$BN$50,MATCH(1,COUNTIF($BU$10:BU14,$BN$10:$BN$50)+($BN$10:$BN$50<>\"\")*1,0)),\"\")","v":"2025-05-29"},"Himmelfahrt",null,{"$f":"IFERROR(INDEX($F$12:$F$52,MATCH(1,COUNTIF($BX$10:BX14,$F$12:$F$52)+($F$12:$F$52<>\"\")*1,0)),\"\")","v":"2025-05-29"},"2025-05-29","","","2025-05-01","2025-05-31","Mai",0,4,null,null,"2025-04-18","Karfreitag"]
["Nein","Nein",{"$f":"IF(E16=\"\",\"\",IF(B16=\"ja\",E16,\"\"))","v":""},"Gründonnerstag",{"$f":"IF(D9,E17-1,)","v":"2025-04-17"},"","",null,"2025-11-22","","","","",null,null,"1909-03-15",null,"","",null,"","","","Mai","2025-05-01","2025-05-31",2,"","Mai",null,"","Gründonnerstag","Donnerstag",{"$f":"IF(IFERROR(INDEX($AE$12:$AE$50,MATCH(1,COUNTIF($AH$11:AH15,$AE$12:$AE$50)+($AE$12:$AE$50<>\"\")*1,0)),\"\")=\"\",\"0\",IFERROR(INDEX($AE$12:$AE$50,MATCH(1,COUNTIF($AH$11:AH15,$AE$12:$AE$50)+($AE$12:$AE$50<>\"\")*1,0)),\"\"))","v":"2025-05-29"},"Himmelfahrt",1,5,"Mai",2,2,0,{"$f":"BD40","v":0},-2,null,{"$f":"AQ16-AR16","v":-2},78,130,"2025-05-29",0,78,null,null,null,null,null,null,null,null,null,null,null,null,null,"Nein","Karsamstag","","","Karsamstag","2025-06-01","2025-06-30","Juni",1,{"$f":"IFERROR(INDEX($BN$10:$BN$50,MATCH(1,COUNTIF($BU$10:BU15,$BN$10:$BN$50)+($BN$10:$BN$50<>\"\")*1,0)),\"\")","v":"2025-06-09"},"Pfingstmontag",null,{"$f":"IFERROR(INDEX($F$12:$F$52,MATCH(1,COUNTIF($BX$10:BX15,$F$12:$F$52)+($F$12:$F$52<>\"\")*1,0)),\"\")","v":"2025-06-09"},"2025-06-09","","","2025-06-01","2025-06-30","Juni",0,5,null,null,"2025-04-19","Karsamstag"]
["Ja","Ja",{"$f":"IF(E17=\"\",\"\",IF(AND(B17=\"ja\",WEEKDAY(E17,2)<$F$7),E17,\"\"))","v":"2025-04-18"},"Karfreitag",{"$f":"E19-2","v":"2025-04-18"},"2025-04-18","2025-04-18",null,"2025-11-23","","","","",null,null,"2025-04-18",null,"","","SonderFeiertag","2025-04-18","2025-04-30",2,"Juni","2025-06-01","2025-06-30",1,"2025-04-18","Juni",null,"2025-04-18","Karfreitag","Montag",{"$f":"IF(IFERROR(INDEX($AE$12:$AE$50,MATCH(1,COUNTIF($AH$11:AH16,$AE$12:$AE$50)+($AE$12:$AE$50<>\"\")*1,0)),\"\")=\"\",\"0\",IFERROR(INDEX($AE$12:$AE$50,MATCH(1,COUNTIF($AH$11:AH16,$AE$12:$AE$50)+($AE$12:$AE$50<>\"\")*1,0)),\"\"))","v":"2025-06-09"},"Pfingstmontag",1,6,"Juni",1,1,0,0,-1,null,-1,78,130,"2025-06-09",0,78,null,null,null,null,null,null,null,null,null,null,null,null,null,"Nein","Ostersonntag ","","","Ostersonntag ","2025-07-01","2025-07-31","Juli",0,{"$f":"IFERROR(INDEX($BN$10:$BN$50,MATCH(1,COUNTIF($BU$10:BU16,$BN$10:$BN$50)+($BN$10:$BN$50<>\"\")*1,0)),\"\")","v":"2025-10-03"},"Tag d.dt.Einheit",null,{"$f":"IFERROR(INDEX($F$12:$F$52,MATCH(1,COUNTIF($BX$10:BX16,$F$12:$F$52)+($F$12:$F$52<>\"\")*1,0)),\"\")","v":"2025-10-03"},"2025-10-03","","","2025-07-01","2025-07-31","Juli",0,4,null,null,"2025-04-20","Ostersonntag "]
["Nein","Nein",{"$f":"IF(E18=\"\",\"\",IF(AND(B18=\"ja\",WEEKDAY(E18,2)<$F$7),E18,\"\"))","v":""},"Karsamstag",{"$f":"E19-1","v":"2025-04-19"},"","",null,null,null,"","","",null,null,{"$f":"IF(C18=\"\",1900,IF(AND(B18=\"ja\",WEEKDAY(C18,2)<7),C18,1900))","v":"1909-03-15"},null,null,null,null,"","","","Juli","2025-07-01","2025-07-31",0,"","Juli",null,"","Karsamstag","Freitag",{"$f":"IF(IFERROR(INDEX($AE$12:$AE$50,MATCH(1,COUNTIF($AH$11:AH17,$AE$12:$AE$50)+($AE$12:$AE$50<>\"\")*1,0)),\"\")=\"\",\"0\",IFERROR(INDEX($AE$12:$AE$50,MATCH(1,COUNTIF($AH$11:AH17,$AE$12:$AE$50)+($AE$12:$AE$50<>\"\")*1,0)),\"\"))","v":"2025-10-03"},"Tag d.dt.Einheit",1,7,"Juli",0,0,0,0,0,null,0,84,130,"2025-10-03",0,84,null,null,null,null,null,null,null,null,null,null,null,null,null,"Ja","Ostermontag","2025-04-21","2025-04-21","Ostermontag","2025-08-01","2025-08-31","August",0,{"$f":"IFERROR(INDEX($BN$10:$BN$50,MATCH(1,COUNTIF($BU$10:BU17,$BN$10:$BN$50)+($BN$10:$BN$50<>\"\")*1,0)),\"\")","v":"2025-10-31"},"Reformationst.",null,{"$f":"IFERROR(INDEX($F$12:$F$52,MATCH(1,COUNTIF($BX$10:BX17,$F$12:$F$52)+($F$12:$F$52<>\"\")*1,0)),\"\")","v":"2025-10-31"},"2025-10-31","","","2025-08-01","2025-08-31","August",0,5,null,null,"2025-04-21","Ostermontag"]
["Nein","Nein",{"$f":"IF(E19=\"\",\"\",IF(AND(B19=\"ja\",WEEKDAY(E19,2)<$F$7),E19,\"\"))","v":""},"Ostersonntag ",{"$f":"DATE(E9,3,28)+MOD(24-MOD(E9,19)*10.63,29)-MOD(TRUNC(E9*5/4)+MOD(24-MOD(E9,19)*10.63,29)+1,7)","v":"2025-04-20"},"","",null,"Muttertag suchen",null,"","2025-04-18","2025-04-18",null,null,{"$f":"IF(C19=\"\",1900,IF(AND(B19=\"ja\",WEEKDAY(C19,2)<7),C19,1900))","v":"1909-03-15"},null,{"$f":"IF(OR($R$8=D17,$R$7=D17,C17=\"\"),\"\",IF(WEEKDAY(C17,1)=1,C17,\"\"))","v":""},{"$f":"IF(OR($R$8=D17,$R$7=D17,C17=\"\"),\"\",IF(WEEKDAY(C17,1)=1,C17,\"\"))","v":""},null,"","","","August","2025-08-01","2025-08-31",0,"","August",null,"","Ostersonntag ","Freitag",{"$f":"IF(IFERROR(INDEX($AE$12:$AE$50,MATCH(1,COUNTIF($AH$11:AH18,$AE$12:$AE$50)+($AE$12:$AE$50<>\"\")*1,0)),\"\")=\"\",\"0\",IFERROR(INDEX($AE$12:$AE$50,MATCH(1,COUNTIF($AH$11:AH18,$AE$12:$AE$50)+($AE$12:$AE$50<>\"\")*1,0)),\"\"))","v":"2025-10-31"},"Reformationst.",1,8,"August",0,0,0,0,0,null,0,72,135,"2025-10-31",0,72,null,null,null,null,null,null,null,null,null,null,null,null,null,"Ja","Tag der Arbeit","2025-05-01","2025-05-01","Tag der Arbeit","2025-09-01","2025-09-30","September",0,{"$f":"IFERROR(INDEX($BN$10:$BN$50,MATCH(1,COUNTIF($BU$10:BU18,$BN$10:$BN$50)+($BN$10:$BN$50<>\"\")*1,0)),\"\")","v":"2025-12-25"},"1.Weihn.Tag",null,{"$f":"IFERROR(INDEX($F$12:$F$52,MATCH(1,COUNTIF($BX$10:BX18,$F$12:$F$52)+($F$12:$F$52<>\"\")*1,0)),\"\")","v":"2025-12-25"},"2025-12-25","","","2025-09-01","2025-09-30","September",0,4,null,null,"2025-05-01","Tag der Arbeit"]
["Ja","Ja","2025-04-21","Ostermontag",{"$f":"E19+1","v":"2025-04-21"},"2025-04-21","2025-04-21",null,{"$f":"DATEVALUE(\"01.05.\"&E9)","v":"2025-05-01"},{"$f":"IF(AND(WEEKDAY(I20)=1,DAY(I20)>7),I20,\"\")","v":""},"","","",null,null,"2025-04-21",null,{"$f":"IF(OR($R$8=D19,$R$7=D19,C19=\"\"),\"\",IF(WEEKDAY(C19,1)=1,C19,\"\"))","v":""},{"$f":"IF(OR($R$8=D19,$R$7=D19,C19=\"\"),\"\",IF(WEEKDAY(C19,1)=1,C19,\"\"))","v":""},null,"2025-04-21","2025-04-30",1,"September","2025-09-01","2025-09-30",0,"2025-04-21","September",null,"2025-04-21","Ostermontag","Donnerstag",{"$f":"IF(IFERROR(INDEX($AE$12:$AE$50,MATCH(1,COUNTIF($AH$11:AH19,$AE$12:$AE$50)+($AE$12:$AE$50<>\"\")*1,0)),\"\")=\"\",\"0\",IFERROR(INDEX($AE$12:$AE$50,MATCH(1,COUNTIF($AH$11:AH19,$AE$12:$AE$50)+($AE$12:$AE$50<>\"\")*1,0)),\"\"))","v":"2025-12-25"},"1.Weihn.Tag",1,9,"September",0,0,0,0,0,null,0,84,130,"2025-12-25",0,84,null,null,null,null,null,null,null,null,null,null,null,null,null,"Ja","Himmelfahrt","2025-05-29","2025-05-29","Himmelfahrt","2025-10-01","2025-10-31","Oktober",2,{"$f":"IFERROR(INDEX($BN$10:$BN$50,MATCH(1,COUNTIF($BU$10:BU19,$BN$10:$BN$50)+($BN$10:$BN$50<>\"\")*1,0)),\"\")","v":"2025-12-26"},"2.Weihn.Tag",null,{"$f":"IFERROR(INDEX($F$12:$F$52,MATCH(1,COUNTIF($BX$10:BX19,$F$12:$F$52)+($F$12:$F$52<>\"\")*1,0)),\"\")","v":"2025-12-26"},"2025-12-26","","","2025-10-01","2025-10-31","Oktober",0,4,null,null,"2025-05-29","Himmelfahrt"]
["Ja","Ja","2025-05-01","Tag der Arbeit",{"$f":"DATEVALUE(\"01.05.\"&E9)","v":"2025-05-01"},"2025-05-01","2025-05-01",null,{"$f":"I20+1","v":"2025-05-02"},"","","","",null,null,"2025-05-01",null,"","",null,"2025-05-01","2025-05-31",2,"Oktober","2025-10-01","2025-10-31",2,"2025-05-01","Oktober",null,"2025-05-01","Tag der Arbeit","Freitag",{"$f":"IF(IFERROR(INDEX($AE$12:$AE$50,MATCH(1,COUNTIF($AH$11:AH20,$AE$12:$AE$50)+($AE$12:$AE$50<>\"\")*1,0)),\"\")=\"\",\"0\",IFERROR(INDEX($AE$12:$AE$50,MATCH(1,COUNTIF($AH$11:AH20,$AE$12:$AE$50)+($AE$12:$AE$50<>\"\")*1,0)),\"\"))","v":"2025-12-26"},{"$f":"IF(AH21=\"0\",\"\",VLOOKUP(AH21,$AE$12:$AF$52,2,FALSE))","v":"2.Weihn.Tag"},{"$f":"IF(AH21<>\"0\",1,\"0\")","v":1},10,"Oktober",2,0,0,0,-2,null,-2,78,130,"2025-12-26",{"$f":"AS21*$AW$9","v":0},78,null,null,null,null,null,null,null,null,null,null,null,null,null,"Nein","Pfingstsonntag ","","","Pfingstsonntag ","2025-11-01","2025-11-30","November",0,{"$f":"IFERROR(INDEX($BN$10:$BN$50,MATCH(1,COUNTIF($BU$10:BU20,$BN$10:$BN$50)+($BN$10:$BN$50<>\"\")*1,0)),\"\")","v":""},"",null,{"$f":"IFERROR(INDEX($F$12:$F$52,MATCH(1,COUNTIF($BX$10:BX20,$F$12:$F$52)+($F$12:$F$52<>\"\")*1,0)),\"\")","v":""},"","","","2025-11-01","2025-11-30","November",0,5,null,null,"2025-06-08","Pfingstsonntag "]
["Ja","Ja","2025-05-29","Himmelfahrt",{"$f":"E19+39","v":"2025-05-29"},"2025-05-29","2025-05-29",null,"2025-05-03","","","2025-04-21","2025-04-21",null,null,"2025-05-29",null,"","",null,"2025-05-29","2025-05-31",1,"November","2025-11-01","2025-11-30",0,"2025-05-29","November",null,"2025-05-29","Himmelfahrt","",{"$f":"IF(IFERROR(INDEX($AE$12:$AE$50,MATCH(1,COUNTIF($AH$11:AH21,$AE$12:$AE$50)+($AE$12:$AE$50<>\"\")*1,0)),\"\")=\"\",\"0\",IFERROR(INDEX($AE$12:$AE$50,MATCH(1,COUNTIF($AH$11:AH21,$AE$12:$AE$50)+($AE$12:$AE$50<>\"\")*1,0)),\"\"))","v":"0"},{"$f":"IF(AH22=\"0\",\"\",VLOOKUP(AH22,$AE$12:$AF$52,2,FALSE))","v":""},{"$f":"IF(AH22<>\"0\",1,\"0\")","v":"0"},11,"November",0,0,0,0,0,null,0,72,130,"0",{"$f":"AS22*$AW$9","v":0},72,null,null,null,null,null,null,null,null,null,null,null,null,null,"Ja","Pfingstmontag","2025-06-09","2025-06-09","Pfingstmontag","2025-12-01","2025-12-31","Dezember",2,{"$f":"IFERROR(INDEX($BN$10:$BN$50,MATCH(1,COUNTIF($BU$10:BU21,$BN$10:$BN$50)+($BN$10:$BN$50<>\"\")*1,0)),\"\")","v":""},"",null,{"$f":"IFERROR(INDEX($F$12:$F$52,MATCH(1,COUNTIF($BX$10:BX21,$F$12:$F$52)+($F$12:$F$52<>\"\")*1,0)),\"\")","v":""},"","","","2025-12-01","2025-12-31","Dezember",0,4,null,null,"2025-06-09","Pfingstmontag"]
["Nein","Nein","","Pfingstsonntag ",{"$f":"E19+49","v":"2025-06-08"},"","",null,"2025-05-04","","","2025-05-01","2025-05-01",null,null,"1909-03-15",null,"","",null,"","","","Dezember","2025-12-01","2025-12-31",2,"","Dezember",null,"","Pfingstsonntag ","",{"$f":"IF(IFERROR(INDEX($AE$12:$AE$50,MATCH(1,COUNTIF($AH$11:AH22,$AE$12:$AE$50)+($AE$12:$AE$50<>\"\")*1,0)),\"\")=\"\",\"0\",IFERROR(INDEX($AE$12:$AE$50,MATCH(1,COUNTIF($AH$11:AH22,$AE$12:$AE$50)+($AE$12:$AE$50<>\"\")*1,0)),\"\"))","v":"0"},"","0",12,"Dezember",2,1,0,0,-2,null,-2,84,130,"0",{"$f":"AS23*$AW$9","v":0},84,null,null,null,null,null,null,null,null,null,null,null,null,null,"Nein","Fronleichnam ","","","Fronleichnam ",null,null,null,null,null,null,null,null,null,null,null,null,null,null,null,{"$f":"SUM(CF11:CF22)","v":{"$error":"#REF!"}},"Freie So.",null,"2025-06-19","Fronleichnam "]
["Ja","Ja","2025-06-09","Pfingstmontag",{"$f":"E23+1","v":"2025-06-09"},"2025-06-09","2025-06-09",null,"2025-05-05","","","2025-05-29","2025-05-29",null,null,"2025-06-09",null,"","",null,"2025-06-09","2025-06-30",1,null,null,null,{"$f":"SUM(AA12:AA23)","v":10},"2025-06-09",null,null,"2025-06-09","Pfingstmontag","",{"$f":"IF(IFERROR(INDEX($AE$12:$AE$50,MATCH(1,COUNTIF($AH$11:AH23,$AE$12:$AE$50)+($AE$12:$AE$50<>\"\")*1,0)),\"\")=\"\",\"0\",IFERROR(INDEX($AE$12:$AE$50,MATCH(1,COUNTIF($AH$11:AH23,$AE$12:$AE$50)+($AE$12:$AE$50<>\"\")*1,0)),\"\"))","v":"0"},"","0",null,null,{"$f":"SUM(AM12:AM23)","v":10},{"$error":"#REF!"},{"$error":"#REF!"},0,-10,0,-10,936,1560,null,0,936,null,null,null,null,null,null,null,null,null,null,null,null,null,"Nein","Augsburger Friedensfest ","","","Augsburger Friedensfest ",null,null,null,null,null,null,null,null,null,null,null,null,null,null,null,{"$f":"IF(CF23>=BY6,\"OK >15 Tage\",\" Error\")","v":{"$error":"#REF!"}},null,null,"2025-08-08","Augsburger Friedensfest "]
["Nein","Nein","","Fronleichnam ",{"$f":"E19+60","v":"2025-06-19"},"","",null,"2025-05-06","","","","",null,null,"1909-03-15",null,"","",null,"","","",null,null,null,null,"",null,null,"","Fronleichnam ","",{"$f":"IF(IFERROR(INDEX($AE$12:$AE$50,MATCH(1,COUNTIF($AH$11:AH24,$AE$12:$AE$50)+($AE$12:$AE$50<>\"\")*1,0)),\"\")=\"\",\"0\",IFERROR(INDEX($AE$12:$AE$50,MATCH(1,COUNTIF($AH$11:AH24,$AE$12:$AE$50)+($AE$12:$AE$50<>\"\")*1,0)),\"\"))","v":"0"},"","0",null,null,null,null,null,null,null,"Arbeitstage ",null,null,null,null,null,null,null,null,null,null,null,null,null,null,null,null,null,null,null,"Nein","Maria Himmelf.","","","Maria Himmelf.",null,null,null,null,null,null,null,null,null,null,null,null,null,null,null,null,null,null,"2025-08-15","Maria Himmelf."]
["Nein","Nein","","Augsburger Friedensfest ",{"$f":"DATE(D$9,8,8)","v":"2025-08-08"},"","",null,"2025-05-07","","","2025-06-09","2025-06-09",null,null,"1909-03-15",null,"","",null,"","","",null,null,null,null,"",null,null,"","Augsburger Friedensfest ","",{"$f":"IF(IFERROR(INDEX($AE$12:$AE$50,MATCH(1,COUNTIF($AH$11:AH25,$AE$12:$AE$50)+($AE$12:$AE$50<>\"\")*1,0)),\"\")=\"\",\"0\",IFERROR(INDEX($AE$12:$AE$50,MATCH(1,COUNTIF($AH$11:AH25,$AE$12:$AE$50)+($AE$12:$AE$50<>\"\")*1,0)),\"\"))","v":"0"},"","0","Arbeitstage ","Sonntag",null,null,null,null,null,{"$f":"AR55","v":"0"},"Sonntag","Arbeitstage ",null,null,null,null,null,null,null,null,null,null,null,null,null,null,null,null,null,"Ja","Tag d.dt.Einheit","2025-10-03","2025-10-03","Tag d.dt.Einheit",null,null,null,null,null,null,null,null,null,null,null,null,null,null,null,null,null,null,"2025-10-03","Tag d.dt.Einheit"]
["Nein","Nein","","Maria Himmelf.",{"$f":"DATEVALUE(\"15.08.\"&E9)","v":"2025-08-15"},"","",null,"2025-05-08","","","","",null,null,"1909-03-15",null,"","",null,"","","",null,null,null,null,"",null,null,"","Maria Himmelf.","",{"$f":"IF(IFERROR(INDEX($AE$12:$AE$50,MATCH(1,COUNTIF($AH$11:AH26,$AE$12:$AE$50)+($AE$12:$AE$50<>\"\")*1,0)),\"\")=\"\",\"0\",IFERROR(INDEX($AE$12:$AE$50,MATCH(1,COUNTIF($AH$11:AH26,$AE$12:$AE$50)+($AE$12:$AE$50<>\"\")*1,0)),\"\"))","v":"0"},"","0",null,null,null,null,null,null,null,{"$f":"AM24","v":10},"Feiertage",null,null,null,null,null,null,null,null,null,null,null,null,null,null,null,null,null,null,"Nein","Winterzeit 1h zurück","","","Winterzeit 1h zurück",null,null,null,null,null,null,null,null,null,null,{"$f":"IF(BX27=\"\",\"\",VLOOKUP(BX27,$BX$11:$BZ$51,3,FALSE))","v":""},null,null,null,null,null,null,null,"2025-10-26","Winterzeit 1h zurück"]
["Ja","Ja","2025-10-03","Tag d.dt.Einheit",{"$f":"DATEVALUE(\"03.10.\"&E9)","v":"2025-10-03"},"2025-10-03","2025-10-03",null,"2025-05-09","","","","",null,null,"2025-10-03",null,"","",null,"2025-10-03","2025-10-31",2,null,null,null,null,"2025-10-03",null,null,"2025-10-03","Tag d.dt.Einheit","",{"$f":"IF(IFERROR(INDEX($AE$12:$AE$50,MATCH(1,COUNTIF($AH$11:AH27,$AE$12:$AE$50)+($AE$12:$AE$50<>\"\")*1,0)),\"\")=\"\",\"0\",IFERROR(INDEX($AE$12:$AE$50,MATCH(1,COUNTIF($AH$11:AH27,$AE$12:$AE$50)+($AE$12:$AE$50<>\"\")*1,0)),\"\"))","v":"0"},"","0",null,null,null,null,null,null,null,{"$f":"(AR27-AR26)*-1","v":-10},null,null,null,null,null,null,null,null,null,null,null,null,null,null,null,null,null,null,null,"Ja","Reformationst.","2025-10-31","2025-10-31","Reformationst.",null,null,null,null,null,null,null,null,null,null,"",null,null,null,null,null,null,null,"2025-10-31","Reformationst."]
["Nein","Nein",{"$f":"IF(E29=\"\",\"\",IF(AND(B29=\"ja\",WEEKDAY(E29,1)<$F$7),E29,\"\"))","v":""},"Winterzeit 1h zurück",{"$f":"DATE(E9,10,31)-(WEEKDAY(DATE(E9,10,31))-1)","v":"2025-10-26"},null,null,null,"2025-05-10","","","","",null,null,"1909-03-15",null,"","",null,"","","",null,null,null,null,"",null,null,"","Winterzeit 1h zurück","",{"$f":"IF(IFERROR(INDEX($AE$12:$AE$50,MATCH(1,COUNTIF($AH$11:AH28,$AE$12:$AE$50)+($AE$12:$AE$50<>\"\")*1,0)),\"\")=\"\",\"0\",IFERROR(INDEX($AE$12:$AE$50,MATCH(1,COUNTIF($AH$11:AH28,$AE$12:$AE$50)+($AE$12:$AE$50<>\"\")*1,0)),\"\"))","v":"0"},"","0",null,null,null,null,null,null,null,null,null,null,null,null,null,null,null,null,null,null,null,null,null,null,null,null,null,null,null,"Nein","Frei","","","Frei",null,null,null,null,null,null,null,null,null,null,"",null,null,null,null,null,null,null,"1961-01-22","Frei"]
["Ja","Ja",{"$f":"IF(E30=\"\",\"\",IF(AND(B30=\"ja\",WEEKDAY(E30,2)<$F$7),E30,\"\"))","v":"2025-10-31"},"Reformationst.",{"$f":"DATEVALUE(\"31.10.\"&E9)","v":"2025-10-31"},{"$f":"IF(C30=\"\",\"\",IF(AND(B30=\"ja\",WEEKDAY(C30,2)<$F$7),C30,\"\"))","v":"2025-10-31"},{"$f":"F30","v":"2025-10-31"},"2017-10-31","2025-05-11","2025-05-11","","2025-10-03","2025-10-03",null,null,"2025-10-31",null,"","",null,"2025-10-31","2025-10-31",1,null,null,null,null,"2025-10-31",null,null,"2025-10-31","Reformationst.","",{"$f":"IF(IFERROR(INDEX($AE$12:$AE$50,MATCH(1,COUNTIF($AH$11:AH29,$AE$12:$AE$50)+($AE$12:$AE$50<>\"\")*1,0)),\"\")=\"\",\"0\",IFERROR(INDEX($AE$12:$AE$50,MATCH(1,COUNTIF($AH$11:AH29,$AE$12:$AE$50)+($AE$12:$AE$50<>\"\")*1,0)),\"\"))","v":"0"},"","0",null,null,null,null,null,null,null,null,null,null,null,null,null,null,null,null,null,null,null,null,null,null,null,null,null,"Alle 9 Jahre ",null,"Nein","Frei","","","Frei",null,null,null,null,null,null,null,null,null,null,"",null,null,null,null,null,null,null,"1904-01-01","Frei"]
["Nein","Nein",{"$f":"IF(E31=\"\",\"\",IF(B31=\"ja\",IF(E31,DATEVALUE(TEXT(E31,\"TT.MM\")),\"\"),\"\"))","v":""},"Frei","1961-01-22",null,null,null,"2025-05-12","","","1904-01-01","1904-01-01",null,null,"1909-03-15",null,"","",null,"","","",null,null,null,null,"",null,null,"","Frei","",{"$f":"IF(IFERROR(INDEX($AE$12:$AE$50,MATCH(1,COUNTIF($AH$11:AH30,$AE$12:$AE$50)+($AE$12:$AE$50<>\"\")*1,0)),\"\")=\"\",\"0\",IFERROR(INDEX($AE$12:$AE$50,MATCH(1,COUNTIF($AH$11:AH30,$AE$12:$AE$50)+($AE$12:$AE$50<>\"\")*1,0)),\"\"))","v":"0"},"","0","Januar",null,"Februar",null,"März",null,"April",null,"Mai",null,"Juni",null,"Juli",null,"August",null,"September",null,"Oktober",null,"November",null,"Dezember",null,null,"Samstag Feiertag",null,"Nein","Frei","","","Frei",null,null,null,null,null,null,null,null,null,null,"",null,null,null,null,null,null,null,"1904-01-01","Frei"]
["Nein","Nein",{"$f":"IF(E32=\"\",\"\",IF(B32=\"ja\",IF(E32,DATEVALUE(TEXT(E32,\"TT.MM\")),\"\"),\"\"))","v":""},"Frei",null,null,null,null,"2025-05-13","","","2025-10-31","2025-10-31",null,null,"1909-03-15",null,"","",null,"","","",null,null,null,null,"",null,null,"","Frei",null,null,null,null,null,null,null,null,null,null,null,null,null,null,null,null,null,null,null,null,null,null,null,null,null,null,null,null,null,{"$f":"-366-365-365-365-365-365-1096-365-366-365-365-365-366-365-365-365","v":-6574},{"$f":"BJ32*-1","v":6574},"Nein","Frei","","","Frei",null,null,null,null,null,null,null,null,null,null,"",null,null,null,null,null,null,null,"1904-01-01","Frei"]
["Nein","Nein",{"$f":"IF(E33=\"\",\"\",IF(B33=\"ja\",IF(E33,DATEVALUE(TEXT(E33,\"TT.MM\")),\"\"),\"\"))","v":""},"Frei",null,null,null,null,"2025-05-14","","","1904-01-01","1904-01-01",null,null,"1909-03-15",null,"","",null,"","","",null,null,null,null,"",null,null,"","Frei",null,null,null,null,78,null,72,null,78,null,78,null,78,null,78,null,84,null,72,null,84,null,78,null,72,null,84,null,null,"Ansere Faormel",null,"Nein","Allerheiligen","","","Allerheiligen",null,null,null,null,null,null,null,null,null,null,"",null,null,null,null,null,null,null,"2025-11-01","Allerheiligen"]
["Nein","Nein",{"$f":"IF(E34=\"\",\"\",IF(B34=\"ja\",IF(E34,DATEVALUE(TEXT(E34,\"TT.MM\")),\"\"),\"\"))","v":""},"Frei",null,null,null,null,null,null,"","1904-01-01","1904-01-01",null,null,"1909-03-15",null,"","",null,"","","",null,null,null,null,"",null,null,"","Frei",null,null,null,null,null,null,null,null,null,null,null,null,null,null,null,null,null,null,null,null,null,null,"Übertrag","Sonntag"," Montag"," Dienstag"," Mittwoch"," Donnerstag"," Freitag"," Samstag",null,"Nein","Muttertag ","","","Muttertag ",null,null,null,null,null,null,null,null,null,null,"",null,null,null,null,null,null,null,"2025-05-11","Muttertag "]
["Nein","Nein",{"$f":"IF(E35=\"\",\"\",IF(B35=\"ja\",E35,\"\"))","v":""},"Allerheiligen",{"$f":"DATE(D$9,11,1)","v":"2025-11-01"},{"$f":"IF(C35=\"\",\"\",IF(AND(B35=\"ja\",WEEKDAY(C35,2)<$F$7),C35,\"\"))","v":""},{"$f":"F35","v":""},null,null,null,"","1904-01-01","1904-01-01",null,null,"1909-03-15",null,"","",null,"","","",null,null,null,null,"",null,null,"","Allerheiligen",null,{"$f":"IFERROR(INDEX($AE$12:$AE$50,MATCH(1,COUNTIF($AH11:AH$11,$AE$12:$AE$50)+($AE$12:$AE$50<>\"\")*1,0)),\"\")","v":"2025-01-01"},null,null,null," Montag"," Dienstag"," Mittwoch"," Donnerstag"," Freitag"," Samstag"," Sonntag",null,null,null,null,null,null,null,null,null,"Monate",null,"Anzahl FT SO","Anzahl ","Anzahl ","Anzahl ","Anzahl ","Anzahl ","Anzahl ",null,"Nein","Maria Himmelf.","","","Maria Himmelf.",null,null,null,null,null,null,null,null,null,null,"",null,null,null,null,null,null,null,"2025-08-15","Maria Himmelf."]
["Nein","Nein",{"$f":"IF(E36=\"\",\"\",IF(B36=\"ja\",E36,\"\"))","v":""},"Muttertag ",{"$f":"MAX(J20:J33)","v":"2025-05-11"},null,null,null,null,null,"","1904-01-01","1904-01-01",null,null,"1909-03-15",null,"","",null,"","","",null,null,null,null,"",null,null,"","Muttertag ",null,{"$f":"IFERROR(INDEX($AE$12:$AE$50,MATCH(1,COUNTIF($AH$11:AH12,$AE$12:$AE$50)+($AE$12:$AE$50<>\"\")*1,0)),\"\")","v":"2025-04-18"},null,null,{"$f":"AH12","v":"2025-01-01"},{"$f":"IF(AH12=\"\",\"\",IF(IF(WEEKDAY(AH12)=2,AK36)=0,\"0\",IF(WEEKDAY(AH12)=2,AK36,\"0\")))","v":"0"},{"$f":"IF(AH12=\"\",\"\",IF(IF(WEEKDAY(AH12)=3,AK36)=0,\"0\",IF(WEEKDAY(AH12)=3,AK36,\"0\")))","v":"0"},{"$f":"IF(AH12=\"\",\"\",IF(IF(WEEKDAY(AH12)=4,AK36)=0,\"0\",IF(WEEKDAY(AH12)=4,AK36,\"0\")))","v":"2025-01-01"},{"$f":"IF(AH12=\"\",\"\",IF(IF(WEEKDAY(AH12)=5,AK36)=0,\"0\",IF(WEEKDAY(AH12)=5,AK36,\"0\")))","v":"0"},{"$f":"IF(AH12=\"\",\"\",IF(IF(WEEKDAY(AH12)=6,AK36)=0,\"0\",IF(WEEKDAY(AH12)=6,AK36,\"0\")))","v":"0"},{"$f":"IF(AH12=\"\",\"\",IF(IF(WEEKDAY(AH12)=7,AK36)=0,\"0\",IF(WEEKDAY(AH12)=7,AK36,\"0\")))","v":"0"},{"$f":"IF(AH12=\"\",\"\",IF(IF(WEEKDAY(AH12)=1,AK36)=0,\"0\",IF(WEEKDAY(AH12)=1,AK36,\"0\")))","v":"0"},{"$f":"AL36","v":"0"},"0","2025-01-01","0","0","0","0",{"$f":"IFERROR(VLOOKUP(AR36,$AH$12:$AH$31,1,FALSE),\"\")","v":"0"},{"$f":"AJ12","v":1},1,"Januar",{"$f":"IFERROR(IF(SUMPRODUCT((MONTH($AR$36:$AR$55)=BB36)*($BA$36:$BA$55))>2,0,SUMPRODUCT((MONTH($AR$36:$AR$55)=BB36)*($BA$36:$BA$55))),\"0\")","v":0},{"$f":"IF(SUMPRODUCT((MONTH($AL$36:$AL$52)=BB36)*($BA$36:$BA$52))>2,0,SUMPRODUCT((MONTH($AL$36:$AL$52)=BB36)*($BA$36:$BA$52)))","v":0},{"$f":"IF(SUMPRODUCT((MONTH($AM$36:$AM$52)=BB36)*($BA$36:$BA$52))>2,0,SUMPRODUCT((MONTH($AM$36:$AM$52)=BB36)*($BA$36:$BA$52)))","v":0},{"$f":"IF(SUMPRODUCT((MONTH($AN$36:$AN$52)=BB36)*($BA$36:$BA$52))>2,0,SUMPRODUCT((MONTH($AN$36:$AN$52)=BB36)*($BA$36:$BA$52)))","v":0},{"$f":"IF(SUMPRODUCT((MONTH($AO$36:$AO$52)=BB36)*($BA$36:$BA$52))>2,0,SUMPRODUCT((MONTH($AO$36:$AO$52)=BB36)*($BA$36:$BA$52)))","v":0},{"$f":"IF(SUMPRODUCT((MONTH($AP$36:$AP$52)=BB36)*($BA$36:$BA$52))>2,0,SUMPRODUCT((MONTH($AP$36:$AP$52)=BB36)*($BA$36:$BA$52)))","v":0},{"$f":"IF(SUMPRODUCT((MONTH($AQ$36:$AQ$52)=BB36)*($BA$36:$BA$52))>2,0,SUMPRODUCT((MONTH($AQ$36:$AQ$52)=BB36)*($BA$36:$BA$52)))+BK36","v":0},{"$f":"IF(WEEKDAY(AQ36,2)=6,1,\"0\")","v":"0"},"Nein","Totensonntag ","","","Totensonntag ",null,null,null,null,null,null,null,null,null,null,"",null,null,null,null,null,null,null,"2025-11-23","Totensonntag "]
["Nein","Nein",{"$f":"IF(E37=\"\",\"\",IF(AND(B37=\"ja\",WEEKDAY(E37,2)<$F$7),E37,\"\"))","v":""},"Maria Himmelf.",{"$f":"DATEVALUE(\"15.08.\"&E9)","v":"2025-08-15"},{"$f":"IF(C37=\"\",\"\",IF(AND(B37=\"ja\",WEEKDAY(C37,2)<$F$7),C37,\"\"))","v":""},{"$f":"F37","v":""},null,null,null,"","","",null,null,"1909-03-15",null,"","",null,"","","",null,null,null,null,"",null,null,"","Maria Himmelf.",null,{"$f":"IFERROR(INDEX($AE$12:$AE$50,MATCH(1,COUNTIF($AH$11:AH13,$AE$12:$AE$50)+($AE$12:$AE$50<>\"\")*1,0)),\"\")","v":"2025-04-21"},null,null,"2025-04-18",{"$f":"IF(AH13=\"\",\"\",IF(IF(WEEKDAY(AH13)=2,AK37)=0,\"0\",IF(WEEKDAY(AH13)=2,AK37,\"0\")))","v":"0"},{"$f":"IF(AH13=\"\",\"\",IF(IF(WEEKDAY(AH13)=3,AK37)=0,\"0\",IF(WEEKDAY(AH13)=3,AK37,\"0\")))","v":"0"},{"$f":"IF(AH13=\"\",\"\",IF(IF(WEEKDAY(AH13)=4,AK37)=0,\"0\",IF(WEEKDAY(AH13)=4,AK37,\"0\")))","v":"0"},{"$f":"IF(AH13=\"\",\"\",IF(IF(WEEKDAY(AH13)=5,AK37)=0,\"0\",IF(WEEKDAY(AH13)=5,AK37,\"0\")))","v":"0"},{"$f":"IF(AH13=\"\",\"\",IF(IF(WEEKDAY(AH13)=6,AK37)=0,\"0\",IF(WEEKDAY(AH13)=6,AK37,\"0\")))","v":"2025-04-18"},{"$f":"IF(AH13=\"\",\"\",IF(IF(WEEKDAY(AH13)=7,AK37)=0,\"0\",IF(WEEKDAY(AH13)=7,AK37,\"0\")))","v":"0"},{"$f":"IF(AH13=\"\",\"\",IF(IF(WEEKDAY(AH13)=1,AK37)=0,\"0\",IF(WEEKDAY(AH13)=1,AK37,\"0\")))","v":"0"},"0","0","0","0","2025-04-18","0","0",{"$f":"IFERROR(VLOOKUP(AR37,$AH$12:$AH$31,1,FALSE),\"\")","v":"0"},{"$f":"AJ13","v":1},2,"Februar",{"$f":"IFERROR(IF(SUMPRODUCT((MONTH($AR$36:$AR$55)=BB37)*($BA$36:$BA$55))>2,0,SUMPRODUCT((MONTH($AR$36:$AR$55)=BB37)*($BA$36:$BA$55))),\"0\")","v":0},{"$f":"IF(SUMPRODUCT((MONTH($AL$36:$AL$52)=BB37)*($BA$36:$BA$52))>2,0,SUMPRODUCT((MONTH($AL$36:$AL$52)=BB37)*($BA$36:$BA$52)))","v":0},{"$f":"IF(SUMPRODUCT((MONTH($AM$36:$AM$52)=BB37)*($BA$36:$BA$52))>2,0,SUMPRODUCT((MONTH($AM$36:$AM$52)=BB37)*($BA$36:$BA$52)))","v":0},{"$f":"IF(SUMPRODUCT((MONTH($AN$36:$AN$52)=BB37)*($BA$36:$BA$52))>2,0,SUMPRODUCT((MONTH($AN$36:$AN$52)=BB37)*($BA$36:$BA$52)))","v":0},{"$f":"IF(SUMPRODUCT((MONTH($AO$36:$AO$52)=BB37)*($BA$36:$BA$52))>2,0,SUMPRODUCT((MONTH($AO$36:$AO$52)=BB37)*($BA$36:$BA$52)))","v":0},{"$f":"IF(SUMPRODUCT((MONTH($AP$36:$AP$52)=BB37)*($BA$36:$BA$52))>2,0,SUMPRODUCT((MONTH($AP$36:$AP$52)=BB37)*($BA$36:$BA$52)))","v":0},{"$f":"IF(SUMPRODUCT((MONTH($AQ$36:$AQ$52)=BB37)*($BA$36:$BA$52))>2,0,SUMPRODUCT((MONTH($AQ$36:$AQ$52)=BB37)*($BA$36:$BA$52)))+BK37","v":0},null,"Nein","1. Advent ","","","1. Advent ",null,null,null,null,null,null,null,null,null,null,"",null,null,null,null,null,null,null,"2025-11-30","1. Advent "]
["Nein","Nein",{"$f":"IF(E38=\"\",\"\",IF(AND(B38=\"ja\",WEEKDAY(E38,2)<$F$7),E38,\"\"))","v":""},"Totensonntag ",{"$f":"E44+4","v":"2025-11-23"},null,null,null,null,null,"","1904-01-01","1904-01-01",null,null,"1909-03-15",null,"","",null,"","","",null,null,null,null,"",null,null,"","Totensonntag ",null,{"$f":"IFERROR(INDEX($AE$12:$AE$50,MATCH(1,COUNTIF($AH$11:AH14,$AE$12:$AE$50)+($AE$12:$AE$50<>\"\")*1,0)),\"\")","v":"2025-05-01"},null,null,"2025-04-21","2025-04-21","0","0","0","0","0","0","2025-04-21","0","0","0","0","0","0","0",1,3,"März",0,0,0,0,0,0,0,null,"Nein","2. Advent ","","","2. Advent ",null,null,null,null,null,null,null,null,null,null,"",null,null,null,null,null,null,null,"2025-12-07","2. Advent "]
["Nein","Nein",{"$f":"IF(E39=\"\",\"\",IF(B39=\"ja\",E39,\"\"))","v":""},"1. Advent ",{"$f":"E44+11","v":"2025-11-30"},null,null,null,null,null,"","","",null,null,"1909-03-15",null,"","",null,"","","",null,null,null,null,"",null,null,"","1. Advent ",null,{"$f":"IFERROR(INDEX($AE$12:$AE$50,MATCH(1,COUNTIF($AH$11:AH15,$AE$12:$AE$50)+($AE$12:$AE$50<>\"\")*1,0)),\"\")","v":"2025-05-29"},null,null,"2025-05-01","0","0","0","2025-05-01","0","0","0","0","0","0","2025-05-01","0","0","0","0",1,4,"April",0,1,0,0,0,1,0,null,"Nein","3. Advent ",{"$f":"IF(E41=\"\",\"\",IF(A41=\"ja\",E41,\"\"))","v":""},"","3. Advent ",null,null,null,null,null,null,null,null,null,null,"",null,null,null,null,null,null,null,"2025-12-14","3. Advent "]
["Nein","Nein",{"$f":"IF(E40=\"\",\"\",IF(B40=\"ja\",E40,\"\"))","v":""},"2. Advent ",{"$f":"E44+18","v":"2025-12-07"},null,null,null,null,null,"","1904-01-01","1904-01-01",null,null,"1909-03-15",null,"","",null,"","","",null,null,null,null,"",null,null,"","2. Advent ",null,{"$f":"IFERROR(INDEX($AE$12:$AE$50,MATCH(1,COUNTIF($AH$11:AH16,$AE$12:$AE$50)+($AE$12:$AE$50<>\"\")*1,0)),\"\")","v":"2025-06-09"},null,null,"2025-05-29","0","0","0","2025-05-29","0","0","0","0","0","0","2025-05-29","0","0","0","0",1,5,"Mai",0,0,0,0,2,0,0,null,"Nein","4. Advent ",{"$f":"IF(E42=\"\",\"\",IF(A42=\"ja\",E42,\"\"))","v":""},"","4. Advent ",null,null,null,null,null,null,null,null,null,null,"",null,null,null,null,null,null,null,"2025-12-21","4. Advent "]
["Nein","Nein",{"$f":"IF(E41=\"\",\"\",IF(B41=\"ja\",E41,\"\"))","v":""},"3. Advent ",{"$f":"E44+25","v":"2025-12-14"},null,null,null,null,null,"","1904-01-01","1904-01-01",null,null,"1909-03-15",null,"","",null,"","","",null,null,null,null,"",null,null,"","3. Advent ",null,{"$f":"IFERROR(INDEX($AE$12:$AE$50,MATCH(1,COUNTIF($AH$11:AH17,$AE$12:$AE$50)+($AE$12:$AE$50<>\"\")*1,0)),\"\")","v":"2025-10-03"},null,null,"2025-06-09","2025-06-09","0","0","0","0","0","0","2025-06-09","0","0","0","0","0","0","0",1,6,"Juni",0,1,0,0,0,0,0,null,"Nein","Frei","","","Frei",null,null,null,null,null,null,null,null,null,null,"",null,null,null,null,null,null,null,"1904-01-01","Frei"]
["Nein","Nein",{"$f":"IF(E42=\"\",\"\",IF(B42=\"ja\",E42,\"\"))","v":""},"4. Advent ",{"$f":"E44+32","v":"2025-12-21"},null,null,null,null,null,{"$f":"IFERROR(IF(G42=\"\",\"\",IF(AND(B42=\"ja\",WEEKDAY(C42,2)=6),C42,\"\")),\"\")","v":""},"1904-01-01","1904-01-01",null,null,"1909-03-15",null,"","",null,"","","",null,null,null,null,"",null,null,"","4. Advent ",null,{"$f":"IFERROR(INDEX($AE$12:$AE$50,MATCH(1,COUNTIF($AH$11:AH18,$AE$12:$AE$50)+($AE$12:$AE$50<>\"\")*1,0)),\"\")","v":"2025-10-31"},null,null,"2025-10-03","0","0","0","0","2025-10-03","0","0","0","0","0","0","2025-10-03","0","0","0",1,7,"Juli",0,0,0,0,0,0,0,null,"Nein","Buß-und Bettag","","","Buß-und Bettag",null,null,null,null,null,null,null,null,null,null,"",null,null,null,null,null,null,null,"2025-11-19","Buß-und Bettag"]
["Nein","Nein",{"$f":"IF(E43=\"\",\"\",IF(B43=\"ja\",IF(E43,DATEVALUE(TEXT(E43,\"TT.MM\")),\"\"),\"\"))","v":""},"Frei",null,null,null,null,null,null,"","1904-01-01","1904-01-01",null,null,"1909-03-15",null,"","",null,"","","",null,null,null,null,"",null,null,"","Frei",null,{"$f":"IFERROR(INDEX($AE$12:$AE$50,MATCH(1,COUNTIF($AH$11:AH19,$AE$12:$AE$50)+($AE$12:$AE$50<>\"\")*1,0)),\"\")","v":"2025-12-25"},null,null,"2025-10-31","0","0","0","0","2025-10-31","0","0","0","0","0","0","2025-10-31","0","0","0",1,8,"August",0,0,0,0,0,0,0,null,"Nein","Heiligabend ½ Tag frei bei GZ","","","Heiligabend ½ Tag frei bei GZ",null,null,null,null,null,null,null,null,null,null,"",null,null,null,null,null,null,null,"2025-12-24","Heiligabend ½ Tag frei bei GZ"]
["Nein","Nein",{"$f":"IF(E44=\"\",\"\",IF(AND(B44=\"ja\",WEEKDAY(E44,2)<$F$7),E44,\"\"))","v":""},"Buß-und Bettag",{"$f":"MIN(J10:J17)","v":"2025-11-19"},{"$f":"IF(C44=\"\",\"\",IF(AND(B44=\"ja\",WEEKDAY(C44,2)<$F$7),C44,\"\"))","v":""},{"$f":"F44","v":""},null,null,null,"","1904-01-01","1904-01-01",null,null,"1909-03-15",null,"","",null,"","","",null,null,null,null,"",null,null,"","Buß-und Bettag",null,{"$f":"IFERROR(INDEX($AE$12:$AE$50,MATCH(1,COUNTIF($AH$11:AH20,$AE$12:$AE$50)+($AE$12:$AE$50<>\"\")*1,0)),\"\")","v":"2025-12-26"},null,null,"2025-12-25","0","0","0","2025-12-25","0","0","0","0","0","0","2025-12-25","0","0","0","0",1,9,"September",0,0,0,0,0,0,0,null,"Ja","1.Weihn.Tag","2025-12-25","2025-12-25","1.Weihn.Tag",null,null,null,null,null,null,null,null,null,null,"",null,null,null,null,null,null,null,"2025-12-25","1.Weihn.Tag"]
["Nein","Nein",{"$f":"IF(E45=\"\",\"\",IF(AND(B45=\"ja\",WEEKDAY(E45,2)<$F$7),E45,\"\"))","v":""},"Heiligabend ½ Tag frei bei GZ",{"$f":"DATE(D$9,12,24)","v":"2025-12-24"},{"$f":"IF(C45=\"\",\"\",IF(AND(B45=\"ja\",WEEKDAY(C45,2)<$F$7),C45,\"\"))","v":""},{"$f":"F45","v":""},null,null,null,"","1904-01-01","1904-01-01",null,null,"1909-03-15",null,"","",null,"","","",null,null,null,null,"",null,null,"","Heiligabend ½ Tag frei bei GZ",null,{"$f":"IFERROR(INDEX($AE$12:$AE$50,MATCH(1,COUNTIF($AH$11:AH21,$AE$12:$AE$50)+($AE$12:$AE$50<>\"\")*1,0)),\"\")","v":""},null,null,"2025-12-26","0","0","0","0","2025-12-26","0","0","0","0","0","0","2025-12-26","0","0","0",1,10,"Oktober",0,0,0,0,0,2,0,null,"Ja","2.Weihn.Tag","2025-12-26","2025-12-26","2.Weihn.Tag",null,null,null,null,null,null,null,null,null,null,"",null,null,null,null,null,null,null,"2025-12-26","2.Weihn.Tag"]
["Ja","Ja",{"$f":"IF(E46=\"\",\"\",IF(AND(B46=\"ja\",WEEKDAY(E46,2)<$F$7),E46,\"\"))","v":"2025-12-25"},"1.Weihn.Tag",{"$f":"DATE(D$9,12,25)","v":"2025-12-25"},{"$f":"IF(C46=\"\",\"\",IF(AND(B46=\"ja\",WEEKDAY(C46,2)<$F$7),C46,\"\"))","v":"2025-12-25"},{"$f":"F46","v":"2025-12-25"},null,null,null,"","","",null,null,"2025-12-25",null,"","",null,"2025-12-25","2025-12-31",2,null,null,null,null,"2025-12-25",null,null,"2025-12-25","1.Weihn.Tag",null,{"$f":"IFERROR(INDEX($AE$12:$AE$50,MATCH(1,COUNTIF($AH$11:AH22,$AE$12:$AE$50)+($AE$12:$AE$50<>\"\")*1,0)),\"\")","v":""},null,null,"0","0","0","0","0","0","0","0","0","0","0","0","0","0","0","0","0",11,"November",0,0,0,0,0,0,0,null,"Nein","Ende Lohnfortzahlung","","","Ende Lohnfortzahlung",null,null,null,null,null,null,null,null,null,null,"",null,null,null,null,null,null,null,"2025-12-02","Ende Lohnfortzahlung"]
["Ja","Ja",{"$f":"IF(E47=\"\",\"\",IF(B47=\"ja\",E47,\"\"))","v":"2025-12-26"},"2.Weihn.Tag",{"$f":"DATE(D$9,12,26)","v":"2025-12-26"},{"$f":"IF(C47=\"\",\"\",IF(AND(B47=\"ja\",WEEKDAY(C47,2)<$F$7),C47,\"\"))","v":"2025-12-26"},{"$f":"F47","v":"2025-12-26"},null,null,null,"","","",null,null,"2025-12-26",null,"","",null,"2025-12-26","2025-12-31",1,null,null,null,null,"2025-12-26",null,null,"2025-12-26","2.Weihn.Tag",null,{"$f":"IFERROR(INDEX($AE$12:$AE$50,MATCH(1,COUNTIF($AH$11:AH23,$AE$12:$AE$50)+($AE$12:$AE$50<>\"\")*1,0)),\"\")","v":""},null,null,"0","0","0","0","0","0","0","0","0","0","0","0","0","0","0","0","0",12,"Dezember",0,0,0,0,1,1,0,null,"Nein","Silvester ½ Tag Frei GZ","","","Silvester ½ Tag Frei GZ",null,null,null,null,null,null,null,null,null,null,"",null,null,null,null,null,null,null,"2025-12-31","Silvester ½ Tag Frei GZ"]
["Nein","Nein",{"$f":"IF(E48=\"\",\"\",IF(AND(B48=\"ja\",WEEKDAY(E48,1)<$F$7),E48,\"\"))","v":""},"Ende Lohnfortzahlung",{"$f":"TODAY()+78","v":"2025-12-02"},{"$f":"IF(C48=\"\",\"\",IF(AND(B48=\"ja\",WEEKDAY(C48,2)<$F$7),C48,\"\"))","v":""},{"$f":"F48","v":""},null,null,null,"","2025-12-25","2025-12-25",null,null,"1909-03-15",null,"","",null,"","","",null,null,null,null,"",null,null,"","Ende Lohnfortzahlung",null,{"$f":"IFERROR(INDEX($AE$12:$AE$50,MATCH(1,COUNTIF($AH$11:AH24,$AE$12:$AE$50)+($AE$12:$AE$50<>\"\")*1,0)),\"\")","v":""},null,null,null,"0","0","0","0","0","0","0","0","0","0","0","0","0","0","0","0",null,{"$f":"SUM(BD48:BJ48)","v":0},{"$f":"SUM(BD36:BD47)","v":0},null,null,null,null,null,null,null,"Nein","Geb. Werner","","","Geb. Werner",null,null,null,null,null,null,null,null,null,null,"",null,null,null,null,null,null,null,"1961-01-21","Geb. Werner"]
["Nein","Nein",{"$f":"IF(E49=\"\",\"\",IF(AND(B49=\"ja\",WEEKDAY(E49,2)<$F$7),E49,\"\"))","v":""},"Silvester ½ Tag Frei GZ",{"$f":"DATEVALUE(\"31.12.\"&E9)","v":"2025-12-31"},"",null,null,null,null,{"$f":"IF(G49=\"\",\"\",IF(AND(B49=\"ja\",WEEKDAY(C49,2)=6),C49,\"\"))","v":""},"2025-12-26","2025-12-26",null,null,"1909-03-15",null,"","",null,"","","",null,null,null,null,"",null,null,"","Silvester ½ Tag Frei GZ",null,{"$f":"IFERROR(INDEX($AE$12:$AE$50,MATCH(1,COUNTIF($AH$11:AH25,$AE$12:$AE$50)+($AE$12:$AE$50<>\"\")*1,0)),\"\")","v":""},null,null,null,"0","0","0","0","0","0","0","0","0","0","0","0","0","0","0","0",null,{"$f":"SUM(BD49:BJ49)","v":9},null,{"$f":"SUM(BE36:BE47)","v":2},0,0,3,4,0,0,"Nein","Geb.Sabine","","","Geb.Sabine",null,null,null,null,null,null,null,null,null,null,"",null,null,null,null,null,null,null,"1962-07-30","Geb.Sabine"]
["Nein","Nein",{"$f":"IF(E50=\"\",\"\",IF(B50=\"ja\",IF(E50,DATEVALUE(TEXT(E50,\"TT.MM\")),\"\"),\"\"))","v":""},"Geb. Werner","1961-01-21",null,null,null,null,null,"","","",null,null,"1909-03-15",null,null,null,null,"","","",null,null,null,null,"",null,null,"","Geb. Werner",null,{"$f":"IFERROR(INDEX($AE$12:$AE$50,MATCH(1,COUNTIF($AH$11:AH26,$AE$12:$AE$50)+($AE$12:$AE$50<>\"\")*1,0)),\"\")","v":""},null,null,null,"0","0","0","0","0","0","0","0","0","0","0","0","0","0","0","0",null,null,null,null,null,null,null,null,null,null,"Nein","Geb. S.Wersal","","","Geb. S.Wersal",null,null,null,null,null,null,null,null,null,null,"",null,null,null,null,null,null,null,"1973-08-16","Geb. S.Wersal"]
["Nein","Nein",{"$f":"IF(E51=\"\",\"\",IF(B51=\"ja\",IF(E51,DATEVALUE(TEXT(E51,\"TT.MM\")),\"\"),\"\"))","v":""},"Geb.Sabine","1962-07-30",null,null,null,null,null,"","1904-01-01","1904-01-01",null,null,"1909-03-15",null,null,null,null,"","","",null,null,null,null,"",null,null,"","Geb.Sabine",null,{"$f":"IFERROR(INDEX($AE$12:$AE$50,MATCH(1,COUNTIF($AH$11:AH27,$AE$12:$AE$50)+($AE$12:$AE$50<>\"\")*1,0)),\"\")","v":""},null,null,null,"0","0","0","0","0","0","0","0","0","0","0","0","0","0","0","0"]
["Nein","Nein",{"$f":"IF(E52=\"\",\"\",IF(B52=\"ja\",IF(E52,DATEVALUE(TEXT(E52,\"TT.MM\")),\"\"),\"\"))","v":""},"Geb. S.Wersal","1973-08-16",null,null,null,null,null,"","1904-01-01","1904-01-01",null,null,"1909-03-15",null,null,null,null,"","","",null,null,null,null,"",null,null,"","Geb. S.Wersal",null,{"$f":"IFERROR(INDEX($AE$12:$AE$50,MATCH(1,COUNTIF($AH$11:AH28,$AE$12:$AE$50)+($AE$12:$AE$50<>\"\")*1,0)),\"\")","v":""},null,null,null,"0","0","0","0","0","0","0",{"$f":"AL52","v":"0"},"0","0","0","0","0","0","0","0"]
[null,null,null,null,null,null,null,null,null,null,"","1904-01-01","1904-01-01",null,null,"1909-03-15",null,null,null,null,"","","",null,null,null,null,"",null,null,null,null,null,{"$f":"IFERROR(INDEX($AE$12:$AE$50,MATCH(1,COUNTIF($AH$11:AH29,$AE$12:$AE$50)+($AE$12:$AE$50<>\"\")*1,0)),\"\")","v":""},null,null,null,{"$f":"IF(COUNT(AL36:AL52)=0,\"0\",COUNT(AL36:AL52))","v":2},"0",1,3,4,"0",{"$f":"IF(COUNT(AR36:AR52)=0,\"0\",COUNT(AR36:AR52))","v":"0"},{"$f":"IF(COUNT(AS36:AS52)=0,\"\",COUNT(AS36:AS52))","v":2},"",1,3,4,"",""]
[null,null,{"$f":"IF(E47=\"\",\"\",IF(AND(B47=\"ja\",WEEKDAY(E47,2)<$F$7),E47,\"\"))","v":"2025-12-26"},null,null,"Eintritsdatum",null,null,null,null,"",null,null,null,null,null,null,null,null,null,null,null,null,null,null,null,null,null,null,null,null,null,null,null,null,"Frei an FT",{"$f":"SUM(AL54:AQ54)","v":10},{"$f":"AL53","v":2},"0",1,3,4,"0"]
[null,null,null,"Händich",null,{"$f":"#REF!","v":{"$error":"#REF!"}},{"$f":"COUNT(G56:G66)","v":0},{"$f":"COUNT(H56:H66)","v":0},"Samstage",{"$f":"COUNT(J56:J66)","v":10},null,null,null,null,null,null,null,null,null,null,null,null,null,null,null,null,null,null,null,null,null,null,null,null,null,"Arbeitstage",{"$f":"SUM(AL55:AR55)","v":0},null,null,null,null,null,null,{"$f":"AR53","v":"0"}]
[null,null,null,"Neujahr","2022-01-01",{"$f":"VLOOKUP(D56,$D$12:$E$47,2,FALSE)","v":"2025-01-01"},{"$f":"IF(F56>$F$55,IF(WEEKDAY(F56,2)=7,\"\",F56),\"\")","v":{"$error":"#REF!"}},{"$f":"IF(WEEKDAY(F56,2)=6,F56,\"\")","v":""},null,{"$f":"IF(F56>=$B$7,IF(WEEKDAY(F56,2)=7,\"\",F56),\"\")","v":"2025-01-01"}]
[null,null,null,"Karfreitag","2022-04-15",{"$f":"VLOOKUP(D57,$D$12:$E$47,2,FALSE)","v":"2025-04-18"},{"$error":"#REF!"},"",null,{"$f":"IF(F57>=$B$7,IF(WEEKDAY(F57,2)=7,\"\",F57),\"\")","v":"2025-04-18"}]
[null,{"$f":"E19-2","v":"2025-04-18"},null,"Ostersonntag ","2022-04-17",{"$f":"VLOOKUP(D58,$D$12:$E$47,2,FALSE)","v":"2025-04-20"},{"$error":"#REF!"},"",null,""]
[null,null,null,"Ostermontag","2022-04-18",{"$f":"VLOOKUP(D59,$D$12:$E$47,2,FALSE)","v":"2025-04-21"},{"$error":"#REF!"},"",null,"2025-04-21"]
[null,null,null,"Tag der Arbeit","2022-05-01",{"$f":"VLOOKUP(D60,$D$12:$E$47,2,FALSE)","v":"2025-05-01"},{"$error":"#REF!"},"",null,"2025-05-01"]
[null,null,null,"Himmelfahrt","2022-05-26","2025-05-29",{"$error":"#REF!"},"",null,"2025-05-29"]
[null,null,null,"Pfingstmontag","2022-06-06","2025-06-09",{"$error":"#REF!"},"",null,"2025-06-09"]
[null,null,null,"Tag d.dt.Einheit","2022-10-03","2025-10-03",{"$error":"#REF!"},"",null,"2025-10-03"]
[null,null,null,"Reformationst.","2022-10-31","2025-10-31",{"$error":"#REF!"},"",null,"2025-10-31"]
[null,null,null,"1.Weihn.Tag","2022-12-25","2025-12-25",{"$error":"#REF!"},"",null,"2025-12-25"]
[null,null,null,"2.Weihn.Tag","2022-12-26","2025-12-26",{"$error":"#REF!"},"",null,"2025-12-26"]

{"sheet":"Kalender","index":4,"n_rows":35,"n_cols":24,"rows_kept":35,"cut":false,"hidden":false,"merged":[[3,0,3,1],[3,2,3,3],[3,4,3,5],[3,6,3,7],[3,8,3,9],[3,22,3,23],[1,2,1,3],[1,6,1,7],[1,15,1,16],[1,21,1,22],[3,10,3,11],[3,12,3,13],[3,14,3,15],[3,16,3,17],[3,18,3,19],[3,20,3,21]]}
["Inhalt",null,null,null,null,"Feiertage"]
[null,null,{"$f":"\"Kalender \" &gewJahr","v":"Kalender 2025"},null,null,null,"Rechnungslauf",null,null,null,null,null,null,null,null,{"$f":"\"Kalender \" &gewJahr","v":"Kalender 2025"}]
[]
["Januar",null,"Februar",null,"März",null,"April",null,"Mai",null,"Juni",null,"Juli",null,"August",null,"September",null,"Oktober",null,"November",null,"Dezember"]
[{"$f":"DATE(gewJahr,1,1)","v":"2025-01-01"},{"$f":"IFERROR(IF(ISNA(VLOOKUP(A5,Feiertage!$C$12:$D$53,1,0)),VLOOKUP(A5,Feiertage!$C$12:$D$53,2,0),VLOOKUP(A5,Feiertage!$C$12:$D$53,2)),\"\")","v":"Neujahr"},{"$f":"DATE(gewJahr,2,1)","v":"2025-02-01"},{"$f":"IFERROR(IF(ISNA(VLOOKUP(C5,Feiertage!$C$12:$D$53,1,0)),VLOOKUP(C5,Feiertage!$C$12:$D$53,2,0),VLOOKUP(C5,Feiertage!$C$12:$D$53,2)),\"\")","v":""},{"$f":"DATE(gewJahr,3,1)","v":"2025-03-01"},{"$f":"IFERROR(IF(ISNA(VLOOKUP(E5,Feiertage!$C$12:$D$53,1,0)),VLOOKUP(E5,Feiertage!$C$12:$D$53,2,0),VLOOKUP(E5,Feiertage!$C$12:$D$53,2)),\"\")","v":""},{"$f":"DATE(gewJahr,4,1)","v":"2025-04-01"},{"$f":"IFERROR(IF(ISNA(VLOOKUP(G5,Feiertage!$C$12:$D$53,1,0)),VLOOKUP(G5,Feiertage!$C$12:$D$53,2,0),VLOOKUP(G5,Feiertage!$C$12:$D$53,2)),\"\")","v":""},{"$f":"DATE(gewJahr,5,1)","v":"2025-05-01"},{"$f":"IFERROR(IF(ISNA(VLOOKUP(I5,Feiertage!$C$12:$D$53,1,0)),VLOOKUP(I5,Feiertage!$C$12:$D$53,2,0),VLOOKUP(I5,Feiertage!$C$12:$D$53,2)),\"\")","v":"Tag der Arbeit"},{"$f":"DATE(gewJahr,6,1)","v":"2025-06-01"},{"$f":"IFERROR(IF(ISNA(VLOOKUP(K5,Feiertage!$C$12:$D$53,1,0)),VLOOKUP(K5,Feiertage!$C$12:$D$53,2,0),VLOOKUP(K5,Feiertage!$C$12:$D$53,2)),\"\")","v":""},{"$f":"DATE(gewJahr,7,1)","v":"2025-07-01"},{"$f":"IFERROR(IF(ISNA(VLOOKUP(M5,Feiertage!$C$12:$D$53,1,0)),VLOOKUP(M5,Feiertage!$C$12:$D$53,2,0),VLOOKUP(M5,Feiertage!$C$12:$D$53,2)),\"\")","v":""},{"$f":"DATE(gewJahr,8,1)","v":"2025-08-01"},{"$f":"IFERROR(IF(ISNA(VLOOKUP(O5,Feiertage!$C$12:$D$53,1,0)),VLOOKUP(O5,Feiertage!$C$12:$D$53,2,0),VLOOKUP(O5,Feiertage!$C$12:$D$53,2)),\"\")","v":""},{"$f":"DATE(gewJahr,9,1)","v":"2025-09-01"},{"$f":"IFERROR(IF(ISNA(VLOOKUP(Q5,Feiertage!$C$12:$D$53,1,0)),VLOOKUP(Q5,Feiertage!$C$12:$D$53,2,0),VLOOKUP(Q5,Feiertage!$C$12:$D$53,2)),\"\")","v":""},{"$f":"DATE(gewJahr,10,1)","v":"2025-10-01"},{"$f":"IFERROR(IF(ISNA(VLOOKUP(S5,Feiertage!$C$12:$D$53,1,0)),VLOOKUP(S5,Feiertage!$C$12:$D$53,2,0),VLOOKUP(S5,Feiertage!$C$12:$D$53,2)),\"\")","v":""},{"$f":"DATE(gewJahr,11,1)","v":"2025-11-01"},{"$f":"IFERROR(IF(ISNA(VLOOKUP(U5,Feiertage!$C$12:$D$53,1,0)),VLOOKUP(U5,Feiertage!$C$12:$D$53,2,0),VLOOKUP(U5,Feiertage!$C$12:$D$53,2)),\"\")","v":""},{"$f":"DATE(gewJahr,12,1)","v":"2025-12-01"},{"$f":"IFERROR(IF(ISNA(VLOOKUP(W5,Feiertage!$C$12:$D$53,1,0)),VLOOKUP(W5,Feiertage!$C$12:$D$53,2,0),VLOOKUP(W5,Feiertage!$C$12:$D$53,2)),\"\")","v":""}]
[{"$f":"A5+1","v":"2025-01-02"},{"$f":"IFERROR(IF(ISNA(VLOOKUP(A6,Feiertage!$C$12:$D$53,1,0)),VLOOKUP(A6,Feiertage!$C$12:$D$53,2,0),VLOOKUP(A6,Feiertage!$C$12:$D$53,2)),\"\")","v":""},{"$f":"C5+1","v":"2025-02-02"},{"$f":"IFERROR(IF(ISNA(VLOOKUP(C6,Feiertage!$C$12:$D$53,1,0)),VLOOKUP(C6,Feiertage!$C$12:$D$53,2,0),VLOOKUP(C6,Feiertage!$C$12:$D$53,2)),\"\")","v":""},{"$f":"E5+1","v":"2025-03-02"},{"$f":"IFERROR(IF(ISNA(VLOOKUP(E6,Feiertage!$C$12:$D$53,1,0)),VLOOKUP(E6,Feiertage!$C$12:$D$53,2,0),VLOOKUP(E6,Feiertage!$C$12:$D$53,2)),\"\")","v":""},{"$f":"G5+1","v":"2025-04-02"},{"$f":"IFERROR(IF(ISNA(VLOOKUP(G6,Feiertage!$C$12:$D$53,1,0)),VLOOKUP(G6,Feiertage!$C$12:$D$53,2,0),VLOOKUP(G6,Feiertage!$C$12:$D$53,2)),\"\")","v":""},{"$f":"I5+1","v":"2025-05-02"},{"$f":"IFERROR(IF(ISNA(VLOOKUP(I6,Feiertage!$C$12:$D$53,1,0)),VLOOKUP(I6,Feiertage!$C$12:$D$53,2,0),VLOOKUP(I6,Feiertage!$C$12:$D$53,2)),\"\")","v":""},{"$f":"K5+1","v":"2025-06-02"},{"$f":"IFERROR(IF(ISNA(VLOOKUP(K6,Feiertage!$C$12:$D$53,1,0)),VLOOKUP(K6,Feiertage!$C$12:$D$53,2,0),VLOOKUP(K6,Feiertage!$C$12:$D$53,2)),\"\")","v":""},{"$f":"M5+1","v":"2025-07-02"},{"$f":"IFERROR(IF(ISNA(VLOOKUP(M6,Feiertage!$C$12:$D$53,1,0)),VLOOKUP(M6,Feiertage!$C$12:$D$53,2,0),VLOOKUP(M6,Feiertage!$C$12:$D$53,2)),\"\")","v":""},{"$f":"O5+1","v":"2025-08-02"},{"$f":"IFERROR(IF(ISNA(VLOOKUP(O6,Feiertage!$C$12:$D$53,1,0)),VLOOKUP(O6,Feiertage!$C$12:$D$53,2,0),VLOOKUP(O6,Feiertage!$C$12:$D$53,2)),\"\")","v":""},{"$f":"Q5+1","v":"2025-09-02"},{"$f":"IFERROR(IF(ISNA(VLOOKUP(Q6,Feiertage!$C$12:$D$53,1,0)),VLOOKUP(Q6,Feiertage!$C$12:$D$53,2,0),VLOOKUP(Q6,Feiertage!$C$12:$D$53,2)),\"\")","v":""},{"$f":"S5+1","v":"2025-10-02"},{"$f":"IFERROR(IF(ISNA(VLOOKUP(S6,Feiertage!$C$12:$D$53,1,0)),VLOOKUP(S6,Feiertage!$C$12:$D$53,2,0),VLOOKUP(S6,Feiertage!$C$12:$D$53,2)),\"\")","v":""},{"$f":"U5+1","v":"2025-11-02"},{"$f":"IFERROR(IF(ISNA(VLOOKUP(U6,Feiertage!$C$12:$D$53,1,0)),VLOOKUP(U6,Feiertage!$C$12:$D$53,2,0),VLOOKUP(U6,Feiertage!$C$12:$D$53,2)),\"\")","v":""},{"$f":"W5+1","v":"2025-12-02"},{"$f":"IFERROR(IF(ISNA(VLOOKUP(W6,Feiertage!$C$12:$D$53,1,0)),VLOOKUP(W6,Feiertage!$C$12:$D$53,2,0),VLOOKUP(W6,Feiertage!$C$12:$D$53,2)),\"\")","v":""}]
[{"$f":"A6+1","v":"2025-01-03"},{"$f":"IFERROR(IF(ISNA(VLOOKUP(A7,Feiertage!$C$12:$D$53,1,0)),VLOOKUP(A7,Feiertage!$C$12:$D$53,2,0),VLOOKUP(A7,Feiertage!$C$12:$D$53,2)),\"\")","v":""},{"$f":"C6+1","v":"2025-02-03"},{"$f":"IFERROR(IF(ISNA(VLOOKUP(C7,Feiertage!$C$12:$D$53,1,0)),VLOOKUP(C7,Feiertage!$C$12:$D$53,2,0),VLOOKUP(C7,Feiertage!$C$12:$D$53,2)),\"\")","v":""},{"$f":"E6+1","v":"2025-03-03"},{"$f":"IFERROR(IF(ISNA(VLOOKUP(E7,Feiertage!$C$12:$D$53,1,0)),VLOOKUP(E7,Feiertage!$C$12:$D$53,2,0),VLOOKUP(E7,Feiertage!$C$12:$D$53,2)),\"\")","v":""},"2025-04-03",{"$f":"IFERROR(IF(ISNA(VLOOKUP(G7,Feiertage!$C$12:$D$53,1,0)),VLOOKUP(G7,Feiertage!$C$12:$D$53,2,0),VLOOKUP(G7,Feiertage!$C$12:$D$53,2)),\"\")","v":""},"2025-05-03",{"$f":"IFERROR(IF(ISNA(VLOOKUP(I7,Feiertage!$C$12:$D$53,1,0)),VLOOKUP(I7,Feiertage!$C$12:$D$53,2,0),VLOOKUP(I7,Feiertage!$C$12:$D$53,2)),\"\")","v":""},{"$f":"K6+1","v":"2025-06-03"},{"$f":"IFERROR(IF(ISNA(VLOOKUP(K7,Feiertage!$C$12:$D$53,1,0)),VLOOKUP(K7,Feiertage!$C$12:$D$53,2,0),VLOOKUP(K7,Feiertage!$C$12:$D$53,2)),\"\")","v":""},{"$f":"M6+1","v":"2025-07-03"},{"$f":"IFERROR(IF(ISNA(VLOOKUP(M7,Feiertage!$C$12:$D$53,1,0)),VLOOKUP(M7,Feiertage!$C$12:$D$53,2,0),VLOOKUP(M7,Feiertage!$C$12:$D$53,2)),\"\")","v":""},"2025-08-03",{"$f":"IFERROR(IF(ISNA(VLOOKUP(O7,Feiertage!$C$12:$D$53,1,0)),VLOOKUP(O7,Feiertage!$C$12:$D$53,2,0),VLOOKUP(O7,Feiertage!$C$12:$D$53,2)),\"\")","v":""},{"$f":"Q6+1","v":"2025-09-03"},{"$f":"IFERROR(IF(ISNA(VLOOKUP(Q7,Feiertage!$C$12:$D$53,1,0)),VLOOKUP(Q7,Feiertage!$C$12:$D$53,2,0),VLOOKUP(Q7,Feiertage!$C$12:$D$53,2)),\"\")","v":""},{"$f":"S6+1","v":"2025-10-03"},{"$f":"IFERROR(IF(ISNA(VLOOKUP(S7,Feiertage!$C$12:$D$53,1,0)),VLOOKUP(S7,Feiertage!$C$12:$D$53,2,0),VLOOKUP(S7,Feiertage!$C$12:$D$53,2)),\"\")","v":"Tag d.dt.Einheit"},{"$f":"U6+1","v":"2025-11-03"},{"$f":"IFERROR(IF(ISNA(VLOOKUP(U7,Feiertage!$C$12:$D$53,1,0)),VLOOKUP(U7,Feiertage!$C$12:$D$53,2,0),VLOOKUP(U7,Feiertage!$C$12:$D$53,2)),\"\")","v":""},{"$f":"W6+1","v":"2025-12-03"},{"$f":"IFERROR(IF(ISNA(VLOOKUP(W7,Feiertage!$C$12:$D$53,1,0)),VLOOKUP(W7,Feiertage!$C$12:$D$53,2,0),VLOOKUP(W7,Feiertage!$C$12:$D$53,2)),\"\")","v":""}]
["2025-01-04",{"$f":"IFERROR(IF(ISNA(VLOOKUP(A8,Feiertage!$C$12:$D$53,1,0)),VLOOKUP(A8,Feiertage!$C$12:$D$53,2,0),VLOOKUP(A8,Feiertage!$C$12:$D$53,2)),\"\")","v":""},"2025-02-04",{"$f":"IFERROR(IF(ISNA(VLOOKUP(C8,Feiertage!$C$12:$D$53,1,0)),VLOOKUP(C8,Feiertage!$C$12:$D$53,2,0),VLOOKUP(C8,Feiertage!$C$12:$D$53,2)),\"\")","v":""},"2025-03-04",{"$f":"IFERROR(IF(ISNA(VLOOKUP(E8,Feiertage!$C$12:$D$53,1,0)),VLOOKUP(E8,Feiertage!$C$12:$D$53,2,0),VLOOKUP(E8,Feiertage!$C$12:$D$53,2)),\"\")","v":""},"2025-04-04",{"$f":"IFERROR(IF(ISNA(VLOOKUP(G8,Feiertage!$C$12:$D$53,1,0)),VLOOKUP(G8,Feiertage!$C$12:$D$53,2,0),VLOOKUP(G8,Feiertage!$C$12:$D$53,2)),\"\")","v":""},"2025-05-04",{"$f":"IFERROR(IF(ISNA(VLOOKUP(I8,Feiertage!$C$12:$D$53,1,0)),VLOOKUP(I8,Feiertage!$C$12:$D$53,2,0),VLOOKUP(I8,Feiertage!$C$12:$D$53,2)),\"\")","v":""},"2025-06-04",{"$f":"IFERROR(IF(ISNA(VLOOKUP(K8,Feiertage!$C$12:$D$53,1,0)),VLOOKUP(K8,Feiertage!$C$12:$D$53,2,0),VLOOKUP(K8,Feiertage!$C$12:$D$53,2)),\"\")","v":""},"2025-07-04",{"$f":"IFERROR(IF(ISNA(VLOOKUP(M8,Feiertage!$C$12:$D$53,1,0)),VLOOKUP(M8,Feiertage!$C$12:$D$53,2,0),VLOOKUP(M8,Feiertage!$C$12:$D$53,2)),\"\")","v":""},"2025-08-04",{"$f":"IFERROR(IF(ISNA(VLOOKUP(O8,Feiertage!$C$12:$D$53,1,0)),VLOOKUP(O8,Feiertage!$C$12:$D$53,2,0),VLOOKUP(O8,Feiertage!$C$12:$D$53,2)),\"\")","v":""},"2025-09-04",{"$f":"IFERROR(IF(ISNA(VLOOKUP(Q8,Feiertage!$C$12:$D$53,1,0)),VLOOKUP(Q8,Feiertage!$C$12:$D$53,2,0),VLOOKUP(Q8,Feiertage!$C$12:$D$53,2)),\"\")","v":""},"2025-10-04",{"$f":"IFERROR(IF(ISNA(VLOOKUP(S8,Feiertage!$C$12:$D$53,1,0)),VLOOKUP(S8,Feiertage!$C$12:$D$53,2,0),VLOOKUP(S8,Feiertage!$C$12:$D$53,2)),\"\")","v":""},"2025-11-04",{"$f":"IFERROR(IF(ISNA(VLOOKUP(U8,Feiertage!$C$12:$D$53,1,0)),VLOOKUP(U8,Feiertage!$C$12:$D$53,2,0),VLOOKUP(U8,Feiertage!$C$12:$D$53,2)),\"\")","v":""},"2025-12-04",{"$f":"IFERROR(IF(ISNA(VLOOKUP(W8,Feiertage!$C$12:$D$53,1,0)),VLOOKUP(W8,Feiertage!$C$12:$D$53,2,0),VLOOKUP(W8,Feiertage!$C$12:$D$53,2)),\"\")","v":""}]
["2025-01-05",{"$f":"IFERROR(IF(ISNA(VLOOKUP(A9,Feiertage!$C$12:$D$53,1,0)),VLOOKUP(A9,Feiertage!$C$12:$D$53,2,0),VLOOKUP(A9,Feiertage!$C$12:$D$53,2)),\"\")","v":""},"2025-02-05",{"$f":"IFERROR(IF(ISNA(VLOOKUP(C9,Feiertage!$C$12:$D$53,1,0)),VLOOKUP(C9,Feiertage!$C$12:$D$53,2,0),VLOOKUP(C9,Feiertage!$C$12:$D$53,2)),\"\")","v":""},"2025-03-05",{"$f":"IFERROR(IF(ISNA(VLOOKUP(E9,Feiertage!$C$12:$D$53,1,0)),VLOOKUP(E9,Feiertage!$C$12:$D$53,2,0),VLOOKUP(E9,Feiertage!$C$12:$D$53,2)),\"\")","v":""},"2025-04-05",{"$f":"IFERROR(IF(ISNA(VLOOKUP(G9,Feiertage!$C$12:$D$53,1,0)),VLOOKUP(G9,Feiertage!$C$12:$D$53,2,0),VLOOKUP(G9,Feiertage!$C$12:$D$53,2)),\"\")","v":""},"2025-05-05",{"$f":"IFERROR(IF(ISNA(VLOOKUP(I9,Feiertage!$C$12:$D$53,1,0)),VLOOKUP(I9,Feiertage!$C$12:$D$53,2,0),VLOOKUP(I9,Feiertage!$C$12:$D$53,2)),\"\")","v":""},"2025-06-05",{"$f":"IFERROR(IF(ISNA(VLOOKUP(K9,Feiertage!$C$12:$D$53,1,0)),VLOOKUP(K9,Feiertage!$C$12:$D$53,2,0),VLOOKUP(K9,Feiertage!$C$12:$D$53,2)),\"\")","v":""},"2025-07-05",{"$f":"IFERROR(IF(ISNA(VLOOKUP(M9,Feiertage!$C$12:$D$53,1,0)),VLOOKUP(M9,Feiertage!$C$12:$D$53,2,0),VLOOKUP(M9,Feiertage!$C$12:$D$53,2)),\"\")","v":""},"2025-08-05",{"$f":"IFERROR(IF(ISNA(VLOOKUP(O9,Feiertage!$C$12:$D$53,1,0)),VLOOKUP(O9,Feiertage!$C$12:$D$53,2,0),VLOOKUP(O9,Feiertage!$C$12:$D$53,2)),\"\")","v":""},"2025-09-05",{"$f":"IFERROR(IF(ISNA(VLOOKUP(Q9,Feiertage!$C$12:$D$53,1,0)),VLOOKUP(Q9,Feiertage!$C$12:$D$53,2,0),VLOOKUP(Q9,Feiertage!$C$12:$D$53,2)),\"\")","v":""},"2025-10-05",{"$f":"IFERROR(IF(ISNA(VLOOKUP(S9,Feiertage!$C$12:$D$53,1,0)),VLOOKUP(S9,Feiertage!$C$12:$D$53,2,0),VLOOKUP(S9,Feiertage!$C$12:$D$53,2)),\"\")","v":""},"2025-11-05",{"$f":"IFERROR(IF(ISNA(VLOOKUP(U9,Feiertage!$C$12:$D$53,1,0)),VLOOKUP(U9,Feiertage!$C$12:$D$53,2,0),VLOOKUP(U9,Feiertage!$C$12:$D$53,2)),\"\")","v":""},"2025-12-05",{"$f":"IFERROR(IF(ISNA(VLOOKUP(W9,Feiertage!$C$12:$D$53,1,0)),VLOOKUP(W9,Feiertage!$C$12:$D$53,2,0),VLOOKUP(W9,Feiertage!$C$12:$D$53,2)),\"\")","v":""}]
[{"$f":"A9+1","v":"2025-01-06"},{"$f":"IFERROR(IF(ISNA(VLOOKUP(A10,Feiertage!$C$12:$D$53,1,0)),VLOOKUP(A10,Feiertage!$C$12:$D$53,2,0),VLOOKUP(A10,Feiertage!$C$12:$D$53,2)),\"\")","v":""},"2025-02-06",{"$f":"IFERROR(IF(ISNA(VLOOKUP(C10,Feiertage!$C$12:$D$53,1,0)),VLOOKUP(C10,Feiertage!$C$12:$D$53,2,0),VLOOKUP(C10,Feiertage!$C$12:$D$53,2)),\"\")","v":""},"2025-03-06",{"$f":"IFERROR(IF(ISNA(VLOOKUP(E10,Feiertage!$C$12:$D$53,1,0)),VLOOKUP(E10,Feiertage!$C$12:$D$53,2,0),VLOOKUP(E10,Feiertage!$C$12:$D$53,2)),\"\")","v":""},"2025-04-06",{"$f":"IFERROR(IF(ISNA(VLOOKUP(G10,Feiertage!$C$12:$D$53,1,0)),VLOOKUP(G10,Feiertage!$C$12:$D$53,2,0),VLOOKUP(G10,Feiertage!$C$12:$D$53,2)),\"\")","v":""},"2025-05-06",{"$f":"IFERROR(IF(ISNA(VLOOKUP(I10,Feiertage!$C$12:$D$53,1,0)),VLOOKUP(I10,Feiertage!$C$12:$D$53,2,0),VLOOKUP(I10,Feiertage!$C$12:$D$53,2)),\"\")","v":""},"2025-06-06",{"$f":"IFERROR(IF(ISNA(VLOOKUP(K10,Feiertage!$C$12:$D$53,1,0)),VLOOKUP(K10,Feiertage!$C$12:$D$53,2,0),VLOOKUP(K10,Feiertage!$C$12:$D$53,2)),\"\")","v":""},"2025-07-06",{"$f":"IFERROR(IF(ISNA(VLOOKUP(M10,Feiertage!$C$12:$D$53,1,0)),VLOOKUP(M10,Feiertage!$C$12:$D$53,2,0),VLOOKUP(M10,Feiertage!$C$12:$D$53,2)),\"\")","v":""},"2025-08-06",{"$f":"IFERROR(IF(ISNA(VLOOKUP(O10,Feiertage!$C$12:$D$53,1,0)),VLOOKUP(O10,Feiertage!$C$12:$D$53,2,0),VLOOKUP(O10,Feiertage!$C$12:$D$53,2)),\"\")","v":""},"2025-09-06",{"$f":"IFERROR(IF(ISNA(VLOOKUP(Q10,Feiertage!$C$12:$D$53,1,0)),VLOOKUP(Q10,Feiertage!$C$12:$D$53,2,0),VLOOKUP(Q10,Feiertage!$C$12:$D$53,2)),\"\")","v":""},"2025-10-06",{"$f":"IFERROR(IF(ISNA(VLOOKUP(S10,Feiertage!$C$12:$D$53,1,0)),VLOOKUP(S10,Feiertage!$C$12:$D$53,2,0),VLOOKUP(S10,Feiertage!$C$12:$D$53,2)),\"\")","v":""},"2025-11-06",{"$f":"IFERROR(IF(ISNA(VLOOKUP(U10,Feiertage!$C$12:$D$53,1,0)),VLOOKUP(U10,Feiertage!$C$12:$D$53,2,0),VLOOKUP(U10,Feiertage!$C$12:$D$53,2)),\"\")","v":""},"2025-12-06",{"$f":"IFERROR(IF(ISNA(VLOOKUP(W10,Feiertage!$C$12:$D$53,1,0)),VLOOKUP(W10,Feiertage!$C$12:$D$53,2,0),VLOOKUP(W10,Feiertage!$C$12:$D$53,2)),\"\")","v":""}]
["2025-01-07",{"$f":"IFERROR(IF(ISNA(VLOOKUP(A11,Feiertage!$C$12:$D$53,1,0)),VLOOKUP(A11,Feiertage!$C$12:$D$53,2,0),VLOOKUP(A11,Feiertage!$C$12:$D$53,2)),\"\")","v":""},"2025-02-07",{"$f":"IFERROR(IF(ISNA(VLOOKUP(C11,Feiertage!$C$12:$D$53,1,0)),VLOOKUP(C11,Feiertage!$C$12:$D$53,2,0),VLOOKUP(C11,Feiertage!$C$12:$D$53,2)),\"\")","v":""},"2025-03-07",{"$f":"IFERROR(IF(ISNA(VLOOKUP(E11,Feiertage!$C$12:$D$53,1,0)),VLOOKUP(E11,Feiertage!$C$12:$D$53,2,0),VLOOKUP(E11,Feiertage!$C$12:$D$53,2)),\"\")","v":""},"2025-04-07",{"$f":"IFERROR(IF(ISNA(VLOOKUP(G11,Feiertage!$C$12:$D$53,1,0)),VLOOKUP(G11,Feiertage!$C$12:$D$53,2,0),VLOOKUP(G11,Feiertage!$C$12:$D$53,2)),\"\")","v":""},"2025-05-07",{"$f":"IFERROR(IF(ISNA(VLOOKUP(I11,Feiertage!$C$12:$D$53,1,0)),VLOOKUP(I11,Feiertage!$C$12:$D$53,2,0),VLOOKUP(I11,Feiertage!$C$12:$D$53,2)),\"\")","v":""},"2025-06-07",{"$f":"IFERROR(IF(ISNA(VLOOKUP(K11,Feiertage!$C$12:$D$53,1,0)),VLOOKUP(K11,Feiertage!$C$12:$D$53,2,0),VLOOKUP(K11,Feiertage!$C$12:$D$53,2)),\"\")","v":""},"2025-07-07",{"$f":"IFERROR(IF(ISNA(VLOOKUP(M11,Feiertage!$C$12:$D$53,1,0)),VLOOKUP(M11,Feiertage!$C$12:$D$53,2,0),VLOOKUP(M11,Feiertage!$C$12:$D$53,2)),\"\")","v":""},"2025-08-07",{"$f":"IFERROR(IF(ISNA(VLOOKUP(O11,Feiertage!$C$12:$D$53,1,0)),VLOOKUP(O11,Feiertage!$C$12:$D$53,2,0),VLOOKUP(O11,Feiertage!$C$12:$D$53,2)),\"\")","v":""},"2025-09-07",{"$f":"IFERROR(IF(ISNA(VLOOKUP(Q11,Feiertage!$C$12:$D$53,1,0)),VLOOKUP(Q11,Feiertage!$C$12:$D$53,2,0),VLOOKUP(Q11,Feiertage!$C$12:$D$53,2)),\"\")","v":""},"2025-10-07",{"$f":"IFERROR(IF(ISNA(VLOOKUP(S11,Feiertage!$C$12:$D$53,1,0)),VLOOKUP(S11,Feiertage!$C$12:$D$53,2,0),VLOOKUP(S11,Feiertage!$C$12:$D$53,2)),\"\")","v":""},"2025-11-07",{"$f":"IFERROR(IF(ISNA(VLOOKUP(U11,Feiertage!$C$12:$D$53,1,0)),VLOOKUP(U11,Feiertage!$C$12:$D$53,2,0),VLOOKUP(U11,Feiertage!$C$12:$D$53,2)),\"\")","v":""},"2025-12-07",{"$f":"IFERROR(IF(ISNA(VLOOKUP(W11,Feiertage!$C$12:$D$53,1,0)),VLOOKUP(W11,Feiertage!$C$12:$D$53,2,0),VLOOKUP(W11,Feiertage!$C$12:$D$53,2)),\"\")","v":""}]
["2025-01-08",{"$f":"IFERROR(IF(ISNA(VLOOKUP(A12,Feiertage!$C$12:$D$53,1,0)),VLOOKUP(A12,Feiertage!$C$12:$D$53,2,0),VLOOKUP(A12,Feiertage!$C$12:$D$53,2)),\"\")","v":""},"2025-02-08",{"$f":"IFERROR(IF(ISNA(VLOOKUP(C12,Feiertage!$C$12:$D$53,1,0)),VLOOKUP(C12,Feiertage!$C$12:$D$53,2,0),VLOOKUP(C12,Feiertage!$C$12:$D$53,2)),\"\")","v":""},"2025-03-08",{"$f":"IFERROR(IF(ISNA(VLOOKUP(E12,Feiertage!$C$12:$D$53,1,0)),VLOOKUP(E12,Feiertage!$C$12:$D$53,2,0),VLOOKUP(E12,Feiertage!$C$12:$D$53,2)),\"\")","v":""},"2025-04-08",{"$f":"IFERROR(IF(ISNA(VLOOKUP(G12,Feiertage!$C$12:$D$53,1,0)),VLOOKUP(G12,Feiertage!$C$12:$D$53,2,0),VLOOKUP(G12,Feiertage!$C$12:$D$53,2)),\"\")","v":""},"2025-05-08",{"$f":"IFERROR(IF(ISNA(VLOOKUP(I12,Feiertage!$C$12:$D$53,1,0)),VLOOKUP(I12,Feiertage!$C$12:$D$53,2,0),VLOOKUP(I12,Feiertage!$C$12:$D$53,2)),\"\")","v":""},"2025-06-08",{"$f":"IFERROR(IF(ISNA(VLOOKUP(K12,Feiertage!$C$12:$D$53,1,0)),VLOOKUP(K12,Feiertage!$C$12:$D$53,2,0),VLOOKUP(K12,Feiertage!$C$12:$D$53,2)),\"\")","v":""},"2025-07-08",{"$f":"IFERROR(IF(ISNA(VLOOKUP(M12,Feiertage!$C$12:$D$53,1,0)),VLOOKUP(M12,Feiertage!$C$12:$D$53,2,0),VLOOKUP(M12,Feiertage!$C$12:$D$53,2)),\"\")","v":""},"2025-08-08",{"$f":"IFERROR(IF(ISNA(VLOOKUP(O12,Feiertage!$C$12:$D$53,1,0)),VLOOKUP(O12,Feiertage!$C$12:$D$53,2,0),VLOOKUP(O12,Feiertage!$C$12:$D$53,2)),\"\")","v":""},"2025-09-08",{"$f":"IFERROR(IF(ISNA(VLOOKUP(Q12,Feiertage!$C$12:$D$53,1,0)),VLOOKUP(Q12,Feiertage!$C$12:$D$53,2,0),VLOOKUP(Q12,Feiertage!$C$12:$D$53,2)),\"\")","v":""},"2025-10-08",{"$f":"IFERROR(IF(ISNA(VLOOKUP(S12,Feiertage!$C$12:$D$53,1,0)),VLOOKUP(S12,Feiertage!$C$12:$D$53,2,0),VLOOKUP(S12,Feiertage!$C$12:$D$53,2)),\"\")","v":""},"2025-11-08",{"$f":"IFERROR(IF(ISNA(VLOOKUP(U12,Feiertage!$C$12:$D$53,1,0)),VLOOKUP(U12,Feiertage!$C$12:$D$53,2,0),VLOOKUP(U12,Feiertage!$C$12:$D$53,2)),\"\")","v":""},"2025-12-08",{"$f":"IFERROR(IF(ISNA(VLOOKUP(W12,Feiertage!$C$12:$D$53,1,0)),VLOOKUP(W12,Feiertage!$C$12:$D$53,2,0),VLOOKUP(W12,Feiertage!$C$12:$D$53,2)),\"\")","v":""}]
["2025-01-09",{"$f":"IFERROR(IF(ISNA(VLOOKUP(A13,Feiertage!$C$12:$D$53,1,0)),VLOOKUP(A13,Feiertage!$C$12:$D$53,2,0),VLOOKUP(A13,Feiertage!$C$12:$D$53,2)),\"\")","v":""},"2025-02-09",{"$f":"IFERROR(IF(ISNA(VLOOKUP(C13,Feiertage!$C$12:$D$53,1,0)),VLOOKUP(C13,Feiertage!$C$12:$D$53,2,0),VLOOKUP(C13,Feiertage!$C$12:$D$53,2)),\"\")","v":""},"2025-03-09",{"$f":"IFERROR(IF(ISNA(VLOOKUP(E13,Feiertage!$C$12:$D$53,1,0)),VLOOKUP(E13,Feiertage!$C$12:$D$53,2,0),VLOOKUP(E13,Feiertage!$C$12:$D$53,2)),\"\")","v":""},"2025-04-09",{"$f":"IFERROR(IF(ISNA(VLOOKUP(G13,Feiertage!$C$12:$D$53,1,0)),VLOOKUP(G13,Feiertage!$C$12:$D$53,2,0),VLOOKUP(G13,Feiertage!$C$12:$D$53,2)),\"\")","v":""},"2025-05-09",{"$f":"IFERROR(IF(ISNA(VLOOKUP(I13,Feiertage!$C$12:$D$53,1,0)),VLOOKUP(I13,Feiertage!$C$12:$D$53,2,0),VLOOKUP(I13,Feiertage!$C$12:$D$53,2)),\"\")","v":""},"2025-06-09",{"$f":"IFERROR(IF(ISNA(VLOOKUP(K13,Feiertage!$C$12:$D$53,1,0)),VLOOKUP(K13,Feiertage!$C$12:$D$53,2,0),VLOOKUP(K13,Feiertage!$C$12:$D$53,2)),\"\")","v":"Pfingstmontag"},"2025-07-09",{"$f":"IFERROR(IF(ISNA(VLOOKUP(M13,Feiertage!$C$12:$D$53,1,0)),VLOOKUP(M13,Feiertage!$C$12:$D$53,2,0),VLOOKUP(M13,Feiertage!$C$12:$D$53,2)),\"\")","v":""},"2025-08-09",{"$f":"IFERROR(IF(ISNA(VLOOKUP(O13,Feiertage!$C$12:$D$53,1,0)),VLOOKUP(O13,Feiertage!$C$12:$D$53,2,0),VLOOKUP(O13,Feiertage!$C$12:$D$53,2)),\"\")","v":""},"2025-09-09",{"$f":"IFERROR(IF(ISNA(VLOOKUP(Q13,Feiertage!$C$12:$D$53,1,0)),VLOOKUP(Q13,Feiertage!$C$12:$D$53,2,0),VLOOKUP(Q13,Feiertage!$C$12:$D$53,2)),\"\")","v":""},"2025-10-09",{"$f":"IFERROR(IF(ISNA(VLOOKUP(S13,Feiertage!$C$12:$D$53,1,0)),VLOOKUP(S13,Feiertage!$C$12:$D$53,2,0),VLOOKUP(S13,Feiertage!$C$12:$D$53,2)),\"\")","v":""},"2025-11-09",{"$f":"IFERROR(IF(ISNA(VLOOKUP(U13,Feiertage!$C$12:$D$53,1,0)),VLOOKUP(U13,Feiertage!$C$12:$D$53,2,0),VLOOKUP(U13,Feiertage!$C$12:$D$53,2)),\"\")","v":""},"2025-12-09",{"$f":"IFERROR(IF(ISNA(VLOOKUP(W13,Feiertage!$C$12:$D$53,1,0)),VLOOKUP(W13,Feiertage!$C$12:$D$53,2,0),VLOOKUP(W13,Feiertage!$C$12:$D$53,2)),\"\")","v":""}]
["2025-01-10",{"$f":"IFERROR(IF(ISNA(VLOOKUP(A14,Feiertage!$C$12:$D$53,1,0)),VLOOKUP(A14,Feiertage!$C$12:$D$53,2,0),VLOOKUP(A14,Feiertage!$C$12:$D$53,2)),\"\")","v":""},"2025-02-10",{"$f":"IFERROR(IF(ISNA(VLOOKUP(C14,Feiertage!$C$12:$D$53,1,0)),VLOOKUP(C14,Feiertage!$C$12:$D$53,2,0),VLOOKUP(C14,Feiertage!$C$12:$D$53,2)),\"\")","v":""},"2025-03-10",{"$f":"IFERROR(IF(ISNA(VLOOKUP(E14,Feiertage!$C$12:$D$53,1,0)),VLOOKUP(E14,Feiertage!$C$12:$D$53,2,0),VLOOKUP(E14,Feiertage!$C$12:$D$53,2)),\"\")","v":""},"2025-04-10",{"$f":"IFERROR(IF(ISNA(VLOOKUP(G14,Feiertage!$C$12:$D$53,1,0)),VLOOKUP(G14,Feiertage!$C$12:$D$53,2,0),VLOOKUP(G14,Feiertage!$C$12:$D$53,2)),\"\")","v":""},"2025-05-10",{"$f":"IFERROR(IF(ISNA(VLOOKUP(I14,Feiertage!$C$12:$D$53,1,0)),VLOOKUP(I14,Feiertage!$C$12:$D$53,2,0),VLOOKUP(I14,Feiertage!$C$12:$D$53,2)),\"\")","v":""},"2025-06-10",{"$f":"IFERROR(IF(ISNA(VLOOKUP(K14,Feiertage!$C$12:$D$53,1,0)),VLOOKUP(K14,Feiertage!$C$12:$D$53,2,0),VLOOKUP(K14,Feiertage!$C$12:$D$53,2)),\"\")","v":""},"2025-07-10",{"$f":"IFERROR(IF(ISNA(VLOOKUP(M14,Feiertage!$C$12:$D$53,1,0)),VLOOKUP(M14,Feiertage!$C$12:$D$53,2,0),VLOOKUP(M14,Feiertage!$C$12:$D$53,2)),\"\")","v":""},"2025-08-10",{"$f":"IFERROR(IF(ISNA(VLOOKUP(O14,Feiertage!$C$12:$D$53,1,0)),VLOOKUP(O14,Feiertage!$C$12:$D$53,2,0),VLOOKUP(O14,Feiertage!$C$12:$D$53,2)),\"\")","v":""},"2025-09-10",{"$f":"IFERROR(IF(ISNA(VLOOKUP(Q14,Feiertage!$C$12:$D$53,1,0)),VLOOKUP(Q14,Feiertage!$C$12:$D$53,2,0),VLOOKUP(Q14,Feiertage!$C$12:$D$53,2)),\"\")","v":""},"2025-10-10",{"$f":"IFERROR(IF(ISNA(VLOOKUP(S14,Feiertage!$C$12:$D$53,1,0)),VLOOKUP(S14,Feiertage!$C$12:$D$53,2,0),VLOOKUP(S14,Feiertage!$C$12:$D$53,2)),\"\")","v":""},"2025-11-10",{"$f":"IFERROR(IF(ISNA(VLOOKUP(U14,Feiertage!$C$12:$D$53,1,0)),VLOOKUP(U14,Feiertage!$C$12:$D$53,2,0),VLOOKUP(U14,Feiertage!$C$12:$D$53,2)),\"\")","v":""},"2025-12-10",{"$f":"IFERROR(IF(ISNA(VLOOKUP(W14,Feiertage!$C$12:$D$53,1,0)),VLOOKUP(W14,Feiertage!$C$12:$D$53,2,0),VLOOKUP(W14,Feiertage!$C$12:$D$53,2)),\"\")","v":""}]
["2025-01-11",{"$f":"IFERROR(IF(ISNA(VLOOKUP(A15,Feiertage!$C$12:$D$53,1,0)),VLOOKUP(A15,Feiertage!$C$12:$D$53,2,0),VLOOKUP(A15,Feiertage!$C$12:$D$53,2)),\"\")","v":""},"2025-02-11",{"$f":"IFERROR(IF(ISNA(VLOOKUP(C15,Feiertage!$C$12:$D$53,1,0)),VLOOKUP(C15,Feiertage!$C$12:$D$53,2,0),VLOOKUP(C15,Feiertage!$C$12:$D$53,2)),\"\")","v":""},"2025-03-11",{"$f":"IFERROR(IF(ISNA(VLOOKUP(E15,Feiertage!$C$12:$D$53,1,0)),VLOOKUP(E15,Feiertage!$C$12:$D$53,2,0),VLOOKUP(E15,Feiertage!$C$12:$D$53,2)),\"\")","v":""},"2025-04-11",{"$f":"IFERROR(IF(ISNA(VLOOKUP(G15,Feiertage!$C$12:$D$53,1,0)),VLOOKUP(G15,Feiertage!$C$12:$D$53,2,0),VLOOKUP(G15,Feiertage!$C$12:$D$53,2)),\"\")","v":""},"2025-05-11",{"$f":"IFERROR(IF(ISNA(VLOOKUP(I15,Feiertage!$C$12:$D$53,1,0)),VLOOKUP(I15,Feiertage!$C$12:$D$53,2,0),VLOOKUP(I15,Feiertage!$C$12:$D$53,2)),\"\")","v":""},"2025-06-11",{"$f":"IFERROR(IF(ISNA(VLOOKUP(K15,Feiertage!$C$12:$D$53,1,0)),VLOOKUP(K15,Feiertage!$C$12:$D$53,2,0),VLOOKUP(K15,Feiertage!$C$12:$D$53,2)),\"\")","v":""},"2025-07-11",{"$f":"IFERROR(IF(ISNA(VLOOKUP(M15,Feiertage!$C$12:$D$53,1,0)),VLOOKUP(M15,Feiertage!$C$12:$D$53,2,0),VLOOKUP(M15,Feiertage!$C$12:$D$53,2)),\"\")","v":""},"2025-08-11",{"$f":"IFERROR(IF(ISNA(VLOOKUP(O15,Feiertage!$C$12:$D$53,1,0)),VLOOKUP(O15,Feiertage!$C$12:$D$53,2,0),VLOOKUP(O15,Feiertage!$C$12:$D$53,2)),\"\")","v":""},"2025-09-11",{"$f":"IFERROR(IF(ISNA(VLOOKUP(Q15,Feiertage!$C$12:$D$53,1,0)),VLOOKUP(Q15,Feiertage!$C$12:$D$53,2,0),VLOOKUP(Q15,Feiertage!$C$12:$D$53,2)),\"\")","v":""},"2025-10-11",{"$f":"IFERROR(IF(ISNA(VLOOKUP(S15,Feiertage!$C$12:$D$53,1,0)),VLOOKUP(S15,Feiertage!$C$12:$D$53,2,0),VLOOKUP(S15,Feiertage!$C$12:$D$53,2)),\"\")","v":""},"2025-11-11",{"$f":"IFERROR(IF(ISNA(VLOOKUP(U15,Feiertage!$C$12:$D$53,1,0)),VLOOKUP(U15,Feiertage!$C$12:$D$53,2,0),VLOOKUP(U15,Feiertage!$C$12:$D$53,2)),\"\")","v":""},"2025-12-11",{"$f":"IFERROR(IF(ISNA(VLOOKUP(W15,Feiertage!$C$12:$D$53,1,0)),VLOOKUP(W15,Feiertage!$C$12:$D$53,2,0),VLOOKUP(W15,Feiertage!$C$12:$D$53,2)),\"\")","v":""}]
["2025-01-12",{"$f":"IFERROR(IF(ISNA(VLOOKUP(A16,Feiertage!$C$12:$D$53,1,0)),VLOOKUP(A16,Feiertage!$C$12:$D$53,2,0),VLOOKUP(A16,Feiertage!$C$12:$D$53,2)),\"\")","v":""},"2025-02-12",{"$f":"IFERROR(IF(ISNA(VLOOKUP(C16,Feiertage!$C$12:$D$53,1,0)),VLOOKUP(C16,Feiertage!$C$12:$D$53,2,0),VLOOKUP(C16,Feiertage!$C$12:$D$53,2)),\"\")","v":""},"2025-03-12",{"$f":"IFERROR(IF(ISNA(VLOOKUP(E16,Feiertage!$C$12:$D$53,1,0)),VLOOKUP(E16,Feiertage!$C$12:$D$53,2,0),VLOOKUP(E16,Feiertage!$C$12:$D$53,2)),\"\")","v":""},"2025-04-12",{"$f":"IFERROR(IF(ISNA(VLOOKUP(G16,Feiertage!$C$12:$D$53,1,0)),VLOOKUP(G16,Feiertage!$C$12:$D$53,2,0),VLOOKUP(G16,Feiertage!$C$12:$D$53,2)),\"\")","v":""},"2025-05-12",{"$f":"IFERROR(IF(ISNA(VLOOKUP(I16,Feiertage!$C$12:$D$53,1,0)),VLOOKUP(I16,Feiertage!$C$12:$D$53,2,0),VLOOKUP(I16,Feiertage!$C$12:$D$53,2)),\"\")","v":""},"2025-06-12",{"$f":"IFERROR(IF(ISNA(VLOOKUP(K16,Feiertage!$C$12:$D$53,1,0)),VLOOKUP(K16,Feiertage!$C$12:$D$53,2,0),VLOOKUP(K16,Feiertage!$C$12:$D$53,2)),\"\")","v":""},"2025-07-12",{"$f":"IFERROR(IF(ISNA(VLOOKUP(M16,Feiertage!$C$12:$D$53,1,0)),VLOOKUP(M16,Feiertage!$C$12:$D$53,2,0),VLOOKUP(M16,Feiertage!$C$12:$D$53,2)),\"\")","v":""},"2025-08-12",{"$f":"IFERROR(IF(ISNA(VLOOKUP(O16,Feiertage!$C$12:$D$53,1,0)),VLOOKUP(O16,Feiertage!$C$12:$D$53,2,0),VLOOKUP(O16,Feiertage!$C$12:$D$53,2)),\"\")","v":""},"2025-09-12",{"$f":"IFERROR(IF(ISNA(VLOOKUP(Q16,Feiertage!$C$12:$D$53,1,0)),VLOOKUP(Q16,Feiertage!$C$12:$D$53,2,0),VLOOKUP(Q16,Feiertage!$C$12:$D$53,2)),\"\")","v":""},"2025-10-12",{"$f":"IFERROR(IF(ISNA(VLOOKUP(S16,Feiertage!$C$12:$D$53,1,0)),VLOOKUP(S16,Feiertage!$C$12:$D$53,2,0),VLOOKUP(S16,Feiertage!$C$12:$D$53,2)),\"\")","v":""},"2025-11-12",{"$f":"IFERROR(IF(ISNA(VLOOKUP(U16,Feiertage!$C$12:$D$53,1,0)),VLOOKUP(U16,Feiertage!$C$12:$D$53,2,0),VLOOKUP(U16,Feiertage!$C$12:$D$53,2)),\"\")","v":""},"2025-12-12",{"$f":"IFERROR(IF(ISNA(VLOOKUP(W16,Feiertage!$C$12:$D$53,1,0)),VLOOKUP(W16,Feiertage!$C$12:$D$53,2,0),VLOOKUP(W16,Feiertage!$C$12:$D$53,2)),\"\")","v":""}]
["2025-01-13",{"$f":"IFERROR(IF(ISNA(VLOOKUP(A17,Feiertage!$C$12:$D$53,1,0)),VLOOKUP(A17,Feiertage!$C$12:$D$53,2,0),VLOOKUP(A17,Feiertage!$C$12:$D$53,2)),\"\")","v":""},"2025-02-13",{"$f":"IFERROR(IF(ISNA(VLOOKUP(C17,Feiertage!$C$12:$D$53,1,0)),VLOOKUP(C17,Feiertage!$C$12:$D$53,2,0),VLOOKUP(C17,Feiertage!$C$12:$D$53,2)),\"\")","v":""},"2025-03-13",{"$f":"IFERROR(IF(ISNA(VLOOKUP(E17,Feiertage!$C$12:$D$53,1,0)),VLOOKUP(E17,Feiertage!$C$12:$D$53,2,0),VLOOKUP(E17,Feiertage!$C$12:$D$53,2)),\"\")","v":""},"2025-04-13",{"$f":"IFERROR(IF(ISNA(VLOOKUP(G17,Feiertage!$C$12:$D$53,1,0)),VLOOKUP(G17,Feiertage!$C$12:$D$53,2,0),VLOOKUP(G17,Feiertage!$C$12:$D$53,2)),\"\")","v":""},"2025-05-13",{"$f":"IFERROR(IF(ISNA(VLOOKUP(I17,Feiertage!$C$12:$D$53,1,0)),VLOOKUP(I17,Feiertage!$C$12:$D$53,2,0),VLOOKUP(I17,Feiertage!$C$12:$D$53,2)),\"\")","v":""},"2025-06-13",{"$f":"IFERROR(IF(ISNA(VLOOKUP(K17,Feiertage!$C$12:$D$53,1,0)),VLOOKUP(K17,Feiertage!$C$12:$D$53,2,0),VLOOKUP(K17,Feiertage!$C$12:$D$53,2)),\"\")","v":""},"2025-07-13",{"$f":"IFERROR(IF(ISNA(VLOOKUP(M17,Feiertage!$C$12:$D$53,1,0)),VLOOKUP(M17,Feiertage!$C$12:$D$53,2,0),VLOOKUP(M17,Feiertage!$C$12:$D$53,2)),\"\")","v":""},"2025-08-13",{"$f":"IFERROR(IF(ISNA(VLOOKUP(O17,Feiertage!$C$12:$D$53,1,0)),VLOOKUP(O17,Feiertage!$C$12:$D$53,2,0),VLOOKUP(O17,Feiertage!$C$12:$D$53,2)),\"\")","v":""},"2025-09-13",{"$f":"IFERROR(IF(ISNA(VLOOKUP(Q17,Feiertage!$C$12:$D$53,1,0)),VLOOKUP(Q17,Feiertage!$C$12:$D$53,2,0),VLOOKUP(Q17,Feiertage!$C$12:$D$53,2)),\"\")","v":""},"2025-10-13",{"$f":"IFERROR(IF(ISNA(VLOOKUP(S17,Feiertage!$C$12:$D$53,1,0)),VLOOKUP(S17,Feiertage!$C$12:$D$53,2,0),VLOOKUP(S17,Feiertage!$C$12:$D$53,2)),\"\")","v":""},"2025-11-13",{"$f":"IFERROR(IF(ISNA(VLOOKUP(U17,Feiertage!$C$12:$D$53,1,0)),VLOOKUP(U17,Feiertage!$C$12:$D$53,2,0),VLOOKUP(U17,Feiertage!$C$12:$D$53,2)),\"\")","v":""},"2025-12-13",{"$f":"IFERROR(IF(ISNA(VLOOKUP(W17,Feiertage!$C$12:$D$53,1,0)),VLOOKUP(W17,Feiertage!$C$12:$D$53,2,0),VLOOKUP(W17,Feiertage!$C$12:$D$53,2)),\"\")","v":""}]
["2025-01-14",{"$f":"IFERROR(IF(ISNA(VLOOKUP(A18,Feiertage!$C$12:$D$53,1,0)),VLOOKUP(A18,Feiertage!$C$12:$D$53,2,0),VLOOKUP(A18,Feiertage!$C$12:$D$53,2)),\"\")","v":""},"2025-02-14",{"$f":"IFERROR(IF(ISNA(VLOOKUP(C18,Feiertage!$C$12:$D$53,1,0)),VLOOKUP(C18,Feiertage!$C$12:$D$53,2,0),VLOOKUP(C18,Feiertage!$C$12:$D$53,2)),\"\")","v":""},"2025-03-14",{"$f":"IFERROR(IF(ISNA(VLOOKUP(E18,Feiertage!$C$12:$D$53,1,0)),VLOOKUP(E18,Feiertage!$C$12:$D$53,2,0),VLOOKUP(E18,Feiertage!$C$12:$D$53,2)),\"\")","v":""},"2025-04-14",{"$f":"IFERROR(IF(ISNA(VLOOKUP(G18,Feiertage!$C$12:$D$53,1,0)),VLOOKUP(G18,Feiertage!$C$12:$D$53,2,0),VLOOKUP(G18,Feiertage!$C$12:$D$53,2)),\"\")","v":""},"2025-05-14",{"$f":"IFERROR(IF(ISNA(VLOOKUP(I18,Feiertage!$C$12:$D$53,1,0)),VLOOKUP(I18,Feiertage!$C$12:$D$53,2,0),VLOOKUP(I18,Feiertage!$C$12:$D$53,2)),\"\")","v":""},"2025-06-14",{"$f":"IFERROR(IF(ISNA(VLOOKUP(K18,Feiertage!$C$12:$D$53,1,0)),VLOOKUP(K18,Feiertage!$C$12:$D$53,2,0),VLOOKUP(K18,Feiertage!$C$12:$D$53,2)),\"\")","v":""},"2025-07-14",{"$f":"IFERROR(IF(ISNA(VLOOKUP(M18,Feiertage!$C$12:$D$53,1,0)),VLOOKUP(M18,Feiertage!$C$12:$D$53,2,0),VLOOKUP(M18,Feiertage!$C$12:$D$53,2)),\"\")","v":""},"2025-08-14",{"$f":"IFERROR(IF(ISNA(VLOOKUP(O18,Feiertage!$C$12:$D$53,1,0)),VLOOKUP(O18,Feiertage!$C$12:$D$53,2,0),VLOOKUP(O18,Feiertage!$C$12:$D$53,2)),\"\")","v":""},"2025-09-14",{"$f":"IFERROR(IF(ISNA(VLOOKUP(Q18,Feiertage!$C$12:$D$53,1,0)),VLOOKUP(Q18,Feiertage!$C$12:$D$53,2,0),VLOOKUP(Q18,Feiertage!$C$12:$D$53,2)),\"\")","v":""},"2025-10-14",{"$f":"IFERROR(IF(ISNA(VLOOKUP(S18,Feiertage!$C$12:$D$53,1,0)),VLOOKUP(S18,Feiertage!$C$12:$D$53,2,0),VLOOKUP(S18,Feiertage!$C$12:$D$53,2)),\"\")","v":""},"2025-11-14",{"$f":"IFERROR(IF(ISNA(VLOOKUP(U18,Feiertage!$C$12:$D$53,1,0)),VLOOKUP(U18,Feiertage!$C$12:$D$53,2,0),VLOOKUP(U18,Feiertage!$C$12:$D$53,2)),\"\")","v":""},"2025-12-14",{"$f":"IFERROR(IF(ISNA(VLOOKUP(W18,Feiertage!$C$12:$D$53,1,0)),VLOOKUP(W18,Feiertage!$C$12:$D$53,2,0),VLOOKUP(W18,Feiertage!$C$12:$D$53,2)),\"\")","v":""}]
["2025-01-15",{"$f":"IFERROR(IF(ISNA(VLOOKUP(A19,Feiertage!$C$12:$D$53,1,0)),VLOOKUP(A19,Feiertage!$C$12:$D$53,2,0),VLOOKUP(A19,Feiertage!$C$12:$D$53,2)),\"\")","v":""},"2025-02-15",{"$f":"IFERROR(IF(ISNA(VLOOKUP(C19,Feiertage!$C$12:$D$53,1,0)),VLOOKUP(C19,Feiertage!$C$12:$D$53,2,0),VLOOKUP(C19,Feiertage!$C$12:$D$53,2)),\"\")","v":""},"2025-03-15",{"$f":"IFERROR(IF(ISNA(VLOOKUP(E19,Feiertage!$C$12:$D$53,1,0)),VLOOKUP(E19,Feiertage!$C$12:$D$53,2,0),VLOOKUP(E19,Feiertage!$C$12:$D$53,2)),\"\")","v":""},"2025-04-15",{"$f":"IFERROR(IF(ISNA(VLOOKUP(G19,Feiertage!$C$12:$D$53,1,0)),VLOOKUP(G19,Feiertage!$C$12:$D$53,2,0),VLOOKUP(G19,Feiertage!$C$12:$D$53,2)),\"\")","v":""},"2025-05-15",{"$f":"IFERROR(IF(ISNA(VLOOKUP(I19,Feiertage!$C$12:$D$53,1,0)),VLOOKUP(I19,Feiertage!$C$12:$D$53,2,0),VLOOKUP(I19,Feiertage!$C$12:$D$53,2)),\"\")","v":""},"2025-06-15",{"$f":"IFERROR(IF(ISNA(VLOOKUP(K19,Feiertage!$C$12:$D$53,1,0)),VLOOKUP(K19,Feiertage!$C$12:$D$53,2,0),VLOOKUP(K19,Feiertage!$C$12:$D$53,2)),\"\")","v":""},"2025-07-15",{"$f":"IFERROR(IF(ISNA(VLOOKUP(M19,Feiertage!$C$12:$D$53,1,0)),VLOOKUP(M19,Feiertage!$C$12:$D$53,2,0),VLOOKUP(M19,Feiertage!$C$12:$D$53,2)),\"\")","v":""},"2025-08-15",{"$f":"IFERROR(IF(ISNA(VLOOKUP(O19,Feiertage!$C$12:$D$53,1,0)),VLOOKUP(O19,Feiertage!$C$12:$D$53,2,0),VLOOKUP(O19,Feiertage!$C$12:$D$53,2)),\"\")","v":""},"2025-09-15",{"$f":"IFERROR(IF(ISNA(VLOOKUP(Q19,Feiertage!$C$12:$D$53,1,0)),VLOOKUP(Q19,Feiertage!$C$12:$D$53,2,0),VLOOKUP(Q19,Feiertage!$C$12:$D$53,2)),\"\")","v":""},"2025-10-15",{"$f":"IFERROR(IF(ISNA(VLOOKUP(S19,Feiertage!$C$12:$D$53,1,0)),VLOOKUP(S19,Feiertage!$C$12:$D$53,2,0),VLOOKUP(S19,Feiertage!$C$12:$D$53,2)),\"\")","v":""},"2025-11-15",{"$f":"IFERROR(IF(ISNA(VLOOKUP(U19,Feiertage!$C$12:$D$53,1,0)),VLOOKUP(U19,Feiertage!$C$12:$D$53,2,0),VLOOKUP(U19,Feiertage!$C$12:$D$53,2)),\"\")","v":""},"2025-12-15",{"$f":"IFERROR(IF(ISNA(VLOOKUP(W19,Feiertage!$C$12:$D$53,1,0)),VLOOKUP(W19,Feiertage!$C$12:$D$53,2,0),VLOOKUP(W19,Feiertage!$C$12:$D$53,2)),\"\")","v":""}]
["2025-01-16",{"$f":"IFERROR(IF(ISNA(VLOOKUP(A20,Feiertage!$C$12:$D$53,1,0)),VLOOKUP(A20,Feiertage!$C$12:$D$53,2,0),VLOOKUP(A20,Feiertage!$C$12:$D$53,2)),\"\")","v":""},"2025-02-16",{"$f":"IFERROR(IF(ISNA(VLOOKUP(C20,Feiertage!$C$12:$D$53,1,0)),VLOOKUP(C20,Feiertage!$C$12:$D$53,2,0),VLOOKUP(C20,Feiertage!$C$12:$D$53,2)),\"\")","v":""},"2025-03-16",{"$f":"IFERROR(IF(ISNA(VLOOKUP(E20,Feiertage!$C$12:$D$53,1,0)),VLOOKUP(E20,Feiertage!$C$12:$D$53,2,0),VLOOKUP(E20,Feiertage!$C$12:$D$53,2)),\"\")","v":""},"2025-04-16",{"$f":"IFERROR(IF(ISNA(VLOOKUP(G20,Feiertage!$C$12:$D$53,1,0)),VLOOKUP(G20,Feiertage!$C$12:$D$53,2,0),VLOOKUP(G20,Feiertage!$C$12:$D$53,2)),\"\")","v":""},"2025-05-16",{"$f":"IFERROR(IF(ISNA(VLOOKUP(I20,Feiertage!$C$12:$D$53,1,0)),VLOOKUP(I20,Feiertage!$C$12:$D$53,2,0),VLOOKUP(I20,Feiertage!$C$12:$D$53,2)),\"\")","v":""},"2025-06-16",{"$f":"IFERROR(IF(ISNA(VLOOKUP(K20,Feiertage!$C$12:$D$53,1,0)),VLOOKUP(K20,Feiertage!$C$12:$D$53,2,0),VLOOKUP(K20,Feiertage!$C$12:$D$53,2)),\"\")","v":""},"2025-07-16",{"$f":"IFERROR(IF(ISNA(VLOOKUP(M20,Feiertage!$C$12:$D$53,1,0)),VLOOKUP(M20,Feiertage!$C$12:$D$53,2,0),VLOOKUP(M20,Feiertage!$C$12:$D$53,2)),\"\")","v":""},"2025-08-16",{"$f":"IFERROR(IF(ISNA(VLOOKUP(O20,Feiertage!$C$12:$D$53,1,0)),VLOOKUP(O20,Feiertage!$C$12:$D$53,2,0),VLOOKUP(O20,Feiertage!$C$12:$D$53,2)),\"\")","v":""},"2025-09-16",{"$f":"IFERROR(IF(ISNA(VLOOKUP(Q20,Feiertage!$C$12:$D$53,1,0)),VLOOKUP(Q20,Feiertage!$C$12:$D$53,2,0),VLOOKUP(Q20,Feiertage!$C$12:$D$53,2)),\"\")","v":""},"2025-10-16",{"$f":"IFERROR(IF(ISNA(VLOOKUP(S20,Feiertage!$C$12:$D$53,1,0)),VLOOKUP(S20,Feiertage!$C$12:$D$53,2,0),VLOOKUP(S20,Feiertage!$C$12:$D$53,2)),\"\")","v":""},"2025-11-16",{"$f":"IFERROR(IF(ISNA(VLOOKUP(U20,Feiertage!$C$12:$D$53,1,0)),VLOOKUP(U20,Feiertage!$C$12:$D$53,2,0),VLOOKUP(U20,Feiertage!$C$12:$D$53,2)),\"\")","v":""},"2025-12-16",{"$f":"IFERROR(IF(ISNA(VLOOKUP(W20,Feiertage!$C$12:$D$53,1,0)),VLOOKUP(W20,Feiertage!$C$12:$D$53,2,0),VLOOKUP(W20,Feiertage!$C$12:$D$53,2)),\"\")","v":""}]
["2025-01-17",{"$f":"IFERROR(IF(ISNA(VLOOKUP(A21,Feiertage!$C$12:$D$53,1,0)),VLOOKUP(A21,Feiertage!$C$12:$D$53,2,0),VLOOKUP(A21,Feiertage!$C$12:$D$53,2)),\"\")","v":""},"2025-02-17",{"$f":"IFERROR(IF(ISNA(VLOOKUP(C21,Feiertage!$C$12:$D$53,1,0)),VLOOKUP(C21,Feiertage!$C$12:$D$53,2,0),VLOOKUP(C21,Feiertage!$C$12:$D$53,2)),\"\")","v":""},"2025-03-17",{"$f":"IFERROR(IF(ISNA(VLOOKUP(E21,Feiertage!$C$12:$D$53,1,0)),VLOOKUP(E21,Feiertage!$C$12:$D$53,2,0),VLOOKUP(E21,Feiertage!$C$12:$D$53,2)),\"\")","v":""},"2025-04-17",{"$f":"IFERROR(IF(ISNA(VLOOKUP(G21,Feiertage!$C$12:$D$53,1,0)),VLOOKUP(G21,Feiertage!$C$12:$D$53,2,0),VLOOKUP(G21,Feiertage!$C$12:$D$53,2)),\"\")","v":""},"2025-05-17",{"$f":"IFERROR(IF(ISNA(VLOOKUP(I21,Feiertage!$C$12:$D$53,1,0)),VLOOKUP(I21,Feiertage!$C$12:$D$53,2,0),VLOOKUP(I21,Feiertage!$C$12:$D$53,2)),\"\")","v":""},"2025-06-17",{"$f":"IFERROR(IF(ISNA(VLOOKUP(K21,Feiertage!$C$12:$D$53,1,0)),VLOOKUP(K21,Feiertage!$C$12:$D$53,2,0),VLOOKUP(K21,Feiertage!$C$12:$D$53,2)),\"\")","v":""},"2025-07-17",{"$f":"IFERROR(IF(ISNA(VLOOKUP(M21,Feiertage!$C$12:$D$53,1,0)),VLOOKUP(M21,Feiertage!$C$12:$D$53,2,0),VLOOKUP(M21,Feiertage!$C$12:$D$53,2)),\"\")","v":""},"2025-08-17",{"$f":"IFERROR(IF(ISNA(VLOOKUP(O21,Feiertage!$C$12:$D$53,1,0)),VLOOKUP(O21,Feiertage!$C$12:$D$53,2,0),VLOOKUP(O21,Feiertage!$C$12:$D$53,2)),\"\")","v":""},"2025-09-17",{"$f":"IFERROR(IF(ISNA(VLOOKUP(Q21,Feiertage!$C$12:$D$53,1,0)),VLOOKUP(Q21,Feiertage!$C$12:$D$53,2,0),VLOOKUP(Q21,Feiertage!$C$12:$D$53,2)),\"\")","v":""},"2025-10-17",{"$f":"IFERROR(IF(ISNA(VLOOKUP(S21,Feiertage!$C$12:$D$53,1,0)),VLOOKUP(S21,Feiertage!$C$12:$D$53,2,0),VLOOKUP(S21,Feiertage!$C$12:$D$53,2)),\"\")","v":""},"2025-11-17",{"$f":"IFERROR(IF(ISNA(VLOOKUP(U21,Feiertage!$C$12:$D$53,1,0)),VLOOKUP(U21,Feiertage!$C$12:$D$53,2,0),VLOOKUP(U21,Feiertage!$C$12:$D$53,2)),\"\")","v":""},"2025-12-17",{"$f":"IFERROR(IF(ISNA(VLOOKUP(W21,Feiertage!$C$12:$D$53,1,0)),VLOOKUP(W21,Feiertage!$C$12:$D$53,2,0),VLOOKUP(W21,Feiertage!$C$12:$D$53,2)),\"\")","v":""}]
["2025-01-18",{"$f":"IFERROR(IF(ISNA(VLOOKUP(A22,Feiertage!$C$12:$D$53,1,0)),VLOOKUP(A22,Feiertage!$C$12:$D$53,2,0),VLOOKUP(A22,Feiertage!$C$12:$D$53,2)),\"\")","v":""},"2025-02-18",{"$f":"IFERROR(IF(ISNA(VLOOKUP(C22,Feiertage!$C$12:$D$53,1,0)),VLOOKUP(C22,Feiertage!$C$12:$D$53,2,0),VLOOKUP(C22,Feiertage!$C$12:$D$53,2)),\"\")","v":""},"2025-03-18",{"$f":"IFERROR(IF(ISNA(VLOOKUP(E22,Feiertage!$C$12:$D$53,1,0)),VLOOKUP(E22,Feiertage!$C$12:$D$53,2,0),VLOOKUP(E22,Feiertage!$C$12:$D$53,2)),\"\")","v":""},"2025-04-18",{"$f":"IFERROR(IF(ISNA(VLOOKUP(G22,Feiertage!$C$12:$D$53,1,0)),VLOOKUP(G22,Feiertage!$C$12:$D$53,2,0),VLOOKUP(G22,Feiertage!$C$12:$D$53,2)),\"\")","v":"Karfreitag"},"2025-05-18",{"$f":"IFERROR(IF(ISNA(VLOOKUP(I22,Feiertage!$C$12:$D$53,1,0)),VLOOKUP(I22,Feiertage!$C$12:$D$53,2,0),VLOOKUP(I22,Feiertage!$C$12:$D$53,2)),\"\")","v":""},"2025-06-18",{"$f":"IFERROR(IF(ISNA(VLOOKUP(K22,Feiertage!$C$12:$D$53,1,0)),VLOOKUP(K22,Feiertage!$C$12:$D$53,2,0),VLOOKUP(K22,Feiertage!$C$12:$D$53,2)),\"\")","v":""},"2025-07-18",{"$f":"IFERROR(IF(ISNA(VLOOKUP(M22,Feiertage!$C$12:$D$53,1,0)),VLOOKUP(M22,Feiertage!$C$12:$D$53,2,0),VLOOKUP(M22,Feiertage!$C$12:$D$53,2)),\"\")","v":""},"2025-08-18",{"$f":"IFERROR(IF(ISNA(VLOOKUP(O22,Feiertage!$C$12:$D$53,1,0)),VLOOKUP(O22,Feiertage!$C$12:$D$53,2,0),VLOOKUP(O22,Feiertage!$C$12:$D$53,2)),\"\")","v":""},"2025-09-18",{"$f":"IFERROR(IF(ISNA(VLOOKUP(Q22,Feiertage!$C$12:$D$53,1,0)),VLOOKUP(Q22,Feiertage!$C$12:$D$53,2,0),VLOOKUP(Q22,Feiertage!$C$12:$D$53,2)),\"\")","v":""},"2025-10-18",{"$f":"IFERROR(IF(ISNA(VLOOKUP(S22,Feiertage!$C$12:$D$53,1,0)),VLOOKUP(S22,Feiertage!$C$12:$D$53,2,0),VLOOKUP(S22,Feiertage!$C$12:$D$53,2)),\"\")","v":""},"2025-11-18",{"$f":"IFERROR(IF(ISNA(VLOOKUP(U22,Feiertage!$C$12:$D$53,1,0)),VLOOKUP(U22,Feiertage!$C$12:$D$53,2,0),VLOOKUP(U22,Feiertage!$C$12:$D$53,2)),\"\")","v":""},"2025-12-18",{"$f":"IFERROR(IF(ISNA(VLOOKUP(W22,Feiertage!$C$12:$D$53,1,0)),VLOOKUP(W22,Feiertage!$C$12:$D$53,2,0),VLOOKUP(W22,Feiertage!$C$12:$D$53,2)),\"\")","v":""}]
["2025-01-19",{"$f":"IFERROR(IF(ISNA(VLOOKUP(A23,Feiertage!$C$12:$D$53,1,0)),VLOOKUP(A23,Feiertage!$C$12:$D$53,2,0),VLOOKUP(A23,Feiertage!$C$12:$D$53,2)),\"\")","v":""},"2025-02-19",{"$f":"IFERROR(IF(ISNA(VLOOKUP(C23,Feiertage!$C$12:$D$53,1,0)),VLOOKUP(C23,Feiertage!$C$12:$D$53,2,0),VLOOKUP(C23,Feiertage!$C$12:$D$53,2)),\"\")","v":""},"2025-03-19",{"$f":"IFERROR(IF(ISNA(VLOOKUP(E23,Feiertage!$C$12:$D$53,1,0)),VLOOKUP(E23,Feiertage!$C$12:$D$53,2,0),VLOOKUP(E23,Feiertage!$C$12:$D$53,2)),\"\")","v":""},"2025-04-19",{"$f":"IFERROR(IF(ISNA(VLOOKUP(G23,Feiertage!$C$12:$D$53,1,0)),VLOOKUP(G23,Feiertage!$C$12:$D$53,2,0),VLOOKUP(G23,Feiertage!$C$12:$D$53,2)),\"\")","v":""},"2025-05-19",{"$f":"IFERROR(IF(ISNA(VLOOKUP(I23,Feiertage!$C$12:$D$53,1,0)),VLOOKUP(I23,Feiertage!$C$12:$D$53,2,0),VLOOKUP(I23,Feiertage!$C$12:$D$53,2)),\"\")","v":""},"2025-06-19",{"$f":"IFERROR(IF(ISNA(VLOOKUP(K23,Feiertage!$C$12:$D$53,1,0)),VLOOKUP(K23,Feiertage!$C$12:$D$53,2,0),VLOOKUP(K23,Feiertage!$C$12:$D$53,2)),\"\")","v":""},"2025-07-19",{"$f":"IFERROR(IF(ISNA(VLOOKUP(M23,Feiertage!$C$12:$D$53,1,0)),VLOOKUP(M23,Feiertage!$C$12:$D$53,2,0),VLOOKUP(M23,Feiertage!$C$12:$D$53,2)),\"\")","v":""},"2025-08-19",{"$f":"IFERROR(IF(ISNA(VLOOKUP(O23,Feiertage!$C$12:$D$53,1,0)),VLOOKUP(O23,Feiertage!$C$12:$D$53,2,0),VLOOKUP(O23,Feiertage!$C$12:$D$53,2)),\"\")","v":""},"2025-09-19",{"$f":"IFERROR(IF(ISNA(VLOOKUP(Q23,Feiertage!$C$12:$D$53,1,0)),VLOOKUP(Q23,Feiertage!$C$12:$D$53,2,0),VLOOKUP(Q23,Feiertage!$C$12:$D$53,2)),\"\")","v":""},"2025-10-19",{"$f":"IFERROR(IF(ISNA(VLOOKUP(S23,Feiertage!$C$12:$D$53,1,0)),VLOOKUP(S23,Feiertage!$C$12:$D$53,2,0),VLOOKUP(S23,Feiertage!$C$12:$D$53,2)),\"\")","v":""},"2025-11-19",{"$f":"IFERROR(IF(ISNA(VLOOKUP(U23,Feiertage!$C$12:$D$53,1,0)),VLOOKUP(U23,Feiertage!$C$12:$D$53,2,0),VLOOKUP(U23,Feiertage!$C$12:$D$53,2)),\"\")","v":""},"2025-12-19",{"$f":"IFERROR(IF(ISNA(VLOOKUP(W23,Feiertage!$C$12:$D$53,1,0)),VLOOKUP(W23,Feiertage!$C$12:$D$53,2,0),VLOOKUP(W23,Feiertage!$C$12:$D$53,2)),\"\")","v":""}]
["2025-01-20",{"$f":"IFERROR(IF(ISNA(VLOOKUP(A24,Feiertage!$C$12:$D$53,1,0)),VLOOKUP(A24,Feiertage!$C$12:$D$53,2,0),VLOOKUP(A24,Feiertage!$C$12:$D$53,2)),\"\")","v":""},"2025-02-20",{"$f":"IFERROR(IF(ISNA(VLOOKUP(C24,Feiertage!$C$12:$D$53,1,0)),VLOOKUP(C24,Feiertage!$C$12:$D$53,2,0),VLOOKUP(C24,Feiertage!$C$12:$D$53,2)),\"\")","v":""},"2025-03-20",{"$f":"IFERROR(IF(ISNA(VLOOKUP(E24,Feiertage!$C$12:$D$53,1,0)),VLOOKUP(E24,Feiertage!$C$12:$D$53,2,0),VLOOKUP(E24,Feiertage!$C$12:$D$53,2)),\"\")","v":""},"2025-04-20",{"$f":"IFERROR(IF(ISNA(VLOOKUP(G24,Feiertage!$C$12:$D$53,1,0)),VLOOKUP(G24,Feiertage!$C$12:$D$53,2,0),VLOOKUP(G24,Feiertage!$C$12:$D$53,2)),\"\")","v":""},"2025-05-20",{"$f":"IFERROR(IF(ISNA(VLOOKUP(I24,Feiertage!$C$12:$D$53,1,0)),VLOOKUP(I24,Feiertage!$C$12:$D$53,2,0),VLOOKUP(I24,Feiertage!$C$12:$D$53,2)),\"\")","v":""},"2025-06-20",{"$f":"IFERROR(IF(ISNA(VLOOKUP(K24,Feiertage!$C$12:$D$53,1,0)),VLOOKUP(K24,Feiertage!$C$12:$D$53,2,0),VLOOKUP(K24,Feiertage!$C$12:$D$53,2)),\"\")","v":""},"2025-07-20",{"$f":"IFERROR(IF(ISNA(VLOOKUP(M24,Feiertage!$C$12:$D$53,1,0)),VLOOKUP(M24,Feiertage!$C$12:$D$53,2,0),VLOOKUP(M24,Feiertage!$C$12:$D$53,2)),\"\")","v":""},"2025-08-20",{"$f":"IFERROR(IF(ISNA(VLOOKUP(O24,Feiertage!$C$12:$D$53,1,0)),VLOOKUP(O24,Feiertage!$C$12:$D$53,2,0),VLOOKUP(O24,Feiertage!$C$12:$D$53,2)),\"\")","v":""},"2025-09-20",{"$f":"IFERROR(IF(ISNA(VLOOKUP(Q24,Feiertage!$C$12:$D$53,1,0)),VLOOKUP(Q24,Feiertage!$C$12:$D$53,2,0),VLOOKUP(Q24,Feiertage!$C$12:$D$53,2)),\"\")","v":""},"2025-10-20",{"$f":"IFERROR(IF(ISNA(VLOOKUP(S24,Feiertage!$C$12:$D$53,1,0)),VLOOKUP(S24,Feiertage!$C$12:$D$53,2,0),VLOOKUP(S24,Feiertage!$C$12:$D$53,2)),\"\")","v":""},"2025-11-20",{"$f":"IFERROR(IF(ISNA(VLOOKUP(U24,Feiertage!$C$12:$D$53,1,0)),VLOOKUP(U24,Feiertage!$C$12:$D$53,2,0),VLOOKUP(U24,Feiertage!$C$12:$D$53,2)),\"\")","v":""},"2025-12-20",{"$f":"IFERROR(IF(ISNA(VLOOKUP(W24,Feiertage!$C$12:$D$53,1,0)),VLOOKUP(W24,Feiertage!$C$12:$D$53,2,0),VLOOKUP(W24,Feiertage!$C$12:$D$53,2)),\"\")","v":""}]
["2025-01-21",{"$f":"IFERROR(IF(ISNA(VLOOKUP(A25,Feiertage!$C$12:$D$53,1,0)),VLOOKUP(A25,Feiertage!$C$12:$D$53,2,0),VLOOKUP(A25,Feiertage!$C$12:$D$53,2)),\"\")","v":""},"2025-02-21",{"$f":"IFERROR(IF(ISNA(VLOOKUP(C25,Feiertage!$C$12:$D$53,1,0)),VLOOKUP(C25,Feiertage!$C$12:$D$53,2,0),VLOOKUP(C25,Feiertage!$C$12:$D$53,2)),\"\")","v":""},"2025-03-21",{"$f":"IFERROR(IF(ISNA(VLOOKUP(E25,Feiertage!$C$12:$D$53,1,0)),VLOOKUP(E25,Feiertage!$C$12:$D$53,2,0),VLOOKUP(E25,Feiertage!$C$12:$D$53,2)),\"\")","v":""},"2025-04-21",{"$f":"IFERROR(IF(ISNA(VLOOKUP(G25,Feiertage!$C$12:$D$53,1,0)),VLOOKUP(G25,Feiertage!$C$12:$D$53,2,0),VLOOKUP(G25,Feiertage!$C$12:$D$53,2)),\"\")","v":"Ostermontag"},"2025-05-21",{"$f":"IFERROR(IF(ISNA(VLOOKUP(I25,Feiertage!$C$12:$D$53,1,0)),VLOOKUP(I25,Feiertage!$C$12:$D$53,2,0),VLOOKUP(I25,Feiertage!$C$12:$D$53,2)),\"\")","v":""},"2025-06-21",{"$f":"IFERROR(IF(ISNA(VLOOKUP(K25,Feiertage!$C$12:$D$53,1,0)),VLOOKUP(K25,Feiertage!$C$12:$D$53,2,0),VLOOKUP(K25,Feiertage!$C$12:$D$53,2)),\"\")","v":""},"2025-07-21",{"$f":"IFERROR(IF(ISNA(VLOOKUP(M25,Feiertage!$C$12:$D$53,1,0)),VLOOKUP(M25,Feiertage!$C$12:$D$53,2,0),VLOOKUP(M25,Feiertage!$C$12:$D$53,2)),\"\")","v":""},"2025-08-21",{"$f":"IFERROR(IF(ISNA(VLOOKUP(O25,Feiertage!$C$12:$D$53,1,0)),VLOOKUP(O25,Feiertage!$C$12:$D$53,2,0),VLOOKUP(O25,Feiertage!$C$12:$D$53,2)),\"\")","v":""},"2025-09-21",{"$f":"IFERROR(IF(ISNA(VLOOKUP(Q25,Feiertage!$C$12:$D$53,1,0)),VLOOKUP(Q25,Feiertage!$C$12:$D$53,2,0),VLOOKUP(Q25,Feiertage!$C$12:$D$53,2)),\"\")","v":""},"2025-10-21",{"$f":"IFERROR(IF(ISNA(VLOOKUP(S25,Feiertage!$C$12:$D$53,1,0)),VLOOKUP(S25,Feiertage!$C$12:$D$53,2,0),VLOOKUP(S25,Feiertage!$C$12:$D$53,2)),\"\")","v":""},"2025-11-21",{"$f":"IFERROR(IF(ISNA(VLOOKUP(U25,Feiertage!$C$12:$D$53,1,0)),VLOOKUP(U25,Feiertage!$C$12:$D$53,2,0),VLOOKUP(U25,Feiertage!$C$12:$D$53,2)),\"\")","v":""},"2025-12-21",{"$f":"IFERROR(IF(ISNA(VLOOKUP(W25,Feiertage!$C$12:$D$53,1,0)),VLOOKUP(W25,Feiertage!$C$12:$D$53,2,0),VLOOKUP(W25,Feiertage!$C$12:$D$53,2)),\"\")","v":""}]
["2025-01-22",{"$f":"IFERROR(IF(ISNA(VLOOKUP(A26,Feiertage!$C$12:$D$53,1,0)),VLOOKUP(A26,Feiertage!$C$12:$D$53,2,0),VLOOKUP(A26,Feiertage!$C$12:$D$53,2)),\"\")","v":""},"2025-02-22",{"$f":"IFERROR(IF(ISNA(VLOOKUP(C26,Feiertage!$C$12:$D$53,1,0)),VLOOKUP(C26,Feiertage!$C$12:$D$53,2,0),VLOOKUP(C26,Feiertage!$C$12:$D$53,2)),\"\")","v":""},"2025-03-22",{"$f":"IFERROR(IF(ISNA(VLOOKUP(E26,Feiertage!$C$12:$D$53,1,0)),VLOOKUP(E26,Feiertage!$C$12:$D$53,2,0),VLOOKUP(E26,Feiertage!$C$12:$D$53,2)),\"\")","v":""},"2025-04-22",{"$f":"IFERROR(IF(ISNA(VLOOKUP(G26,Feiertage!$C$12:$D$53,1,0)),VLOOKUP(G26,Feiertage!$C$12:$D$53,2,0),VLOOKUP(G26,Feiertage!$C$12:$D$53,2)),\"\")","v":""},"2025-05-22",{"$f":"IFERROR(IF(ISNA(VLOOKUP(I26,Feiertage!$C$12:$D$53,1,0)),VLOOKUP(I26,Feiertage!$C$12:$D$53,2,0),VLOOKUP(I26,Feiertage!$C$12:$D$53,2)),\"\")","v":""},"2025-06-22",{"$f":"IFERROR(IF(ISNA(VLOOKUP(K26,Feiertage!$C$12:$D$53,1,0)),VLOOKUP(K26,Feiertage!$C$12:$D$53,2,0),VLOOKUP(K26,Feiertage!$C$12:$D$53,2)),\"\")","v":""},"2025-07-22",{"$f":"IFERROR(IF(ISNA(VLOOKUP(M26,Feiertage!$C$12:$D$53,1,0)),VLOOKUP(M26,Feiertage!$C$12:$D$53,2,0),VLOOKUP(M26,Feiertage!$C$12:$D$53,2)),\"\")","v":""},"2025-08-22",{"$f":"IFERROR(IF(ISNA(VLOOKUP(O26,Feiertage!$C$12:$D$53,1,0)),VLOOKUP(O26,Feiertage!$C$12:$D$53,2,0),VLOOKUP(O26,Feiertage!$C$12:$D$53,2)),\"\")","v":""},"2025-09-22",{"$f":"IFERROR(IF(ISNA(VLOOKUP(Q26,Feiertage!$C$12:$D$53,1,0)),VLOOKUP(Q26,Feiertage!$C$12:$D$53,2,0),VLOOKUP(Q26,Feiertage!$C$12:$D$53,2)),\"\")","v":""},"2025-10-22",{"$f":"IFERROR(IF(ISNA(VLOOKUP(S26,Feiertage!$C$12:$D$53,1,0)),VLOOKUP(S26,Feiertage!$C$12:$D$53,2,0),VLOOKUP(S26,Feiertage!$C$12:$D$53,2)),\"\")","v":""},"2025-11-22",{"$f":"IFERROR(IF(ISNA(VLOOKUP(U26,Feiertage!$C$12:$D$53,1,0)),VLOOKUP(U26,Feiertage!$C$12:$D$53,2,0),VLOOKUP(U26,Feiertage!$C$12:$D$53,2)),\"\")","v":""},"2025-12-22",{"$f":"IFERROR(IF(ISNA(VLOOKUP(W26,Feiertage!$C$12:$D$53,1,0)),VLOOKUP(W26,Feiertage!$C$12:$D$53,2,0),VLOOKUP(W26,Feiertage!$C$12:$D$53,2)),\"\")","v":""}]
["2025-01-23",{"$f":"IFERROR(IF(ISNA(VLOOKUP(A27,Feiertage!$C$12:$D$53,1,0)),VLOOKUP(A27,Feiertage!$C$12:$D$53,2,0),VLOOKUP(A27,Feiertage!$C$12:$D$53,2)),\"\")","v":""},"2025-02-23",{"$f":"IFERROR(IF(ISNA(VLOOKUP(C27,Feiertage!$C$12:$D$53,1,0)),VLOOKUP(C27,Feiertage!$C$12:$D$53,2,0),VLOOKUP(C27,Feiertage!$C$12:$D$53,2)),\"\")","v":""},"2025-03-23",{"$f":"IFERROR(IF(ISNA(VLOOKUP(E27,Feiertage!$C$12:$D$53,1,0)),VLOOKUP(E27,Feiertage!$C$12:$D$53,2,0),VLOOKUP(E27,Feiertage!$C$12:$D$53,2)),\"\")","v":""},"2025-04-23",{"$f":"IFERROR(IF(ISNA(VLOOKUP(G27,Feiertage!$C$12:$D$53,1,0)),VLOOKUP(G27,Feiertage!$C$12:$D$53,2,0),VLOOKUP(G27,Feiertage!$C$12:$D$53,2)),\"\")","v":""},"2025-05-23",{"$f":"IFERROR(IF(ISNA(VLOOKUP(I27,Feiertage!$C$12:$D$53,1,0)),VLOOKUP(I27,Feiertage!$C$12:$D$53,2,0),VLOOKUP(I27,Feiertage!$C$12:$D$53,2)),\"\")","v":""},"2025-06-23",{"$f":"IFERROR(IF(ISNA(VLOOKUP(K27,Feiertage!$C$12:$D$53,1,0)),VLOOKUP(K27,Feiertage!$C$12:$D$53,2,0),VLOOKUP(K27,Feiertage!$C$12:$D$53,2)),\"\")","v":""},"2025-07-23",{"$f":"IFERROR(IF(ISNA(VLOOKUP(M27,Feiertage!$C$12:$D$53,1,0)),VLOOKUP(M27,Feiertage!$C$12:$D$53,2,0),VLOOKUP(M27,Feiertage!$C$12:$D$53,2)),\"\")","v":""},"2025-08-23",{"$f":"IFERROR(IF(ISNA(VLOOKUP(O27,Feiertage!$C$12:$D$53,1,0)),VLOOKUP(O27,Feiertage!$C$12:$D$53,2,0),VLOOKUP(O27,Feiertage!$C$12:$D$53,2)),\"\")","v":""},"2025-09-23",{"$f":"IFERROR(IF(ISNA(VLOOKUP(Q27,Feiertage!$C$12:$D$53,1,0)),VLOOKUP(Q27,Feiertage!$C$12:$D$53,2,0),VLOOKUP(Q27,Feiertage!$C$12:$D$53,2)),\"\")","v":""},"2025-10-23",{"$f":"IFERROR(IF(ISNA(VLOOKUP(S27,Feiertage!$C$12:$D$53,1,0)),VLOOKUP(S27,Feiertage!$C$12:$D$53,2,0),VLOOKUP(S27,Feiertage!$C$12:$D$53,2)),\"\")","v":""},"2025-11-23",{"$f":"IFERROR(IF(ISNA(VLOOKUP(U27,Feiertage!$C$12:$D$53,1,0)),VLOOKUP(U27,Feiertage!$C$12:$D$53,2,0),VLOOKUP(U27,Feiertage!$C$12:$D$53,2)),\"\")","v":""},"2025-12-23",{"$f":"IFERROR(IF(ISNA(VLOOKUP(W27,Feiertage!$C$12:$D$53,1,0)),VLOOKUP(W27,Feiertage!$C$12:$D$53,2,0),VLOOKUP(W27,Feiertage!$C$12:$D$53,2)),\"\")","v":""}]
["2025-01-24",{"$f":"IFERROR(IF(ISNA(VLOOKUP(A28,Feiertage!$C$12:$D$53,1,0)),VLOOKUP(A28,Feiertage!$C$12:$D$53,2,0),VLOOKUP(A28,Feiertage!$C$12:$D$53,2)),\"\")","v":""},"2025-02-24",{"$f":"IFERROR(IF(ISNA(VLOOKUP(C28,Feiertage!$C$12:$D$53,1,0)),VLOOKUP(C28,Feiertage!$C$12:$D$53,2,0),VLOOKUP(C28,Feiertage!$C$12:$D$53,2)),\"\")","v":""},"2025-03-24",{"$f":"IFERROR(IF(ISNA(VLOOKUP(E28,Feiertage!$C$12:$D$53,1,0)),VLOOKUP(E28,Feiertage!$C$12:$D$53,2,0),VLOOKUP(E28,Feiertage!$C$12:$D$53,2)),\"\")","v":""},"2025-04-24",{"$f":"IFERROR(IF(ISNA(VLOOKUP(G28,Feiertage!$C$12:$D$53,1,0)),VLOOKUP(G28,Feiertage!$C$12:$D$53,2,0),VLOOKUP(G28,Feiertage!$C$12:$D$53,2)),\"\")","v":""},"2025-05-24",{"$f":"IFERROR(IF(ISNA(VLOOKUP(I28,Feiertage!$C$12:$D$53,1,0)),VLOOKUP(I28,Feiertage!$C$12:$D$53,2,0),VLOOKUP(I28,Feiertage!$C$12:$D$53,2)),\"\")","v":""},"2025-06-24",{"$f":"IFERROR(IF(ISNA(VLOOKUP(K28,Feiertage!$C$12:$D$53,1,0)),VLOOKUP(K28,Feiertage!$C$12:$D$53,2,0),VLOOKUP(K28,Feiertage!$C$12:$D$53,2)),\"\")","v":""},"2025-07-24",{"$f":"IFERROR(IF(ISNA(VLOOKUP(M28,Feiertage!$C$12:$D$53,1,0)),VLOOKUP(M28,Feiertage!$C$12:$D$53,2,0),VLOOKUP(M28,Feiertage!$C$12:$D$53,2)),\"\")","v":""},"2025-08-24",{"$f":"IFERROR(IF(ISNA(VLOOKUP(O28,Feiertage!$C$12:$D$53,1,0)),VLOOKUP(O28,Feiertage!$C$12:$D$53,2,0),VLOOKUP(O28,Feiertage!$C$12:$D$53,2)),\"\")","v":""},"2025-09-24",{"$f":"IFERROR(IF(ISNA(VLOOKUP(Q28,Feiertage!$C$12:$D$53,1,0)),VLOOKUP(Q28,Feiertage!$C$12:$D$53,2,0),VLOOKUP(Q28,Feiertage!$C$12:$D$53,2)),\"\")","v":""},"2025-10-24",{"$f":"IFERROR(IF(ISNA(VLOOKUP(S28,Feiertage!$C$12:$D$53,1,0)),VLOOKUP(S28,Feiertage!$C$12:$D$53,2,0),VLOOKUP(S28,Feiertage!$C$12:$D$53,2)),\"\")","v":""},"2025-11-24",{"$f":"IFERROR(IF(ISNA(VLOOKUP(U28,Feiertage!$C$12:$D$53,1,0)),VLOOKUP(U28,Feiertage!$C$12:$D$53,2,0),VLOOKUP(U28,Feiertage!$C$12:$D$53,2)),\"\")","v":""},"2025-12-24",{"$f":"IFERROR(IF(ISNA(VLOOKUP(W28,Feiertage!$C$12:$D$53,1,0)),VLOOKUP(W28,Feiertage!$C$12:$D$53,2,0),VLOOKUP(W28,Feiertage!$C$12:$D$53,2)),\"\")","v":""}]
["2025-01-25",{"$f":"IFERROR(IF(ISNA(VLOOKUP(A29,Feiertage!$C$12:$D$53,1,0)),VLOOKUP(A29,Feiertage!$C$12:$D$53,2,0),VLOOKUP(A29,Feiertage!$C$12:$D$53,2)),\"\")","v":""},"2025-02-25",{"$f":"IFERROR(IF(ISNA(VLOOKUP(C29,Feiertage!$C$12:$D$53,1,0)),VLOOKUP(C29,Feiertage!$C$12:$D$53,2,0),VLOOKUP(C29,Feiertage!$C$12:$D$53,2)),\"\")","v":""},"2025-03-25",{"$f":"IFERROR(IF(ISNA(VLOOKUP(E29,Feiertage!$C$12:$D$53,1,0)),VLOOKUP(E29,Feiertage!$C$12:$D$53,2,0),VLOOKUP(E29,Feiertage!$C$12:$D$53,2)),\"\")","v":""},"2025-04-25",{"$f":"IFERROR(IF(ISNA(VLOOKUP(G29,Feiertage!$C$12:$D$53,1,0)),VLOOKUP(G29,Feiertage!$C$12:$D$53,2,0),VLOOKUP(G29,Feiertage!$C$12:$D$53,2)),\"\")","v":""},"2025-05-25",{"$f":"IFERROR(IF(ISNA(VLOOKUP(I29,Feiertage!$C$12:$D$53,1,0)),VLOOKUP(I29,Feiertage!$C$12:$D$53,2,0),VLOOKUP(I29,Feiertage!$C$12:$D$53,2)),\"\")","v":""},"2025-06-25",{"$f":"IFERROR(IF(ISNA(VLOOKUP(K29,Feiertage!$C$12:$D$53,1,0)),VLOOKUP(K29,Feiertage!$C$12:$D$53,2,0),VLOOKUP(K29,Feiertage!$C$12:$D$53,2)),\"\")","v":""},"2025-07-25",{"$f":"IFERROR(IF(ISNA(VLOOKUP(M29,Feiertage!$C$12:$D$53,1,0)),VLOOKUP(M29,Feiertage!$C$12:$D$53,2,0),VLOOKUP(M29,Feiertage!$C$12:$D$53,2)),\"\")","v":""},"2025-08-25",{"$f":"IFERROR(IF(ISNA(VLOOKUP(O29,Feiertage!$C$12:$D$53,1,0)),VLOOKUP(O29,Feiertage!$C$12:$D$53,2,0),VLOOKUP(O29,Feiertage!$C$12:$D$53,2)),\"\")","v":""},"2025-09-25",{"$f":"IFERROR(IF(ISNA(VLOOKUP(Q29,Feiertage!$C$12:$D$53,1,0)),VLOOKUP(Q29,Feiertage!$C$12:$D$53,2,0),VLOOKUP(Q29,Feiertage!$C$12:$D$53,2)),\"\")","v":""},"2025-10-25",{"$f":"IFERROR(IF(ISNA(VLOOKUP(S29,Feiertage!$C$12:$D$53,1,0)),VLOOKUP(S29,Feiertage!$C$12:$D$53,2,0),VLOOKUP(S29,Feiertage!$C$12:$D$53,2)),\"\")","v":""},"2025-11-25",{"$f":"IFERROR(IF(ISNA(VLOOKUP(U29,Feiertage!$C$12:$D$53,1,0)),VLOOKUP(U29,Feiertage!$C$12:$D$53,2,0),VLOOKUP(U29,Feiertage!$C$12:$D$53,2)),\"\")","v":""},"2025-12-25",{"$f":"IFERROR(IF(ISNA(VLOOKUP(W29,Feiertage!$C$12:$D$53,1,0)),VLOOKUP(W29,Feiertage!$C$12:$D$53,2,0),VLOOKUP(W29,Feiertage!$C$12:$D$53,2)),\"\")","v":"1.Weihn.Tag"}]
["2025-01-26",{"$f":"IFERROR(IF(ISNA(VLOOKUP(A30,Feiertage!$C$12:$D$53,1,0)),VLOOKUP(A30,Feiertage!$C$12:$D$53,2,0),VLOOKUP(A30,Feiertage!$C$12:$D$53,2)),\"\")","v":""},"2025-02-26",{"$f":"IFERROR(IF(ISNA(VLOOKUP(C30,Feiertage!$C$12:$D$53,1,0)),VLOOKUP(C30,Feiertage!$C$12:$D$53,2,0),VLOOKUP(C30,Feiertage!$C$12:$D$53,2)),\"\")","v":""},"2025-03-26",{"$f":"IFERROR(IF(ISNA(VLOOKUP(E30,Feiertage!$C$12:$D$53,1,0)),VLOOKUP(E30,Feiertage!$C$12:$D$53,2,0),VLOOKUP(E30,Feiertage!$C$12:$D$53,2)),\"\")","v":""},"2025-04-26",{"$f":"IFERROR(IF(ISNA(VLOOKUP(G30,Feiertage!$C$12:$D$53,1,0)),VLOOKUP(G30,Feiertage!$C$12:$D$53,2,0),VLOOKUP(G30,Feiertage!$C$12:$D$53,2)),\"\")","v":""},"2025-05-26",{"$f":"IFERROR(IF(ISNA(VLOOKUP(I30,Feiertage!$C$12:$D$53,1,0)),VLOOKUP(I30,Feiertage!$C$12:$D$53,2,0),VLOOKUP(I30,Feiertage!$C$12:$D$53,2)),\"\")","v":""},"2025-06-26",{"$f":"IFERROR(IF(ISNA(VLOOKUP(K30,Feiertage!$C$12:$D$53,1,0)),VLOOKUP(K30,Feiertage!$C$12:$D$53,2,0),VLOOKUP(K30,Feiertage!$C$12:$D$53,2)),\"\")","v":""},"2025-07-26",{"$f":"IFERROR(IF(ISNA(VLOOKUP(M30,Feiertage!$C$12:$D$53,1,0)),VLOOKUP(M30,Feiertage!$C$12:$D$53,2,0),VLOOKUP(M30,Feiertage!$C$12:$D$53,2)),\"\")","v":""},"2025-08-26",{"$f":"IFERROR(IF(ISNA(VLOOKUP(O30,Feiertage!$C$12:$D$53,1,0)),VLOOKUP(O30,Feiertage!$C$12:$D$53,2,0),VLOOKUP(O30,Feiertage!$C$12:$D$53,2)),\"\")","v":""},"2025-09-26",{"$f":"IFERROR(IF(ISNA(VLOOKUP(Q30,Feiertage!$C$12:$D$53,1,0)),VLOOKUP(Q30,Feiertage!$C$12:$D$53,2,0),VLOOKUP(Q30,Feiertage!$C$12:$D$53,2)),\"\")","v":""},"2025-10-26",{"$f":"IFERROR(IF(ISNA(VLOOKUP(S30,Feiertage!$C$12:$D$53,1,0)),VLOOKUP(S30,Feiertage!$C$12:$D$53,2,0),VLOOKUP(S30,Feiertage!$C$12:$D$53,2)),\"\")","v":""},"2025-11-26",{"$f":"IFERROR(IF(ISNA(VLOOKUP(U30,Feiertage!$C$12:$D$53,1,0)),VLOOKUP(U30,Feiertage!$C$12:$D$53,2,0),VLOOKUP(U30,Feiertage!$C$12:$D$53,2)),\"\")","v":""},"2025-12-26",{"$f":"IFERROR(IF(ISNA(VLOOKUP(W30,Feiertage!$C$12:$D$53,1,0)),VLOOKUP(W30,Feiertage!$C$12:$D$53,2,0),VLOOKUP(W30,Feiertage!$C$12:$D$53,2)),\"\")","v":"2.Weihn.Tag"}]
["2025-01-27",{"$f":"IFERROR(IF(ISNA(VLOOKUP(A31,Feiertage!$C$12:$D$53,1,0)),VLOOKUP(A31,Feiertage!$C$12:$D$53,2,0),VLOOKUP(A31,Feiertage!$C$12:$D$53,2)),\"\")","v":""},"2025-02-27",{"$f":"IFERROR(IF(ISNA(VLOOKUP(C31,Feiertage!$C$12:$D$53,1,0)),VLOOKUP(C31,Feiertage!$C$12:$D$53,2,0),VLOOKUP(C31,Feiertage!$C$12:$D$53,2)),\"\")","v":""},"2025-03-27",{"$f":"IFERROR(IF(ISNA(VLOOKUP(E31,Feiertage!$C$12:$D$53,1,0)),VLOOKUP(E31,Feiertage!$C$12:$D$53,2,0),VLOOKUP(E31,Feiertage!$C$12:$D$53,2)),\"\")","v":""},"2025-04-27",{"$f":"IFERROR(IF(ISNA(VLOOKUP(G31,Feiertage!$C$12:$D$53,1,0)),VLOOKUP(G31,Feiertage!$C$12:$D$53,2,0),VLOOKUP(G31,Feiertage!$C$12:$D$53,2)),\"\")","v":""},"2025-05-27",{"$f":"IFERROR(IF(ISNA(VLOOKUP(I31,Feiertage!$C$12:$D$53,1,0)),VLOOKUP(I31,Feiertage!$C$12:$D$53,2,0),VLOOKUP(I31,Feiertage!$C$12:$D$53,2)),\"\")","v":""},"2025-06-27",{"$f":"IFERROR(IF(ISNA(VLOOKUP(K31,Feiertage!$C$12:$D$53,1,0)),VLOOKUP(K31,Feiertage!$C$12:$D$53,2,0),VLOOKUP(K31,Feiertage!$C$12:$D$53,2)),\"\")","v":""},"2025-07-27",{"$f":"IFERROR(IF(ISNA(VLOOKUP(M31,Feiertage!$C$12:$D$53,1,0)),VLOOKUP(M31,Feiertage!$C$12:$D$53,2,0),VLOOKUP(M31,Feiertage!$C$12:$D$53,2)),\"\")","v":""},"2025-08-27",{"$f":"IFERROR(IF(ISNA(VLOOKUP(O31,Feiertage!$C$12:$D$53,1,0)),VLOOKUP(O31,Feiertage!$C$12:$D$53,2,0),VLOOKUP(O31,Feiertage!$C$12:$D$53,2)),\"\")","v":""},"2025-09-27",{"$f":"IFERROR(IF(ISNA(VLOOKUP(Q31,Feiertage!$C$12:$D$53,1,0)),VLOOKUP(Q31,Feiertage!$C$12:$D$53,2,0),VLOOKUP(Q31,Feiertage!$C$12:$D$53,2)),\"\")","v":""},"2025-10-27",{"$f":"IFERROR(IF(ISNA(VLOOKUP(S31,Feiertage!$C$12:$D$53,1,0)),VLOOKUP(S31,Feiertage!$C$12:$D$53,2,0),VLOOKUP(S31,Feiertage!$C$12:$D$53,2)),\"\")","v":""},"2025-11-27",{"$f":"IFERROR(IF(ISNA(VLOOKUP(U31,Feiertage!$C$12:$D$53,1,0)),VLOOKUP(U31,Feiertage!$C$12:$D$53,2,0),VLOOKUP(U31,Feiertage!$C$12:$D$53,2)),\"\")","v":""},"2025-12-27",{"$f":"IFERROR(IF(ISNA(VLOOKUP(W31,Feiertage!$C$12:$D$53,1,0)),VLOOKUP(W31,Feiertage!$C$12:$D$53,2,0),VLOOKUP(W31,Feiertage!$C$12:$D$53,2)),\"\")","v":""}]
["2025-01-28",{"$f":"IFERROR(IF(ISNA(VLOOKUP(A32,Feiertage!$C$12:$D$53,1,0)),VLOOKUP(A32,Feiertage!$C$12:$D$53,2,0),VLOOKUP(A32,Feiertage!$C$12:$D$53,2)),\"\")","v":""},"2025-02-28",{"$f":"IFERROR(IF(ISNA(VLOOKUP(C32,Feiertage!$C$12:$D$53,1,0)),VLOOKUP(C32,Feiertage!$C$12:$D$53,2,0),VLOOKUP(C32,Feiertage!$C$12:$D$53,2)),\"\")","v":""},"2025-03-28",{"$f":"IFERROR(IF(ISNA(VLOOKUP(E32,Feiertage!$C$12:$D$53,1,0)),VLOOKUP(E32,Feiertage!$C$12:$D$53,2,0),VLOOKUP(E32,Feiertage!$C$12:$D$53,2)),\"\")","v":""},"2025-04-28",{"$f":"IFERROR(IF(ISNA(VLOOKUP(G32,Feiertage!$C$12:$D$53,1,0)),VLOOKUP(G32,Feiertage!$C$12:$D$53,2,0),VLOOKUP(G32,Feiertage!$C$12:$D$53,2)),\"\")","v":""},"2025-05-28",{"$f":"IFERROR(IF(ISNA(VLOOKUP(I32,Feiertage!$C$12:$D$53,1,0)),VLOOKUP(I32,Feiertage!$C$12:$D$53,2,0),VLOOKUP(I32,Feiertage!$C$12:$D$53,2)),\"\")","v":""},{"$f":"K31+1","v":"2025-06-28"},{"$f":"IFERROR(IF(ISNA(VLOOKUP(K32,Feiertage!$C$12:$D$53,1,0)),VLOOKUP(K32,Feiertage!$C$12:$D$53,2,0),VLOOKUP(K32,Feiertage!$C$12:$D$53,2)),\"\")","v":""},"2025-07-28",{"$f":"IFERROR(IF(ISNA(VLOOKUP(M32,Feiertage!$C$12:$D$53,1,0)),VLOOKUP(M32,Feiertage!$C$12:$D$53,2,0),VLOOKUP(M32,Feiertage!$C$12:$D$53,2)),\"\")","v":""},"2025-08-28",{"$f":"IFERROR(IF(ISNA(VLOOKUP(O32,Feiertage!$C$12:$D$53,1,0)),VLOOKUP(O32,Feiertage!$C$12:$D$53,2,0),VLOOKUP(O32,Feiertage!$C$12:$D$53,2)),\"\")","v":""},"2025-09-28",{"$f":"IFERROR(IF(ISNA(VLOOKUP(Q32,Feiertage!$C$12:$D$53,1,0)),VLOOKUP(Q32,Feiertage!$C$12:$D$53,2,0),VLOOKUP(Q32,Feiertage!$C$12:$D$53,2)),\"\")","v":""},"2025-10-28",{"$f":"IFERROR(IF(ISNA(VLOOKUP(S32,Feiertage!$C$12:$D$53,1,0)),VLOOKUP(S32,Feiertage!$C$12:$D$53,2,0),VLOOKUP(S32,Feiertage!$C$12:$D$53,2)),\"\")","v":""},"2025-11-28",{"$f":"IFERROR(IF(ISNA(VLOOKUP(U32,Feiertage!$C$12:$D$53,1,0)),VLOOKUP(U32,Feiertage!$C$12:$D$53,2,0),VLOOKUP(U32,Feiertage!$C$12:$D$53,2)),\"\")","v":""},"2025-12-28",{"$f":"IFERROR(IF(ISNA(VLOOKUP(W32,Feiertage!$C$12:$D$53,1,0)),VLOOKUP(W32,Feiertage!$C$12:$D$53,2,0),VLOOKUP(W32,Feiertage!$C$12:$D$53,2)),\"\")","v":""}]
["2025-01-29",{"$f":"IFERROR(IF(ISNA(VLOOKUP(A33,Feiertage!$C$12:$D$53,1,0)),VLOOKUP(A33,Feiertage!$C$12:$D$53,2,0),VLOOKUP(A33,Feiertage!$C$12:$D$53,2)),\"\")","v":""},{"$f":"CHOOSE(OR(AND(MOD(gewJahr,4)=0,MOD(gewJahr,100)<>0),MOD(gewJahr,400)=0)+1,\"\",C32+1)","v":""},{"$f":"IF(C33=\"\",\"\",IFERROR(IF(ISNA(VLOOKUP(C33,Feiertage!$C$12:$D$53,1,0)),VLOOKUP(C33,Feiertage!$C$12:$D$53,2,0),VLOOKUP(C33,Feiertage!$C$12:$D$53,2)),\"\"))","v":""},"2025-03-29",{"$f":"IFERROR(IF(ISNA(VLOOKUP(E33,Feiertage!$C$12:$D$53,1,0)),VLOOKUP(E33,Feiertage!$C$12:$D$53,2,0),VLOOKUP(E33,Feiertage!$C$12:$D$53,2)),\"\")","v":""},"2025-04-29",{"$f":"IFERROR(IF(ISNA(VLOOKUP(G33,Feiertage!$C$12:$D$53,1,0)),VLOOKUP(G33,Feiertage!$C$12:$D$53,2,0),VLOOKUP(G33,Feiertage!$C$12:$D$53,2)),\"\")","v":""},"2025-05-29",{"$f":"IFERROR(IF(ISNA(VLOOKUP(I33,Feiertage!$C$12:$D$53,1,0)),VLOOKUP(I33,Feiertage!$C$12:$D$53,2,0),VLOOKUP(I33,Feiertage!$C$12:$D$53,2)),\"\")","v":"Himmelfahrt"},{"$f":"K32+1","v":"2025-06-29"},{"$f":"IFERROR(IF(ISNA(VLOOKUP(K33,Feiertage!$C$12:$D$53,1,0)),VLOOKUP(K33,Feiertage!$C$12:$D$53,2,0),VLOOKUP(K33,Feiertage!$C$12:$D$53,2)),\"\")","v":""},"2025-07-29",{"$f":"IFERROR(IF(ISNA(VLOOKUP(M33,Feiertage!$C$12:$D$53,1,0)),VLOOKUP(M33,Feiertage!$C$12:$D$53,2,0),VLOOKUP(M33,Feiertage!$C$12:$D$53,2)),\"\")","v":""},"2025-08-29",{"$f":"IFERROR(IF(ISNA(VLOOKUP(O33,Feiertage!$C$12:$D$53,1,0)),VLOOKUP(O33,Feiertage!$C$12:$D$53,2,0),VLOOKUP(O33,Feiertage!$C$12:$D$53,2)),\"\")","v":""},"2025-09-29",{"$f":"IFERROR(IF(ISNA(VLOOKUP(Q33,Feiertage!$C$12:$D$53,1,0)),VLOOKUP(Q33,Feiertage!$C$12:$D$53,2,0),VLOOKUP(Q33,Feiertage!$C$12:$D$53,2)),\"\")","v":""},"2025-10-29",{"$f":"IFERROR(IF(ISNA(VLOOKUP(S33,Feiertage!$C$12:$D$53,1,0)),VLOOKUP(S33,Feiertage!$C$12:$D$53,2,0),VLOOKUP(S33,Feiertage!$C$12:$D$53,2)),\"\")","v":""},"2025-11-29",{"$f":"IFERROR(IF(ISNA(VLOOKUP(U33,Feiertage!$C$12:$D$53,1,0)),VLOOKUP(U33,Feiertage!$C$12:$D$53,2,0),VLOOKUP(U33,Feiertage!$C$12:$D$53,2)),\"\")","v":""},"2025-12-29",{"$f":"IFERROR(IF(ISNA(VLOOKUP(W33,Feiertage!$C$12:$D$53,1,0)),VLOOKUP(W33,Feiertage!$C$12:$D$53,2,0),VLOOKUP(W33,Feiertage!$C$12:$D$53,2)),\"\")","v":""}]
["2025-01-30",{"$f":"IFERROR(IF(ISNA(VLOOKUP(A34,Feiertage!$C$12:$D$53,1,0)),VLOOKUP(A34,Feiertage!$C$12:$D$53,2,0),VLOOKUP(A34,Feiertage!$C$12:$D$53,2)),\"\")","v":""},null,{"$f":"IFERROR(IF(ISNA(VLOOKUP(C34,Feiertage!$C$12:$D$53,1,0)),VLOOKUP(C34,Feiertage!$C$12:$D$53,2,0),VLOOKUP(C34,Feiertage!$C$12:$D$53,2)),\"\")","v":""},"2025-03-30",{"$f":"IFERROR(IF(ISNA(VLOOKUP(E34,Feiertage!$C$12:$D$53,1,0)),VLOOKUP(E34,Feiertage!$C$12:$D$53,2,0),VLOOKUP(E34,Feiertage!$C$12:$D$53,2)),\"\")","v":""},"2025-04-30",{"$f":"IFERROR(IF(ISNA(VLOOKUP(G34,Feiertage!$C$12:$D$53,1,0)),VLOOKUP(G34,Feiertage!$C$12:$D$53,2,0),VLOOKUP(G34,Feiertage!$C$12:$D$53,2)),\"\")","v":""},"2025-05-30",{"$f":"IFERROR(IF(ISNA(VLOOKUP(I34,Feiertage!$C$12:$D$53,1,0)),VLOOKUP(I34,Feiertage!$C$12:$D$53,2,0),VLOOKUP(I34,Feiertage!$C$12:$D$53,2)),\"\")","v":""},{"$f":"K33+1","v":"2025-06-30"},{"$f":"IFERROR(IF(ISNA(VLOOKUP(K34,Feiertage!$C$12:$D$53,1,0)),VLOOKUP(K34,Feiertage!$C$12:$D$53,2,0),VLOOKUP(K34,Feiertage!$C$12:$D$53,2)),\"\")","v":""},"2025-07-30",{"$f":"IFERROR(IF(ISNA(VLOOKUP(M34,Feiertage!$C$12:$D$53,1,0)),VLOOKUP(M34,Feiertage!$C$12:$D$53,2,0),VLOOKUP(M34,Feiertage!$C$12:$D$53,2)),\"\")","v":""},"2025-08-30",{"$f":"IFERROR(IF(ISNA(VLOOKUP(O34,Feiertage!$C$12:$D$53,1,0)),VLOOKUP(O34,Feiertage!$C$12:$D$53,2,0),VLOOKUP(O34,Feiertage!$C$12:$D$53,2)),\"\")","v":""},"2025-09-30",{"$f":"IFERROR(IF(ISNA(VLOOKUP(Q34,Feiertage!$C$12:$D$53,1,0)),VLOOKUP(Q34,Feiertage!$C$12:$D$53,2,0),VLOOKUP(Q34,Feiertage!$C$12:$D$53,2)),\"\")","v":""},"2025-10-30",{"$f":"IFERROR(IF(ISNA(VLOOKUP(S34,Feiertage!$C$12:$D$53,1,0)),VLOOKUP(S34,Feiertage!$C$12:$D$53,2,0),VLOOKUP(S34,Feiertage!$C$12:$D$53,2)),\"\")","v":""},"2025-11-30",{"$f":"IFERROR(IF(ISNA(VLOOKUP(U34,Feiertage!$C$12:$D$53,1,0)),VLOOKUP(U34,Feiertage!$C$12:$D$53,2,0),VLOOKUP(U34,Feiertage!$C$12:$D$53,2)),\"\")","v":""},"2025-12-30",{"$f":"IFERROR(IF(ISNA(VLOOKUP(W34,Feiertage!$C$12:$D$53,1,0)),VLOOKUP(W34,Feiertage!$C$12:$D$53,2,0),VLOOKUP(W34,Feiertage!$C$12:$D$53,2)),\"\")","v":""}]
["2025-01-31",{"$f":"IFERROR(IF(ISNA(VLOOKUP(A35,Feiertage!$C$12:$D$53,1,0)),VLOOKUP(A35,Feiertage!$C$12:$D$53,2,0),VLOOKUP(A35,Feiertage!$C$12:$D$53,2)),\"\")","v":""},null,null,"2025-03-31",{"$f":"IFERROR(IF(ISNA(VLOOKUP(E35,Feiertage!$C$12:$D$53,1,0)),VLOOKUP(E35,Feiertage!$C$12:$D$53,2,0),VLOOKUP(E35,Feiertage!$C$12:$D$53,2)),\"\")","v":""},null,null,"2025-05-31",{"$f":"IFERROR(IF(ISNA(VLOOKUP(I35,Feiertage!$C$12:$D$53,1,0)),VLOOKUP(I35,Feiertage!$C$12:$D$53,2,0),VLOOKUP(I35,Feiertage!$C$12:$D$53,2)),\"\")","v":""},null,null,"2025-07-31",{"$f":"IFERROR(IF(ISNA(VLOOKUP(M35,Feiertage!$C$12:$D$53,1,0)),VLOOKUP(M35,Feiertage!$C$12:$D$53,2,0),VLOOKUP(M35,Feiertage!$C$12:$D$53,2)),\"\")","v":""},"2025-08-31",{"$f":"IFERROR(IF(ISNA(VLOOKUP(O35,Feiertage!$C$12:$D$53,1,0)),VLOOKUP(O35,Feiertage!$C$12:$D$53,2,0),VLOOKUP(O35,Feiertage!$C$12:$D$53,2)),\"\")","v":""},null,null,"2025-10-31",{"$f":"IFERROR(IF(ISNA(VLOOKUP(S35,Feiertage!$C$12:$D$53,1,0)),VLOOKUP(S35,Feiertage!$C$12:$D$53,2,0),VLOOKUP(S35,Feiertage!$C$12:$D$53,2)),\"\")","v":"Reformationst."},null,null,"2025-12-31",{"$f":"IFERROR(IF(ISNA(VLOOKUP(W35,Feiertage!$C$12:$D$53,1,0)),VLOOKUP(W35,Feiertage!$C$12:$D$53,2,0),VLOOKUP(W35,Feiertage!$C$12:$D$53,2)),\"\")","v":""}]