{"text_format":"1","workbook":"xlsx","n_sheets":2,"sheets":["Liste","Maske"],"not_rendered":{"charts":0,"images":0,"macros":1,"external_links":0,"defined_names":2,"comments":0,"pivot_tables":0},"unopened":[],"bounds":{"document_bytes":16777216,"sheet_cells":100000,"rows_first":2000,"rows_last":500,"rows_between":2000,"halvings":0,"cell_chars":16384,"cell_head_chars":4096},"cells_cut":0,"cells_raw":0,"read":"whole","date_system":"1900"}

{"sheet":"Liste","index":0,"n_rows":226,"n_cols":107,"rows_kept":226,"cut":false,"hidden":false,"merged":[[0,3,0,4],[222,3,223,3],[107,3,108,3],[63,3,64,3],[189,3,190,3],[94,3,95,3],[123,3,124,3],[172,3,173,3],[68,3,72,3],[165,3,169,3],[142,3,145,3],[155,3,156,3],[88,3,91,3],[21,3,22,3],[58,3,59,3],[52,3,53,3],[41,3,42,3],[35,3,40,3],[26,3,29,3]]}
["Extern","Obst","Lidl","Artikel",null,"Min 2025","MAX 2025","Min 2026","MAX 2026","letzter Preis ","Einkauf","Soll","Ist",{"$f":"TODAY()+5-WEEKDAY(TODAY())+4*(WEEKDAY(TODAY())>7)","v":"2025-09-18"},{"$f":"TODAY()+5-WEEKDAY(TODAY())+4*(WEEKDAY(TODAY())>7)-7","v":"2025-09-11"},"2025-01-02","2025-01-09","2025-01-16","2025-01-23","2025-01-30","2025-02-06","2025-02-13","2025-02-20","2025-02-27","2025-03-06","2025-03-13","2025-03-20","2025-03-27","2025-04-03","2025-04-10","2025-04-17","2025-04-24","2025-05-01","2025-05-08","2025-05-15","2025-05-22","2025-05-29","2025-06-05","2025-06-12","2025-06-19","2025-06-26","2025-07-03","2025-07-10","2025-07-17","2025-07-24","2025-07-31","2025-08-07","2025-08-14","2025-08-21","2025-08-28","2025-09-04","2025-09-11","2025-09-18","2025-09-25","2025-10-02","2025-10-09","2025-10-16","2025-10-23","2025-10-30","2025-11-06","2025-11-13","2025-11-20","2025-11-27","2025-12-04","2025-12-11","2025-12-18","2025-12-25","2026-01-01","2026-01-08","2026-01-15","2026-01-22","2026-01-29","2026-02-05","2026-02-12","2026-02-19","2026-02-26","2026-03-05","2026-03-12","2026-03-19","2026-03-26","2026-04-02","2026-04-09","2026-04-16","2026-04-23","2026-04-30","2026-05-07","2026-05-14","2026-05-21","2026-05-28","2026-06-04","2026-06-11","2026-06-18","2026-06-25","2026-07-02","2026-07-09","2026-07-16","2026-07-23","2026-07-30","2026-08-06","2026-08-13","2026-08-20","2026-08-27","2026-09-03","2026-09-10","2026-09-17","2026-09-24","2026-10-01"]
[0,0,{"$f":"IF(OR(K2>0,F2=O2,F2=N2),1,0)","v":0},null,"Artikel 1",{"$f":"MIN($P2:BO2)","v":99.99},{"$f":"MAX($P2:BO2)","v":99.99},{"$f":"MIN($BP2:DC2)","v":0},{"$f":"MAX($BP2:DC2)","v":0},{"$f":"IFERROR(LOOKUP(100000,P2:DC2),0)","v":99.99},{"$f":"SUM(L2-M2)","v":0},2,2,{"$f":"INDEX(P2:ZC2,MATCH(N$1,P$1:ZC$1,0))","v":0},{"$f":"IFERROR(INDEX(Q2:ZD2,MATCH(O$1,Q$1:ZD$1,0)),0)","v":0},null,null,null,null,null,null,null,null,null,null,null,null,99.99,99.99,null,null,null,null,null,null,null,null,null,99.99]
[{"$f":"A2","v":0},{"$f":"B2","v":0},{"$f":"IF(OR(K3>0,F3=O3,F3=N3),C2+1,C2)","v":1},null,"Artikel 2",{"$f":"MIN($P3:BO3)","v":58.99},{"$f":"MAX($P3:BO3)","v":58.99},{"$f":"MIN($BP3:DC3)","v":0},{"$f":"MAX($BP3:DC3)","v":0},{"$f":"IFERROR(LOOKUP(100000,P3:DC3),0)","v":58.99},1,2,1,0,0,null,null,null,null,null,null,null,null,null,null,null,58.99,null,null,58.99,null,null,null,null,null,null,58.99,null,58.99]
[{"$f":"A3","v":0},{"$f":"B3","v":0},{"$f":"IF(OR(K4>0,F4=O4,F4=N4),C3+1,C3)","v":2},null,"Artikel 3",{"$f":"MIN($P4:BO4)","v":247.99},{"$f":"MAX($P4:BO4)","v":247.99},{"$f":"MIN($BP4:DC4)","v":0},{"$f":"MAX($BP4:DC4)","v":0},{"$f":"IFERROR(LOOKUP(100000,P4:DC4),0)","v":247.99},1,7,6,0,0,null,null,null,null,null,247.99]
[{"$f":"A4","v":0},0,2,null,"Artikel 4",{"$f":"MIN($P5:BO5)","v":239.99},{"$f":"MAX($P5:BO5)","v":239.99},{"$f":"MIN($BP5:DC5)","v":0},{"$f":"MAX($BP5:DC5)","v":0},239.99,0,1,1,0,0,null,null,null,null,null,null,null,null,null,null,null,null,null,null,null,null,null,null,null,null,null,null,null,null,239.99,null,null,null,null,null,null,239.99]
[{"$f":"IF(K6>0,A5+1,A5)","v":0},0,{"$f":"C5","v":2},null,"Artikel 5",{"$f":"MIN($P6:BO6)","v":167},{"$f":"MAX($P6:BO6)","v":167},{"$f":"MIN($BP6:DC6)","v":0},{"$f":"MAX($BP6:DC6)","v":0},167,0,12,12,0,0,167]
[{"$f":"A6","v":0},0,2,null,"Artikel 6",{"$f":"MIN($P7:BO7)","v":299.99},{"$f":"MAX($P7:BO7)","v":319.99},{"$f":"MIN($BP7:DC7)","v":0},{"$f":"MAX($BP7:DC7)","v":0},319.99,0,4,4,0,0,null,null,null,null,null,null,299.99,null,null,null,null,null,null,null,null,null,null,null,null,null,null,null,null,null,319.99]
[{"$f":"IF(K8>0,A7+1,A7)","v":0},0,{"$f":"C7","v":2},null,"Artikel 7",{"$f":"MIN($P8:BO8)","v":450},{"$f":"MAX($P8:BO8)","v":450},{"$f":"MIN($BP8:DC8)","v":0},{"$f":"MAX($BP8:DC8)","v":0},450,0,2,2,0,0,450]
[{"$f":"A8","v":0},0,2,null,"Artikel 8",{"$f":"MIN($P9:BO9)","v":139.99},{"$f":"MAX($P9:BO9)","v":179.99},{"$f":"MIN($BP9:DC9)","v":0},{"$f":"MAX($BP9:DC9)","v":0},145.99,-1,5,6,0,0,null,null,null,null,null,null,null,null,null,null,null,null,null,null,null,null,null,179.99,null,null,null,null,null,null,null,null,139.99,null,null,null,null,null,null,null,null,145.99]
[0,0,2,null,"Artikel 9",{"$f":"MIN($P10:BO10)","v":399.99},{"$f":"MAX($P10:BO10)","v":399.99},{"$f":"MIN($BP10:DC10)","v":0},{"$f":"MAX($BP10:DC10)","v":0},399.99,0,1,1,0,0,null,null,null,null,null,null,null,null,null,null,null,null,null,null,null,null,null,null,null,null,null,null,null,null,null,399.99]
[0,{"$f":"IF(OR(K11>0,F11=N11),B10+1,B10)","v":1},{"$f":"IF(OR(F11=O11,F11=N11),C10+1,C10)","v":2},null,"Artikel 10",{"$f":"MIN($P11:BO11)","v":69.989999999999995},{"$f":"MAX($P11:BO11)","v":139.99},{"$f":"MIN($BP11:DC11)","v":0},{"$f":"MAX($BP11:DC11)","v":0},79.989999999999995,3,3,null,0,79.989999999999995,94.99,null,89.99,null,null,null,69.989999999999995,null,99.99,null,null,null,119.99,null,69.989999999999995,89.99,99.99,99.99,null,99.99,null,null,null,null,null,null,null,null,null,null,null,null,null,null,139.99,null,79.989999999999995]
[0,{"$f":"IF(OR(K12>0,F12=N12),B11+1,B11)","v":2},{"$f":"IF(OR(F12=O12,F12=N12),C11+1,C11)","v":2},null,"Artikel 11",{"$f":"MIN($P12:BO12)","v":249.99},{"$f":"MAX($P12:BO12)","v":299.99},{"$f":"MIN($BP12:DC12)","v":0},{"$f":"MAX($BP12:DC12)","v":0},299.99,1,1,null,0,0,null,null,null,null,null,null,null,null,null,null,null,null,null,null,null,null,null,null,null,null,null,null,null,null,299.99,249.99,299.99]
[0,{"$f":"B12","v":2},{"$f":"IF(OR(K13>0,F13=O13,F13=N13),C12+1,C12)","v":2},null,"Artikel 12",{"$f":"MIN($P13:BO13)","v":189.99},{"$f":"MAX($P13:BO13)","v":269.99},{"$f":"MIN($BP13:DC13)","v":0},{"$f":"MAX($BP13:DC13)","v":0},269.99,0,8,8,0,0,null,null,null,null,null,null,null,null,null,null,null,null,null,null,null,null,189.99,null,null,null,null,null,null,null,null,null,null,269.99]
[0,{"$f":"B13","v":2},2,null,"Artikel 13",{"$f":"MIN($P14:BO14)","v":129.99},{"$f":"MAX($P14:BO14)","v":134.99},{"$f":"MIN($BP14:DC14)","v":0},{"$f":"MAX($BP14:DC14)","v":0},134.99,-1,5,6,0,0,null,null,null,null,null,null,null,null,null,null,null,null,null,null,null,null,null,null,null,null,null,null,null,null,null,129.99,null,null,null,null,null,null,null,null,null,134.99]
[{"$f":"A14","v":0},{"$f":"IF(OR(K15>0,F15=N15),B14+1,B14)","v":3},{"$f":"IF(OR(F15=O15,F15=N15),C14+1,C14)","v":2},null,"Artikel 14",{"$f":"MIN($P15:BO15)","v":129.99},{"$f":"MAX($P15:BO15)","v":169.99},{"$f":"MIN($BP15:DC15)","v":0},{"$f":"MAX($BP15:DC15)","v":0},169.99,2,2,null,0,0,null,null,null,null,null,null,null,null,null,129.99,null,null,139.99,null,149.49,149.99,null,null,149.49,null,null,null,139.99,null,null,null,null,null,null,null,null,null,169.99]
{"$rows_left_out":212}
{"sheet":"Maske","index":1,"n_rows":60,"n_cols":32,"rows_kept":60,"cut":false,"hidden":false,"merged":[[6,29,6,31],[6,5,7,5],[1,9,1,10],[1,16,1,17],[6,9,6,10],[6,16,6,17],[2,9,2,10],[2,16,2,17],[6,13,6,14],[6,20,6,21],[1,23,1,24],[2,23,2,24],[6,23,6,24],[6,27,6,28]]}
[{"$f":"IF(A4>A3,A2,A3)","v":"2025-09-18"},{"$f":"A1+5-WEEKDAY(A1)+4*(WEEKDAY(A1)>4)","v":"2025-09-22"},{"$f":"B1+5-WEEKDAY(B1)+4*(WEEKDAY(B1)>4)","v":"2025-09-25"},null,null,null,{"$f":"TODAY()+9-WEEKDAY(TODAY())+8*(WEEKDAY(TODAY())>8)","v":"2025-09-22"}]
[{"$f":"TODAY()+5-WEEKDAY(TODAY())+4*(WEEKDAY(TODAY())>5)","v":"2025-09-18"},null,null,null,null,null,null,null,null,"Preisspanne 2025",null,null,null,{"$f":"IFERROR(VLOOKUP(L3,Liste!$E$2:$F226,2,0),\"\")","v":99.99},{"$f":"IFERROR(VLOOKUP(L3,Liste!$E$2:$G226,3,0),\"\")","v":149.99},null,"Preisspanne 2025",null,null,null,{"$f":"IFERROR(VLOOKUP(S3,Liste!$E$2:$F226,2,0),\"\")","v":249.99},{"$f":"IFERROR(VLOOKUP(S3,Liste!$E$2:$G226,3,0),\"\")","v":299.99},null,"Preisspanne 2025",null,null,null,{"$f":"IFERROR(VLOOKUP(Z3,Liste!$E$2:$F226,2,0),\"\")","v":199.99},{"$f":"IFERROR(VLOOKUP(Z3,Liste!$E$2:$G226,3,0),\"\")","v":219.99}]
[{"$f":"TODAY()+5-WEEKDAY(TODAY())+4*(WEEKDAY(TODAY())>4)+0.4163","v":"2025-09-18T09:59:28.320"},null,null,null,null,null,null,null,null,{"$f":"\"Preisspanne \"&YEAR(A1)","v":"Preisspanne 2025"},null,{"$f":"INDEX(J:J,_xlfn.AGGREGATE(14,6,ROW(J9:J27)/(J9:J27<>\"\"),1))","v":"Artikel 222"},null,{"$f":"IFERROR(VLOOKUP(L3,Liste!$E$2:$H226,2,0),\"\")","v":99.99},{"$f":"IFERROR(VLOOKUP(L3,Liste!$E$2:$I226,3,0),\"\")","v":149.99},null,{"$f":"\"Preisspanne \"&YEAR(A1)","v":"Preisspanne 2025"},null,{"$f":"INDEX(Q:Q,_xlfn.AGGREGATE(14,6,ROW(Q9:Q27)/(Q9:Q27<>\"\"),1))","v":"Artikel 11"},null,{"$f":"IFERROR(VLOOKUP(S3,Liste!$E$2:$H226,2,0),\"\")","v":249.99},{"$f":"IFERROR(VLOOKUP(S3,Liste!$E$2:$I226,3,0),\"\")","v":299.99},null,{"$f":"\"Preisspanne \"&YEAR(A1)","v":"Preisspanne 2025"},null,{"$f":"INDEX(X:X,_xlfn.AGGREGATE(14,6,ROW(X9:X27)/(X9:X27<>\"\"),1))","v":"Artikel 223"},null,{"$f":"IFERROR(VLOOKUP(Z3,Liste!$E$2:$H226,2,0),\"\")","v":199.99},{"$f":"IFERROR(VLOOKUP(Z3,Liste!$E$2:$I226,3,0),\"\")","v":219.99}]
[{"$f":"NOW()+5-WEEKDAY(NOW())+4*(WEEKDAY(NOW())>4)","v":"2025-09-18T15:19:24.680"},null,null,null,null,null,null,null,null,"Coupon",null,null,null,null,null,null,"Coupon",null,null,null,null,null,null,"Coupon"]
[null,null,null,null,null,"Obst und Gemüse",null,null,null,null,null,null,null,null,{"$f":"SUM(O9:O27)","v":1399.86},null,null,null,null,null,null,{"$f":"SUM(V9:V27)","v":2687.62},null,null,null,null,null,null,{"$f":"SUM(AC9:AC27)","v":4555.8099999999995}]
[null,null,null,null,null,"Lidl",null,null,null,"Bonus",null,null,null,{"$f":"SUM(O9:O29)","v":1399.86},{"$f":"IF(O5>5000,SUM(O9:O29),SUM(O9:O27))","v":1399.86},null,"Bonus",null,null,null,{"$f":"SUM(V9:V29)","v":2687.62},{"$f":"IF(V5>5000,SUM(V9:V29),SUM(V9:V27))","v":2687.62},null,"Bonus",null,null,null,{"$f":"SUM(AC9:AC29)","v":4555.8099999999995},{"$f":"IF(AC5>5000,SUM(AC9:AC29),SUM(AC9:AC27))","v":4555.8099999999995}]
[null,null,null,null,null,"Lidl",null,"min","max",{"$f":"A1","v":"2025-09-18"},null,null,null,{"$f":"IF(J5=\"Bonus\",N6,O6)","v":1399.86},null,null,{"$f":"B1","v":"2025-09-22"},null,null,null,{"$f":"IF(Q5=\"Bonus\",U6,V6)","v":2687.62},null,null,{"$f":"C1","v":"2025-09-25"},null,null,null,{"$f":"IF(X5=\"Bonus\",AB6,AC6)","v":4555.8099999999995},null,"Originalverweis"]
[null,null,null,null,null,null,{"$f":"Liste!N1","v":"2025-09-18"},{"$f":"Liste!N1","v":"2025-09-18"},{"$f":"Liste!N1","v":"2025-09-18"},"Artikel","ME","Min","Max","Preis","Summe",null,"Artikel","ME","Min","Max","Preis","Summe",null,"Artikel","ME","Min","Max","Preis","Summe","Y","R","K"]
[1,{"$f":"IF(VLOOKUP(F9,Liste!E$2:F226,2,0)<VLOOKUP(F9,Liste!E2:J226,6,0),2,0)","v":0},{"$f":"IF(VLOOKUP(F9,Liste!E$2:G226,3,0)=VLOOKUP(F9,Liste!E2:N226,10,0),2,0)","v":0},{"$f":"IF(VLOOKUP(F9,Liste!E$2:F226,2,0)=0,3,0)","v":0},"●",{"$f":"IF($F$7=\"Obst und Gemüse\",VLOOKUP(A9,Liste!B$2:E226,4,0),IF($F$7=\"Lidl\",VLOOKUP(A9,Liste!C$2:E226,3,0)))","v":"Artikel 2"},{"$f":"IF(VLOOKUP(F9,Liste!E$2:F226,2,0)=VLOOKUP(F9,Liste!E2:N226,10,0),1,0)","v":0},{"$f":"IF(AND(TODAY()<$H$8,VLOOKUP(F9,Liste!E$2:F226,2,0)=VLOOKUP(F9,Liste!E2:O226,11,0)),1,0)","v":0},{"$f":"IF(AND(TODAY()<$I$8,VLOOKUP(F9,Liste!E$2:G226,3,0)=VLOOKUP(F9,Liste!E2:O226,11,0)),1,0)","v":0},"Artikel 88",{"$f":"IFERROR(VLOOKUP(J9,Liste!$E$2:BF226,7,0),0)","v":12},{"$f":"IFERROR(VLOOKUP(J9,Liste!$E$2:$H226,2,0),0)","v":89.99},{"$f":"IFERROR(VLOOKUP(J9,Liste!$E$2:$I226,3,0),0)","v":119.99},{"$f":"IFERROR(VLOOKUP(J9,Liste!$E$2:$J226,6,0),0)","v":89.99},{"$f":"IF(K9>0,(K9*N9),0)","v":1079.8799999999999},null,"Artikel 2",{"$f":"IFERROR(VLOOKUP(Q9,Liste!$E$2:BF226,7,0),0)","v":1},{"$f":"IFERROR(VLOOKUP(Q9,Liste!$E$2:$H226,2,0),0)","v":58.99},{"$f":"IFERROR(VLOOKUP(Q9,Liste!$E$2:$I226,3,0),0)","v":58.99},{"$f":"IFERROR(VLOOKUP(Q9,Liste!$E$2:$J226,6,0),0)","v":58.99},{"$f":"IF(R9>0,(R9*U9),0)","v":58.99},null,"Artikel 94",{"$f":"IFERROR(VLOOKUP(X9,Liste!$E$2:BF226,7,0),0)","v":6},{"$f":"IFERROR(VLOOKUP(X9,Liste!$E$2:$H226,2,0),0)","v":369.99},{"$f":"IFERROR(VLOOKUP(X9,Liste!$E$2:$I226,3,0),0)","v":475.99},{"$f":"IFERROR(VLOOKUP(X9,Liste!$E$2:$J226,6,0),0)","v":475.99},{"$f":"IF(Y9>0,(Y9*AB9),0)","v":2855.94},{"$f":"IFERROR(VLOOKUP(X9,Liste!$E$2:BF226,7,0),0)","v":6},{"$f":"IFERROR(VLOOKUP(Q9,Liste!$E$2:BF226,7,0),0)","v":1},{"$f":"IFERROR(VLOOKUP(J9,Liste!$E$2:BF226,7,0),0)","v":12}]
[2,{"$f":"IF(VLOOKUP(F10,Liste!E$2:F227,2,0)<VLOOKUP(F10,Liste!E3:J227,6,0),2,0)","v":0},{"$f":"IF(VLOOKUP(F10,Liste!E$2:G227,3,0)=VLOOKUP(F10,Liste!E3:N227,10,0),2,0)","v":0},{"$f":"IF(VLOOKUP(F10,Liste!E$2:F227,2,0)=0,3,0)","v":0},"●",{"$f":"IF($F$7=\"Obst und Gemüse\",VLOOKUP(A10,Liste!B$2:E227,4,0),IF($F$7=\"Lidl\",VLOOKUP(A10,Liste!C$2:E227,3,0)))","v":"Artikel 3"},{"$f":"IF(VLOOKUP(F10,Liste!E$2:F227,2,0)=VLOOKUP(F10,Liste!E3:N227,10,0),1,0)","v":0},{"$f":"IF(AND(TODAY()<$H$8,VLOOKUP(F10,Liste!E$2:F227,2,0)=VLOOKUP(F10,Liste!E3:O227,11,0)),1,0)","v":0},{"$f":"IF(AND(TODAY()<$I$8,VLOOKUP(F10,Liste!E$2:G227,3,0)=VLOOKUP(F10,Liste!E3:O227,11,0)),1,0)","v":0},"Artikel 27",{"$f":"IFERROR(VLOOKUP(J10,Liste!$E$2:BF227,7,0),0)","v":1},{"$f":"IFERROR(VLOOKUP(J10,Liste!$E$2:$H227,2,0),0)","v":179.99},{"$f":"IFERROR(VLOOKUP(J10,Liste!$E$2:$I227,3,0),0)","v":179.99},{"$f":"IFERROR(VLOOKUP(J10,Liste!$E$2:$J227,6,0),0)","v":179.99},{"$f":"IF(K10>0,(K10*N10),0)","v":179.99},null,"Artikel 84",{"$f":"IFERROR(VLOOKUP(Q10,Liste!$E$2:BF227,7,0),0)","v":5},{"$f":"IFERROR(VLOOKUP(Q10,Liste!$E$2:$H227,2,0),0)","v":149.99},{"$f":"IFERROR(VLOOKUP(Q10,Liste!$E$2:$I227,3,0),0)","v":165.74},{"$f":"IFERROR(VLOOKUP(Q10,Liste!$E$2:$J227,6,0),0)","v":165.74},{"$f":"IF(R10>0,(R10*U10),0)","v":828.7},null,"Artikel 143",{"$f":"IFERROR(VLOOKUP(X10,Liste!$E$2:BF227,7,0),0)","v":2},{"$f":"IFERROR(VLOOKUP(X10,Liste!$E$2:$H227,2,0),0)","v":149.99},{"$f":"IFERROR(VLOOKUP(X10,Liste!$E$2:$I227,3,0),0)","v":149.99},{"$f":"IFERROR(VLOOKUP(X10,Liste!$E$2:$J227,6,0),0)","v":149.99},{"$f":"IF(Y10>0,(Y10*AB10),0)","v":299.98},{"$f":"IFERROR(VLOOKUP(X10,Liste!$E$2:BF227,7,0),0)","v":2},{"$f":"IFERROR(VLOOKUP(Q10,Liste!$E$2:BF227,7,0),0)","v":5},{"$f":"IFERROR(VLOOKUP(J10,Liste!$E$2:BF227,7,0),0)","v":1}]
[3,{"$f":"IF(VLOOKUP(F11,Liste!E$2:F228,2,0)<VLOOKUP(F11,Liste!E4:J228,6,0),2,0)","v":2},{"$f":"IF(VLOOKUP(F11,Liste!E$2:G228,3,0)=VLOOKUP(F11,Liste!E4:N228,10,0),2,0)","v":0},{"$f":"IF(VLOOKUP(F11,Liste!E$2:F228,2,0)=0,3,0)","v":0},"●",{"$f":"IF($F$7=\"Obst und Gemüse\",VLOOKUP(A11,Liste!B$2:E228,4,0),IF($F$7=\"Lidl\",VLOOKUP(A11,Liste!C$2:E228,3,0)))","v":"Artikel 20"},{"$f":"IF(VLOOKUP(F11,Liste!E$2:F228,2,0)=VLOOKUP(F11,Liste!E4:N228,10,0),1,0)","v":0},{"$f":"IF(AND(TODAY()<$H$8,VLOOKUP(F11,Liste!E$2:F228,2,0)=VLOOKUP(F11,Liste!E4:O228,11,0)),1,0)","v":0},{"$f":"IF(AND(TODAY()<$I$8,VLOOKUP(F11,Liste!E$2:G228,3,0)=VLOOKUP(F11,Liste!E4:O228,11,0)),1,0)","v":0},"Artikel 222",{"$f":"IFERROR(VLOOKUP(J11,Liste!$E$2:BF228,7,0),0)","v":1},{"$f":"IFERROR(VLOOKUP(J11,Liste!$E$2:$H228,2,0),0)","v":99.99},{"$f":"IFERROR(VLOOKUP(J11,Liste!$E$2:$I228,3,0),0)","v":149.99},{"$f":"IFERROR(VLOOKUP(J11,Liste!$E$2:$J228,6,0),0)","v":139.99},{"$f":"IF(K11>0,(K11*N11),0)","v":139.99},null,"Artikel 170",{"$f":"IFERROR(VLOOKUP(Q11,Liste!$E$2:BF228,7,0),0)","v":2},{"$f":"IFERROR(VLOOKUP(Q11,Liste!$E$2:$H228,2,0),0)","v":149.99},{"$f":"IFERROR(VLOOKUP(Q11,Liste!$E$2:$I228,3,0),0)","v":149.99},{"$f":"IFERROR(VLOOKUP(Q11,Liste!$E$2:$J228,6,0),0)","v":149.99},{"$f":"IF(R11>0,(R11*U11),0)","v":299.98},null,"Artikel 205",10,{"$f":"IFERROR(VLOOKUP(X11,Liste!$E$2:$H228,2,0),0)","v":119.99},{"$f":"IFERROR(VLOOKUP(X11,Liste!$E$2:$I228,3,0),0)","v":249.99},{"$f":"IFERROR(VLOOKUP(X11,Liste!$E$2:$J228,6,0),0)","v":119.99},{"$f":"IF(Y11>0,(Y11*AB11),0)","v":1199.8999999999999},{"$f":"IFERROR(VLOOKUP(X11,Liste!$E$2:BF228,7,0),0)","v":3},{"$f":"IFERROR(VLOOKUP(Q11,Liste!$E$2:BF228,7,0),0)","v":2},{"$f":"IFERROR(VLOOKUP(J11,Liste!$E$2:BF228,7,0),0)","v":1}]
[4,{"$f":"IF(VLOOKUP(F12,Liste!E$2:F229,2,0)<VLOOKUP(F12,Liste!E5:J229,6,0),2,0)","v":0},{"$f":"IF(VLOOKUP(F12,Liste!E$2:G229,3,0)=VLOOKUP(F12,Liste!E5:N229,10,0),2,0)","v":0},{"$f":"IF(VLOOKUP(F12,Liste!E$2:F229,2,0)=0,3,0)","v":0},"●",{"$f":"IF($F$7=\"Obst und Gemüse\",VLOOKUP(A12,Liste!B$2:E229,4,0),IF($F$7=\"Lidl\",VLOOKUP(A12,Liste!C$2:E229,3,0)))","v":"Artikel 63"},{"$f":"IF(VLOOKUP(F12,Liste!E$2:F229,2,0)=VLOOKUP(F12,Liste!E5:N229,10,0),1,0)","v":0},{"$f":"IF(AND(TODAY()<$H$8,VLOOKUP(F12,Liste!E$2:F229,2,0)=VLOOKUP(F12,Liste!E5:O229,11,0)),1,0)","v":0},{"$f":"IF(AND(TODAY()<$I$8,VLOOKUP(F12,Liste!E$2:G229,3,0)=VLOOKUP(F12,Liste!E5:O229,11,0)),1,0)","v":0},null,{"$f":"IFERROR(VLOOKUP(J12,Liste!$E$2:BF229,7,0),0)","v":0},{"$f":"IFERROR(VLOOKUP(J12,Liste!$E$2:$H229,2,0),0)","v":0},{"$f":"IFERROR(VLOOKUP(J12,Liste!$E$2:$I229,3,0),0)","v":0},{"$f":"IFERROR(VLOOKUP(J12,Liste!$E$2:$J229,6,0),0)","v":0},0,null,"Artikel 11",5,{"$f":"IFERROR(VLOOKUP(Q12,Liste!$E$2:$H229,2,0),0)","v":249.99},{"$f":"IFERROR(VLOOKUP(Q12,Liste!$E$2:$I229,3,0),0)","v":299.99},{"$f":"IFERROR(VLOOKUP(Q12,Liste!$E$2:$J229,6,0),0)","v":299.99},1499.95,null,"Artikel 223",{"$f":"IFERROR(VLOOKUP(X12,Liste!$E$2:BF229,7,0),0)","v":1},{"$f":"IFERROR(VLOOKUP(X12,Liste!$E$2:$H229,2,0),0)","v":199.99},{"$f":"IFERROR(VLOOKUP(X12,Liste!$E$2:$I229,3,0),0)","v":219.99},{"$f":"IFERROR(VLOOKUP(X12,Liste!$E$2:$J229,6,0),0)","v":199.99},199.99,{"$f":"IFERROR(VLOOKUP(X12,Liste!$E$2:BF229,7,0),0)","v":1},{"$f":"IFERROR(VLOOKUP(Q12,Liste!$E$2:BF229,7,0),0)","v":1},{"$f":"IFERROR(VLOOKUP(J12,Liste!$E$2:BF229,7,0),0)","v":0}]
[5,{"$f":"IF(VLOOKUP(F13,Liste!E$2:F230,2,0)<VLOOKUP(F13,Liste!E6:J230,6,0),2,0)","v":2},{"$f":"IF(VLOOKUP(F13,Liste!E$2:G230,3,0)=VLOOKUP(F13,Liste!E6:N230,10,0),2,0)","v":0},{"$f":"IF(VLOOKUP(F13,Liste!E$2:F230,2,0)=0,3,0)","v":0},"●",{"$f":"IF($F$7=\"Obst und Gemüse\",VLOOKUP(A13,Liste!B$2:E230,4,0),IF($F$7=\"Lidl\",VLOOKUP(A13,Liste!C$2:E230,3,0)))","v":"Artikel 64"},{"$f":"IF(VLOOKUP(F13,Liste!E$2:F230,2,0)=VLOOKUP(F13,Liste!E6:N230,10,0),1,0)","v":0},{"$f":"IF(AND(TODAY()<$H$8,VLOOKUP(F13,Liste!E$2:F230,2,0)=VLOOKUP(F13,Liste!E6:O230,11,0)),1,0)","v":0},{"$f":"IF(AND(TODAY()<$I$8,VLOOKUP(F13,Liste!E$2:G230,3,0)=VLOOKUP(F13,Liste!E6:O230,11,0)),1,0)","v":0},null,{"$f":"IFERROR(VLOOKUP(J13,Liste!$E$2:BF230,7,0),0)","v":0},{"$f":"IFERROR(VLOOKUP(J13,Liste!$E$2:$H230,2,0),0)","v":0},{"$f":"IFERROR(VLOOKUP(J13,Liste!$E$2:$I230,3,0),0)","v":0},{"$f":"IFERROR(VLOOKUP(J13,Liste!$E$2:$J230,6,0),0)","v":0},0,null,null,{"$f":"IFERROR(VLOOKUP(Q13,Liste!$E$2:BF230,7,0),0)","v":0},{"$f":"IFERROR(VLOOKUP(Q13,Liste!$E$2:$H230,2,0),0)","v":0},{"$f":"IFERROR(VLOOKUP(Q13,Liste!$E$2:$I230,3,0),0)","v":0},{"$f":"IFERROR(VLOOKUP(Q13,Liste!$E$2:$J230,6,0),0)","v":0},0,null,null,{"$f":"IFERROR(VLOOKUP(X13,Liste!$E$2:BF230,7,0),0)","v":0},{"$f":"IFERROR(VLOOKUP(X13,Liste!$E$2:$H230,2,0),0)","v":0},{"$f":"IFERROR(VLOOKUP(X13,Liste!$E$2:$I230,3,0),0)","v":0},{"$f":"IFERROR(VLOOKUP(X13,Liste!$E$2:$J230,6,0),0)","v":0},0,{"$f":"IFERROR(VLOOKUP(X13,Liste!$E$2:BF230,7,0),0)","v":0},{"$f":"IFERROR(VLOOKUP(Q13,Liste!$E$2:BF230,7,0),0)","v":0},{"$f":"IFERROR(VLOOKUP(J13,Liste!$E$2:BF230,7,0),0)","v":0}]
[6,{"$f":"IF(VLOOKUP(F14,Liste!E$2:F231,2,0)<VLOOKUP(F14,Liste!E7:J231,6,0),2,0)","v":2},{"$f":"IF(VLOOKUP(F14,Liste!E$2:G231,3,0)=VLOOKUP(F14,Liste!E7:N231,10,0),2,0)","v":0},{"$f":"IF(VLOOKUP(F14,Liste!E$2:F231,2,0)=0,3,0)","v":0},"●",{"$f":"IF($F$7=\"Obst und Gemüse\",VLOOKUP(A14,Liste!B$2:E231,4,0),IF($F$7=\"Lidl\",VLOOKUP(A14,Liste!C$2:E231,3,0)))","v":"Artikel 74"},{"$f":"IF(VLOOKUP(F14,Liste!E$2:F231,2,0)=VLOOKUP(F14,Liste!E7:N231,10,0),1,0)","v":0},{"$f":"IF(AND(TODAY()<$H$8,VLOOKUP(F14,Liste!E$2:F231,2,0)=VLOOKUP(F14,Liste!E7:O231,11,0)),1,0)","v":0},{"$f":"IF(AND(TODAY()<$I$8,VLOOKUP(F14,Liste!E$2:G231,3,0)=VLOOKUP(F14,Liste!E7:O231,11,0)),1,0)","v":0},null,{"$f":"IFERROR(VLOOKUP(J14,Liste!$E$2:BF231,7,0),0)","v":0},{"$f":"IFERROR(VLOOKUP(J14,Liste!$E$2:$H231,2,0),0)","v":0},{"$f":"IFERROR(VLOOKUP(J14,Liste!$E$2:$I231,3,0),0)","v":0},{"$f":"IFERROR(VLOOKUP(J14,Liste!$E$2:$J231,6,0),0)","v":0},0,null,null,{"$f":"IFERROR(VLOOKUP(Q14,Liste!$E$2:BF231,7,0),0)","v":0},{"$f":"IFERROR(VLOOKUP(Q14,Liste!$E$2:$H231,2,0),0)","v":0},{"$f":"IFERROR(VLOOKUP(Q14,Liste!$E$2:$I231,3,0),0)","v":0},{"$f":"IFERROR(VLOOKUP(Q14,Liste!$E$2:$J231,6,0),0)","v":0},0,null,null,{"$f":"IFERROR(VLOOKUP(X14,Liste!$E$2:BF231,7,0),0)","v":0},{"$f":"IFERROR(VLOOKUP(X14,Liste!$E$2:$H231,2,0),0)","v":0},{"$f":"IFERROR(VLOOKUP(X14,Liste!$E$2:$I231,3,0),0)","v":0},{"$f":"IFERROR(VLOOKUP(X14,Liste!$E$2:$J231,6,0),0)","v":0},0,{"$f":"IFERROR(VLOOKUP(X14,Liste!$E$2:BF231,7,0),0)","v":0},{"$f":"IFERROR(VLOOKUP(Q14,Liste!$E$2:BF231,7,0),0)","v":0},{"$f":"IFERROR(VLOOKUP(J14,Liste!$E$2:BF231,7,0),0)","v":0}]
[7,{"$f":"IF(VLOOKUP(F15,Liste!E$2:F232,2,0)<VLOOKUP(F15,Liste!E8:J232,6,0),2,0)","v":2},{"$f":"IF(VLOOKUP(F15,Liste!E$2:G232,3,0)=VLOOKUP(F15,Liste!E8:N232,10,0),2,0)","v":0},{"$f":"IF(VLOOKUP(F15,Liste!E$2:F232,2,0)=0,3,0)","v":0},"●",{"$f":"IF($F$7=\"Obst und Gemüse\",VLOOKUP(A15,Liste!B$2:E232,4,0),IF($F$7=\"Lidl\",VLOOKUP(A15,Liste!C$2:E232,3,0)))","v":"Artikel 84"},{"$f":"IF(VLOOKUP(F15,Liste!E$2:F232,2,0)=VLOOKUP(F15,Liste!E8:N232,10,0),1,0)","v":0},{"$f":"IF(AND(TODAY()<$H$8,VLOOKUP(F15,Liste!E$2:F232,2,0)=VLOOKUP(F15,Liste!E8:O232,11,0)),1,0)","v":0},{"$f":"IF(AND(TODAY()<$I$8,VLOOKUP(F15,Liste!E$2:G232,3,0)=VLOOKUP(F15,Liste!E8:O232,11,0)),1,0)","v":0},null,{"$f":"IFERROR(VLOOKUP(J15,Liste!$E$2:BF232,7,0),0)","v":0},{"$f":"IFERROR(VLOOKUP(J15,Liste!$E$2:$H232,2,0),0)","v":0},{"$f":"IFERROR(VLOOKUP(J15,Liste!$E$2:$I232,3,0),0)","v":0},{"$f":"IFERROR(VLOOKUP(J15,Liste!$E$2:$J232,6,0),0)","v":0},0,null,null,{"$f":"IFERROR(VLOOKUP(Q15,Liste!$E$2:BF232,7,0),0)","v":0},{"$f":"IFERROR(VLOOKUP(Q15,Liste!$E$2:$H232,2,0),0)","v":0},{"$f":"IFERROR(VLOOKUP(Q15,Liste!$E$2:$I232,3,0),0)","v":0},{"$f":"IFERROR(VLOOKUP(Q15,Liste!$E$2:$J232,6,0),0)","v":0},0,null,null,{"$f":"IFERROR(VLOOKUP(X15,Liste!$E$2:BF232,7,0),0)","v":0},{"$f":"IFERROR(VLOOKUP(X15,Liste!$E$2:$H232,2,0),0)","v":0},{"$f":"IFERROR(VLOOKUP(X15,Liste!$E$2:$I232,3,0),0)","v":0},{"$f":"IFERROR(VLOOKUP(X15,Liste!$E$2:$J232,6,0),0)","v":0},0,{"$f":"IFERROR(VLOOKUP(X15,Liste!$E$2:BF232,7,0),0)","v":0},{"$f":"IFERROR(VLOOKUP(Q15,Liste!$E$2:BF232,7,0),0)","v":0},{"$f":"IFERROR(VLOOKUP(J15,Liste!$E$2:BF232,7,0),0)","v":0}]
{"$rows_left_out":45}