{"text_format":"1","workbook":"xlsx","n_sheets":2,"sheets":["Daten ","Januar 2025 "],"not_rendered":{"charts":0,"images":1,"macros":1,"external_links":1,"defined_names":2,"comments":0,"pivot_tables":0},"unopened":[],"bounds":{"document_bytes":16777216,"sheet_cells":100000,"rows_first":2000,"rows_last":500,"rows_between":2000,"halvings":0,"cell_chars":16384,"cell_head_chars":4096},"cells_cut":0,"cells_raw":0,"read":"whole","date_system":"1900"}

{"sheet":"Daten ","index":0,"n_rows":102,"n_cols":20,"rows_kept":102,"cut":false,"hidden":false,"merged":[]}
[]
[]
[]
[]
[null,null," "]
[]
["Nr.",null,"Name des Kindes","w/m ","Status","Zuordnung ",null,"Offene Einheiten ","Januar","Februar","März ","April","Mai","Juni","Juli","August","September","Oktober","November","Dezember"]
[1,null,"Klient 1","m",null,null,null,null,{"$f":"'[1]Januar 2025 '!AN15","v":5},{"$f":"'[1]Februar 2025'!AN56","v":0},{"$f":"'[1]März 2025'!AN15","v":0},{"$f":"'[1]April 2025'!AN15","v":0},{"$f":"'[1]Mai 2025'!AN15","v":0},{"$f":"'[1]Juni 2025'!AN15","v":0},{"$f":"'[1]Juli 2025'!AN15","v":0},{"$f":"'[1]August 2025'!AN15","v":0},{"$f":"'[1]September 2025'!AN15","v":0},{"$f":"'[1]Oktober 2025'!AN15","v":0},{"$f":"'[1]November 2025'!AN15","v":0},{"$f":"'[1]Dezember 2025'!AN15","v":0}]
[2,null,"Klient 2","m",null,null,null,null,{"$f":"'[1]Januar 2025 '!AN16","v":0},{"$f":"'[1]Februar 2025'!AN57","v":0},{"$f":"'[1]März 2025'!AN16","v":0},{"$f":"'[1]April 2025'!AN16","v":0},{"$f":"'[1]Mai 2025'!AN16","v":0},{"$f":"'[1]Juni 2025'!AN16","v":0},{"$f":"'[1]Juli 2025'!AN16","v":0},{"$f":"'[1]August 2025'!AN16","v":0},{"$f":"'[1]September 2025'!AN16","v":0},{"$f":"'[1]Oktober 2025'!AN16","v":0},{"$f":"'[1]November 2025'!AN16","v":0},{"$f":"'[1]Dezember 2025'!AN16","v":0}]
[3,null,"Klient 3","m",null,null,null,null,{"$f":"'[1]Januar 2025 '!AN17","v":0},{"$f":"'[1]Februar 2025'!AN58","v":0},{"$f":"'[1]März 2025'!AN17","v":0},{"$f":"'[1]April 2025'!AN17","v":0},{"$f":"'[1]Mai 2025'!AN17","v":0},{"$f":"'[1]Juni 2025'!AN17","v":0},{"$f":"'[1]Juli 2025'!AN17","v":0},{"$f":"'[1]August 2025'!AN17","v":0},{"$f":"'[1]September 2025'!AN17","v":0},{"$f":"'[1]Oktober 2025'!AN17","v":0},{"$f":"'[1]November 2025'!AN17","v":0},{"$f":"'[1]Dezember 2025'!AN17","v":0}]
[4,null,"Klient 4","w",null,null,null,null,{"$f":"'[1]Januar 2025 '!AN18","v":0},{"$f":"'[1]Februar 2025'!AN59","v":0},{"$f":"'[1]März 2025'!AN18","v":0},{"$f":"'[1]April 2025'!AN18","v":0},{"$f":"'[1]Mai 2025'!AN18","v":0},{"$f":"'[1]Juni 2025'!AN18","v":0},{"$f":"'[1]Juli 2025'!AN18","v":0},{"$f":"'[1]August 2025'!AN18","v":0},{"$f":"'[1]September 2025'!AN18","v":0},{"$f":"'[1]Oktober 2025'!AN18","v":0},{"$f":"'[1]November 2025'!AN18","v":0},{"$f":"'[1]Dezember 2025'!AN18","v":0}]
[5,null,"Klient 5","w",null,null,null,null,{"$f":"'[1]Januar 2025 '!AN19","v":0},{"$f":"'[1]Februar 2025'!AN60","v":0},{"$f":"'[1]März 2025'!AN19","v":0},{"$f":"'[1]April 2025'!AN19","v":0},{"$f":"'[1]Mai 2025'!AN19","v":0},{"$f":"'[1]Juni 2025'!AN19","v":0},{"$f":"'[1]Juli 2025'!AN19","v":0},{"$f":"'[1]August 2025'!AN19","v":0},{"$f":"'[1]September 2025'!AN19","v":0},{"$f":"'[1]Oktober 2025'!AN19","v":0},{"$f":"'[1]November 2025'!AN19","v":0},{"$f":"'[1]Dezember 2025'!AN19","v":0}]
[6,null,"Klient 6","w",null,null,null,null,{"$f":"'[1]Januar 2025 '!AN20","v":4},{"$f":"'[1]Februar 2025'!AN61","v":0},{"$f":"'[1]März 2025'!AN20","v":0},{"$f":"'[1]April 2025'!AN20","v":0},{"$f":"'[1]Mai 2025'!AN20","v":0},{"$f":"'[1]Juni 2025'!AN20","v":0},{"$f":"'[1]Juli 2025'!AN20","v":0},{"$f":"'[1]August 2025'!AN20","v":0},{"$f":"'[1]September 2025'!AN20","v":0},{"$f":"'[1]Oktober 2025'!AN20","v":0},{"$f":"'[1]November 2025'!AN20","v":0},{"$f":"'[1]Dezember 2025'!AN20","v":0}]
[7,null,"Klient 7","w",null,null,null,null,{"$f":"'[1]Januar 2025 '!AN21","v":0},{"$f":"'[1]Februar 2025'!AN62","v":0},{"$f":"'[1]März 2025'!AN21","v":0},{"$f":"'[1]April 2025'!AN21","v":0},{"$f":"'[1]Mai 2025'!AN21","v":0},{"$f":"'[1]Juni 2025'!AN21","v":0},{"$f":"'[1]Juli 2025'!AN21","v":0},{"$f":"'[1]August 2025'!AN21","v":0},{"$f":"'[1]September 2025'!AN21","v":0},{"$f":"'[1]Oktober 2025'!AN21","v":0},{"$f":"'[1]November 2025'!AN21","v":0},{"$f":"'[1]Dezember 2025'!AN21","v":0}]
[8,null,"Klient 8","m",null,null,null,null,{"$f":"'[1]Januar 2025 '!AN22","v":0},{"$f":"'[1]Februar 2025'!AN63","v":0},{"$f":"'[1]März 2025'!AN22","v":0},{"$f":"'[1]April 2025'!AN22","v":0},{"$f":"'[1]Mai 2025'!AN22","v":0},{"$f":"'[1]Juni 2025'!AN22","v":0},{"$f":"'[1]Juli 2025'!AN22","v":0},{"$f":"'[1]August 2025'!AN22","v":0},{"$f":"'[1]September 2025'!AN22","v":0},{"$f":"'[1]Oktober 2025'!AN22","v":0},{"$f":"'[1]November 2025'!AN22","v":0},{"$f":"'[1]Dezember 2025'!AN22","v":0}]
[9,null,"Klient 9","m",null,null,null,null,{"$f":"'[1]Januar 2025 '!AN23","v":0},{"$f":"'[1]Februar 2025'!AN64","v":0},{"$f":"'[1]März 2025'!AN23","v":0},{"$f":"'[1]April 2025'!AN23","v":0},{"$f":"'[1]Mai 2025'!AN23","v":0},{"$f":"'[1]Juni 2025'!AN23","v":0},{"$f":"'[1]Juli 2025'!AN23","v":0},{"$f":"'[1]August 2025'!AN23","v":0},{"$f":"'[1]September 2025'!AN23","v":0},{"$f":"'[1]Oktober 2025'!AN23","v":0},{"$f":"'[1]November 2025'!AN23","v":0},{"$f":"'[1]Dezember 2025'!AN23","v":0}]
[10,null,"Klient 10","w",null,null,null,null,{"$f":"'[1]Januar 2025 '!AN24","v":0},{"$f":"'[1]Februar 2025'!AN65","v":0},{"$f":"'[1]März 2025'!AN24","v":0},{"$f":"'[1]April 2025'!AN24","v":0},{"$f":"'[1]Mai 2025'!AN24","v":0},{"$f":"'[1]Juni 2025'!AN24","v":0},{"$f":"'[1]Juli 2025'!AN24","v":0},{"$f":"'[1]August 2025'!AN24","v":0},{"$f":"'[1]September 2025'!AN24","v":0},{"$f":"'[1]Oktober 2025'!AN24","v":0},{"$f":"'[1]November 2025'!AN24","v":0},{"$f":"'[1]Dezember 2025'!AN24","v":0}]
[11,null,"Klient 11","w",null,null,null,null,{"$f":"'[1]Januar 2025 '!AN25","v":0},{"$f":"'[1]Februar 2025'!AN66","v":0},{"$f":"'[1]März 2025'!AN25","v":0},{"$f":"'[1]April 2025'!AN25","v":0},{"$f":"'[1]Mai 2025'!AN25","v":0},{"$f":"'[1]Juni 2025'!AN25","v":0},{"$f":"'[1]Juli 2025'!AN25","v":0},{"$f":"'[1]August 2025'!AN25","v":0},{"$f":"'[1]September 2025'!AN25","v":0},{"$f":"'[1]Oktober 2025'!AN25","v":0},{"$f":"'[1]November 2025'!AN25","v":0},{"$f":"'[1]Dezember 2025'!AN25","v":0}]
[12,null,null,null,null,null,null,null,{"$f":"'[1]Januar 2025 '!AN26","v":0},{"$f":"'[1]Februar 2025'!AN67","v":0},{"$f":"'[1]März 2025'!AN26","v":0},{"$f":"'[1]April 2025'!AN26","v":0},{"$f":"'[1]Mai 2025'!AN26","v":0},{"$f":"'[1]Juni 2025'!AN26","v":0},{"$f":"'[1]Juli 2025'!AN26","v":0},{"$f":"'[1]August 2025'!AN26","v":0},{"$f":"'[1]September 2025'!AN26","v":0},{"$f":"'[1]Oktober 2025'!AN26","v":0},{"$f":"'[1]November 2025'!AN26","v":0},{"$f":"'[1]Dezember 2025'!AN26","v":0}]
[13,null,null,null,null,null,null,null,{"$f":"'[1]Januar 2025 '!AN27","v":0},{"$f":"'[1]Februar 2025'!AN68","v":0},{"$f":"'[1]März 2025'!AN27","v":0},{"$f":"'[1]April 2025'!AN27","v":0},{"$f":"'[1]Mai 2025'!AN27","v":0},{"$f":"'[1]Juni 2025'!AN27","v":0},{"$f":"'[1]Juli 2025'!AN27","v":0},{"$f":"'[1]August 2025'!AN27","v":0},{"$f":"'[1]September 2025'!AN27","v":0},{"$f":"'[1]Oktober 2025'!AN27","v":0},{"$f":"'[1]November 2025'!AN27","v":0},{"$f":"'[1]Dezember 2025'!AN27","v":0}]
{"$rows_left_out":83}
{"sheet":"Januar 2025 ","index":1,"n_rows":109,"n_cols":53,"rows_kept":109,"cut":false,"hidden":false,"merged":[[10,43,10,45],[11,36,11,37],[8,13,8,21],[8,24,8,26],[9,13,9,21],[9,24,9,26],[9,29,9,33],[5,1,9,10],[5,13,5,21],[5,23,7,26],[5,33,8,33],[6,13,6,21],[7,13,7,21],[1,11,1,22],[1,23,1,26],[2,7,3,14],[3,4,3,6],[3,18,3,23],[3,24,3,27]]}
[]
[null,null,null,null,null,null,null,null,null,null,null,null,null,null,null,null,null,null,null,null,null,null,null,null,null,null,null,null,null,null,null,null,null,null,null,null,null,null,null,null,null,null,null,null,null,null,null,null,null,null,null,null,{"$f":"AW8","v":0}]
[null,null,null,null,null,null,null,"Vorname Name",null,null,null,null,null,null,null,null,null,null,null,null,null,null,null,null,null,null,null,null,null,null,null,null,null,null,null,null,null,null,{"$f":"IF(AND(AW8<57),\"\",\"PRIMA\")","v":""}]
[null,"Name: ",null,null,null,null,null,null,null,null,null,null,null,null,null,null,null,null,"Januar",null,null,null,null,null,2025]
[]
[null,null,null,null,null,null,null,null,null,null,null,null,null,"Komplexleistungskinder:",null,null,null,null,null,null,null,null,null,null,null,null,null,null,null,null,null,"Komplex-FE:"]
[null,null,null,null,null,null,null,null,null,null,null,null,null,"Komplex Physio Kinder:",null,null,null,null,null,null,null,null,null,null,null,null,null,null,null,null,null,"Komplex-Physio BE:"]
[null,null,null,null,null,null,null,null,null,null,null,null,null,"Komplex Ergo Kinder:",null,null,null,null,null,null,null,null,null,null,null,null,null,null,null,null,null,"Komplex-Ergo BE:"]
[null,null,null,null,null,null,null,null,null,null,null,null,null,"Behandlungs- oder Fördereinheiten: ",null,null,null,null,null,null,null,null,{"$f":"SUM(AB9,AG9)","v":0},null,"ambulant: ",null,null,{"$f":"SUM(AK15:AK109)","v":0},null,null,"mobil: ",null,{"$f":"SUM(AL15:AL109)","v":0}]
[null,null,null,null,null,null,null,null,null,null,null,null,null,"männlich: ",null,null,null,null,null,null,null,null,{"$f":"COUNTIF(AU15:AU109,\"m\")","v":5},null,"weiblich: ",null,null,{"$f":"COUNTIF(AU15:AU109,\"w\")","v":6}]
[null,null,null,null,null,null,null,null,null,null,null,null,null,null,null,null,null,null,null,null,null,null,null,null,null,null,null,null,null,null,null,null,null,null,null,null,null,null,null," ",null,null,null,"DIAGNOSTIKEN "]
["Nr.","Name des Kindes",null,null,1,2,3,4,5,6,7,8,9,10,11,12,13,14,15,16,17,18,19,20,21,22,23,24,25,26,27,28,29,30,31,null,"a / m ",null,null,"Einheiten","UE","KA","E","ED","VD","AD"]
[]
["Spalte1","Spalte2","STATUS","Diagnostik","Spalte4","Spalte5","Spalte6","Spalte7","Spalte8","Spalte9","Spalte10","Spalte11","Spalte12","Spalte13","Spalte14","Spalte15","Spalte16","Spalte17","Spalte18","Spalte19","Spalte20","Spalte21","Spalte22","Spalte23","Spalte24","Spalte25","Spalte26","Spalte27","Spalte28","Spalte29","Spalte30","Spalte31","Spalte32","Spalte33","Spalte34",null,null,null,null,null,null,null,null,null,null,null,null,null,null,null,null,"Zuordnung"]
[1,{"$f":"'Daten '!C8","v":"Klient 1"},{"$f":"'[1]Daten '!E8","v":0},{"$f":"IF(AV15>0,\"Diagnostik\",\"0\")","v":"0"},null,null,null,null,null,null,null,null,null,null,null,null,null,null,null,null,null,null,null,null,null,null,null,null,null,null,null,null,null,null,null,null,{"$f":"SUM(LEN($C15:$AI15))-SUM(LEN(SUBSTITUTE($C15:$AI15,\"a\",\"\")))","v":0},{"$f":"SUM(LEN($C15:$AI15))-SUM(LEN(SUBSTITUTE($C15:$AI15,\"m\",\"\")))","v":0},null,{"$f":"SUM(AK15:AL15)","v":0},{"$f":"COUNTIF($E$15:$AI$15,\"UE\")","v":0},{"$f":"COUNTIF($E$15:$AI$15,\"ka\")","v":0},{"$f":"COUNTIF($E$15:$AI$15,\"E\")","v":0},{"$f":"COUNTIF($E$15:$AI$15,\"ED\")","v":0},{"$f":"COUNTIF($E$15:$AI$15,\"VD\")","v":0},{"$f":"COUNTIF($E$15:$AI$15,\"AD\")","v":0},{"$f":"VLOOKUP(Tabelle323567[[#This Row],[Spalte2]],'Daten '!C8:D102,2,)","v":"m"},{"$f":"SUM(AR15:AT15)","v":0}]
[2,{"$f":"'Daten '!C9","v":"Klient 2"},{"$f":"'[1]Daten '!E9","v":0},"0",null,null,null,null,null,null,null,null,null,null,null,null,null,null,null,null,null,null,null,null,null,null,null,null,null,null,null,null,null,null,null,null,{"$f":"SUM(LEN($C16:$AI16))-SUM(LEN(SUBSTITUTE($C16:$AI16,\"a\",\"\")))","v":0},{"$f":"SUM(LEN($C16:$AI16))-SUM(LEN(SUBSTITUTE($C16:$AI16,\"m\",\"\")))","v":0},null,{"$f":"SUM(AK16:AL16)","v":0},{"$f":"COUNTIF($E$16:$AI$16,\"UE\")","v":0},{"$f":"COUNTIF($E$16:$AI$16,\"ka\")","v":0},{"$f":"COUNTIF($E$16:$AI$16,\"E\")","v":0},{"$f":"COUNTIF($E$16:$AI$16,\"ED\")","v":0},{"$f":"COUNTIF($E$16:$AI$16,\"VD\")","v":0},{"$f":"COUNTIF($E$16:$AI$16,\"AD\")","v":0},{"$f":"VLOOKUP(Tabelle323567[[#This Row],[Spalte2]],'Daten '!C9:D103,2,)","v":"m"},0]
[3,{"$f":"'Daten '!C10","v":"Klient 3"},{"$f":"'[1]Daten '!E10","v":0},"0",null,null,null,null,null,null,null,null,null,null,null,null,null,null,null,null,null,null,null,null,null,null,null,null,null,null,null,null,null,null,null,null,{"$f":"SUM(LEN($C17:$AI17))-SUM(LEN(SUBSTITUTE($C17:$AI17,\"a\",\"\")))","v":0},{"$f":"SUM(LEN($C17:$AI17))-SUM(LEN(SUBSTITUTE($C17:$AI17,\"m\",\"\")))","v":0},null,0,{"$f":"COUNTIF($E$17:$AI$17,\"UE\")","v":0},{"$f":"COUNTIF($E$17:$AI$17,\"ka\")","v":0},{"$f":"COUNTIF($E$17:$AI$17,\"E\")","v":0},{"$f":"COUNTIF($E$17:$AI$17,\"ED\")","v":0},{"$f":"COUNTIF($E$17:$AI$17,\"VD\")","v":0},{"$f":"COUNTIF($E$17:$AI$17,\"AD\")","v":0},{"$f":"VLOOKUP(Tabelle323567[[#This Row],[Spalte2]],'Daten '!C10:D104,2,)","v":"m"},0]
[4,{"$f":"'Daten '!C11","v":"Klient 4"},{"$f":"'[1]Daten '!E11","v":0},"0",null,null,null,null,null,null,null,null,null,null,null,null,null,null,null,null,null,null,null,null,null,null,null,null,null,null,null,null,null,null,null,null,{"$f":"SUM(LEN($C18:$AI18))-SUM(LEN(SUBSTITUTE($C18:$AI18,\"a\",\"\")))","v":0},{"$f":"SUM(LEN($C18:$AI18))-SUM(LEN(SUBSTITUTE($C18:$AI18,\"m\",\"\")))","v":0},null,0,{"$f":"COUNTIF($E$18:$AI$18,\"UE\")","v":0},{"$f":"COUNTIF($E$18:$AI$18,\"ka\")","v":0},{"$f":"COUNTIF($E$18:$AI$18,\"E\")","v":0},{"$f":"COUNTIF($E$18:$AI$18,\"ED\")","v":0},{"$f":"COUNTIF($E$18:$AI$18,\"VD\")","v":0},{"$f":"COUNTIF($E$18:$AI$18,\"AD\")","v":0},{"$f":"VLOOKUP(Tabelle323567[[#This Row],[Spalte2]],'Daten '!C11:D105,2,)","v":"w"},0]
[5,{"$f":"'Daten '!C12","v":"Klient 5"},{"$f":"'[1]Daten '!E12","v":0},"0",null,null,null,null,null,null,null,null,null,null,null,null,null,null,null,null,null,null,null,null,null,null,null,null,null,null,null,null,null,null,null,null,{"$f":"SUM(LEN($C19:$AI19))-SUM(LEN(SUBSTITUTE($C19:$AI19,\"a\",\"\")))","v":0},{"$f":"SUM(LEN($C19:$AI19))-SUM(LEN(SUBSTITUTE($C19:$AI19,\"m\",\"\")))","v":0},null,0,{"$f":"COUNTIF($E$19:$AI$19,\"UE\")","v":0},{"$f":"COUNTIF($E$19:$AI$19,\"KA\")","v":0},{"$f":"COUNTIF($E$19:$AI$19,\"E\")","v":0},{"$f":"COUNTIF($E$19:$AI$19,\"ED\")","v":0},{"$f":"COUNTIF($E$19:$AI$19,\"VD\")","v":0},{"$f":"COUNTIF($E$19:$AI$19,\"AD\")","v":0},{"$f":"VLOOKUP(Tabelle323567[[#This Row],[Spalte2]],'Daten '!C12:D106,2,)","v":"w"},0]
[6,{"$f":"'Daten '!C13","v":"Klient 6"},{"$f":"'[1]Daten '!E13","v":0},"0",null,null,null,null,null,null,null,null,null,null,null,null,null,null,null,null,null,null,null,null,null,null,null,null,null,null,null,null,null,null,null,null,{"$f":"SUM(LEN($C20:$AI20))-SUM(LEN(SUBSTITUTE($C20:$AI20,\"a\",\"\")))","v":0},{"$f":"SUM(LEN($C20:$AI20))-SUM(LEN(SUBSTITUTE($C20:$AI20,\"m\",\"\")))","v":0},null,0,{"$f":"COUNTIF($E$20:$AI$20,\"UE\")","v":0},{"$f":"COUNTIF($E$20:$AI$20,\"KA\")","v":0},{"$f":"COUNTIF($E$20:$AI$20,\"E\")","v":0},{"$f":"COUNTIF($E$20:$AI$20,\"ED\")","v":0},{"$f":"COUNTIF($E$20:$AI$20,\"VD\")","v":0},{"$f":"COUNTIF($E$20:$AI$20,\"AD\")","v":0},{"$f":"VLOOKUP(Tabelle323567[[#This Row],[Spalte2]],'Daten '!C13:D107,2,)","v":"w"},0]
{"$rows_left_out":89}