{"text_format":"1","workbook":"xlsx","n_sheets":3,"sheets":["Gelbe Zeilen","Stueckliste","Tabelle1"],"not_rendered":{"charts":0,"images":0,"macros":1,"external_links":0,"defined_names":3,"comments":0,"pivot_tables":0},"unopened":[],"bounds":{"document_bytes":16777216,"sheet_cells":100000,"rows_first":2000,"rows_last":500,"rows_between":2000,"halvings":0,"cell_chars":16384,"cell_head_chars":4096},"cells_cut":0,"cells_raw":0,"read":"whole","date_system":"1900"}

{"sheet":"Gelbe Zeilen","index":0,"n_rows":46,"n_cols":42,"rows_kept":46,"cut":false,"hidden":false,"merged":[]}
["Positionierung","Level","Position Number","Revision Number","Number","Bearbeitung","Fehr Kategorie","Oberfläche","Quantity","Stückzahl","Länge [mm]","Breite [mm]","File Name","Rohmat Artikel","Title","Abmass","Norm","Material","Oberfläche","Bestand","Masse [kg]","Position","Abmass","Änderungsgrund","Blechstärke [mm]","Ersatz für","Revision","State","Typ","Zulieferer","Zulieferer Artikelnummer","Category Name","Rohmat Gewicht [g]","Kettenlängen","Bemerkung","Category Name","Laserteil bearbeitet","Laserteil gekantet","Beschaffung","Gesamt KG","IFW Art."]
["1-1-1-1",">>>4","1","-",3202602,"schw","Stahlbau",null,2,4,null,null,3202602,null,"Kettenschiene oben STB",null,null,"-",null,"",25.814551288161301,"",null,null,null,null,"-","Released","",null,null,"Assembly",null,2,null,"Assembly",null,null,null,{"$f":"J2*U2","v":103.2582051526452},240773,{"$f":"IF(IFERROR(FIND($A2,$A3),0),_xlfn.IFNA(_xlfn.XLOOKUP($O2,Tabelle1!$K$2:$K$100,Tabelle1!$I$2:$I$100),\"nicht gefunden!\"),\"\")","v":"240773"}]
["1-1-1-1-1",">>>>5","1","-",3202600,"schw","Stahlbau",null,1,4,6580,null,3202600,"161179 ","Kettenschienenprofil unten","4k-Rohr 40x40x3 - 6580","DIN EN 10210-2","S235JRH",null,"",22.298731033980101,"","4k-Rohr 40x40x3 - 6580",null,null,null,"-","Released",null,null,null,"Part",null,6580,"Sägeliste nach Zeichnung","Part",null,null,null,89.194924135920402,null,{"$f":"IF(IFERROR(FIND($A3,$A4),0),_xlfn.IFNA(_xlfn.XLOOKUP($O3,Tabelle1!$K$2:$K$100,Tabelle1!$I$2:$I$100),\"nicht gefunden!\"),\"\")","v":""}]
["1-1-1-1-2",">>>>5","2","01",3124590,"schw","Stahlbau",null,2,8,52,36,3124590,162101,"Abdeckblech","Blech 3 - 52x 36","EN 10029","S235JRG2",null,"",4.358021267E-2,"","Blech 3 - 52x 36","Oberflächenbeschaffenheit geändert",3,null,"01","Released",null,null,null,"Part",null,2,null,"Part","ohne Bearbeitung","ohne Kante",null,0.34864170136,null,{"$f":"IF(IFERROR(FIND($A4,$A5),0),_xlfn.IFNA(_xlfn.XLOOKUP($O4,Tabelle1!$K$2:$K$100,Tabelle1!$I$2:$I$100),\"nicht gefunden!\"),\"\")","v":""}]
["1-1-1-1-3",">>>>5","3","-",3202601,"schw","Einkaufsteil","Blank",1,4,6605,null,3202601,138517,"C-Profil L=6605","HM 20/12 - 6605",null,"ST","Blank","",3.4286598288316199,"","HM 20/12 - 6605",null,null,null,"-","Released","C-2010 (6m)",null,null,"Purchased",null,6605,"Sägeliste nach Zeichnung","Purchased",null,null,null,13.71463931532648,null,{"$f":"IF(IFERROR(FIND($A5,$A6),0),_xlfn.IFNA(_xlfn.XLOOKUP($O5,Tabelle1!$K$2:$K$100,Tabelle1!$I$2:$I$100),\"nicht gefunden!\"),\"\")","v":""}]
["1-1-1-2",">>>4","2","-",3202633,"schw","Stahlbau",null,14,28,null,null,3202633,null,"Gleiterhalter aussen STB",null,null,"-",null,"",3.8598691347807299,"",null,null,null,null,"-","Released","",null,null,"Assembly",null,14,null,"Assembly",null,null,null,108.07633577386044,"Nicht gefunden",{"$f":"IF(IFERROR(FIND($A6,$A7),0),_xlfn.IFNA(_xlfn.XLOOKUP($O6,Tabelle1!$K$2:$K$100,Tabelle1!$I$2:$I$100),\"nicht gefunden!\"),\"\")","v":"nicht gefunden!"}]
["1-1-1-2-1",">>>>5","1","-",3202630,"schw","Stahlbau",null,1,28,810.4,121.8,3202630,206073,"Gleiterhalter aussen","Blech 5 - 122x 810","EN 10029","S235JRG2",null,"",3.7197858847807304,"","Blech 5 - 122x 810",null,5,null,"-","Released",null,null,null,"Part",null,1,null,"Part","ohne Bearbeitung","mit Kante",null,104.15400477386045,null,{"$f":"IF(IFERROR(FIND($A7,$A8),0),_xlfn.IFNA(_xlfn.XLOOKUP($O7,Tabelle1!$K$2:$K$100,Tabelle1!$I$2:$I$100),\"nicht gefunden!\"),\"\")","v":""}]
["1-1-1-2-2",">>>>5","2","-",3202802,"schw","Stahlbau",null,2,56,61,35,3202802,206073,"Gleiterrippe","Blech 5 - 35x 61","EN 10029","S235JRG2",null,"",7.0041624999999996E-2,"","Blech 5 - 35x 61",null,5,null,"-","Released",null,null,null,"Part",null,2,null,"Part","ohne Bearbeitung","ohne Kante",null,3.9223309999999998,null,{"$f":"IF(IFERROR(FIND($A8,$A9),0),_xlfn.IFNA(_xlfn.XLOOKUP($O8,Tabelle1!$K$2:$K$100,Tabelle1!$I$2:$I$100),\"nicht gefunden!\"),\"\")","v":""}]
["1-1-1-3",">>>4","3","-",3202634,"schw","Stahlbau",null,4,8,null,null,3202634,null,"Gleiterhalter Einlauf STB",null,null,"-",null,"",3.2465520193977198,"",null,null,null,null,"-","Released","",null,null,"Assembly",null,4,null,"Assembly",null,null,null,25.972416155181758,"Nicht gefunden",{"$f":"IF(IFERROR(FIND($A9,$A10),0),_xlfn.IFNA(_xlfn.XLOOKUP($O9,Tabelle1!$K$2:$K$100,Tabelle1!$I$2:$I$100),\"nicht gefunden!\"),\"\")","v":"nicht gefunden!"}]
["1-1-1-3-1",">>>>5","1","-",3202631,"schw","Stahlbau",null,1,8,651,121.8,3202631,206073,"Gleiterhalter aussen","Blech 5 - 122x 651","EN 10029","S235JRG2",null,"",3.1765103943977202,"","Blech 5 - 122x 651",null,5,null,"-","Released",null,null,null,"Part",null,1,null,"Part","ohne Bearbeitung","mit Kante",null,25.412083155181762,null,{"$f":"IF(IFERROR(FIND($A10,$A11),0),_xlfn.IFNA(_xlfn.XLOOKUP($O10,Tabelle1!$K$2:$K$100,Tabelle1!$I$2:$I$100),\"nicht gefunden!\"),\"\")","v":""}]
["1-1-1-3-2",">>>>5","2","-",3202802,"schw","Stahlbau",null,1,8,61,35,3202802,206073,"Gleiterrippe","Blech 5 - 35x 61","EN 10029","S235JRG2",null,"",7.0041624999999996E-2,"","Blech 5 - 35x 61",null,5,null,"-","Released",null,null,null,"Part",null,1,null,"Part","ohne Bearbeitung","ohne Kante",null,0.56033299999999997,null,{"$f":"IF(IFERROR(FIND($A11,$A12),0),_xlfn.IFNA(_xlfn.XLOOKUP($O11,Tabelle1!$K$2:$K$100,Tabelle1!$I$2:$I$100),\"nicht gefunden!\"),\"\")","v":""}]
["1-1-1-4",">>>4","4","-",3202628,"schw","Stahlbau",null,14,28,null,null,3202628,null,"Abstützung STB",null,null,"-",null,"",4.8254875671925603,"",null,null,null,null,"-","Released","",null,null,"Assembly",null,14,null,"Assembly",null,null,null,135.11365188139169,"Nicht gefunden",{"$f":"IF(IFERROR(FIND($A12,$A13),0),_xlfn.IFNA(_xlfn.XLOOKUP($O12,Tabelle1!$K$2:$K$100,Tabelle1!$I$2:$I$100),\"nicht gefunden!\"),\"\")","v":"nicht gefunden!"}]
["1-1-1-4-1",">>>>5","1","-",3202629,"schw","Stahlbau",null,1,28,553.79999999999995,419.9,3202629,206073,"Biegeblech 3","Blech 5 - 420x 554","EN 10029","S235JRG2",null,"",4.6816461296925596,"","Blech 5 - 420x 554",null,5,null,"-","Released",null,null,null,"Part",null,1,null,"Part","ohne Bearbeitung","mit Kante",null,131.08609163139167,null,{"$f":"IF(IFERROR(FIND($A13,$A14),0),_xlfn.IFNA(_xlfn.XLOOKUP($O13,Tabelle1!$K$2:$K$100,Tabelle1!$I$2:$I$100),\"nicht gefunden!\"),\"\")","v":""}]
["1-1-1-4-2",">>>>5","2","-",3124582,"schw","Stahlbau",null,2,56,48,45,3124582,206073,"Rippe Abstützung","Blech 5 - 45x 48","EN 10029","S235JRG2",null,"",7.1920718750000001E-2,"","Blech 5 - 45x 48",null,5,null,"-","Released","",null,null,"Part",null,2,null,"Part","ohne Bearbeitung","ohne Kante",null,4.0275602500000005,null,{"$f":"IF(IFERROR(FIND($A14,$A15),0),_xlfn.IFNA(_xlfn.XLOOKUP($O14,Tabelle1!$K$2:$K$100,Tabelle1!$I$2:$I$100),\"nicht gefunden!\"),\"\")","v":""}]
["1-1-1-5",">>>4","5","-",3202598,"schw","Stahlbau",null,2,4,null,null,3202598,null,"Kettenschiene unten STB",null,null,"Generisch",null,"",36.449751853067298,"",null,null,null,null,"-","Released","",null,null,"Assembly",null,2,null,"Assembly",null,null,null,145.79900741226919,240772,{"$f":"IF(IFERROR(FIND($A15,$A16),0),_xlfn.IFNA(_xlfn.XLOOKUP($O15,Tabelle1!$K$2:$K$100,Tabelle1!$I$2:$I$100),\"nicht gefunden!\"),\"\")","v":"240772"}]
["1-1-1-5-1",">>>>5","1","-",3202597,"schw","Stahlbau",null,1,4,6760,null,3202597,116454,"-","U-Stahl 40 x 35 - 6760","DIN 1026-1","S235JRG2",null,"",32.957266107347699,"","U-Stahl 40 x 35 - 6760",null,null,null,"-","Released",null,null,null,"Part",null,6760,null,"Part",null,null,null,131.8290644293908,null,{"$f":"IF(IFERROR(FIND($A16,$A17),0),_xlfn.IFNA(_xlfn.XLOOKUP($O16,Tabelle1!$K$2:$K$100,Tabelle1!$I$2:$I$100),\"nicht gefunden!\"),\"\")","v":""}]
["1-1-1-5-3",">>>>5","3","-",3202596,"schw","Einkaufsteil","Blank",1,4,6720,null,3202596,138517,"C-Profil L=6720","HM 20/12 - 6720",null,"ST","Blank","",3.4924857457196401,"","HM 20/12 - 6720",null,null,null,"-","Released","C-2010 (6m)",null,null,"Purchased",null,6720,null,"Purchased",null,null,null,13.96994298287856,null,{"$f":"IF(IFERROR(FIND($A17,$A18),0),_xlfn.IFNA(_xlfn.XLOOKUP($O17,Tabelle1!$K$2:$K$100,Tabelle1!$I$2:$I$100),\"nicht gefunden!\"),\"\")","v":""}]
["1-1-1-6",">>>4","6","-",3183621,"schw","Stahlbau",null,2,4,null,null,3183621,null,"Kettenspanner STB",null,null,"Generisch",null,"",4.0953163328932902,"",null,null,null,null,"-","Released","",null,null,"Assembly",null,2,null,"Assembly",null,null,null,16.381265331573161,240771,{"$f":"IF(IFERROR(FIND($A18,$A19),0),_xlfn.IFNA(_xlfn.XLOOKUP($O18,Tabelle1!$K$2:$K$100,Tabelle1!$I$2:$I$100),\"nicht gefunden!\"),\"\")","v":"240771"}]
["1-1-1-6-1",">>>>5","1","-",3123597,"schw","Stahlbau",null,1,4,261,170,3123597,207897,"Biegeblech Kettenspanner","Blech 10 - 170x 261","EN 10029","S235JRG2",null,"",3.47181877913349,"","Blech 10 - 170x 261",null,10,null,"01","Released",null,null,null,"Part",null,1,null,"Part","ohne Bearbeitung","mit Kante",null,13.88727511653396,null,{"$f":"IF(IFERROR(FIND($A19,$A20),0),_xlfn.IFNA(_xlfn.XLOOKUP($O19,Tabelle1!$K$2:$K$100,Tabelle1!$I$2:$I$100),\"nicht gefunden!\"),\"\")","v":""}]
["1-1-1-6-2",">>>>5","2","-",3107187,"schw","Stahlbau",null,2,8,190,65,3107187,206073,"Rippenblech Kettenspanner","Blech 5 - 65x 190","EN 10029","S235JRG2",null,"",0.31174877687999997,"","Blech 5 - 65x 190",null,5,null,"02","Released",null,null,null,"Part",null,2,null,"Part","ohne Bearbeitung","ohne Kante",null,2.4939902150399997,null,{"$f":"IF(IFERROR(FIND($A20,$A21),0),_xlfn.IFNA(_xlfn.XLOOKUP($O20,Tabelle1!$K$2:$K$100,Tabelle1!$I$2:$I$100),\"nicht gefunden!\"),\"\")","v":""}]
["1-1-2-1",">>>4","1","-",3123635,"schw","Stahlbau","roh, leicht eingeölt",1,4,null,null,3123635,null,"Halbflansch heavy 1",null,null,"-","roh, leicht eingeölt","",4.4216260664371099,"",null,null,null,"ZF-27441","-","Released",null,null,null,"Assembly",null,1,null,"Assembly",null,null,null,17.686504265748439,"Nicht gefunden",{"$f":"IF(IFERROR(FIND($A21,$A22),0),_xlfn.IFNA(_xlfn.XLOOKUP($O21,Tabelle1!$K$2:$K$100,Tabelle1!$I$2:$I$100),\"nicht gefunden!\"),\"\")","v":"nicht gefunden!"}]
["1-1-2-1-1",">>>>5","1","-",3123636,"schw","Fertigung","roh, leicht eingeölt",1,4,135,135,3123636,null,"Flansch heavy 1","Rund Ø 135 - 76","DIN EN 10060","S355J2+N","roh, leicht eingeölt","",2.6538450062277796,"","Rund Ø 135 - 76",null,null,"ZF-27439","-","Released",null,null,null,"Part",null,76,null,"Part",null,null,null,10.615380024911119,null,{"$f":"IF(IFERROR(FIND($A22,$A23),0),_xlfn.IFNA(_xlfn.XLOOKUP($O22,Tabelle1!$K$2:$K$100,Tabelle1!$I$2:$I$100),\"nicht gefunden!\"),\"\")","v":""}]
["1-1-2-1-2",">>>>5","2","-",3123637,"schw","Fertigung","roh, leicht eingeölt",1,4,51,null,3123637,"131612 ","Flansch heavy 2","Rund Ø 220 - 51","DIN EN 10060","S355J2+N","roh, leicht eingeölt","",1.76778106020932,"","Rund Ø 220 - 51",null,null,"ZF-27440","-","Released",null,null,null,"Part",null,51,null,"Part",null,null,null,7.0711242408372801,null,{"$f":"IF(IFERROR(FIND($A23,$A24),0),_xlfn.IFNA(_xlfn.XLOOKUP($O23,Tabelle1!$K$2:$K$100,Tabelle1!$I$2:$I$100),\"nicht gefunden!\"),\"\")","v":""}]
["1-1-3-1",">>>4","1","-",3123691,"schw","Stahlbau","roh, leicht eingeölt",1,4,null,null,3123691,null,"Halbflasch 2 heavy",null,null,"-","roh, leicht eingeölt","",5.2493883596990898,"",null,null,null,"ZF-27436","-","Released",null,null,null,"Assembly",null,1,null,"Assembly",null,null,null,20.997553438796359,"Nicht gefunden",{"$f":"IF(IFERROR(FIND($A24,$A25),0),_xlfn.IFNA(_xlfn.XLOOKUP($O24,Tabelle1!$K$2:$K$100,Tabelle1!$I$2:$I$100),\"nicht gefunden!\"),\"\")","v":"nicht gefunden!"}]
["1-1-3-1-1",">>>>5","1","-",3123692,"schw","Fertigung","roh, leicht eingeölt",1,4,86,null,3123692,"127474 ","Bolzen 2 heavy","Rund Ø 150 - 86","DIN EN 10060","S355J2+N","roh, leicht eingeölt","",3.2723727945286201,"","Rund Ø 150 - 86",null,null,"ZF-27434","-","Released",null,null,null,"Part",null,86,null,"Part",null,null,null,13.08949117811448,null,{"$f":"IF(IFERROR(FIND($A25,$A26),0),_xlfn.IFNA(_xlfn.XLOOKUP($O25,Tabelle1!$K$2:$K$100,Tabelle1!$I$2:$I$100),\"nicht gefunden!\"),\"\")","v":""}]
["1-1-3-1-2",">>>>5","2","-",3123693,"schw","Fertigung","roh, leicht eingeölt",1,4,47.5,null,3123693,"131612 ","Flansch 3 heavy","Rund Ø 220 - 47.5","DIN EN 10060","S355J2+N","roh, leicht eingeölt","",1.97701556517046,"","Rund Ø 220 - 47.5",null,null,"ZF-27435","-","Released",null,null,null,"Part",null,47.5,null,"Part",null,null,null,7.9080622606818398,null,{"$f":"IF(IFERROR(FIND($A26,$A27),0),_xlfn.IFNA(_xlfn.XLOOKUP($O26,Tabelle1!$K$2:$K$100,Tabelle1!$I$2:$I$100),\"nicht gefunden!\"),\"\")","v":""}]
["1-1-5-1",">>>4","1","-",3203332,"schw","Stahlbau","Nasslackierung\nFarbanstrich gem. Bestellangaben\nGrund- und Deckanstrich\nSchichtdicke 70µm total \nLauf- Anschluss- und speziell\ngekennzeichnete Flächen sind abzudecken",1,4,null,null,3203332,null,"Getriebeplatte STB",null,null,"-","Nasslackierung\nFarbanstrich gem. Bestellangaben\nGrund- und Deckanstrich\nSchichtdicke 70µm total \nLauf- Anschluss- und speziell\ngekennzeichnete Flächen sind abzudecken","",9.7734803653386209,"",null,null,null,null,"-","Released","",null,null,"Assembly",null,1,null,"Assembly",null,null,null,39.093921461354483,"Nicht gefunden",{"$f":"IF(IFERROR(FIND($A27,$A28),0),_xlfn.IFNA(_xlfn.XLOOKUP($O27,Tabelle1!$K$2:$K$100,Tabelle1!$I$2:$I$100),\"nicht gefunden!\"),\"\")","v":"nicht gefunden!"}]
["1-1-5-1-1",">>>>5","1","-",3203331,"schw","Stahlbau",null,1,4,430,247,3203331,202336,"Getriebeplatte","Blech 15 - 247x 430","EN 10029","S235JRG2",null,"",9.2460431426939991,"","Blech 15 - 247x 430",null,15,null,"-","Released",null,null,null,"Part",null,1,null,"Part","mit Bearbeitung","ohne Kante",null,36.984172570775996,null,{"$f":"IF(IFERROR(FIND($A28,$A29),0),_xlfn.IFNA(_xlfn.XLOOKUP($O28,Tabelle1!$K$2:$K$100,Tabelle1!$I$2:$I$100),\"nicht gefunden!\"),\"\")","v":""}]
["1-1-5-1-2",">>>>5","2","-",3124597,"schw","Fertigung",null,1,4,30,null,3124597,null,"Schweissklotz","Flach 40 x 20 - 30","DIN EN 10058","S235JRG2",null,"",0.16479805137276698,"","Flach 40 x 20 - 30",null,null,null,"-","Released","",null,null,"Part",null,30,null,"Part",null,null,null,0.65919220549106794,null,{"$f":"IF(IFERROR(FIND($A29,$A30),0),_xlfn.IFNA(_xlfn.XLOOKUP($O29,Tabelle1!$K$2:$K$100,Tabelle1!$I$2:$I$100),\"nicht gefunden!\"),\"\")","v":""}]
["1-1-5-1-3",">>>>5","3","-",3124596,"schw","Stahlbau","roh, leicht eingeölt",1,4,230,null,3124596,125005,"Gewindestange M16 x 230","Rund Ø 16 x 230","DIN 975","ST","roh, leicht eingeölt","",0.36263917127,"","Rund Ø 16 x 230",null,null,null,"01","Released","Gewindestange M16x230, KL 8.8 Stahl blank",null,null,"Part",null,1,null,"Part",null,null,null,1.45055668508,null,{"$f":"IF(IFERROR(FIND($A30,$A31),0),_xlfn.IFNA(_xlfn.XLOOKUP($O30,Tabelle1!$K$2:$K$100,Tabelle1!$I$2:$I$100),\"nicht gefunden!\"),\"\")","v":""}]
["1-1-24-1",">>>4","1","01",3104992,"schw","Stahlbau","Nasslackierung\nFarbanstrich gem. Bestellangaben\nGrund- und Deckanstrich\nSchichtdicke 70µm total \nLauf- Anschluss- und speziell\ngekennzeichnete Flächen sind abzudecken",1,4,null,null,3104992,null,"Kassettenschmierung STB",null,null,"-","Nasslackierung\nFarbanstrich gem. Bestellangaben\nGrund- und Deckanstrich\nSchichtdicke 70µm total \nLauf- Anschluss- und speziell\ngekennzeichnete Flächen sind abzudecken","",2.5317509805856,"",null,"Zeichnung aktualisiert",null,null,"03","Released",null,null,null,"Assembly",null,1,null,"Assembly",null,null,null,10.1270039223424,"Nicht gefunden",{"$f":"IF(IFERROR(FIND($A31,$A32),0),_xlfn.IFNA(_xlfn.XLOOKUP($O31,Tabelle1!$K$2:$K$100,Tabelle1!$I$2:$I$100),\"nicht gefunden!\"),\"\")","v":"nicht gefunden!"}]
["1-1-24-1-1",">>>>5","1","-",3104993,"schw","Stahlbau",null,1,4,426,156,3104993,162103,"Biegeblech","Blech 2 - 156x 426","EN 10029","S235JRG2",null,"",1.0528883999600001,"","Blech 2 - 156x 426",null,2,null,"01","Released","",null,null,"Part",null,1,null,"Part","ohne Bearbeitung","mit Kante",null,4.2115535998400002,null,{"$f":"IF(IFERROR(FIND($A32,$A33),0),_xlfn.IFNA(_xlfn.XLOOKUP($O32,Tabelle1!$K$2:$K$100,Tabelle1!$I$2:$I$100),\"nicht gefunden!\"),\"\")","v":""}]
["1-1-24-1-2",">>>>5","2","01",3104994,"schw","Stahlbau",null,2,8,78,40,3104994,162103,"Deckblech","Blech 2 - 40x 78","EN 10029","S235JRG2",null,"",4.8923353519999997E-2,"","Blech 2 - 40x 78","Einzelteilzeichnung erstellt",2,null,"02","Released",null,null,null,"Part",null,2,null,"Part","ohne Bearbeitung","ohne Kante",null,0.39138682815999998,null,{"$f":"IF(IFERROR(FIND($A33,$A34),0),_xlfn.IFNA(_xlfn.XLOOKUP($O33,Tabelle1!$K$2:$K$100,Tabelle1!$I$2:$I$100),\"nicht gefunden!\"),\"\")","v":""}]
["1-1-24-1-3",">>>>5","3","01",3104998,"schw","Stahlbau",null,2,8,60,35,3104998,207897,"Befestigungsblech","Blech 10 - 35x 60","EN 10029","S235JRG2",null,"",0.14779709156000001,"","Blech 10 - 35x 60","Einzelteilzeichnung erstellt",10,null,"02","Released",null,null,null,"Part",null,2,null,"Part","ohne Bearbeitung","ohne Kante",null,1.1823767324800001,null,{"$f":"IF(IFERROR(FIND($A34,$A35),0),_xlfn.IFNA(_xlfn.XLOOKUP($O34,Tabelle1!$K$2:$K$100,Tabelle1!$I$2:$I$100),\"nicht gefunden!\"),\"\")","v":""}]
["1-1-24-1-4",">>>>5","4","01",3104997,"schw","Stahlbau",null,4,16,76,30,3104997,202336,"Quersteg","Blech 15 - 30x 76","DIN EN 10058","S235JRG2",null,"",0.26268690454999999,"","Blech 15 - 30x 76","Einzelteil Zeichnung erstellt",15,null,"03","Released",null,null,null,"Part",null,304,null,"Part","mit Bearbeitung","ohne Kante",null,4.2029904727999998,null,{"$f":"IF(IFERROR(FIND($A35,$A36),0),_xlfn.IFNA(_xlfn.XLOOKUP($O35,Tabelle1!$K$2:$K$100,Tabelle1!$I$2:$I$100),\"nicht gefunden!\"),\"\")","v":""}]
["1-1-24-1-5",">>>>5","5","-",3104996,"schw","Stahlbau",null,1,4,74,null,3104996,116667,"-","Rohr Ø 20 - 74","DIN2391","S235JRG2",null,"",3.4674072279999996E-2,"","Rohr Ø 20 - 74",null,null,null,"01","Released","",null,null,"Part",null,1,"schw","Part",null,null,null,0.13869628911999998,null,{"$f":"IF(IFERROR(FIND($A36,$A37),0),_xlfn.IFNA(_xlfn.XLOOKUP($O36,Tabelle1!$K$2:$K$100,Tabelle1!$I$2:$I$100),\"nicht gefunden!\"),\"\")","v":""}]
["1-4-1",">>3","1","01",3142490,"schw","Stahlbau","Nasslackierung\nFarbanstrich gem. Bestellangaben\nGrund- und Deckanstrich\nSchichtdicke 70µm total \nLauf- Anschluss- und speziell\ngekennzeichnete Flächen sind abzudecken",1,4,null,null,3142490,null,"Halter Lichtvorhang MLG10A-590 STB",null,null,"-","Nasslackierung\nFarbanstrich gem. Bestellangaben\nGrund- und Deckanstrich\nSchichtdicke 70µm total \nLauf- Anschluss- und speziell\ngekennzeichnete Flächen sind abzudecken","",1.99174253744,"",null,"Pos.2 ers",null,null,"01","Released","Empfänger",null,null,"Assembly",null,1,null,"Assembly",null,null,null,7.9669701497599998,null,{"$f":"IF(IFERROR(FIND($A37,$A38),0),_xlfn.IFNA(_xlfn.XLOOKUP($O37,Tabelle1!$K$2:$K$100,Tabelle1!$I$2:$I$100),\"nicht gefunden!\"),\"\")","v":"nicht gefunden!"}]
["1-4-1-1",">>>4","1","-",3142492,"schw","Stahlbau",null,1,4,800,90.9,3142492,206073,"Halter Lichtvorhang zu MLG10A-590","Blech 5 - 91x 800","EN 10029","S235JRG2",null,"",1.71456112905,"","Blech 5 - 91x 800",null,5,null,"01","Released","Empfänger",null,null,"Part",null,1,null,"Part","ohne Bearbeitung","mit Kante",null,6.8582445162000001,"Nicht gefunden",{"$f":"IF(IFERROR(FIND($A38,$A39),0),_xlfn.IFNA(_xlfn.XLOOKUP($O38,Tabelle1!$K$2:$K$100,Tabelle1!$I$2:$I$100),\"nicht gefunden!\"),\"\")","v":""}]
["1-4-1-2",">>>4","2","-",3145937,"schw","Stahlbau",null,1,4,300,null,3145937,160783,"-","C 28 x 15 x14 x 2 - 300","DIN EN 10162","S235JRG2",null,"",0.27718140838999999,"","C 28 x 15 x14 x 2 - 300",null,null,null,"02","Released",null,null,null,"Part",null,300,null,"Part",null,null,null,1.10872563356,"Nicht gefunden",{"$f":"IF(IFERROR(FIND($A39,$A40),0),_xlfn.IFNA(_xlfn.XLOOKUP($O39,Tabelle1!$K$2:$K$100,Tabelle1!$I$2:$I$100),\"nicht gefunden!\"),\"\")","v":""}]
["1-5-1",">>3","1","01",3142495,"schw","Stahlbau","Nasslackierung\nFarbanstrich gem. Bestellangaben\nGrund- und Deckanstrich\nSchichtdicke 70µm total \nLauf- Anschluss- und speziell\ngekennzeichnete Flächen sind abzudecken",1,4,null,null,3142495,null,"Halter Lichtvorhang MLG10A-590 STB",null,null,"-","Nasslackierung\nFarbanstrich gem. Bestellangaben\nGrund- und Deckanstrich\nSchichtdicke 70µm total \nLauf- Anschluss- und speziell\ngekennzeichnete Flächen sind abzudecken","",1.99174253744,"",null,"Pos.2 ers",null,null,"01","Released","Sender",null,null,"Assembly",null,1,null,"Assembly",null,null,null,7.9669701497599998,null,{"$f":"IF(IFERROR(FIND($A40,$A41),0),_xlfn.IFNA(_xlfn.XLOOKUP($O40,Tabelle1!$K$2:$K$100,Tabelle1!$I$2:$I$100),\"nicht gefunden!\"),\"\")","v":"nicht gefunden!"}]
["1-5-1-1",">>>4","1","-",3142496,"schw","Stahlbau",null,1,4,800,90.9,3142496,206073,"Halter Lichtvorhang zu MLG10A-590","Blech 5 - 91x 800","EN 10029","S235JRG2",null,"",1.71456112905,"","Blech 5 - 91x 800",null,5,null,"01","Released","Sender",null,null,"Part",null,1,null,"Part","ohne Bearbeitung","mit Kante",null,6.8582445162000001,"Nicht gefunden",{"$f":"IF(IFERROR(FIND($A41,$A42),0),_xlfn.IFNA(_xlfn.XLOOKUP($O41,Tabelle1!$K$2:$K$100,Tabelle1!$I$2:$I$100),\"nicht gefunden!\"),\"\")","v":""}]
["1-5-1-3",">>>4","3","-",3145937,"schw","Stahlbau",null,1,4,300,null,3145937,160783,"-","C 28 x 15 x14 x 2 - 300","DIN EN 10162","S235JRG2",null,"",0.27718140838999999,"","C 28 x 15 x14 x 2 - 300",null,null,null,"02","Released",null,null,null,"Part",null,300,null,"Part",null,null,null,1.10872563356,"Nicht gefunden",{"$f":"IF(IFERROR(FIND($A42,$A43),0),_xlfn.IFNA(_xlfn.XLOOKUP($O42,Tabelle1!$K$2:$K$100,Tabelle1!$I$2:$I$100),\"nicht gefunden!\"),\"\")","v":""}]
["1-6-1",">>3","1","-",3202788,"schw","Stahlbau","Nasslackierung\nFarbanstrich gem. Bestellangaben\nGrund- und Deckanstrich\nSchichtdicke 70µm total \nLauf- Anschluss- und speziell\ngekennzeichnete Flächen sind abzudecken",1,8,null,null,3202788,null,"Halter Lichtgitter STB",null,null,"Generisch","Nasslackierung\nFarbanstrich gem. Bestellangaben\nGrund- und Deckanstrich\nSchichtdicke 70µm total \nLauf- Anschluss- und speziell\ngekennzeichnete Flächen sind abzudecken","",1.5302058535821499,"",null,null,null,null,"-","Released","",null,null,"Assembly",null,1,null,"Assembly",null,null,null,12.241646828657199,null,{"$f":"IF(IFERROR(FIND($A43,$A44),0),_xlfn.IFNA(_xlfn.XLOOKUP($O43,Tabelle1!$K$2:$K$100,Tabelle1!$I$2:$I$100),\"nicht gefunden!\"),\"\")","v":"240783"}]
["1-6-1-1",">>>4","1","-",3196861,"schw","Stahlbau",null,2,16,200,40,3196861,162095,"Blech 1","Blech 8 - 40x 200","EN 10029","S235JRG2",null,"",0.48807416666547798,"","Blech 8 - 40x 200",null,8,null,"-","Released",null,null,null,"Part",null,2,null,"Part","ohne Bearbeitung","ohne Kante",null,7.8091866666476477,"Nicht gefunden",{"$f":"IF(IFERROR(FIND($A44,$A45),0),_xlfn.IFNA(_xlfn.XLOOKUP($O44,Tabelle1!$K$2:$K$100,Tabelle1!$I$2:$I$100),\"nicht gefunden!\"),\"\")","v":""}]
["1-6-1-2",">>>4","2","-",3202787,"schw","Stahlbau",null,1,8,164,null,3202787,163196,"-","4kt-Rohr 50 x 30 x 3 - 164","DIN EN 10219-2","S235JRH",null,"",0.54176753232024999,"","4kt-Rohr 50 x 30 x 3 - 164",null,null,null,"-","Released",null,null,null,"Part",null,164,null,"Part",null,null,null,4.3341402585619999,"Nicht gefunden",{"$f":"IF(IFERROR(FIND($A45,$A46),0),_xlfn.IFNA(_xlfn.XLOOKUP($O45,Tabelle1!$K$2:$K$100,Tabelle1!$I$2:$I$100),\"nicht gefunden!\"),\"\")","v":""}]
["1-6-1-3",">>>4","3","01",3107726,"schw","Normteil",null,2,16,null,null,3107726,122907,"Sechskant-Schweissmutter M8",null,"DIN 929","-",null,"",6.1449939700000001E-3,"",null,"Eigenschaften angepasst",null,null,"03","Released",null,null,null,"Purchased",null,2,null,"Purchased",null,null,null,9.8319903520000002E-2,"Nicht gefunden",{"$f":"IF(IFERROR(FIND($A46,$A47),0),_xlfn.IFNA(_xlfn.XLOOKUP($O46,Tabelle1!$K$2:$K$100,Tabelle1!$I$2:$I$100),\"nicht gefunden!\"),\"\")","v":""}]

{"sheet":"Stueckliste","index":1,"n_rows":327,"n_cols":39,"rows_kept":327,"cut":false,"hidden":false,"merged":[]}
["Positionierung","Level","Position Number","Revision Number","Number","Bearbeitung","Fehr Kategorie","Oberfläche","Quantity","Stückzahl","Länge [mm]","Breite [mm]","File Name","Rohmat Artikel","Title","Abmass","Norm","Material","Oberfläche","Bestand","Masse [kg]","Position","Abmass","Änderungsgrund","Blechstärke [mm]","Ersatz für","Revision","State","Typ","Zulieferer","Zulieferer Artikelnummer","Category Name","Rohmat Gewicht [g]","Kettenlängen","Bemerkung","Category Name","Laserteil bearbeitet","Laserteil gekantet","Beschaffung"]
["1",1,1,"-",3202584,null,"Montage",null,1,2,null,null,null,null,"HW-GT",null,null,null,null,null,0,null,null,null,null,null,null,null,null,null,null,null,null,null,null,"Assembly"]
["1-1",">2","1","-",3202583,"mon","Montage",null,1,2,null,null,3202583,null,"Greiferträger 1 kpl",null,null,"-",null,"",2376.1747370494904,"",null,null,null,null,"-","Released",null,null,null,"Assembly",null,1,null,"Assembly"]
["1-1-1",">>3","1","-",3202599,"schw","Stahlbau","Nasslackierung\nFarbanstrich gem. Bestellangaben\nGrund- und Deckanstrich\nSchichtdicke 70µm total \nLauf- Anschluss- und speziell\ngekennzeichnete Flächen sind abzudecken",1,2,null,null,3202599,null,"Greiferträger STB",null,null,"-","Nasslackierung\nFarbanstrich gem. Bestellangaben\nGrund- und Deckanstrich\nSchichtdicke 70µm total \nLauf- Anschluss- und speziell\ngekennzeichnete Flächen sind abzudecken","",1558.98571385379,"",null,null,null,null,"-","Released",null,null,null,"Assembly",null,1,null,"Assembly"]
["1-1-1-1",">>>4","1","-",3202602,"schw","Stahlbau",null,2,4,null,null,3202602,null,"Kettenschiene oben STB",null,null,"-",null,"",25.814551288161301,"",null,null,null,null,"-","Released","",null,null,"Assembly",null,2,null,"Assembly"]
["1-1-1-1-1",">>>>5","1","-",3202600,"schw","Stahlbau",null,1,4,6580,null,3202600,"161179 ","Kettenschienenprofil unten","4k-Rohr 40x40x3 - 6580","DIN EN 10210-2","S235JRH",null,"",22.298731033980101,"","4k-Rohr 40x40x3 - 6580",null,null,null,"-","Released",null,null,null,"Part",null,6580,"Sägeliste nach Zeichnung","Part"]
["1-1-1-1-2",">>>>5","2","01",3124590,"schw","Stahlbau",null,2,8,52,36,3124590,162101,"Abdeckblech","Blech 3 - 52x 36","EN 10029","S235JRG2",null,"",4.358021267E-2,"","Blech 3 - 52x 36","Oberflächenbeschaffenheit geändert",3,null,"01","Released",null,null,null,"Part",null,2,null,"Part","ohne Bearbeitung","ohne Kante"]
["1-1-1-1-3",">>>>5","3","-",3202601,"schw","Einkaufsteil","Blank",1,4,6605,null,3202601,138517,"C-Profil L=6605","HM 20/12 - 6605",null,"ST","Blank","",3.4286598288316199,"","HM 20/12 - 6605",null,null,null,"-","Released","C-2010 (6m)",null,null,"Purchased",null,6605,"Sägeliste nach Zeichnung","Purchased"]
["1-1-1-2",">>>4","2","-",3202633,"schw","Stahlbau",null,14,28,null,null,3202633,null,"Gleiterhalter aussen STB",null,null,"-",null,"",3.8598691347807299,"",null,null,null,null,"-","Released","",null,null,"Assembly",null,14,null,"Assembly"]
["1-1-1-2-1",">>>>5","1","-",3202630,"schw","Stahlbau",null,1,28,810.4,121.8,3202630,206073,"Gleiterhalter aussen","Blech 5 - 122x 810","EN 10029","S235JRG2",null,"",3.7197858847807304,"","Blech 5 - 122x 810",null,5,null,"-","Released",null,null,null,"Part",null,1,null,"Part","ohne Bearbeitung","mit Kante"]
["1-1-1-2-2",">>>>5","2","-",3202802,"schw","Stahlbau",null,2,56,61,35,3202802,206073,"Gleiterrippe","Blech 5 - 35x 61","EN 10029","S235JRG2",null,"",7.0041624999999996E-2,"","Blech 5 - 35x 61",null,5,null,"-","Released",null,null,null,"Part",null,2,null,"Part","ohne Bearbeitung","ohne Kante"]
["1-1-1-3",">>>4","3","-",3202634,"schw","Stahlbau",null,4,8,null,null,3202634,null,"Gleiterhalter Einlauf STB",null,null,"-",null,"",3.2465520193977198,"",null,null,null,null,"-","Released","",null,null,"Assembly",null,4,null,"Assembly"]
["1-1-1-3-1",">>>>5","1","-",3202631,"schw","Stahlbau",null,1,8,651,121.8,3202631,206073,"Gleiterhalter aussen","Blech 5 - 122x 651","EN 10029","S235JRG2",null,"",3.1765103943977202,"","Blech 5 - 122x 651",null,5,null,"-","Released",null,null,null,"Part",null,1,null,"Part","ohne Bearbeitung","mit Kante"]
["1-1-1-3-2",">>>>5","2","-",3202802,"schw","Stahlbau",null,1,8,61,35,3202802,206073,"Gleiterrippe","Blech 5 - 35x 61","EN 10029","S235JRG2",null,"",7.0041624999999996E-2,"","Blech 5 - 35x 61",null,5,null,"-","Released",null,null,null,"Part",null,1,null,"Part","ohne Bearbeitung","ohne Kante"]
["1-1-1-4",">>>4","4","-",3202628,"schw","Stahlbau",null,14,28,null,null,3202628,null,"Abstützung STB",null,null,"-",null,"",4.8254875671925603,"",null,null,null,null,"-","Released","",null,null,"Assembly",null,14,null,"Assembly"]
["1-1-1-4-1",">>>>5","1","-",3202629,"schw","Stahlbau",null,1,28,553.79999999999995,419.9,3202629,206073,"Biegeblech 3","Blech 5 - 420x 554","EN 10029","S235JRG2",null,"",4.6816461296925596,"","Blech 5 - 420x 554",null,5,null,"-","Released",null,null,null,"Part",null,1,null,"Part","ohne Bearbeitung","mit Kante"]
["1-1-1-4-2",">>>>5","2","-",3124582,"schw","Stahlbau",null,2,56,48,45,3124582,206073,"Rippe Abstützung","Blech 5 - 45x 48","EN 10029","S235JRG2",null,"",7.1920718750000001E-2,"","Blech 5 - 45x 48",null,5,null,"-","Released","",null,null,"Part",null,2,null,"Part","ohne Bearbeitung","ohne Kante"]
["1-1-1-5",">>>4","5","-",3202598,"schw","Stahlbau",null,2,4,null,null,3202598,null,"Kettenschiene unten STB",null,null,"Generisch",null,"",36.449751853067298,"",null,null,null,null,"-","Released","",null,null,"Assembly",null,2,null,"Assembly"]
["1-1-1-5-1",">>>>5","1","-",3202597,"schw","Stahlbau",null,1,4,6760,null,3202597,116454,"-","U-Stahl 40 x 35 - 6760","DIN 1026-1","S235JRG2",null,"",32.957266107347699,"","U-Stahl 40 x 35 - 6760",null,null,null,"-","Released",null,null,null,"Part",null,6760,null,"Part"]
["1-1-1-5-3",">>>>5","3","-",3202596,"schw","Einkaufsteil","Blank",1,4,6720,null,3202596,138517,"C-Profil L=6720","HM 20/12 - 6720",null,"ST","Blank","",3.4924857457196401,"","HM 20/12 - 6720",null,null,null,"-","Released","C-2010 (6m)",null,null,"Purchased",null,6720,null,"Purchased"]
["1-1-1-6",">>>4","6","-",3183621,"schw","Stahlbau",null,2,4,null,null,3183621,null,"Kettenspanner STB",null,null,"Generisch",null,"",4.0953163328932902,"",null,null,null,null,"-","Released","",null,null,"Assembly",null,2,null,"Assembly"]
["1-1-1-6-1",">>>>5","1","-",3123597,"schw","Stahlbau",null,1,4,261,170,3123597,207897,"Biegeblech Kettenspanner","Blech 10 - 170x 261","EN 10029","S235JRG2",null,"",3.47181877913349,"","Blech 10 - 170x 261",null,10,null,"01","Released",null,null,null,"Part",null,1,null,"Part","ohne Bearbeitung","mit Kante"]
["1-1-1-6-2",">>>>5","2","-",3107187,"schw","Stahlbau",null,2,8,190,65,3107187,206073,"Rippenblech Kettenspanner","Blech 5 - 65x 190","EN 10029","S235JRG2",null,"",0.31174877687999997,"","Blech 5 - 65x 190",null,5,null,"02","Released",null,null,null,"Part",null,2,null,"Part","ohne Bearbeitung","ohne Kante"]
["1-1-1-7",">>>4","7","-",3202662,"schw","Stahlbau",null,2,4,446,311,3202662,207897,"Seitenplatte","Blech 10 - 311x 446","EN 10029","S235JRG2",null,"",10.876090248834601,"","Blech 10 - 311x 446",null,10,null,"-","Released",null,null,null,"Part",null,2,null,"Part","mit Bearbeitung","ohne Kante"]
["1-1-1-8",">>>4","8","-",3123696,"schw","Fertigung",null,2,4,270,170,3123696,null,"Kettenspanner gefräst","Flach 50 - 170x 270","EN 10029","S355J2H",null,"",10.484382656677601,"","Flach 50 - 170x 270",null,50,null,"-","Released",null,null,null,"Part",null,2,null,"Part"]
["1-1-1-9",">>>4","9","-",3203066,"schw","Stahlbau",null,2,4,419.9,163.80000000000001,3203066,206073,"Abstützung aussen 1","Blech 5 - 164x 420","EN 10029","S235JRG2",null,"",1.9852536190886301,"","Blech 5 - 164x 420",null,5,null,"-","Released",null,null,null,"Part",null,2,null,"Part","ohne Bearbeitung","mit Kante"]
["1-1-1-10",">>>4","10","-",3202626,"schw","Stahlbau",null,12,24,794,188.5,3202626,162101,"Zwischenblech","Blech 3 - 188x 794","EN 10029","S235JRG2",null,"",3.5128045709493798,"","Blech 3 - 188x 794",null,3,null,"-","Released",null,null,null,"Part",null,12,null,"Part","ohne Bearbeitung","mit Kante"]
["1-1-1-11",">>>4","11","-",3123356,"schw","Stahlbau",null,2,4,60,172,3123356,162095,"Rippe","Blech 8 - 172x 60","EN 10029","S235JRG2",null,"",0.64674830046613596,"","Blech 8 - 172x 60",null,8,null,"-","Released","",null,null,"Part",null,2,null,"Part","ohne Bearbeitung","ohne Kante"]
["1-1-1-12",">>>4","12","-",3123610,"schw","Stahlbau",null,2,4,311,64,3123610,205819,"Seitenabdeckung 1","Blech 4 - 64x 311","EN 10029","S235JRG2",null,"",0.62498560000000003,"","Blech 4 - 64x 311",null,4,null,"-","Released","",null,null,"Part",null,2,null,"Part","ohne Bearbeitung","ohne Kante"]
["1-1-1-13",">>>4","13","-",3202627,"schw","Stahlbau",null,2,4,419.9,523.79999999999995,3202627,206073,"Abstützung aussen 2","Blech 5 - 524x 420","EN 10029","S235JRG2",null,"",4.5038510028688199,"","Blech 5 - 524x 420",null,5,null,"-","Released",null,null,null,"Part",null,2,null,"Part","ohne Bearbeitung","mit Kante"]
["1-1-1-14",">>>4","14","-",3202625,"schw","Stahlbau",null,2,4,6066,311,3202625,205819,"Seitenblech","Blech 4 - 311x 6066","EN 10029","S235JRG2",null,"",58.532034655711001,"","Blech 4 - 311x 6066",null,4,null,"-","Released",null,null,null,"Part",null,2,null,"Part","mit Bearbeitung","ohne Kante"]
["1-1-1-15",">>>4","15","-",3123337,"schw","Stahlbau",null,4,8,400,76,3123337,205819,"Blech Grundposition","Blech 4 - 76x 400","EN 10029","S235JRG2",null,"",0.88073084180773298,"","Blech 4 - 76x 400",null,4,null,"-","Released",null,null,null,"Part",null,4,null,"Part","ohne Bearbeitung","ohne Kante"]
["1-1-1-16",">>>4","16","-",3202650,"schw","Stahlbau",null,2,4,1262,716,3202650,202336,"Fussblech","Blech 15 - 716x 1262","EN 10029","S235JRG2",null,"",76.742042374874103,"","Blech 15 - 716x 1262",null,15,null,"-","Released",null,null,null,"Part",null,2,null,"Part","ohne Bearbeitung","ohne Kante"]
["1-1-1-17",">>>4","17","-",3123604,"schw","Fertigung",null,2,4,400,311,3123604,null,"Flansch","Blech 25 - 311x 400","EN 10029","S235JRG2",null,"",18.573257708558,"","Blech 25 - 311x 400",null,25,null,"-","Released",null,null,null,"Part",null,2,null,"Part"]
["1-1-1-18",">>>4","18","-",3202615,"schw","Stahlbau",null,2,4,380.5,357,3202615,206073,"Rippe Abstützung aussen","Blech 5 - 357x 380","EN 10029","S235JRG2",null,"",2.7470707203386402,"","Blech 5 - 357x 380",null,5,null,"-","Released",null,null,null,"Part",null,2,null,"Part","mit Bearbeitung","ohne Kante"]
["1-1-1-19",">>>4","19","-",3104070,"schw","Fertigung",null,8,16,110,null,3104070,"116474 ","Haltewinkel","Winkel 40 x 40 x 5 - 110","DIN EN 10056-1","S235JRG2",null,"",0.32640275833999999,"","Winkel 40 x 40 x 5 - 110",null,null,null,"04","Released",null,null,null,"Part",null,880,null,"Part"]
["1-1-1-20",">>>4","20","-",3104069,"schw","Stahlbau",null,2,4,50,50,3104069,205911,"Gewinde Anschluss Abdeckbl.","Blech 20 - 50x 50","DIN EN 10058","S235JRG2",null,"",0.38705195242999996,"","Blech 20 - 50x 50",null,20,null,"03","Released",null,null,null,"Part",null,100,null,"Part","mit Bearbeitung","ohne Kante"]
["1-1-1-21",">>>4","21","-",3202664,"schw","Stahlbau",null,2,4,50,50,3202664,202336,"Gewinde Anschluss Abdeckbl. 2","Blech 15 - 50x 50","DIN EN 10058","S235JRG2",null,"",0.29028896431939105,"","Blech 15 - 50x 50",null,20,null,"-","Released",null,null,null,"Part",null,100,null,"Part","mit Bearbeitung","ohne Kante"]
["1-1-1-22",">>>4","22","-",3103988,"schw","Fertigung",null,4,8,74.5,null,3103988,160309,"Bolzen zu Umlenkrad 1\"","Rund Ø 70 - 74.5","DIN EN 10060","S355J2H",null,"",0.8630298808700001,"","Rund Ø 70 - 74.5",null,null,null,"02","Released",null,null,null,"Part",null,298,null,"Part"]
["1-1-1-23",">>>4","23","-",3202607,"schw","Stahlbau",null,2,4,7202,null,3202607,162294,"Rohr 2","4kt-Rohr 100 x 50 x 3 - 7202","DIN EN 10210-2","S355J2H",null,"",48.300874872587301,"","4kt-Rohr 100 x 50 x 3 - 7202",null,null,null,"-","Released",null,null,null,"Part",null,14404,null,"Part"]
["1-1-1-24",">>>4","24","-",3202604,"schw","Stahlbau",null,2,4,7102,295.5,3202604,205819,"Seitenblech aussen","Blech 4 - 296x 7102","EN 10029","S235JRG2",null,"",38.174755132876498,"","Blech 4 - 296x 7102",null,4,null,"-","Released",null,null,null,"Part",null,2,null,"Part","ohne Bearbeitung","ohne Kante"]
["1-1-1-25",">>>4","25","-",3202616,"schw","Stahlbau",null,14,28,385,200,3202616,206073,"Rippenblech aussen 2","Blech 5 - 200x 385","EN 10029","S235JRG2",null,"",2.2609821730618203,"","Blech 5 - 200x 385",null,5,null,"-","Released",null,null,null,"Part",null,14,null,"Part","ohne Bearbeitung","ohne Kante"]
["1-1-1-26",">>>4","26","-",3202617,"schw","Stahlbau",null,4,8,150,125,3202617,206073,"Rippenblech aussen 3","Blech 5 - 125x 150","EN 10029","S235JRG2",null,"",0.46673558985272701,"","Blech 5 - 125x 150",null,5,null,"-","Released",null,null,null,"Part",null,4,null,"Part","ohne Bearbeitung","ohne Kante"]
["1-1-1-27",">>>4","27","-",3182440,"schw","Stahlbau",null,4,8,220,50,3182440,202336,"Gewindeplatte","Blech 15 - 50x 220","EN 10029","S235JRG2",null,"",1.2870779286387799,"","Blech 15 - 50x 220",null,15,null,"-","Released","",null,null,"Part",null,4,null,"Part","mit Bearbeitung","ohne Kante"]
["1-1-1-28",">>>4","28","-",3123333,"schw","Stahlbau",null,4,8,94,94,3123333,206073,"Deckblech","Blech 5 - 94x 94","EN 10029","S235JRG2",null,"",0.345970687791335,"","Blech 5 - 94x 94",null,5,null,"-","Released",null,null,null,"Part",null,4,null,"Part","ohne Bearbeitung","ohne Kante"]
["1-1-1-29",">>>4","29","-",3182791,"schw","Stahlbau",null,8,16,94,44,3182791,205819,"Deckblech 2","Blech 4 - 44x 94","EN 10029","S235JRG2",null,"",0.129439136149164,"","Blech 4 - 44x 94",null,4,null,"-","Released","",null,null,"Part",null,8,null,"Part","ohne Bearbeitung","ohne Kante"]
["1-1-1-30",">>>4","30","01",3133559,"schw","Fertigung",null,9,18,50,null,3133559,"116473 ","Befestigungswinkel","Winkel 40 x 40 x 4 - 50","DIN EN 10056-1","S235JRG2",null,"",0.11883858029,"","Winkel 40 x 40 x 4 - 50","Fehr Kategorie geändert",null,null,"03","Released",null,null,null,"Part",null,450,null,"Part"]
["1-1-1-31",">>>4","31","-",3202603,"schw","Lagerteil",null,2,4,7210,null,3202603,"ZN-00118","Führungsschiene L=7210","Spezialprofil 74.5x 85.5 - 7210","ZN-00118","St52-3KS",null,"",127.661648928807,"","Spezialprofil 74.5x 85.5 - 7210",null,null,null,"-","Released","ZN-00118",null,null,"Purchased",null,2,null,"Purchased"]
["1-1-1-32",">>>4","32","-",3203300,"schw","Fertigung",null,2,4,80,null,3203300,null,"Rohr zu Befestigung GT","Rohr nahtlos ø26.9x 4 - 80","DIN 2448","S235JRG2",null,"",0.177956167743062,"","Rohr nahtlos ø26.9x 4 - 80",null,null,null,"-","Released",null,null,null,"Part",null,160,null,"Part"]
["1-1-1-33",">>>4","33","-",3203299,"schw","Fertigung",null,2,4,212,null,3203299,null,"Rohr Befestigung GT","4kt-Rohr 80 x 60 x 4 - 212","DIN EN 10219-2","S235JRH",null,"",1.64909259454208,"","4kt-Rohr 80 x 60 x 4 - 212",null,null,null,"-","Released",null,null,null,"Part",null,424,null,"Part"]
["1-1-1-34",">>>4","34","-",3202639,"schw","Einkaufsteil","Blank",2,4,6817,null,3202639,"138296 ","C-Profil L=6817","C-3818 - 6817",null,"ST","Blank","",9.8413836510295898,"","C-3818 - 6817",null,null,null,"-","Released","C-3818 (6m)",null,null,"Purchased",null,13634,null,"Purchased"]
["1-1-1-35",">>>4","35","-",3202636,"schw","Stahlbau",null,2,4,7210,null,3202636,117465,"Führungsleiste","Flach 20 x 8 - 7210","DIN EN 10058","S355J2+N",null,"",9.1134400000000007,"","Flach 20 x 8 - 7210",null,null,null,"-","Released","",null,null,"Part",null,14420,null,"Part"]
["1-1-1-36",">>>4","36","-",3202340,"schw","Stahlbau",null,4,8,239,111,3202340,207897,"Blech 1","Blech 10 - 111x 239","EN 10029","S235JRG2",null,"",1.3041628755826999,"","Blech 10 - 111x 239",null,10,null,"-","Released",null,null,null,"Part",null,4,null,"Part","ohne Bearbeitung","ohne Kante"]
["1-1-1-37",">>>4","37","-",3108802,"schw","Stahlbau",null,4,8,700,null,3108802,160783,"-","C-Profil 28 x 15 x 2.3 - 700",null,"S235JRG2",null,"",0.77232418063999997,"","C-Profil 28 x 15 x 2.3 - 700",null,null,null,"02","Released",null,null,null,"Part",null,4,"schw","Part"]
["1-1-1-38",">>>4","38","-",3123358,"schw","Stahlbau",null,4,8,580,null,3123358,null,"-"," 49 x 580 x 30",null,"S235JRG2",null,"",1.92434005722923,""," 49 x 580 x 30",null,null,null,"03","Released","Profil 50/30 - 580",null,null,"Part",null,4,null,"Part"]
["1-1-1-39",">>>4","39","-",3123317,"schw","Stahlbau",null,9,18,212,null,3123317,162274,"-","4kt-Rohr 90 x 50 x 4 - 212","DIN EN 10219-2","S235JRH",null,"",1.6888242477169899,"","4kt-Rohr 90 x 50 x 4 - 212",null,null,null,"01","Released",null,null,null,"Part",null,1908,null,"Part"]
["1-1-1-40",">>>4","40","-",3202637,"schw","Stahlbau",null,2,4,7200,null,3202637,130497,"-","4kt-Rohr 100 x 100 x 4 - 7200","DIN EN 10219-2","S235JRH",null,"",84.485895205482791,"","4kt-Rohr 100 x 100 x 4 - 7200",null,null,null,"-","Released",null,null,null,"Part",null,14400,null,"Part"]
["1-1-1-41",">>>4","41","-",3202605,"schw","Stahlbau",null,2,4,7202,null,3202605,162294,"-","4kt-Rohr 100 x 50 x 3 - 7202","DIN EN 10210-2","S355J2H",null,"",48.300874872587301,"","4kt-Rohr 100 x 50 x 3 - 7202",null,null,null,"-","Released",null,null,null,"Part",null,14404,null,"Part"]
["1-1-1-42",">>>4","42","-",3202609,"schw","Stahlbau",null,4,8,295.5,null,3202609,162294,"-","4kt-Rohr 100 x 50 x 3 - 295.5","DIN EN 10210-2","S355J2H",null,"",1.98179790681055,"","4kt-Rohr 100 x 50 x 3 - 295.5",null,null,null,"-","Released",null,null,null,"Part",null,1182,null,"Part"]
["1-1-1-43",">>>4","43","-",3202618,"schw","Stahlbau",null,8,16,770.5,null,3202618,"116466 ","-","Winkel 25 x 25 x 4 - 770.5","DIN EN 10056-1","S235JRG2",null,"",1.12086046907051,"","Winkel 25 x 25 x 4 - 770.5",null,null,null,"-","Released",null,null,null,"Part",null,6164,null,"Part"]
["1-1-1-44",">>>4","44","-",3202619,"schw","Stahlbau",null,32,64,365,null,3202619,"116466 ","-","Winkel 25 x 25 x 4 - 365","DIN EN 10056-1","S235JRG2",null,"",0.53097218846299399,"","Winkel 25 x 25 x 4 - 365",null,null,null,"-","Released",null,null,null,"Part",null,11680,null,"Part"]
["1-1-1-45",">>>4","45","-",3202620,"schw","Stahlbau",null,4,8,470,null,3202620,"116466 ","-","Winkel 25 x 25 x 4 - 470","DIN EN 10056-1","S235JRG2",null,"",0.68371761254138907,"","Winkel 25 x 25 x 4 - 470",null,null,null,"-","Released",null,null,null,"Part",null,1880,null,"Part"]
["1-1-1-46",">>>4","46","-",3202621,"schw","Stahlbau",null,4,8,150,null,3202621,"116466 ","-","Winkel 25 x 25 x 4 - 150","DIN EN 10056-1","S235JRG2",null,"",0.21820774868342202,"","Winkel 25 x 25 x 4 - 150",null,null,null,"-","Released",null,null,null,"Part",null,600,null,"Part"]
["1-1-1-47",">>>4","47","-",3202622,"schw","Stahlbau",null,4,8,950,null,3202622,"116466 ","-","Winkel 25 x 25 x 4 - 950","DIN EN 10056-1","S235JRG2",null,"",1.3819824083283299,"","Winkel 25 x 25 x 4 - 950",null,null,null,"-","Released",null,null,null,"Part",null,3800,null,"Part"]
["1-1-1-48",">>>4","48","-",3123357,"schw","Stahlbau",null,6,12,172,null,3123357,"116237 ","-","Flach 50 x 20 - 172","DIN EN 10058","S235JRG2",null,"",1.3502000000000001,"","Flach 50 x 20 - 172",null,null,null,"-","Released","",null,null,"Part",null,1032,null,"Part"]
["1-1-1-49",">>>4","49","-",3202623,"schw","Stahlbau",null,4,8,964,null,3202623,"116214 ","-","Flach 40 x 6 - 964","DIN EN 10058","S235JRG2",null,"",1.816176,"","Flach 40 x 6 - 964",null,null,null,"-","Released",null,null,null,"Part",null,3856,null,"Part"]
["1-1-2",">>3","2","-",3123634,"mon","Montage",null,2,4,null,null,3123634,null,"Greiferantrieb Umlenkung heavy 1 kpl",null,null,"-",null,"",14.774938509538801,"",null,null,null,"ZF-27445","01","Released",null,null,null,"Assembly",null,2,null,"Assembly"]
["1-1-2-1",">>>4","1","-",3123635,"schw","Stahlbau","roh, leicht eingeölt",1,4,null,null,3123635,null,"Halbflansch heavy 1",null,null,"-","roh, leicht eingeölt","",4.4216260664371099,"",null,null,null,"ZF-27441","-","Released",null,null,null,"Assembly",null,1,null,"Assembly"]
["1-1-2-1-1",">>>>5","1","-",3123636,"schw","Fertigung","roh, leicht eingeölt",1,4,135,135,3123636,null,"Flansch heavy 1","Rund Ø 135 - 76","DIN EN 10060","S355J2+N","roh, leicht eingeölt","",2.6538450062277796,"","Rund Ø 135 - 76",null,null,"ZF-27439","-","Released",null,null,null,"Part",null,76,null,"Part"]
["1-1-2-1-2",">>>>5","2","-",3123637,"schw","Fertigung","roh, leicht eingeölt",1,4,51,null,3123637,"131612 ","Flansch heavy 2","Rund Ø 220 - 51","DIN EN 10060","S355J2+N","roh, leicht eingeölt","",1.76778106020932,"","Rund Ø 220 - 51",null,null,"ZF-27440","-","Released",null,null,null,"Part",null,51,null,"Part"]
["1-1-2-2",">>>4","2","-",3123638,"mon","Fertigung","roh, leicht eingeölt",1,4,6,null,3123638,"116083 ","Distanzring heavy 1","Rund Ø 70 - 6","DIN EN 10060","S355J2+N","roh, leicht eingeölt","",6.8589803357205992E-2,"","Rund Ø 70 - 6",null,null,"ZF-27442","-","Released",null,null,null,"Part",null,6,null,"Part"]
["1-1-2-3",">>>4","3","-",3104925,"mon","Stahlbau","galvanisch verzinkt",1,4,70,70,3104925,162096,"Abschlussdeckel","Blech 8 - 70x 70","EN 10029","S355J2H","galvanisch verzinkt","",0.2253444775466,"","Blech 8 - 70x 70",null,8,null,"03","Released",null,null,null,"Part",null,1,null,"Part","ohne Bearbeitung","ohne Kante"]
["1-1-2-4",">>>4","4","-",3123645,"mon","Fertigung","roh, leicht eingeölt",1,4,null,null,3123645,null,"Kettenrad 2 heavy",null,"DIN 8196","C45E","roh, leicht eingeölt","",3.7559854706018898,"",null,null,null,"ZF-27444","-","Released","20B-1, z16",null,null,"Part",null,1,null,"Part"]
["1-1-2-5",">>>4","5","01",3123649,"mon","Fertigung","roh, leicht eingeölt",1,4,null,null,3123649,null,"Kettenrad heavy 7",null,"DIN 8196","C45E","roh, leicht eingeölt","",3.6687759617008799,"",null,"Gewindebohrungen hinzugefügt",null,"ZF-27443","01","Released","16B-1, z25",null,null,"Part",null,1,null,"Part"]
["1-1-2-6",">>>4","6",null,127043,"mon","Normteil","ZN",1,4,null,null,127043,null,"Sicherungsscheibe SCHNORR Typ VS 16",null,"-","C60S","ZN","",4.1218339599999997E-3,"",null,null,null,null,"19","Released",null,null,null,"Purchased",null,1,null,"Purchased"]
["1-1-2-7",">>>4","7",null,127268,"mon","Normteil","ZN",5,20,null,null,127268,null,"Sicherungsscheibe SCHNORR Typ VS 12",null,"-","C60S","ZN","",1.68313183E-3,"",null,null,null,null,"10","Released",null,null,null,"Purchased",null,5,null,"Purchased"]
["1-1-2-8",">>>4","8",null,127677,"mon","Normteil","ZN",1,4,null,null,127677,null,"Sicherungsscheibe SCHNORR Typ VS 6",null,"-","C60S","ZN","",3.9293860000000005E-4,"",null,null,null,null,"21","Released",null,null,null,"Purchased",null,1,null,"Purchased"]
["1-1-2-9",">>>4","9",null,120183,"mon","Normteil","A2K",1,4,null,null,120183,null,"Sch DIN 125A - 6.4-140 HV-A2K",null,"DIN 125A","140 HV","A2K","",1.0164484799999999E-3,"",null,null,null,null,"15","Released",null,null,null,"Purchased",null,1,null,"Purchased"]
["1-1-2-10",">>>4","10",null,120189,"mon","Normteil","A2K",1,4,null,null,120189,null,"Sch DIN 125A - 17-140 HV-A2K",null,"DIN 125A","140 HV","A2K","",1.130113344E-2,"",null,null,null,null,"25","Released",null,null,null,"Purchased",null,1,null,"Purchased"]
["1-1-2-11",">>>4","11",null,120187,"mon","Normteil","A2K",5,20,null,null,120187,null,"Sch DIN 125A - 13-140 HV-A2K",null,"DIN 125A","140 HV","A2K","",6.2732696600000006E-3,"",null,null,null,null,"12","Released",null,null,null,"Purchased",null,5,null,"Purchased"]
["1-1-2-12",">>>4","12",null,123850,"mon","Normteil","A2K",1,4,null,null,123850,null,"6kt-Schr ISO 4017 - M6x20-8.8-A2K",null,"ISO 4017","8.8","A2K","",7.0271374999999999E-3,"",null,null,null,null,"07","Released",null,null,null,"Purchased",null,1,null,"Purchased"]
["1-1-2-13",">>>4","13",null,123970,"mon","Normteil","A2K",1,4,null,null,123970,null,"6kt-Schr ISO 4017 - M16x30-8.8-A2K",null,"ISO 4017","8.8","A2K","",8.5471081069999996E-2,"",null,null,null,null,"04","Released",null,null,null,"Purchased",null,1,null,"Purchased"]
["1-1-2-14",">>>4","14",null,123928,"mon","Normteil","A2K",5,20,null,null,123928,null,"6kt-Schr ISO 4017 - M12x22-8.8-A2K",null,"ISO 4017","8.8","A2K","",3.5543331919999997E-2,"",null,null,null,null,"01","Released",null,null,null,"Purchased",null,5,null,"Purchased"]
["1-1-2-15",">>>4","15",null,202580,"mon","Normteil","blank",1,4,null,null,202580,null,"Passfeder DIN 6885-1-A - 16x10x50",null,"DIN 6885-1-A","C45+C","blank","",5.8487361490000001E-2,"",null,null,null,null,"01","Released",null,null,null,"Purchased",null,1,null,"Purchased"]
["1-1-2-16",">>>4","16","-",3123642,"mon","Einkaufsteil",null,1,4,null,null,3123642,null,"Pendelrollenlager d55 D100 B31",null,null,"-",null,"",0.82798949513264297,"",null,null,null,null,"-","Released","BS2-2211-2RS/VT143","SKF",null,"Purchased",null,1,null,"Purchased"]
["1-1-2-17",">>>4","17","-",3123644,"mon","Einkaufsteil",null,1,4,null,null,3123644,null,"Pendelrollenlager d75 D115 B40",null,null,"-",null,"",1.42,"",null,"Typ angepasst",null,null,"01","Released","24015-2RS5/VT143","SKF",null,"Purchased",null,1,null,"Purchased"]
["1-1-3",">>3","3","-",3123690,"mon","Montage",null,2,4,null,null,3123690,null,"Gr.-antrieb Uml. verstellbar heavy 1",null,null,"-",null,"",9.4345439289187993,"",null,null,null,"ZF-27438","-","Released",null,null,null,"Assembly",null,2,null,"Assembly"]
["1-1-3-1",">>>4","1","-",3123691,"schw","Stahlbau","roh, leicht eingeölt",1,4,null,null,3123691,null,"Halbflasch 2 heavy",null,null,"-","roh, leicht eingeölt","",5.2493883596990898,"",null,null,null,"ZF-27436","-","Released",null,null,null,"Assembly",null,1,null,"Assembly"]
["1-1-3-1-1",">>>>5","1","-",3123692,"schw","Fertigung","roh, leicht eingeölt",1,4,86,null,3123692,"127474 ","Bolzen 2 heavy","Rund Ø 150 - 86","DIN EN 10060","S355J2+N","roh, leicht eingeölt","",3.2723727945286201,"","Rund Ø 150 - 86",null,null,"ZF-27434","-","Released",null,null,null,"Part",null,86,null,"Part"]
["1-1-3-1-2",">>>>5","2","-",3123693,"schw","Fertigung","roh, leicht eingeölt",1,4,47.5,null,3123693,"131612 ","Flansch 3 heavy","Rund Ø 220 - 47.5","DIN EN 10060","S355J2+N","roh, leicht eingeölt","",1.97701556517046,"","Rund Ø 220 - 47.5",null,null,"ZF-27435","-","Released",null,null,null,"Part",null,47.5,null,"Part"]
["1-1-3-2",">>>4","2","-",3123695,"mon","Fertigung","roh, leicht eingeölt",1,4,null,null,3123695,null,"Kettenrad 3 heavy",null,"DIN 8196","C45E","roh, leicht eingeölt","",2.0675407533922496,"",null,null,null,"ZF-27437","-","Released","20B-1, z=16",null,null,"Part",null,1,null,"Part"]
["1-1-3-3",">>>4","3",null,127459,"mon","Normteil","A2K",1,4,null,null,127459,null,"Sch DIN 7349 - 25-140 HV-A2K",null,"DIN 7349","140 HV","A2K","",0.11560079217999999,"",null,null,null,null,"02","Released",null,null,null,"Purchased",null,1,null,"Purchased"]
["1-1-3-4",">>>4","4",null,127680,"mon","Normteil","ZN",1,4,null,null,127680,null,"Sicherungsscheibe SCHNORR Typ VS 24",null,"-","C60S","ZN","",1.2118044729999999E-2,"",null,null,null,null,"02","Released",null,null,null,"Purchased",null,1,null,"Purchased"]
["1-1-3-5",">>>4","5",null,124027,"mon","Normteil","A2K",1,4,null,null,124027,null,"6kt-Schr ISO 4017 - M24x50-8.8-A2K",null,"ISO 4017","8.8","A2K","",0.30689696498000002,"",null,null,null,null,"01","Released",null,null,null,"Purchased",null,1,null,"Purchased"]
["1-1-3-6",">>>4","6",null,123984,"mon","Normteil","A2K",1,4,null,null,123984,null,"6kt-Schr ISO 4017 - M16x110-8.8-A2K",null,"ISO 4017","8.8","A2K","",0.21173797300000002,"",null,null,null,null,"02","Released",null,null,null,"Purchased",null,1,null,"Purchased"]
["1-1-3-7",">>>4","7",null,124248,"mon","Normteil","A2K",1,4,null,null,124248,null,"6kt-Mu ISO 4032 - M16-8-A2K",null,"ISO 4032","8","A2K","",3.9506279929999999E-2,"",null,null,null,null,"05","Released",null,null,null,"Purchased",null,1,null,"Purchased"]
["1-1-3-8",">>>4","8",null,120509,"mon","Normteil",null,1,4,null,null,120509,null,"Si-Ring As DIN 471 - 65x2.5",null,"DIN 471","-",null,"",1.8857751669999999E-2,"",null,null,null,null,"-","Released",null,null,null,"Purchased",null,1,null,"Purchased"]
["1-1-3-9",">>>4","9",null,120521,"mon","Normteil",null,2,8,null,null,120521,null,"Si-Ring As DIN 471 - 100x3",null,"DIN 471","-",null,"",4.7396432760000003E-2,"",null,null,null,null,"-","Released",null,null,null,"Purchased",null,2,null,"Purchased"]
["1-1-3-10",">>>4","10","-",3123694,"mon","Einkaufsteil",null,1,4,null,null,3123694,null,"Zylinderrollenlager abgedichtet zweireihig d65 D100 b46",null,null,"-",null,"",1.3145337063109199,"",null,null,null,null,"-","Released","NNF 5013 ADB-2LSV","SKF",null,"Purchased",null,1,null,"Purchased"]
["1-1-3-11",">>>4","11","-",3123705,"mon","Einkaufsteil",null,1,4,null,null,3123705,null,"Trichter-Schmiernippel d8",null,"DIN 3405","-",null,"",3.5704375040969999E-3,"",null,null,null,null,"-","Released","Form D1a","Hausammann","04.159","Purchased",null,1,null,"Purchased"]
["1-1-4",">>3","4","01",3104912,"mon","Montage",null,4,8,null,null,3104912,null,"Greiferantrieb Umlenkung 2 kpl",null,null,"-",null,"",0.95747013081999999,"",null,"Fehr Kategorie hinzugefügt",null,null,"02","Released",null,null,null,"Assembly",null,4,null,"Assembly"]
["1-1-4-1",">>>4","1","01",3104910,"mon","Lagerteil","roh, leicht eingeölt",1,8,null,null,3104910,null,"Kettenradscheibe 16B-1 z13 bearb.","Kettenradscheibe 16B-1 z13","DIN 8187","C45","roh, leicht eingeölt","",0.7194267678352001,"","Kettenradscheibe 16B-1 z13","Fehr Kategorie auf Lagerteil geändert",null,null,"04","Released",null,null,null,"Purchased",null,1,null,"Purchased"]
["1-1-4-2",">>>4","2",null,126693,"mon","Normteil","blank",6,48,null,null,126693,null,"Pass-Sch DIN 988 - 25x35x1-ST-blank",null,"DIN 988","ST","blank","",3.6992253499999999E-3,"",null,null,null,null,"02","Released",null,null,null,"Purchased",null,6,null,"Purchased"]
["1-1-4-3",">>>4","3",null,120558,"mon","Normteil",null,1,8,null,null,120558,null,"Si-Ring In DIN 472 - 52x2",null,"DIN 472","-",null,"",8.5989351500000005E-3,"",null,null,null,null,"02","Released",null,null,null,"Purchased",null,1,null,"Purchased"]
["1-1-4-4",">>>4","4",null,120487,"mon","Normteil",null,1,8,null,null,120487,null,"Si-Ring As DIN 471 - 25x1.2",null,"DIN 471","-",null,"",1.8357755899999998E-3,"",null,null,null,null,"02","Released",null,null,null,"Purchased",null,1,null,"Purchased"]
["1-1-4-5",">>>4","5","-",3104909,"mon","Einkaufsteil",null,2,16,null,null,3104909,null,"Rillenkugellager d25 D52 B15",null,"DIN 625","-",null,"",0.1027066500711,"",null,null,null,null,"04","Released","6205-2RS",null,null,"Purchased",null,2,null,"Purchased"]
["1-1-5",">>3","5","-",3203295,"mon","Montage",null,2,4,null,null,3203295,null,"Greiferantrieb verstellbar kpl",null,null,"-",null,"",101.191445398667,"",null,null,null,null,"-","Released","",null,null,"Assembly",null,2,null,"Assembly"]
["1-1-5-1",">>>4","1","-",3203332,"schw","Stahlbau","Nasslackierung\nFarbanstrich gem. Bestellangaben\nGrund- und Deckanstrich\nSchichtdicke 70µm total \nLauf- Anschluss- und speziell\ngekennzeichnete Flächen sind abzudecken",1,4,null,null,3203332,null,"Getriebeplatte STB",null,null,"-","Nasslackierung\nFarbanstrich gem. Bestellangaben\nGrund- und Deckanstrich\nSchichtdicke 70µm total \nLauf- Anschluss- und speziell\ngekennzeichnete Flächen sind abzudecken","",9.7734803653386209,"",null,null,null,null,"-","Released","",null,null,"Assembly",null,1,null,"Assembly"]
["1-1-5-1-1",">>>>5","1","-",3203331,"schw","Stahlbau",null,1,4,430,247,3203331,202336,"Getriebeplatte","Blech 15 - 247x 430","EN 10029","S235JRG2",null,"",9.2460431426939991,"","Blech 15 - 247x 430",null,15,null,"-","Released",null,null,null,"Part",null,1,null,"Part","mit Bearbeitung","ohne Kante"]
["1-1-5-1-2",">>>>5","2","-",3124597,"schw","Fertigung",null,1,4,30,null,3124597,null,"Schweissklotz","Flach 40 x 20 - 30","DIN EN 10058","S235JRG2",null,"",0.16479805137276698,"","Flach 40 x 20 - 30",null,null,null,"-","Released","",null,null,"Part",null,30,null,"Part"]
["1-1-5-1-3",">>>>5","3","-",3124596,"schw","Stahlbau","roh, leicht eingeölt",1,4,230,null,3124596,125005,"Gewindestange M16 x 230","Rund Ø 16 x 230","DIN 975","ST","roh, leicht eingeölt","",0.36263917127,"","Rund Ø 16 x 230",null,null,null,"01","Released","Gewindestange M16x230, KL 8.8 Stahl blank",null,null,"Part",null,1,null,"Part"]
["1-1-5-2",">>>4","2","01",3104899,"mon","Fertigung","roh, leicht eingeölt",1,4,275,null,3104899,160024,"Antriebswelle","Rund Ø 40 - 275","DIN EN 10060","C45+C","roh, leicht eingeölt","",2.6727400620199999,"","Rund Ø 40 - 275","Toleranz 40h6 richtig gestellt",null,null,"02","Released","",null,null,"Part",null,275,null,"Part"]
["1-1-5-3",">>>4","3","-",3203294,"mon","Stahlbau","Nasslackierung\nFarbanstrich gem. Bestellangaben\nGrund- und Deckanstrich\nSchichtdicke 70µm total \nLauf- Anschluss- und speziell\ngekennzeichnete Flächen sind abzudecken",1,4,550.29999999999995,525.6,3203294,205819,"Schutzblech","Blech 4 - 526x 550","EN 10029","S235JRG2","Nasslackierung\nFarbanstrich gem. Bestellangaben\nGrund- und Deckanstrich\nSchichtdicke 70µm total \nLauf- Anschluss- und speziell\ngekennzeichnete Flächen sind abzudecken","",5.0743923379388196,"","Blech 4 - 526x 550",null,4,null,"01","Released",null,null,null,"Part",null,1,null,"Part","ohne Bearbeitung","mit Kante"]
["1-1-5-4",">>>4","4","-",3116520,"mon","Einkaufsteil Nacharbeit",null,1,4,null,null,3116520,null,"Kettenrad 16 B-1 Z=16 Nacharbeit",null,"DIN ISO 606","C45",null,"",2.0659142706018003,"",null,null,null,null,"05","Released","16 B-1, Z=16",null,null,"Purchased",null,1,null,"Purchased"]
["1-1-5-5",">>>4","5","-",3120265,"mon","Fertigung",null,2,8,26,21,3120265,116062,"Führungsbolzen","Rund Ø 21 x 26",null,"S235JRG2",null,"",3.8248962552300002E-2,"","Rund Ø 21 x 26",null,null,null,"05","Released",null,null,null,"Part",null,2,null,"Part"]
["1-1-5-6",">>>4","6",null,127268,"mon","Normteil","ZN",16,64,null,null,127268,null,"Sicherungsscheibe SCHNORR Typ VS 12",null,"-","C60S","ZN","",1.68313183E-3,"",null,null,null,null,"10","Released",null,null,null,"Purchased",null,16,null,"Purchased"]
["1-1-5-7",">>>4","7",null,126913,"mon","Normteil","A2K",1,4,null,null,126913,null,"Sch DIN 7349 - 17-140 HV-A2K",null,"DIN 7349","140 HV","A2K","",4.8496844330000004E-2,"",null,null,null,null,"10","Released",null,null,null,"Purchased",null,1,null,"Purchased"]
["1-1-5-8",">>>4","8",null,120187,"mon","Normteil","A2K",4,16,null,null,120187,null,"Sch DIN 125A - 13-140 HV-A2K",null,"DIN 125A","140 HV","A2K","",6.2732696600000006E-3,"",null,null,null,null,"12","Released",null,null,null,"Purchased",null,4,null,"Purchased"]
["1-1-5-9",">>>4","9",null,122673,"mon","Normteil","ZN",4,16,null,null,122673,null,"Zyl-Schr In-6kt ISO 4762 - M12x30-8.8-ZN",null,"ISO 4762","8.8","ZN","",4.5345264010000004E-2,"",null,null,null,null,"-","Released",null,null,null,"Purchased",null,4,null,"Purchased"]
["1-1-5-10",">>>4","10",null,123929,"mon","Normteil","A2K",4,16,null,null,123929,null,"6kt-Schr ISO 4017 - M12x25-8.8-A2K",null,"ISO 4017","8.8","A2K","",3.820677418E-2,"",null,null,null,null,"03","Released",null,null,null,"Purchased",null,4,null,"Purchased"]
["1-1-5-11",">>>4","11",null,124246,"mon","Normteil","A2K",4,16,null,null,124246,null,"6kt-Mu ISO 4032 - M12-8-A2K",null,"ISO 4032","8","A2K","",1.6463449330000001E-2,"",null,null,null,null,"09","Released",null,null,null,"Purchased",null,4,null,"Purchased"]
["1-1-5-12",">>>4","12",null,124248,"mon","Normteil","A2K",2,8,null,null,124248,null,"6kt-Mu ISO 4032 - M16-8-A2K",null,"ISO 4032","8","A2K","",3.9506279929999999E-2,"",null,null,null,null,"05","Released",null,null,null,"Purchased",null,2,null,"Purchased"]
["1-1-5-13",">>>4","13","-",3116527,"mon","Einkaufsteil",null,1,4,null,null,3116527,null,"Spannsatz d40 D65 / 2105 Nm",null,null,"-",null,"",0.57999999999999996,"",null,null,null,null,"04","Released","BR 145 40x65 Hakon","Hausmann Haensgen","145040","Purchased",null,1,null,"Purchased"]
["1-1-5-14",">>>4","14","01",3104898,"mon","Normteil",null,4,16,null,null,3104898,null,"Halfenschraube M12x50",null,null,"-",null,"",9.2206473890000001E-2,"",null,"Eigenschaften aktuallisiert",null,"BT-02515","06","Released","HS 50/30 M12x50-GV-S 4.6","Halfen","0350.090-00030 / 50 Stk","Purchased",null,4,null,"Purchased"]
["1-1-5-15",">>>4","15","-",3176641,"mon","Einkaufsteil",null,1,4,null,null,3176641,"E-116519","Flachgetriebe Servomotor EU/USA/CAN i=11.31 Resolver",null,null,"-",null,"",80,"",null,null,null,null,"-","Released","FH67BCMP100L/BP/PK/RH1M/SBB","SEW","O-101909","Purchased",null,1,null,"Purchased"]
["1-1-6",">>3","6","01",3123679,"mon","Montage",null,2,4,null,null,3123679,null,"Schutzblech Antriebsseite kpl",null,null,"Generisch",null,"",0.20036188401431801,"",null,"Pos. 2 ersetzt",null,null,"-","Released",null,null,null,"Assembly",null,2,null,"Assembly"]
["1-1-6-1",">>>4","1","-",3104926,"mon","Stahlbau","Nasslackierung\nFarbanstrich gem. Bestellangaben\nGrund- und Deckanstrich\nSchichtdicke 70µm total \nLauf- Anschluss- und speziell\ngekennzeichnete Flächen sind abzudecken",1,4,186.2,114,3104926,204736,"Schutzblech Antriebsseite","Blech 1.5 - 114x 186","EN 10029","S235JRG2","Nasslackierung\nFarbanstrich gem. Bestellangaben\nGrund- und Deckanstrich\nSchichtdicke 70µm total \nLauf- Anschluss- und speziell\ngekennzeichnete Flächen sind abzudecken","",0.1852644630253,"","Blech 1.5 - 114x 186",null,1.5,null,"03","Released",null,null,null,"Part",null,1,null,"Part","ohne Bearbeitung","mit Kante"]
["1-1-6-2",">>>4","2",null,120183,"mon","Normteil","A2K",2,8,null,null,120183,null,"Sch DIN 125A - 6.4-140 HV-A2K",null,"DIN 125A","140 HV","A2K","",1.0164484799999999E-3,"",null,null,null,null,"15","Released",null,null,null,"Purchased",null,2,null,"Purchased"]
["1-1-6-3",">>>4","3",null,127677,"mon","Normteil","ZN",2,8,null,null,127677,null,"Sicherungsscheibe SCHNORR Typ VS 6",null,"-","C60S","ZN","",3.9293860000000005E-4,"",null,null,null,null,"21","Released",null,null,null,"Purchased",null,2,null,"Purchased"]
["1-1-6-4",">>>4","4",null,123848,"mon","Normteil","A2K",2,8,null,null,123848,null,"6kt-Schr ISO 4017 - M6x16-8.8-A2K",null,"ISO 4017","8.8","A2K","",6.1393234200000004E-3,"",null,null,null,null,"19","Released",null,null,null,"Purchased",null,2,null,"Purchased"]
["1-1-7",">>3","7","01",3123689,"mon","Montage",null,2,4,null,null,3123689,null,"Schutzblech Uml. Seite kpl",null,null,"Generisch",null,"",0.19750212040451601,"",null,"Pos. 2 ersetzt",null,null,"-","Released",null,null,null,"Assembly",null,2,null,"Assembly"]
["1-1-7-1",">>>4","1","-",3104935,"mon","Stahlbau","Nasslackierung\nFarbanstrich gem. Bestellangaben\nGrund- und Deckanstrich\nSchichtdicke 70µm total \nLauf- Anschluss- und speziell\ngekennzeichnete Flächen sind abzudecken",1,4,234.6,114,3104935,204736,"Schutzblech Uml. Seite","Blech 1.5 - 114x 235","EN 10029","S235JRG2","Nasslackierung\nFarbanstrich gem. Bestellangaben\nGrund- und Deckanstrich\nSchichtdicke 70µm total \nLauf- Anschluss- und speziell\ngekennzeichnete Flächen sind abzudecken","",0.1770376659863,"","Blech 1.5 - 114x 235",null,1.5,null,"03","Released",null,null,null,"Part",null,1,null,"Part","ohne Bearbeitung","mit Kante"]
["1-1-7-2",">>>4","2",null,126908,"mon","Normteil","A2K",2,8,null,null,126908,null,"Sch DIN 7349 - 6.4-140 HV-A2K",null,"DIN 7349","140 HV","A2K","",4.5877792800000008E-3,"",null,null,null,null,"16","Released",null,null,null,"Purchased",null,2,null,"Purchased"]
["1-1-7-3",">>>4","3",null,127677,"mon","Normteil","ZN",2,8,null,null,127677,null,"Sicherungsscheibe SCHNORR Typ VS 6",null,"-","C60S","ZN","",3.9293860000000005E-4,"",null,null,null,null,"21","Released",null,null,null,"Purchased",null,2,null,"Purchased"]
["1-1-7-4",">>>4","4",null,123846,"mon","Normteil","A2K",2,8,null,null,123846,null,"6kt-Schr ISO 4017 - M6x12-8.8-A2K",null,"ISO 4017","8.8","A2K","",5.2515093300000001E-3,"",null,null,null,null,"10","Released",null,null,null,"Purchased",null,2,null,"Purchased"]
["1-1-8",">>3","8","03",3104974,"mon","Montage",null,2,4,null,null,3104974,null,"Greifer Grundposition",null,null,"-",null,"",1.03455837524233,"",null,"Pos. 1+13 aktualisiert",null,null,"01","Released",null,null,null,"Assembly",null,2,null,"Assembly"]
["1-1-8-1",">>>4","1","03",3104972,"mon","Stahlbau","Nasslackierung\nFarbanstrich gem. Bestellangaben\nGrund- und Deckanstrich\nSchichtdicke 70µm total \nLauf- Anschluss- und speziell\ngekennzeichnete Flächen sind abzudecken",1,4,130,92,3104972,162101,"Abschaltfahne","Blech 3 - 130x 92","EN 10029","S235JRG2","Nasslackierung\nFarbanstrich gem. Bestellangaben\nGrund- und Deckanstrich\nSchichtdicke 70µm total \nLauf- Anschluss- und speziell\ngekennzeichnete Flächen sind abzudecken","",0.18137597763759999,"","Blech 3 - 130x 92","Geometrie geändert",3,null,"05","Released",null,null,null,"Part",null,1,null,"Part","ohne Bearbeitung","mit Kante"]
["1-1-8-2",">>>4","2","01",3104973,"mon","Stahlbau","Nasslackierung\nFarbanstrich gem. Bestellangaben\nGrund- und Deckanstrich\nSchichtdicke 70µm total \nLauf- Anschluss- und speziell\ngekennzeichnete Flächen sind abzudecken",1,4,271,120,3104973,162101,"Schutzblech Grundposition","Blech 3 - 120x 271","EN 10029","S235JRG2","Nasslackierung\nFarbanstrich gem. Bestellangaben\nGrund- und Deckanstrich\nSchichtdicke 70µm total \nLauf- Anschluss- und speziell\ngekennzeichnete Flächen sind abzudecken","",0.50382650958660002,"","Blech 3 - 120x 271","Ausschnitt für Sensoreinstellung hinzugefügt",3,null,"01","Released",null,null,null,"Part",null,1,null,"Part","ohne Bearbeitung","mit Kante"]
["1-1-8-5",">>>4","5",null,138446,"mon","Normteil","A2K",2,8,null,null,138446,null,"6kt-Schr ISO 4017 - M3x20-8.8-A2K",null,"ISO 4017","8.8","A2K","",1.4856616399999999E-3,"",null,null,null,null,"04","Released",null,null,null,"Purchased",null,2,null,"Purchased"]
["1-1-8-6",">>>4","6",null,123830,"mon","Normteil","A2K",4,16,null,null,123830,null,"6kt-Schr ISO 4017 - M5x25-8.8-A2K",null,"ISO 4017","8.8","A2K","",5.2863364100000001E-3,"",null,null,null,null,"01","Released",null,null,null,"Purchased",null,4,null,"Purchased"]
["1-1-8-7",">>>4","7",null,123826,"mon","Normteil","A2K",2,8,null,null,123826,null,"6kt-Schr ISO 4017 - M5x16-8.8-A2K",null,"ISO 4017","8.8","A2K","",3.89912691E-3,"",null,null,null,null,"03","Released",null,null,null,"Purchased",null,2,null,"Purchased"]
["1-1-8-8",">>>4","8",null,120182,"mon","Normteil","A2K",4,16,null,null,120182,null,"Sch DIN 125A - 5.3-140 HV-A2K",null,"DIN 125A","140 HV","A2K","",4.4335216E-4,"",null,null,null,null,"06","Released",null,null,null,"Purchased",null,4,null,"Purchased"]
["1-1-8-10",">>>4","10",null,126907,"mon","Normteil","A2K",2,8,null,null,126907,null,"Sch DIN 7349 - 5.3-140 HV-A2K",null,"DIN 7349","140 HV","A2K","",2.42804821E-3,"",null,null,null,null,"05","Released",null,null,null,"Purchased",null,2,null,"Purchased"]
["1-1-8-11",">>>4","11",null,126421,"mon","Normteil","ZN",2,8,null,null,126421,null,"Sch DIN 9021 - 3.2-100 HV-ZN",null,"DIN 9021","100 HV","ZN","",3.4900957999999996E-4,"",null,null,null,null,"01","Released",null,null,null,"Purchased",null,2,null,"Purchased"]
["1-1-8-12",">>>4","12",null,127047,"mon","Normteil","ZN",6,24,null,null,127047,null,"Sicherungsscheibe SCHNORR Typ VS 5",null,"-","C60S","ZN","",3.5214060000000001E-4,"",null,null,null,null,"06","Released",null,null,null,"Purchased",null,6,null,"Purchased"]
["1-1-8-13",">>>4","13","01",3104971,"mon","Lagerteil",null,1,4,null,null,3104971,null,"Reflexions-Lichttaster Sn=20-200mm",null,null,"-",null,"",7.9185834810499997E-2,"",null,"Fehr Kategorie auf Lagerteil geändert",null,null,"07","Released","WTB9-3P2261","SICK","1049047","Purchased",null,1,null,"Purchased"]
["1-1-8-14",">>>4","14","-",3120333,"mon","Stahlbau","Nasslackierung\nFarbanstrich gem. Bestellangaben\nGrund- und Deckanstrich\nSchichtdicke 70µm total \nLauf- Anschluss- und speziell\ngekennzeichnete Flächen sind abzudecken",2,8,240,15,3120333,205819,"Gewindeplatte","Blech 4 - 15x 240","EN 10029","S235JRG2","Nasslackierung\nFarbanstrich gem. Bestellangaben\nGrund- und Deckanstrich\nSchichtdicke 70µm total \nLauf- Anschluss- und speziell\ngekennzeichnete Flächen sind abzudecken","",0.11122672836,"","Blech 4 - 15x 240",null,4,null,"04","Released",null,null,null,"Part",null,2,null,"Part","mit Bearbeitung","ohne Kante"]
["1-1-8-15",">>>4","15","-",3120580,"mon","Stahlbau","galvanisch verzinkt",1,4,33,9,3120580,162101,"Gewindeplatte klein","Blech 3 - 9x 33","EN 10029","S235JRG2","galvanisch verzinkt","",6.3613059101999998E-3,"","Blech 3 - 9x 33",null,3,null,"03","Released",null,null,null,"Part",null,1,null,"Part","mit Bearbeitung","ohne Kante"]
["1-1-9",">>3","9","-",3202587,"mon","Montage",null,1,2,null,null,3202587,null,"Durchsturtzsicherung kpl",null,null,"Generisch",null,"",11.549867048923101,"",null,null,null,null,"-","Released","",null,null,"Assembly",null,1,null,"Assembly"]
["1-1-9-1",">>>4","1","-",3202586,"mon","Stahlbau","Nasslackierung\nFarbanstrich gem. Bestellangaben\nGrund- und Deckanstrich\nSchichtdicke 70µm total \nLauf- Anschluss- und speziell\ngekennzeichnete Flächen sind abzudecken",1,2,5780,50,3202586,206073,"Durchsturtzsicherung ","Blech 5 - 50x 5780","DIN EN 10058","S235JRG2","Nasslackierung\nFarbanstrich gem. Bestellangaben\nGrund- und Deckanstrich\nSchichtdicke 70µm total \nLauf- Anschluss- und speziell\ngekennzeichnete Flächen sind abzudecken","",11.2563498937925,"","Blech 5 - 50x 5780",null,5,null,"-","Released",null,null,null,"Part",null,5780,null,"Part","ohne Bearbeitung","ohne Kante"]
["1-1-9-2",">>>4","2",null,120185,"mon","Normteil","A2K",9,18,null,null,120185,null,"Sch DIN 125A - 8.4-140 HV-A2K",null,"DIN 125A","140 HV","A2K","",1.8292915999999998E-3,"",null,null,null,null,"11","Released",null,null,null,"Purchased",null,9,null,"Purchased"]
["1-1-9-3",">>>4","3",null,126909,"mon","Normteil","A2K",9,18,null,null,126909,null,"Sch DIN 7349 - 8.4-140 HV-A2K",null,"DIN 7349","140 HV","A2K","",9.1356069200000008E-3,"",null,null,null,null,"11","Released",null,null,null,"Purchased",null,9,null,"Purchased"]
["1-1-9-4",">>>4","4",null,123878,"mon","Normteil","A2K",9,18,null,null,123878,null,"6kt-Schr ISO 4017 - M8x25-8.8-A2K",null,"ISO 4017","8.8","A2K","",1.569189319E-2,"",null,null,null,null,"03","Released",null,null,null,"Purchased",null,9,null,"Purchased"]
["1-1-9-5",">>>4","5",null,125091,"mon","Normteil","ZN",9,18,null,null,125091,null,"6kt-Si-Mu DIN 985 - M8-8-ZN",null,"DIN 985","8","ZN","",5.9562255200000004E-3,"",null,null,null,null,"01","Released",null,null,null,"Purchased",null,9,null,"Purchased"]
["1-1-10",">>3","10","04",3112558,"mon","Lagerteil",null,4,8,128,38,3112558,null,"Einlaufstück","Blech 20 - 38x 128","EN 10029","EN-GJL-250(GG-25)",null,"",0.51748337058560001,"","Blech 20 - 38x 128","Fehr Kategorie auf Lagerteil geändert",20,null,"01","Released",null,null,null,"Purchased",null,4,null,"Purchased"]
["1-1-11",">>3","11","-",3108614,"mon","Einkaufsteil",null,4,8,50,50,3108614,208319,"Gleitstück 1","Blech 114 - 50x 50","EN 10029","EN-GJL-250(GG-25)",null,"",2.1282959249999998,"","Blech 114 - 50x 50",null,114,null,"03","Released",null,null,null,"Part",null,4,null,"Part"]
["1-1-12",">>3","12","-",3108619,"mon","Einkaufsteil",null,14,28,50,50,3108619,202980,"Gleitstück 1","Blech 114 - 50x 50","EN 10029","PA 6.6 GF30",null,"",0.30365496000000003,"","Blech 114 - 50x 50",null,114,null,"03","Released",null,null,null,"Part",null,14,null,"Part"]
["1-1-13",">>3","13","-",3202643,"mon","Einkaufsteil Nacharbeit",null,2,4,16,16,3202643,201081,"Gleitschiene 1"," 16 x 16 x 6720",null,"PA 6.6 natur",null,"",1.79429375999999,""," 16 x 16 x 6720",null,null,null,"-","Released","Gleitschiene 16 x 16 ",null,null,"Part",null,2,null,"Part"]
["1-1-14",">>3","14","-",3202585,"mon","Einkaufsteil Nacharbeit",null,2,4,16,16,3202585,201081,"Gleitschiene 2"," 16 x 16 x 6605",null,"PA 6.6 natur",null,"",1.7625689199999899,""," 16 x 16 x 6605",null,null,null,"-","Released","Gleitschiene 16 x 16 ",null,null,"Part",null,2,"mit Bearbeitung","Part"]
["1-1-15",">>3","15","-",3202589,"mon","Einkaufsteil Nacharbeit",null,2,4,100,null,3202589,161646,"Führungsprofil CF 9 H20C L=6657 Nacharbeit","CF 9 H20C - 6657",null,"A4 grün",null,"",3.9606287490000001,"","CF 9 H20C - 6657",null,null,null,"-","Released","CF 9 H20C (2m)","Wefapress","1000181","Purchased",null,2,null,"Purchased"]
["1-1-16",">>3","16","-",3202588,"mon","Stahlbau","Nasslackierung\nFarbanstrich gem. Bestellangaben\nGrund- und Deckanstrich\nSchichtdicke 70µm total \nLauf- Anschluss- und speziell\ngekennzeichnete Flächen sind abzudecken",8,16,766,500,3202588,162101,"Lochblech RV20, Teilung 28","Blech 3 - 500x 766","DIN 24041","S235JRG2","Nasslackierung\nFarbanstrich gem. Bestellangaben\nGrund- und Deckanstrich\nSchichtdicke 70µm total \nLauf- Anschluss- und speziell\ngekennzeichnete Flächen sind abzudecken","",4.8422441048217797,"","Blech 3 - 500x 766",null,3,null,"-","Released","RV20, Teilung 28",null,null,"Purchased",null,8,null,"Purchased"]
["1-1-17",">>3","17","01",3123741,"mon","Montage","Nasslackierung \nFarbanstrich RAL 5005 \nGrund- und Deckanstrich \nSchichtdicke 70µm total \nLauf- Anschluss- und speziell \ngekennzeichnete Flächen sind abzudecken",1,2,null,null,3123741,null,"Greifer Blau heavy kpl",null,null,"Generisch","Nasslackierung \nFarbanstrich RAL 5005 \nGrund- und Deckanstrich \nSchichtdicke 70µm total \nLauf- Anschluss- und speziell \ngekennzeichnete Flächen sind abzudecken","",46.471309727001305,"",null,"Pos. 1 als Baugruppe erstellt, Pos. 10 Kettenmitnehmer hinzugefügt",null,"ZF-A1983","01","Released","G 1500kg",null,null,"Assembly",null,1,null,"Assembly"]
["1-1-17-1",">>>4","1","01",3117824,"mon","Lagerteil",null,1,2,null,null,3117824,null,"Greifer 1000kg M EL END",null,null,"Generisch",null,"",34.324863023111199,"",null,"Kettenmitnehmer entfernt",null,"ZN-00018","04","Released",null,null,null,"Purchased",null,1,null,"Purchased"]
["1-1-17-2",">>>4","2","-",3117826,"mon","Lagerteil","roh, leicht eingeölt",1,2,197,50,3117826,null,"Greiferhebel 50x40x197","Blech 40 - 50x 197","EN 10029","CK45K","roh, leicht eingeölt","",1.9072221704723,"","Blech 40 - 50x 197",null,40,"ZN-00024","03","Released","G 1000kg",null,null,"Purchased",null,1,null,"Purchased"]
["1-1-17-3",">>>4","3","-",3117829,"mon","Lagerteil","roh, leicht eingeölt",1,2,312,50,3117829,"ZN-00025","Greiferhebel 50x40x312","Blech 40 - 50x 312","EN 10029","CK45K","roh, leicht eingeölt","",2.3380614564470004,"","Blech 40 - 50x 312",null,40,"ZN-00025","03","Released","G 1000kg",null,null,"Purchased",null,1,null,"Purchased"]
["1-1-17-4",">>>4","4","-",3117830,"mon","Lagerteil","roh, leicht eingeölt",4,8,18,18,3117830,null,"Bolzen d18x51","Rund Ø 18 x 51",null,"CK45K","roh, leicht eingeölt","",0.1017677444927,"","Rund Ø 18 x 51",null,null,"ZN-00002","03","Released",null,null,null,"Purchased",null,4,null,"Purchased"]
["1-1-17-5",">>>4","5","-",3117831,"mon","Lagerteil","roh, leicht eingeölt",1,2,20,45,3117831,null,"Ring D45/d23x20","Rund Ø 45 x 20",null,"CK45K","roh, leicht eingeölt","",0.1605401054666,"","Rund Ø 45 x 20",null,null,"ZN-00066","03","Released",null,null,null,"Part",null,1,null,"Part"]
["1-1-17-6",">>>4","6","-",3117832,"mon","Lagerteil","roh, leicht eingeölt",1,2,41,30,3117832,null,"Zapfen D30/d20x41","Rund Ø 30 x 41",null,"CK45K","roh, leicht eingeölt","",0.11248078331019999,"","Rund Ø 30 x 41",null,null,"ZN-00084","03","Released",null,null,null,"Purchased",null,1,null,"Purchased"]
["1-1-17-7",">>>4","7",null,120483,"mon","Normteil",null,1,2,null,null,120483,null,"Si-Ring As DIN 471 - 20x1.2",null,"DIN 471","-",null,"",1.3174285199999999E-3,"",null,null,null,null,"01","Released",null,null,null,"Purchased",null,1,null,"Purchased"]
["1-1-17-8",">>>4","8","01",3117833,"mon","Normteil",null,4,8,null,null,3117833,128053,"Spannstift schwer DIN 1481 - 4x40-ST-blank",null,"DIN 1481","ST",null,"",2.4830896025000004E-3,"",null,null,null,"BT-00352","04","Released",null,null,null,"Purchased",null,4,null,"Purchased"]
["1-1-17-9",">>>4","9","02",3117834,"mon","Lagerteil",null,1,2,null,null,3117834,null,"Gleitlagerbuchse D23/d20x15",null,"DIN 1494","-",null,"",1.1775201617700001E-2,"",null,"Fehr Kategorie auf Lagerteil geändert",null,"BT-00482","04","Released",null,null,null,"Purchased",null,1,null,"Purchased"]
["1-1-17-10",">>>4","10","-",3190158,"mon","Lagerteil",null,1,2,null,null,3190158,null,"RBG Kettenmitnehmer Heavy kpl",null,null,"Generisch",null,"",7.1980462216730903,"",null,null,null,"ZF-A1865","-","Released",null,null,null,"Purchased",null,1,null,"Purchased"]
["1-1-18",">>3","18","01",3123743,"mon","Montage","Nasslackierung \nFarbanstrich RAL 9004 \nGrund- und Deckanstrich \nSchichtdicke 70µm total \nLauf- Anschluss- und speziell \ngekennzeichnete Flächen sind abzudecken",1,2,null,null,3123743,null,"Greifer Schwarz heavy kpl",null,null,"Generisch","Nasslackierung \nFarbanstrich RAL 9004 \nGrund- und Deckanstrich \nSchichtdicke 70µm total \nLauf- Anschluss- und speziell \ngekennzeichnete Flächen sind abzudecken","",46.471309727001305,"",null,"Pos. 1 als Baugruppe erstellt, Pos. 10 Kettenmitnehmer hinzugefügt",null,"ZF-A1982","01","Released","G 1500kg",null,null,"Assembly",null,1,null,"Assembly"]
["1-1-18-1",">>>4","1","01",3117824,"mon","Lagerteil",null,1,2,null,null,3117824,null,"Greifer 1000kg M EL END",null,null,"Generisch",null,"",34.324863023111199,"",null,"Kettenmitnehmer entfernt",null,"ZN-00018","04","Released",null,null,null,"Purchased",null,1,null,"Purchased"]
["1-1-18-2",">>>4","2","-",3117826,"mon","Lagerteil","roh, leicht eingeölt",1,2,197,50,3117826,null,"Greiferhebel 50x40x197","Blech 40 - 50x 197","EN 10029","CK45K","roh, leicht eingeölt","",1.9072221704723,"","Blech 40 - 50x 197",null,40,"ZN-00024","03","Released","G 1000kg",null,null,"Purchased",null,1,null,"Purchased"]
["1-1-18-3",">>>4","3","-",3117829,"mon","Lagerteil","roh, leicht eingeölt",1,2,312,50,3117829,"ZN-00025","Greiferhebel 50x40x312","Blech 40 - 50x 312","EN 10029","CK45K","roh, leicht eingeölt","",2.3380614564470004,"","Blech 40 - 50x 312",null,40,"ZN-00025","03","Released","G 1000kg",null,null,"Purchased",null,1,null,"Purchased"]
["1-1-18-4",">>>4","4","-",3117830,"mon","Lagerteil","roh, leicht eingeölt",4,8,18,18,3117830,null,"Bolzen d18x51","Rund Ø 18 x 51",null,"CK45K","roh, leicht eingeölt","",0.1017677444927,"","Rund Ø 18 x 51",null,null,"ZN-00002","03","Released",null,null,null,"Purchased",null,4,null,"Purchased"]
["1-1-18-5",">>>4","5","-",3117831,"mon","Lagerteil","roh, leicht eingeölt",1,2,20,45,3117831,null,"Ring D45/d23x20","Rund Ø 45 x 20",null,"CK45K","roh, leicht eingeölt","",0.1605401054666,"","Rund Ø 45 x 20",null,null,"ZN-00066","03","Released",null,null,null,"Part",null,1,null,"Part"]
["1-1-18-6",">>>4","6","-",3117832,"mon","Lagerteil","roh, leicht eingeölt",1,2,41,30,3117832,null,"Zapfen D30/d20x41","Rund Ø 30 x 41",null,"CK45K","roh, leicht eingeölt","",0.11248078331019999,"","Rund Ø 30 x 41",null,null,"ZN-00084","03","Released",null,null,null,"Purchased",null,1,null,"Purchased"]
["1-1-18-7",">>>4","7",null,120483,"mon","Normteil",null,1,2,null,null,120483,null,"Si-Ring As DIN 471 - 20x1.2",null,"DIN 471","-",null,"",1.3174285199999999E-3,"",null,null,null,null,"01","Released",null,null,null,"Purchased",null,1,null,"Purchased"]
["1-1-18-8",">>>4","8","01",3117833,"mon","Normteil",null,4,8,null,null,3117833,128053,"Spannstift schwer DIN 1481 - 4x40-ST-blank",null,"DIN 1481","ST",null,"",2.4830896025000004E-3,"",null,null,null,"BT-00352","04","Released",null,null,null,"Purchased",null,4,null,"Purchased"]
["1-1-18-9",">>>4","9","02",3117834,"mon","Lagerteil",null,1,2,null,null,3117834,null,"Gleitlagerbuchse D23/d20x15",null,"DIN 1494","-",null,"",1.1775201617700001E-2,"",null,"Fehr Kategorie auf Lagerteil geändert",null,"BT-00482","04","Released",null,null,null,"Purchased",null,1,null,"Purchased"]
["1-1-18-10",">>>4","10","-",3190158,"mon","Lagerteil",null,1,2,null,null,3190158,null,"RBG Kettenmitnehmer Heavy kpl",null,null,"Generisch",null,"",7.1980462216730903,"",null,null,null,"ZF-A1865","-","Released",null,null,null,"Purchased",null,1,null,"Purchased"]
["1-1-19",">>3","19","-",3202582,"mon","Montage",null,2,4,null,null,3202582,null,"Rollenkette R31-1 SH kpl L=14'287.5",null,null,"Generisch",null,"",75,"",null,null,null,null,"-","Released","",null,null,"Assembly",null,2,null,"Assembly"]
["1-1-19-1",">>>4","1","-",3123739,"mon","Montage",null,1,4,null,null,3123739,null,"Kette Längenausleich heavy 1 kpl",null,null,"Generisch",null,"",3.8822269745705098,"",null,null,null,"ZF-29590","-","Released",null,null,null,"Assembly",null,1,null,"Assembly"]
["1-1-19-1-1",">>>>5","1","-",3110122,"mon","Montage",null,1,4,null,null,3110122,null,"Kette R 31 SH Kröpfglied kpl",null,null,"Generisch",null,"",0.15942383857082801,"",null,null,null,"ZF-29589","-","Released",null,null,null,"Assembly",null,1,null,"Assembly"]
["1-1-19-1-1-1",">>>>>6","1","-",3110123,"mon","Fertigung","roh, leicht eingeölt",1,4,61,29,3110123,null,"Kettenlasche Kröpfglied R 31 SH - 1","Flach 11 - 29x 61",null,"30CrNiMo8+QT","roh, leicht eingeölt","",6.3920425066954001E-2,"","Flach 11 - 29x 61",null,null,"ZF-29591","-","Released",null,null,null,"Part",null,1,null,"Part"]
["1-1-19-1-1-2",">>>>>6","2","-",3110124,"mon","Fertigung","roh, leicht eingeölt",1,4,61,29,3110124,null,"Kettenlasche Kröpfglied R 31 SH - 2","Flach 11 - 29x 61",null,"30CrNiMo8+QT","roh, leicht eingeölt","",6.3987641188927996E-2,"","Flach 11 - 29x 61",null,null,"ZF-29588","-","Released",null,null,null,"Part",null,1,null,"Part"]
["1-1-19-1-1-3",">>>>>6","3","-",3110125,"mon","Fertigung","roh, leicht eingeölt",1,4,49,14,3110125,null,"Kettenbolzen Kröpfglied R 31 SH","Rund Ø 14 - 49",null,"30CrNiMo8+QT","roh, leicht eingeölt","",3.0052944614232999E-2,"","Rund Ø 14 - 49",null,null,"ZF-29587","-","Released",null,null,null,"Part",null,1,null,"Part"]
["1-1-19-1-1-4",">>>>>6","4",null,129653,"mon","Normteil","ZN",1,4,null,null,129653,null,"Splint ISO 1234 - 3.2x16-ST-ZN",null,"ISO 1234","ST","ZN","",1.4628277000000001E-3,"",null,null,null,null,"-","Released",null,null,null,"Purchased",null,1,null,"Purchased"]
["1-1-19-1-2",">>>>5","2","01",3110120,"mon","Einkaufsteil",null,4,16,null,null,3110120,130175,"Verbindungsglied mit Splint R 31-1 SH",null,"DIN ISO 606","Generisch",null,"",0.16013164820041101,"",null,"Bauteil umbenannt",null,null,"-","Released","RexProX R 31-1 SH S","Rexnord",null,"Purchased",null,4,null,"Purchased"]
["1-1-19-1-3",">>>>5","3","-",3110114,"mon","Einkaufsteil",null,3,108,null,null,3110114,null,"Kettenglied Rollenkette R 31-1 SH",null,null,"Generisch",null,"",0.34247517146644901,"",null,null,null,"BT-08787","-","Released","RexProX R 31-1 SH","Rexnord",null,"Purchased",null,9,null,"Purchased"]
["1-1-19-2",">>>4","2","-",3110114,"mon","Einkaufsteil",null,1,1800,null,null,3110114,null,"Kettenglied Rollenkette R 31-1 SH",null,null,"Generisch",null,"",0.34247517146644901,"",null,null,null,"BT-08787","-","Released","RexProX R 31-1 SH","Rexnord",null,"Purchased",null,450,null,"Purchased"]
["1-1-19-3",">>>4","3","01",3110120,"mon","Einkaufsteil",null,1,4,null,null,3110120,130175,"Verbindungsglied mit Splint R 31-1 SH",null,"DIN ISO 606","Generisch",null,"",0.16013164820041101,"",null,"Bauteil umbenannt",null,null,"-","Released","RexProX R 31-1 SH S","Rexnord",null,"Purchased",null,5,null,"Purchased"]
["1-1-20",">>3","20","-",3202661,"mon","Montage",null,2,4,null,null,3202661,null,"Rollenkette 16 B-1 kpl L= 2413",null,null,"Generisch",null,"",10,"",null,null,null,null,"-","Released","",null,null,"Assembly",null,2,null,"Assembly"]
["1-1-20-1",">>>4","1","-",3102510,"mon","Einkaufsteil",null,1,380,null,null,3102510,null,"Kettenglied Rollenkette 16 B-1",null,"DIN ISO 606","-",null,"",6.6000000000000003E-2,"",null,null,null,"Muss bei Rexnord bestellt werden","-","Released","RexPro 16 B-1 Bruchkraft 80'000 N","Rexnord",null,"Purchased",null,95,null,"Purchased"]
["1-1-20-2",">>>4","2","-",3102511,"mon","Einkaufsteil",null,1,4,null,null,3102511,null,"Verbindungsglied mit Feder 16 B-1",null,"DIN ISO 606","-",null,"",8.620345908999999E-2,"",null,null,null,"Muss bei Rexnord bestellt werden","01","Released","RexPro 16 B-1 Typ E Bruchkraft 80'000 N","Rexnord",null,"Purchased",null,1,null,"Purchased"]
["1-1-20-3",">>>4","3","01",3105892,"mon","Einkaufsteil",null,1,4,null,null,3105892,null,"Kettenglied Gekröpft 16 B-1",null,"DIN ISO 606","-",null,"",8.917177171E-2,"",null,"Eigenschaften Korrigiert (R25SH entfernt)",null,null,"-","Released","RexPro 16 B-1 Bruchkraft 64'000 N","Rexnord",null,"Purchased",null,1,null,"Purchased"]
["1-1-21",">>3","21","-",3202591,"mon","Montage",null,4,8,null,null,3202591,null,"Montagedeckel 1 kpl",null,null,"Generisch",null,"",18.087073472527603,"",null,null,null,null,"-","Released","",null,null,"Assembly",null,4,null,"Assembly"]
["1-1-21-1",">>>4","1","-",3202590,"mon","Stahlbau","Nasslackierung\nFarbanstrich gem. Bestellangaben\nGrund- und Deckanstrich\nSchichtdicke 70µm total \nLauf- Anschluss- und speziell\ngekennzeichnete Flächen sind abzudecken",1,8,766,501,3202590,162097,"Montagedeckel 1","Blech 6 - 501x 766","EN 10029","S235JRG2","Nasslackierung\nFarbanstrich gem. Bestellangaben\nGrund- und Deckanstrich\nSchichtdicke 70µm total \nLauf- Anschluss- und speziell\ngekennzeichnete Flächen sind abzudecken","",17.986873538077802,"","Blech 6 - 501x 766",null,6,null,"-","Released",null,null,null,"Part",null,1,null,"Part","ohne Bearbeitung","ohne Kante"]
["1-1-21-2",">>>4","2",null,127300,"mon","Normteil","ZN",4,32,null,null,127300,null,"Sicherungsscheibe SCHNORR Typ VS 8",null,"-","C60S","ZN","",7.9309311999999999E-4,"",null,null,null,null,"11","Released",null,null,null,"Purchased",null,4,null,"Purchased"]
["1-1-21-3",">>>4","3",null,123880,"mon","Normteil","A2K",4,32,null,null,123880,null,"6kt-Schr ISO 4017 - M8x30-8.8-A2K",null,"ISO 4017","8.8","A2K","",1.7664813379999998E-2,"",null,null,null,null,"06","Released",null,null,null,"Purchased",null,4,null,"Purchased"]
["1-1-21-4",">>>4","4",null,120185,"mon","Normteil","A2K",4,32,null,null,120185,null,"Sch DIN 125A - 8.4-140 HV-A2K",null,"DIN 125A","140 HV","A2K","",1.8292915999999998E-3,"",null,null,null,null,"11","Released",null,null,null,"Purchased",null,4,null,"Purchased"]
["1-1-21-5",">>>4","5","-",3107812,"mon","Normteil","galvanisch verzinkt",4,32,null,null,3107812,null,"Einpressmutter M8",null,null,"-","galvanisch verzinkt","",4.7627855192069997E-3,"",null,null,null,null,"-","Released","N0302","Schrauben Jäger","0000145133","Purchased",null,4,null,"Purchased"]
["1-1-22",">>3","22","-",3202593,"mon","Montage",null,4,8,null,null,3202593,null,"Montagedeckel 2 kpl",null,null,"Generisch",null,"",21.844428872527597,"",null,null,null,null,"-","Released","",null,null,"Assembly",null,4,null,"Assembly"]
["1-1-22-1",">>>4","1","-",3202592,"mon","Stahlbau","Nasslackierung\nFarbanstrich gem. Bestellangaben\nGrund- und Deckanstrich\nSchichtdicke 70µm total \nLauf- Anschluss- und speziell\ngekennzeichnete Flächen sind abzudecken",1,8,946,490,3202592,162097,"Montagedeckel 2","Blech 6 - 490x 946","EN 10029","S235JRG2","Nasslackierung\nFarbanstrich gem. Bestellangaben\nGrund- und Deckanstrich\nSchichtdicke 70µm total \nLauf- Anschluss- und speziell\ngekennzeichnete Flächen sind abzudecken","",21.7442289380778,"","Blech 6 - 490x 946",null,6,null,"-","Released",null,null,null,"Part",null,1,null,"Part","ohne Bearbeitung","ohne Kante"]
["1-1-22-2",">>>4","2",null,127300,"mon","Normteil","ZN",4,32,null,null,127300,null,"Sicherungsscheibe SCHNORR Typ VS 8",null,"-","C60S","ZN","",7.9309311999999999E-4,"",null,null,null,null,"11","Released",null,null,null,"Purchased",null,4,null,"Purchased"]
["1-1-22-3",">>>4","3",null,123880,"mon","Normteil","A2K",4,32,null,null,123880,null,"6kt-Schr ISO 4017 - M8x30-8.8-A2K",null,"ISO 4017","8.8","A2K","",1.7664813379999998E-2,"",null,null,null,null,"06","Released",null,null,null,"Purchased",null,4,null,"Purchased"]
["1-1-22-4",">>>4","4",null,120185,"mon","Normteil","A2K",4,32,null,null,120185,null,"Sch DIN 125A - 8.4-140 HV-A2K",null,"DIN 125A","140 HV","A2K","",1.8292915999999998E-3,"",null,null,null,null,"11","Released",null,null,null,"Purchased",null,4,null,"Purchased"]
["1-1-22-5",">>>4","5","-",3107812,"mon","Normteil","galvanisch verzinkt",4,32,null,null,3107812,null,"Einpressmutter M8",null,null,"-","galvanisch verzinkt","",4.7627855192069997E-3,"",null,null,null,null,"-","Released","N0302","Schrauben Jäger","0000145133","Purchased",null,4,null,"Purchased"]
["1-1-23",">>3","23","-",3202595,"mon","Montage",null,4,8,null,null,3202595,null,"KAS-Blech 1 kpl",null,null,"Generisch",null,"",4.3118654681833002,"",null,null,null,null,"-","Released","",null,null,"Assembly",null,4,null,"Assembly"]
["1-1-23-1",">>>4","1","-",3202594,"mon","Stahlbau","Nasslackierung\nFarbanstrich gem. Bestellangaben\nGrund- und Deckanstrich\nSchichtdicke 70µm total \nLauf- Anschluss- und speziell\ngekennzeichnete Flächen sind abzudecken",1,8,942,150,3202594,162097,"Abdeckblech 2","Blech 6 - 150x 942","EN 10029","S235JRG2","Nasslackierung\nFarbanstrich gem. Bestellangaben\nGrund- und Deckanstrich\nSchichtdicke 70µm total \nLauf- Anschluss- und speziell\ngekennzeichnete Flächen sind abzudecken","",4.29676804719427,"","Blech 6 - 150x 942",null,6,null,"-","Released",null,null,null,"Part",null,1,null,"Part","ohne Bearbeitung","ohne Kante"]
["1-1-23-2",">>>4","2",null,120183,"mon","Normteil","A2K",2,16,null,null,120183,null,"Sch DIN 125A - 6.4-140 HV-A2K",null,"DIN 125A","140 HV","A2K","",1.0164484799999999E-3,"",null,null,null,null,"15","Released",null,null,null,"Purchased",null,2,null,"Purchased"]
["1-1-23-3",">>>4","3",null,127677,"mon","Normteil","ZN",2,16,null,null,127677,null,"Sicherungsscheibe SCHNORR Typ VS 6",null,"-","C60S","ZN","",3.9293860000000005E-4,"",null,null,null,null,"21","Released",null,null,null,"Purchased",null,2,null,"Purchased"]
["1-1-23-4",">>>4","4",null,123848,"mon","Normteil","A2K",2,16,null,null,123848,null,"6kt-Schr ISO 4017 - M6x16-8.8-A2K",null,"ISO 4017","8.8","A2K","",6.1393234200000004E-3,"",null,null,null,null,"19","Released",null,null,null,"Purchased",null,2,null,"Purchased"]
["1-1-24",">>3","24","04",3105002,"mon","Montage",null,2,4,null,null,3105002,null,"Kassettenschmierung kpl",null,null,"-",null,"",6.5282554675300002,"",null,"Fehr Kategorie hinzugefügt",null,null,"02","Released",null,null,null,"Assembly",null,2,null,"Assembly"]
["1-1-24-1",">>>4","1","01",3104992,"schw","Stahlbau","Nasslackierung\nFarbanstrich gem. Bestellangaben\nGrund- und Deckanstrich\nSchichtdicke 70µm total \nLauf- Anschluss- und speziell\ngekennzeichnete Flächen sind abzudecken",1,4,null,null,3104992,null,"Kassettenschmierung STB",null,null,"-","Nasslackierung\nFarbanstrich gem. Bestellangaben\nGrund- und Deckanstrich\nSchichtdicke 70µm total \nLauf- Anschluss- und speziell\ngekennzeichnete Flächen sind abzudecken","",2.5317509805856,"",null,"Zeichnung aktualisiert",null,null,"03","Released",null,null,null,"Assembly",null,1,null,"Assembly"]
["1-1-24-1-1",">>>>5","1","-",3104993,"schw","Stahlbau",null,1,4,426,156,3104993,162103,"Biegeblech","Blech 2 - 156x 426","EN 10029","S235JRG2",null,"",1.0528883999600001,"","Blech 2 - 156x 426",null,2,null,"01","Released","",null,null,"Part",null,1,null,"Part","ohne Bearbeitung","mit Kante"]
["1-1-24-1-2",">>>>5","2","01",3104994,"schw","Stahlbau",null,2,8,78,40,3104994,162103,"Deckblech","Blech 2 - 40x 78","EN 10029","S235JRG2",null,"",4.8923353519999997E-2,"","Blech 2 - 40x 78","Einzelteilzeichnung erstellt",2,null,"02","Released",null,null,null,"Part",null,2,null,"Part","ohne Bearbeitung","ohne Kante"]
["1-1-24-1-3",">>>>5","3","01",3104998,"schw","Stahlbau",null,2,8,60,35,3104998,207897,"Befestigungsblech","Blech 10 - 35x 60","EN 10029","S235JRG2",null,"",0.14779709156000001,"","Blech 10 - 35x 60","Einzelteilzeichnung erstellt",10,null,"02","Released",null,null,null,"Part",null,2,null,"Part","ohne Bearbeitung","ohne Kante"]
["1-1-24-1-4",">>>>5","4","01",3104997,"schw","Stahlbau",null,4,16,76,30,3104997,202336,"Quersteg","Blech 15 - 30x 76","DIN EN 10058","S235JRG2",null,"",0.26268690454999999,"","Blech 15 - 30x 76","Einzelteil Zeichnung erstellt",15,null,"03","Released",null,null,null,"Part",null,304,null,"Part","mit Bearbeitung","ohne Kante"]
["1-1-24-1-5",">>>>5","5","-",3104996,"schw","Stahlbau",null,1,4,74,null,3104996,116667,"-","Rohr Ø 20 - 74","DIN2391","S235JRG2",null,"",3.4674072279999996E-2,"","Rohr Ø 20 - 74",null,null,null,"01","Released","",null,null,"Part",null,1,"schw","Part"]
["1-1-24-2",">>>4","2","-",3104999,"mon","Stahlbau","Nasslackierung\nFarbanstrich gem. Bestellangaben\nGrund- und Deckanstrich\nSchichtdicke 70µm total \nLauf- Anschluss- und speziell\ngekennzeichnete Flächen sind abzudecken",2,8,120,73,3104999,162101,"Deckblech","Blech 3 - 73x 120","EN 10029","S235JRG2","Nasslackierung\nFarbanstrich gem. Bestellangaben\nGrund- und Deckanstrich\nSchichtdicke 70µm total \nLauf- Anschluss- und speziell\ngekennzeichnete Flächen sind abzudecken","",0.2016689702485,"","Blech 3 - 73x 120",null,3,null,"02","Released",null,null,null,"Part",null,2,null,"Part","mit Bearbeitung","ohne Kante"]
["1-1-24-3",">>>4","3",null,120185,"mon","Normteil","A2K",12,48,null,null,120185,null,"Sch DIN 125A - 8.4-140 HV-A2K",null,"DIN 125A","140 HV","A2K","",1.8292915999999998E-3,"",null,null,null,null,"11","Released",null,null,null,"Purchased",null,12,null,"Purchased"]
["1-1-24-4",">>>4","4",null,124244,"mon","Normteil","A2K",4,16,null,null,124244,null,"6kt-Mu ISO 4032 - M8-8-A2K",null,"ISO 4032","8","A2K","",5.7026624199999999E-3,"",null,null,null,null,"10","Released",null,null,null,"Purchased",null,4,null,"Purchased"]
["1-1-24-5",">>>4","5",null,120417,"mon","Normteil","A2K",8,32,null,null,120417,null,"6kt-Mu ISO 4035 - M8-04-A2K",null,"ISO 4035","04","A2K","",3.2484337900000001E-3,"",null,null,null,null,"01","Released",null,null,null,"Purchased",null,8,null,"Purchased"]
["1-1-24-6",">>>4","6",null,123882,"mon","Normteil","A2K",4,16,null,null,123882,null,"6kt-Schr ISO 4017 - M8x40-8.8-A2K",null,"ISO 4017","8.8","A2K","",2.161065375E-2,"",null,null,null,null,"02","Released",null,null,null,"Purchased",null,4,null,"Purchased"]
["1-1-24-7",">>>4","7",null,126300,"mon","Normteil","ZN",8,32,null,null,126300,null,"Se-Schr ISO 10642 - M5x16-8.8-ZN",null,"ISO 10642","8.8","ZN","",3.05265555E-3,"",null,null,null,null,"01","Released",null,null,null,"Purchased",null,8,null,"Purchased"]
["1-1-24-8",">>>4","8","-",3105000,"mon","Lagerteil",null,1,4,null,null,3105000,null,"Pressfilz weiss 40x64x160","40x64x160",null,"-",null,"",3.4115530678938999,"","40x64x160",null,null,"BT-03768","04","Released","weiss","Fisco",null,"Purchased",null,1,null,"Purchased"]
["1-1-25",">>3","25","-",3175419,"mon","Montage",null,2,4,null,null,3175419,null,"KAS-Abdeckblech kpl",null,null,"Generisch",null,"",1.75945471900252,"",null,null,null,null,"-","Released","",null,null,"Assembly",null,2,null,"Assembly"]
["1-1-25-1",">>>4","1","-",3175420,"mon","Stahlbau","Nasslackierung\nFarbanstrich gem. Bestellangaben\nGrund- und Deckanstrich\nSchichtdicke 70µm total \nLauf- Anschluss- und speziell\ngekennzeichnete Flächen sind abzudecken",1,4,496,110,3175420,205819,"KAS-Abdeckblech","Blech 4 - 110x 496","EN 10029","S235JRG2","Nasslackierung\nFarbanstrich gem. Bestellangaben\nGrund- und Deckanstrich\nSchichtdicke 70µm total \nLauf- Anschluss- und speziell\ngekennzeichnete Flächen sind abzudecken","",1.7077622551649199,"","Blech 4 - 110x 496",null,4,null,"-","Released","",null,null,"Part",null,1,null,"Part","ohne Bearbeitung","ohne Kante"]
["1-1-25-2",">>>4","2",null,120185,"mon","Normteil","A2K",4,16,null,null,120185,null,"Sch DIN 125A - 8.4-140 HV-A2K",null,"DIN 125A","140 HV","A2K","",1.8292915999999998E-3,"",null,null,null,null,"11","Released",null,null,null,"Purchased",null,4,null,"Purchased"]
["1-1-25-3",">>>4","3",null,127300,"mon","Normteil","ZN",2,8,null,null,127300,null,"Sicherungsscheibe SCHNORR Typ VS 8",null,"-","C60S","ZN","",7.9309311999999999E-4,"",null,null,null,null,"11","Released",null,null,null,"Purchased",null,2,null,"Purchased"]
["1-1-25-4",">>>4","4",null,124244,"mon","Normteil","A2K",2,8,null,null,124244,null,"6kt-Mu ISO 4032 - M8-8-A2K",null,"ISO 4032","8","A2K","",5.7026624199999999E-3,"",null,null,null,null,"10","Released",null,null,null,"Purchased",null,2,null,"Purchased"]
["1-1-25-5",">>>4","5",null,123878,"mon","Normteil","A2K",2,8,null,null,123878,null,"6kt-Schr ISO 4017 - M8x25-8.8-A2K",null,"ISO 4017","8.8","A2K","",1.569189319E-2,"",null,null,null,null,"03","Released",null,null,null,"Purchased",null,2,null,"Purchased"]
["1-1-26",">>3","26","-",3202663,"mon","Stahlbau","Nasslackierung\nFarbanstrich gem. Bestellangaben\nGrund- und Deckanstrich\nSchichtdicke 70µm total \nLauf- Anschluss- und speziell\ngekennzeichnete Flächen sind abzudecken",2,4,930.1,375.7,3202663,205819,"Abdeckblech Antrieb","Blech 4 - 376x 930","EN 10029","S235JRG2","Nasslackierung\nFarbanstrich gem. Bestellangaben\nGrund- und Deckanstrich\nSchichtdicke 70µm total \nLauf- Anschluss- und speziell\ngekennzeichnete Flächen sind abzudecken","",9.4462762709104506,"","Blech 4 - 376x 930",null,4,null,"-","Released",null,null,null,"Part",null,2,null,"Part","ohne Bearbeitung","mit Kante"]
["1-1-27",">>3","27",null,120185,"mon","Normteil","A2K",8,16,null,null,120185,null,"Sch DIN 125A - 8.4-140 HV-A2K",null,"DIN 125A","140 HV","A2K","",1.8292915999999998E-3,"",null,null,null,null,"11","Released",null,null,null,"Purchased",null,8,null,"Purchased"]
["1-1-28",">>3","28",null,126913,"mon","Normteil","A2K",24,48,null,null,126913,null,"Sch DIN 7349 - 17-140 HV-A2K",null,"DIN 7349","140 HV","A2K","",4.8496844330000004E-2,"",null,null,null,null,"10","Released",null,null,null,"Purchased",null,24,null,"Purchased"]
["1-1-29",">>3","29",null,127300,"mon","Normteil","ZN",8,16,null,null,127300,null,"Sicherungsscheibe SCHNORR Typ VS 8",null,"-","C60S","ZN","",7.9309311999999999E-4,"",null,null,null,null,"11","Released",null,null,null,"Purchased",null,8,null,"Purchased"]
["1-1-30",">>3","30",null,123874,"mon","Normteil","A2K",8,16,null,null,123874,null,"6kt-Schr ISO 4017 - M8x16-8.8-A2K",null,"ISO 4017","8.8","A2K","",1.2140636860000002E-2,"",null,null,null,null,"02","Released",null,null,null,"Purchased",null,8,null,"Purchased"]
["1-1-31",">>3","31",null,123980,"mon","Normteil","A2K",10,20,null,null,123980,null,"6kt-Schr ISO 4017 - M16x80-8.8-A2K",null,"ISO 4017","8.8","A2K","",0.16438788853,"",null,null,null,null,"01","Released",null,null,null,"Purchased",null,10,null,"Purchased"]
["1-1-32",">>3","32",null,123989,"mon","Normteil","A2K",2,4,null,null,123989,null,"6kt-Schr ISO 4017 - M16x160-8.8-A2K",null,"ISO 4017","8.8","A2K","",0.29054724238000001,"",null,null,null,null,"-","Released",null,null,null,"Purchased",null,2,null,"Purchased"]
["1-1-33",">>3","33",null,125095,"mon","Normteil","ZN",12,24,null,null,125095,null,"6kt-Si-Mu DIN 985 - M16-8-ZN",null,"DIN 985","8","ZN","",3.8418852649999995E-2,"",null,null,null,null,"05","Released",null,null,null,"Purchased",null,12,null,"Purchased"]
["1-1-34",">>3","34",null,126171,"mon","Normteil","ZN",8,16,null,null,126171,null,"Zyl-Schr In-6kt DIN 7984 - M8x12-8.8-ZN",null,"DIN 7984","8.8","ZN","",9.09117563E-3,"",null,null,null,null,"01","Released",null,null,null,"Purchased",null,8,null,"Purchased"]
["1-1-35",">>3","35","-",3159239,"mon","Einkaufsteil",null,32,64,null,null,3159239,null,"Bohrschraube 4.8x13",null,null,"-",null,"",3.19644175E-3,"",null,null,null,null,"-","Released","Zebra Pias","Würth","02144813/500Stk","Purchased",null,32,null,"Purchased"]
["1-1-36",">>3","36","01",3104982,"mon","Normteil",null,16,32,null,null,3104982,null,"Spannstift leicht DIN 7346 - 3x24-ST-blank",null,"DIN 7346","ST",null,"",5.1535435E-4,"",null,"Fehr Kategorie Neu Normteil",null,null,"03","Released",null,null,null,"Purchased",null,16,null,"Purchased"]
["1-2",">2","2","-",3135749,"mon","Montage",null,2,4,null,null,3135749,null,"Halter Belegtkontrolle WL9L kpl",null,null,"-",null,"",0.57753127419460604,"",null,null,null,null,"01","Released",null,null,null,"Assembly",null,2,null,"Assembly"]
["1-2-1",">>3","1","-",3105343,"mon","Stahlbau","Nasslackierung\nFarbanstrich gem. Bestellangaben\nGrund- und Deckanstrich\nSchichtdicke 70µm total \nLauf- Anschluss- und speziell\ngekennzeichnete Flächen sind abzudecken",1,4,105,138,3105343,162101,"Halter Belegtkontrolle ","Blech 3 - 138x 105","EN 10029","S235JRG2","Nasslackierung\nFarbanstrich gem. Bestellangaben\nGrund- und Deckanstrich\nSchichtdicke 70µm total \nLauf- Anschluss- und speziell\ngekennzeichnete Flächen sind abzudecken","",0.19752305596700001,"","Blech 3 - 138x 105",null,3,null,"04","Released",null,null,null,"Part",null,1,null,"Part","ohne Bearbeitung","mit Kante"]
["1-2-2",">>3","2","-",3129432,"mon","Stahlbau","Nasslackierung\nFarbanstrich gem. Bestellangaben\nGrund- und Deckanstrich\nSchichtdicke 70µm total \nLauf- Anschluss- und speziell\ngekennzeichnete Flächen sind abzudecken",1,4,50,21,3129432,162097,"Gewindeplatte Sensor","Blech 6 - 21x 50","EN 10029","S235JRG2","Nasslackierung\nFarbanstrich gem. Bestellangaben\nGrund- und Deckanstrich\nSchichtdicke 70µm total \nLauf- Anschluss- und speziell\ngekennzeichnete Flächen sind abzudecken","",4.6096284789999997E-2,"","Blech 6 - 21x 50",null,6,null,"01","Released",null,null,null,"Part",null,1,null,"Part","mit Bearbeitung","ohne Kante"]
["1-2-3",">>3","3","01",3129426,"mon","Stahlbau","Nasslackierung\nFarbanstrich gem. Bestellangaben\nGrund- und Deckanstrich\nSchichtdicke 70µm total \nLauf- Anschluss- und speziell\ngekennzeichnete Flächen sind abzudecken",1,4,30,50,3129426,205911,"Distanzstück","Blech 20 - 30x 50","DIN EN 10058","S235JRG2","Nasslackierung\nFarbanstrich gem. Bestellangaben\nGrund- und Deckanstrich\nSchichtdicke 70µm total \nLauf- Anschluss- und speziell\ngekennzeichnete Flächen sind abzudecken","",0.223415863857966,"","Blech 20 - 30x 50","In Blech konventiert",20,null,"01","Released",null,null,null,"Part",null,20,null,"Part","ohne Bearbeitung","ohne Kante"]
["1-2-4",">>3","4",null,120179,"mon","Normteil","A2K",4,16,null,null,120179,null,"Sch DIN 125A - 3.2-140 HV-A2K",null,"DIN 125A","140 HV","A2K","",1.1948498000000001E-4,"",null,null,null,null,"04","Released",null,null,null,"Purchased",null,4,null,"Purchased"]
["1-2-5",">>3","5",null,200890,"mon","Normteil","ZN",2,8,null,null,200890,null,"Sch DIN 9021 - 6.4-100 HV-ZN",null,"DIN 9021","100 HV","ZN","",2.7920766499999997E-3,"",null,null,null,null,"11","Released",null,null,null,"Purchased",null,2,null,"Purchased"]
["1-2-6",">>3","6",null,124239,"mon","Normteil","A2K",2,8,null,null,124239,null,"6kt-Mu ISO 4032 - M3-8-A2K",null,"ISO 4032","8","A2K","",3.7355490000000004E-4,"",null,null,null,null,"04","Released",null,null,null,"Purchased",null,2,null,"Purchased"]
["1-2-7",">>3","7",null,127677,"mon","Normteil","ZN",2,8,null,null,127677,null,"Sicherungsscheibe SCHNORR Typ VS 6",null,"-","C60S","ZN","",3.9293860000000005E-4,"",null,null,null,null,"21","Released",null,null,null,"Purchased",null,2,null,"Purchased"]
["1-2-8",">>3","8",null,138446,"mon","Normteil","A2K",2,8,null,null,138446,null,"6kt-Schr ISO 4017 - M3x20-8.8-A2K",null,"ISO 4017","8.8","A2K","",1.4856616399999999E-3,"",null,null,null,null,"04","Released",null,null,null,"Purchased",null,2,null,"Purchased"]
["1-2-9",">>3","9",null,123855,"mon","Normteil","A2K",2,8,null,null,123855,null,"6kt-Schr ISO 4017 - M6x35-8.8-A2K",null,"ISO 4017","8.8","A2K","",1.035644032E-2,"",null,null,null,null,"01","Released",null,null,null,"Purchased",null,2,null,"Purchased"]
["1-2-10",">>3","10","01",3101866,"mon","Lagerteil",null,1,4,null,null,3101866,null,"Reflexionslichtschranke Sn=8m",null,null,"-",null,"",7.9216785459999994E-2,"",null,"Fehr Kategorie auf Lagerteil geändert",null,"BT-05697","03","Released","WL9L-3P2232","SICK","1058174","Purchased",null,1,null,"Purchased"]
["1-3",">2","3","01",3112289,"mon","Montage",null,2,4,null,null,3112289,null,"Halter Reflektor kpl",null,null,"-",null,"",0.20554665323000001,"",null,"Pos. 7 aktualisiert",null,null,"01","Released","",null,null,"Assembly",null,2,null,"Assembly"]
["1-3-1",">>3","1","-",3112290,"mon","Stahlbau","Nasslackierung\nFarbanstrich gem. Bestellangaben\nGrund- und Deckanstrich\nSchichtdicke 70µm total \nLauf- Anschluss- und speziell\ngekennzeichnete Flächen sind abzudecken",1,4,60,70,3112290,162101,"Halter Reflektor","Blech 3 - 70x 60","EN 10029","S235JRG2","Nasslackierung\nFarbanstrich gem. Bestellangaben\nGrund- und Deckanstrich\nSchichtdicke 70µm total \nLauf- Anschluss- und speziell\ngekennzeichnete Flächen sind abzudecken","",9.1682208160000001E-2,"","Blech 3 - 70x 60",null,3,null,"01","Released","",null,null,"Part",null,1,null,"Part","mit Bearbeitung","ohne Kante"]
["1-3-2",">>3","2","-",3105353,"mon","Stahlbau","Nasslackierung\nFarbanstrich gem. Bestellangaben\nGrund- und Deckanstrich\nSchichtdicke 70µm total \nLauf- Anschluss- und speziell\ngekennzeichnete Flächen sind abzudecken",1,4,50,22,3105353,162097,"Gewindeplatte Sensor","Blech 6 - 22x 50","EN 10029","S235JRG2","Nasslackierung\nFarbanstrich gem. Bestellangaben\nGrund- und Deckanstrich\nSchichtdicke 70µm total \nLauf- Anschluss- und speziell\ngekennzeichnete Flächen sind abzudecken","",4.8451284786700001E-2,"","Blech 6 - 22x 50",null,6,null,"04","Released",null,null,null,"Part",null,1,null,"Part","mit Bearbeitung","ohne Kante"]
["1-3-3",">>3","3",null,200890,"mon","Normteil","ZN",2,8,null,null,200890,null,"Sch DIN 9021 - 6.4-100 HV-ZN",null,"DIN 9021","100 HV","ZN","",2.7920766499999997E-3,"",null,null,null,null,"11","Released",null,null,null,"Purchased",null,2,null,"Purchased"]
["1-3-4",">>3","4",null,127677,"mon","Normteil","ZN",2,8,null,null,127677,null,"Sicherungsscheibe SCHNORR Typ VS 6",null,"-","C60S","ZN","",3.9293860000000005E-4,"",null,null,null,null,"21","Released",null,null,null,"Purchased",null,2,null,"Purchased"]
["1-3-5",">>3","5",null,123848,"mon","Normteil","A2K",2,8,null,null,123848,null,"6kt-Schr ISO 4017 - M6x16-8.8-A2K",null,"ISO 4017","8.8","A2K","",6.1393234200000004E-3,"",null,null,null,null,"19","Released",null,null,null,"Purchased",null,2,null,"Purchased"]
["1-3-6",">>3","6",null,126284,"mon","Normteil","ZN",2,8,null,null,126284,null,"Se-Schr ISO 10642 - M4x12-8.8-ZN",null,"ISO 10642","8.8","ZN","",1.4759647199999999E-3,"",null,null,null,null,"01","Released",null,null,null,"Purchased",null,2,null,"Purchased"]
["1-3-7",">>3","7","01",3105342,"mon","Lagerteil",null,1,4,null,null,3105342,null,"Reflektor 15x38",null,null,"-",null,"",4.3812553529999999E-2,"",null,"Fehr Kategorie auf Lagerteil geändert",null,"BT-03281","03","Released","PL20F","SICK","5308844","Purchased",null,1,null,"Purchased"]
["1-4",">2","4","01",3142489,"mon","Montage",null,2,4,null,null,3142489,null,"Lichtvorhang Empf. MLG10A-590 kpl",null,null,"-",null,"",6.78660847721875,"",null,"Pos. 21-23 aktualisiert",null,null,"01","Released",null,null,null,"Assembly",null,2,null,"Assembly"]
["1-4-1",">>3","1","01",3142490,"schw","Stahlbau","Nasslackierung\nFarbanstrich gem. Bestellangaben\nGrund- und Deckanstrich\nSchichtdicke 70µm total \nLauf- Anschluss- und speziell\ngekennzeichnete Flächen sind abzudecken",1,4,null,null,3142490,null,"Halter Lichtvorhang MLG10A-590 STB",null,null,"-","Nasslackierung\nFarbanstrich gem. Bestellangaben\nGrund- und Deckanstrich\nSchichtdicke 70µm total \nLauf- Anschluss- und speziell\ngekennzeichnete Flächen sind abzudecken","",1.99174253744,"",null,"Pos.2 ers",null,null,"01","Released","Empfänger",null,null,"Assembly",null,1,null,"Assembly"]
["1-4-1-1",">>>4","1","-",3142492,"schw","Stahlbau",null,1,4,800,90.9,3142492,206073,"Halter Lichtvorhang zu MLG10A-590","Blech 5 - 91x 800","EN 10029","S235JRG2",null,"",1.71456112905,"","Blech 5 - 91x 800",null,5,null,"01","Released","Empfänger",null,null,"Part",null,1,null,"Part","ohne Bearbeitung","mit Kante"]
["1-4-1-2",">>>4","2","-",3145937,"schw","Stahlbau",null,1,4,300,null,3145937,160783,"-","C 28 x 15 x14 x 2 - 300","DIN EN 10162","S235JRG2",null,"",0.27718140838999999,"","C 28 x 15 x14 x 2 - 300",null,null,null,"02","Released",null,null,null,"Part",null,300,null,"Part"]
["1-4-2",">>3","2","01",3105318,"mon","Stahlbau","Nasslackierung\nFarbanstrich gem. Bestellangaben\nGrund- und Deckanstrich\nSchichtdicke 70µm total \nLauf- Anschluss- und speziell\ngekennzeichnete Flächen sind abzudecken",1,4,119,85,3105318,162101,"Fachbelegthalter WT27-L1","Blech 3 - 85x 119","EN 10029","S235JRG2","Nasslackierung\nFarbanstrich gem. Bestellangaben\nGrund- und Deckanstrich\nSchichtdicke 70µm total \nLauf- Anschluss- und speziell\ngekennzeichnete Flächen sind abzudecken","",0.14030813873340001,"","Blech 3 - 85x 119","neu Lochbilder",3,null,"03","Released",null,null,null,"Part",null,1,null,"Part","ohne Bearbeitung","mit Kante"]
["1-4-3",">>3","3","-",3142491,"mon","Stahlbau","Nasslackierung\nFarbanstrich gem. Bestellangaben\nGrund- und Deckanstrich\nSchichtdicke 70µm total \nLauf- Anschluss- und speziell\ngekennzeichnete Flächen sind abzudecken",1,4,800,146.69999999999999,3142491,205819,"Halterung Lichtgitter MLG10A-590","Blech 4.2 - 147x 800","EN 10029","S235JRG2","Nasslackierung\nFarbanstrich gem. Bestellangaben\nGrund- und Deckanstrich\nSchichtdicke 70µm total \nLauf- Anschluss- und speziell\ngekennzeichnete Flächen sind abzudecken","",3.27294320232,"","Blech 4.2 - 147x 800",null,4,null,"01","Released",null,null,null,"Part",null,1,null,"Part","ohne Bearbeitung","mit Kante"]
["1-4-4",">>3","4",null,120182,"mon","Normteil","A2K",9,36,null,null,120182,null,"Sch DIN 125A - 5.3-140 HV-A2K",null,"DIN 125A","140 HV","A2K","",4.4335216E-4,"",null,null,null,null,"06","Released",null,null,null,"Purchased",null,9,null,"Purchased"]
["1-4-5",">>3","5",null,120183,"mon","Normteil","A2K",6,24,null,null,120183,null,"Sch DIN 125A - 6.4-140 HV-A2K",null,"DIN 125A","140 HV","A2K","",1.0164484799999999E-3,"",null,null,null,null,"15","Released",null,null,null,"Purchased",null,6,null,"Purchased"]
["1-4-6",">>3","6",null,126423,"mon","Normteil","ZN",7,28,null,null,126423,null,"Sch DIN 9021 - 5.3-100 HV-ZN",null,"DIN 9021","100 HV","ZN","",1.4568289299999998E-3,"",null,null,null,null,"03","Released",null,null,null,"Purchased",null,7,null,"Purchased"]
["1-4-7",">>3","7",null,126909,"mon","Normteil","A2K",4,16,null,null,126909,null,"Sch DIN 7349 - 8.4-140 HV-A2K",null,"DIN 7349","140 HV","A2K","",9.1356069200000008E-3,"",null,null,null,null,"11","Released",null,null,null,"Purchased",null,4,null,"Purchased"]
["1-4-8",">>3","8",null,127047,"mon","Normteil","ZN",11,44,null,null,127047,null,"Sicherungsscheibe SCHNORR Typ VS 5",null,"-","C60S","ZN","",3.5214060000000001E-4,"",null,null,null,null,"06","Released",null,null,null,"Purchased",null,11,null,"Purchased"]
["1-4-9",">>3","9",null,127677,"mon","Normteil","ZN",4,16,null,null,127677,null,"Sicherungsscheibe SCHNORR Typ VS 6",null,"-","C60S","ZN","",3.9293860000000005E-4,"",null,null,null,null,"21","Released",null,null,null,"Purchased",null,4,null,"Purchased"]
["1-4-10",">>3","10",null,127300,"mon","Normteil","ZN",2,8,null,null,127300,null,"Sicherungsscheibe SCHNORR Typ VS 8",null,"-","C60S","ZN","",7.9309311999999999E-4,"",null,null,null,null,"11","Released",null,null,null,"Purchased",null,2,null,"Purchased"]
["1-4-11",">>3","11",null,124241,"mon","Normteil","A2K",8,32,null,null,124241,null,"6kt-Mu ISO 4032 - M5-8-A2K",null,"ISO 4032","8","A2K","",1.47057223E-3,"",null,null,null,null,"05","Released",null,null,null,"Purchased",null,8,null,"Purchased"]
["1-4-12",">>3","12",null,124242,"mon","Normteil","A2K",4,16,null,null,124242,null,"6kt-Mu ISO 4032 - M6-8-A2K",null,"ISO 4032","8","A2K","",2.6392592899999998E-3,"",null,null,null,null,"10","Released",null,null,null,"Purchased",null,4,null,"Purchased"]
["1-4-13",">>3","13",null,127945,"mon","Normteil","A2K",3,12,null,null,127945,null,"6kt-Mu ISO 4035 - M5-04-A2K",null,"ISO 4035","04","A2K","",8.1112189999999992E-4,"",null,null,null,null,"01","Released",null,null,null,"Purchased",null,3,null,"Purchased"]
["1-4-14",">>3","14",null,124244,"mon","Normteil","A2K",2,8,null,null,124244,null,"6kt-Mu ISO 4032 - M8-8-A2K",null,"ISO 4032","8","A2K","",5.7026624199999999E-3,"",null,null,null,null,"10","Released",null,null,null,"Purchased",null,2,null,"Purchased"]
["1-4-15",">>3","15",null,123834,"mon","Normteil","A2K",2,8,null,null,123834,null,"6kt-Schr ISO 4017 - M5x40-8.8-A2K",null,"ISO 4017","8.8","A2K","",7.5983522600000008E-3,"",null,null,null,null,"01","Released",null,null,null,"Purchased",null,2,null,"Purchased"]
["1-4-16",">>3","16",null,123836,"mon","Normteil","A2K",2,8,null,null,123836,null,"6kt-Schr ISO 4017 - M5x50-8.8-A2K",null,"ISO 4017","8.8","A2K","",9.1396961500000012E-3,"",null,null,null,null,"01","Released",null,null,null,"Purchased",null,2,null,"Purchased"]
["1-4-17",">>3","17",null,123826,"mon","Normteil","A2K",7,28,null,null,123826,null,"6kt-Schr ISO 4017 - M5x16-8.8-A2K",null,"ISO 4017","8.8","A2K","",3.89912691E-3,"",null,null,null,null,"03","Released",null,null,null,"Purchased",null,7,null,"Purchased"]
["1-4-18",">>3","18",null,123850,"mon","Normteil","A2K",2,8,null,null,123850,null,"6kt-Schr ISO 4017 - M6x20-8.8-A2K",null,"ISO 4017","8.8","A2K","",7.0271374999999999E-3,"",null,null,null,null,"07","Released",null,null,null,"Purchased",null,2,null,"Purchased"]
["1-4-19",">>3","19",null,123880,"mon","Normteil","A2K",2,8,null,null,123880,null,"6kt-Schr ISO 4017 - M8x30-8.8-A2K",null,"ISO 4017","8.8","A2K","",1.7664813379999998E-2,"",null,null,null,null,"06","Released",null,null,null,"Purchased",null,2,null,"Purchased"]
["1-4-20",">>3","20","02",3105330,"mon","Lagerteil",null,2,8,null,null,3105330,null,"Halfenschraube M6x20","M6x20",null,"-",null,"",1.6317222158100001E-2,"","M6x20","Fehr Kategorie auf Lagerteil geändert",null,"BT-00683","07","Released","HS 28/15 M6x20 GV-S 4.6","Halfen","0350.020-00022 / 100 Stk","Purchased",null,2,null,"Purchased"]
["1-4-21",">>3","21","01",3105309,"mon","Lagerteil",null,1,4,null,null,3105309,null,"Befestigungswinkel BEF-WN-W27",null,null,"-",null,"",0.10746229338969999,"",null,"Fehr Kategorie auf Lagerteil geändert",null,"BT-00041","05","Released","BEF-WN-W27","SICK","2009122","Purchased",null,1,null,"Purchased"]
["1-4-22",">>3","22","01",3111060,"mon","Lagerteil",null,1,4,null,null,3111060,null,"Reflexions-Lichttaster Sn=10-1600mm",null,null,"-",null,"",0.75134309078770001,"",null,"Fehr Kategorie auf Lagerteil geändert",null,"3102993 (BT-02130)","06","Released","WTB26P-24161120A00","SICK","1218666","Purchased",null,1,null,"Purchased"]
["1-4-23",">>3","23","01",3107348,"mon","Lagerteil",null,2,8,null,null,3107348,null,"Zubehör Befestigungstechnik (Lieferumfang 4 Stk.)",null,null,"-",null,"",0.14000000000000001,"",null,"Fehr Kategorie auf Lagerteil geändert",null,"BT-08701","02","Released","BEF-3SHABPKU4","SICK","2098710","Purchased",null,2,null,"Purchased"]
["1-5",">2","5","01",3142494,"mon","Montage",null,2,4,null,null,3142494,null,"Lichtvorhang Sender MLG10A-590 kpl",null,null,"-",null,"",6.7866084772187598,"",null,"Pos. 21-23 aktualisiert",null,null,"01","Released",null,null,null,"Assembly",null,2,null,"Assembly"]
["1-5-1",">>3","1","01",3142495,"schw","Stahlbau","Nasslackierung\nFarbanstrich gem. Bestellangaben\nGrund- und Deckanstrich\nSchichtdicke 70µm total \nLauf- Anschluss- und speziell\ngekennzeichnete Flächen sind abzudecken",1,4,null,null,3142495,null,"Halter Lichtvorhang MLG10A-590 STB",null,null,"-","Nasslackierung\nFarbanstrich gem. Bestellangaben\nGrund- und Deckanstrich\nSchichtdicke 70µm total \nLauf- Anschluss- und speziell\ngekennzeichnete Flächen sind abzudecken","",1.99174253744,"",null,"Pos.2 ers",null,null,"01","Released","Sender",null,null,"Assembly",null,1,null,"Assembly"]
["1-5-1-1",">>>4","1","-",3142496,"schw","Stahlbau",null,1,4,800,90.9,3142496,206073,"Halter Lichtvorhang zu MLG10A-590","Blech 5 - 91x 800","EN 10029","S235JRG2",null,"",1.71456112905,"","Blech 5 - 91x 800",null,5,null,"01","Released","Sender",null,null,"Part",null,1,null,"Part","ohne Bearbeitung","mit Kante"]
["1-5-1-3",">>>4","3","-",3145937,"schw","Stahlbau",null,1,4,300,null,3145937,160783,"-","C 28 x 15 x14 x 2 - 300","DIN EN 10162","S235JRG2",null,"",0.27718140838999999,"","C 28 x 15 x14 x 2 - 300",null,null,null,"02","Released",null,null,null,"Part",null,300,null,"Part"]
["1-5-2",">>3","2","01",3105338,"mon","Stahlbau","Nasslackierung\nFarbanstrich gem. Bestellangaben\nGrund- und Deckanstrich\nSchichtdicke 70µm total \nLauf- Anschluss- und speziell\ngekennzeichnete Flächen sind abzudecken",1,4,119,85,3105338,162101,"Fachbelegthalter WT27-L 1","Blech 3 - 85x 119","EN 10029","S235JRG2","Nasslackierung\nFarbanstrich gem. Bestellangaben\nGrund- und Deckanstrich\nSchichtdicke 70µm total \nLauf- Anschluss- und speziell\ngekennzeichnete Flächen sind abzudecken","",0.14030813873340001,"","Blech 3 - 85x 119","neue Bohrbilder",3,null,"04","Released",null,null,null,"Part",null,1,null,"Part","ohne Bearbeitung","mit Kante"]
["1-5-3",">>3","3","-",3142491,"mon","Stahlbau","Nasslackierung\nFarbanstrich gem. Bestellangaben\nGrund- und Deckanstrich\nSchichtdicke 70µm total \nLauf- Anschluss- und speziell\ngekennzeichnete Flächen sind abzudecken",1,4,800,146.69999999999999,3142491,205819,"Halterung Lichtgitter MLG10A-590","Blech 4.2 - 147x 800","EN 10029","S235JRG2","Nasslackierung\nFarbanstrich gem. Bestellangaben\nGrund- und Deckanstrich\nSchichtdicke 70µm total \nLauf- Anschluss- und speziell\ngekennzeichnete Flächen sind abzudecken","",3.27294320232,"","Blech 4.2 - 147x 800",null,4,null,"01","Released",null,null,null,"Part",null,1,null,"Part","ohne Bearbeitung","mit Kante"]
["1-5-4",">>3","4",null,120182,"mon","Normteil","A2K",9,36,null,null,120182,null,"Sch DIN 125A - 5.3-140 HV-A2K",null,"DIN 125A","140 HV","A2K","",4.4335216E-4,"",null,null,null,null,"06","Released",null,null,null,"Purchased",null,9,null,"Purchased"]
["1-5-5",">>3","5",null,120183,"mon","Normteil","A2K",6,24,null,null,120183,null,"Sch DIN 125A - 6.4-140 HV-A2K",null,"DIN 125A","140 HV","A2K","",1.0164484799999999E-3,"",null,null,null,null,"15","Released",null,null,null,"Purchased",null,6,null,"Purchased"]
["1-5-6",">>3","6",null,126423,"mon","Normteil","ZN",7,28,null,null,126423,null,"Sch DIN 9021 - 5.3-100 HV-ZN",null,"DIN 9021","100 HV","ZN","",1.4568289299999998E-3,"",null,null,null,null,"03","Released",null,null,null,"Purchased",null,7,null,"Purchased"]
["1-5-7",">>3","7",null,126909,"mon","Normteil","A2K",4,16,null,null,126909,null,"Sch DIN 7349 - 8.4-140 HV-A2K",null,"DIN 7349","140 HV","A2K","",9.1356069200000008E-3,"",null,null,null,null,"11","Released",null,null,null,"Purchased",null,4,null,"Purchased"]
["1-5-8",">>3","8",null,127047,"mon","Normteil","ZN",11,44,null,null,127047,null,"Sicherungsscheibe SCHNORR Typ VS 5",null,"-","C60S","ZN","",3.5214060000000001E-4,"",null,null,null,null,"06","Released",null,null,null,"Purchased",null,11,null,"Purchased"]
["1-5-9",">>3","9",null,127677,"mon","Normteil","ZN",4,16,null,null,127677,null,"Sicherungsscheibe SCHNORR Typ VS 6",null,"-","C60S","ZN","",3.9293860000000005E-4,"",null,null,null,null,"21","Released",null,null,null,"Purchased",null,4,null,"Purchased"]
["1-5-10",">>3","10",null,127300,"mon","Normteil","ZN",2,8,null,null,127300,null,"Sicherungsscheibe SCHNORR Typ VS 8",null,"-","C60S","ZN","",7.9309311999999999E-4,"",null,null,null,null,"11","Released",null,null,null,"Purchased",null,2,null,"Purchased"]
["1-5-11",">>3","11",null,124241,"mon","Normteil","A2K",8,32,null,null,124241,null,"6kt-Mu ISO 4032 - M5-8-A2K",null,"ISO 4032","8","A2K","",1.47057223E-3,"",null,null,null,null,"05","Released",null,null,null,"Purchased",null,8,null,"Purchased"]
["1-5-12",">>3","12",null,124242,"mon","Normteil","A2K",4,16,null,null,124242,null,"6kt-Mu ISO 4032 - M6-8-A2K",null,"ISO 4032","8","A2K","",2.6392592899999998E-3,"",null,null,null,null,"10","Released",null,null,null,"Purchased",null,4,null,"Purchased"]
["1-5-13",">>3","13",null,127945,"mon","Normteil","A2K",3,12,null,null,127945,null,"6kt-Mu ISO 4035 - M5-04-A2K",null,"ISO 4035","04","A2K","",8.1112189999999992E-4,"",null,null,null,null,"01","Released",null,null,null,"Purchased",null,3,null,"Purchased"]
["1-5-14",">>3","14",null,124244,"mon","Normteil","A2K",2,8,null,null,124244,null,"6kt-Mu ISO 4032 - M8-8-A2K",null,"ISO 4032","8","A2K","",5.7026624199999999E-3,"",null,null,null,null,"10","Released",null,null,null,"Purchased",null,2,null,"Purchased"]
["1-5-15",">>3","15",null,123834,"mon","Normteil","A2K",2,8,null,null,123834,null,"6kt-Schr ISO 4017 - M5x40-8.8-A2K",null,"ISO 4017","8.8","A2K","",7.5983522600000008E-3,"",null,null,null,null,"01","Released",null,null,null,"Purchased",null,2,null,"Purchased"]
["1-5-16",">>3","16",null,123836,"mon","Normteil","A2K",2,8,null,null,123836,null,"6kt-Schr ISO 4017 - M5x50-8.8-A2K",null,"ISO 4017","8.8","A2K","",9.1396961500000012E-3,"",null,null,null,null,"01","Released",null,null,null,"Purchased",null,2,null,"Purchased"]
["1-5-17",">>3","17",null,123826,"mon","Normteil","A2K",7,28,null,null,123826,null,"6kt-Schr ISO 4017 - M5x16-8.8-A2K",null,"ISO 4017","8.8","A2K","",3.89912691E-3,"",null,null,null,null,"03","Released",null,null,null,"Purchased",null,7,null,"Purchased"]
["1-5-18",">>3","18",null,123850,"mon","Normteil","A2K",2,8,null,null,123850,null,"6kt-Schr ISO 4017 - M6x20-8.8-A2K",null,"ISO 4017","8.8","A2K","",7.0271374999999999E-3,"",null,null,null,null,"07","Released",null,null,null,"Purchased",null,2,null,"Purchased"]
["1-5-19",">>3","19",null,123880,"mon","Normteil","A2K",2,8,null,null,123880,null,"6kt-Schr ISO 4017 - M8x30-8.8-A2K",null,"ISO 4017","8.8","A2K","",1.7664813379999998E-2,"",null,null,null,null,"06","Released",null,null,null,"Purchased",null,2,null,"Purchased"]
["1-5-20",">>3","20","02",3105330,"mon","Lagerteil",null,2,8,null,null,3105330,null,"Halfenschraube M6x20","M6x20",null,"-",null,"",1.6317222158100001E-2,"","M6x20","Fehr Kategorie auf Lagerteil geändert",null,"BT-00683","07","Released","HS 28/15 M6x20 GV-S 4.6","Halfen","0350.020-00022 / 100 Stk","Purchased",null,2,null,"Purchased"]
["1-5-21",">>3","21","01",3105309,"mon","Lagerteil",null,1,4,null,null,3105309,null,"Befestigungswinkel BEF-WN-W27",null,null,"-",null,"",0.10746229338969999,"",null,"Fehr Kategorie auf Lagerteil geändert",null,"BT-00041","05","Released","BEF-WN-W27","SICK","2009122","Purchased",null,1,null,"Purchased"]
["1-5-22",">>3","22","01",3111060,"mon","Lagerteil",null,1,4,null,null,3111060,null,"Reflexions-Lichttaster Sn=10-1600mm",null,null,"-",null,"",0.75134309078770001,"",null,"Fehr Kategorie auf Lagerteil geändert",null,"3102993 (BT-02130)","06","Released","WTB26P-24161120A00","SICK","1218666","Purchased",null,1,null,"Purchased"]
["1-5-23",">>3","23","01",3107348,"mon","Lagerteil",null,2,8,null,null,3107348,null,"Zubehör Befestigungstechnik (Lieferumfang 4 Stk.)",null,null,"-",null,"",0.14000000000000001,"",null,"Fehr Kategorie auf Lagerteil geändert",null,"BT-08701","02","Released","BEF-3SHABPKU4","SICK","2098710","Purchased",null,2,null,"Purchased"]
["1-6",">2","6","-",3202789,"mon","Montage",null,4,8,null,null,3202789,null,"Halter Lichtgitter kpl",null,null,"Generisch",null,"",1.58144704004868,"",null,null,null,null,"-","Released","",null,null,"Assembly",null,4,null,"Assembly"]
["1-6-1",">>3","1","-",3202788,"schw","Stahlbau","Nasslackierung\nFarbanstrich gem. Bestellangaben\nGrund- und Deckanstrich\nSchichtdicke 70µm total \nLauf- Anschluss- und speziell\ngekennzeichnete Flächen sind abzudecken",1,8,null,null,3202788,null,"Halter Lichtgitter STB",null,null,"Generisch","Nasslackierung\nFarbanstrich gem. Bestellangaben\nGrund- und Deckanstrich\nSchichtdicke 70µm total \nLauf- Anschluss- und speziell\ngekennzeichnete Flächen sind abzudecken","",1.5302058535821499,"",null,null,null,null,"-","Released","",null,null,"Assembly",null,1,null,"Assembly"]
["1-6-1-1",">>>4","1","-",3196861,"schw","Stahlbau",null,2,16,200,40,3196861,162095,"Blech 1","Blech 8 - 40x 200","EN 10029","S235JRG2",null,"",0.48807416666547798,"","Blech 8 - 40x 200",null,8,null,"-","Released",null,null,null,"Part",null,2,null,"Part","ohne Bearbeitung","ohne Kante"]
["1-6-1-2",">>>4","2","-",3202787,"schw","Stahlbau",null,1,8,164,null,3202787,163196,"-","4kt-Rohr 50 x 30 x 3 - 164","DIN EN 10219-2","S235JRH",null,"",0.54176753232024999,"","4kt-Rohr 50 x 30 x 3 - 164",null,null,null,"-","Released",null,null,null,"Part",null,164,null,"Part"]
["1-6-1-3",">>>4","3","01",3107726,"schw","Normteil",null,2,16,null,null,3107726,122907,"Sechskant-Schweissmutter M8",null,"DIN 929","-",null,"",6.1449939700000001E-3,"",null,"Eigenschaften angepasst",null,null,"03","Released",null,null,null,"Purchased",null,2,null,"Purchased"]
["1-6-2",">>3","2",null,126909,"mon","Normteil","A2K",2,16,null,null,126909,null,"Sch DIN 7349 - 8.4-140 HV-A2K",null,"DIN 7349","140 HV","A2K","",9.1356069200000008E-3,"",null,null,null,null,"11","Released",null,null,null,"Purchased",null,2,null,"Purchased"]
["1-6-3",">>3","3",null,127300,"mon","Normteil","ZN",2,16,null,null,127300,null,"Sicherungsscheibe SCHNORR Typ VS 8",null,"-","C60S","ZN","",7.9309311999999999E-4,"",null,null,null,null,"11","Released",null,null,null,"Purchased",null,2,null,"Purchased"]
["1-6-4",">>3","4",null,123878,"mon","Normteil","A2K",2,16,null,null,123878,null,"6kt-Schr ISO 4017 - M8x25-8.8-A2K",null,"ISO 4017","8.8","A2K","",1.569189319E-2,"",null,null,null,null,"03","Released",null,null,null,"Purchased",null,2,null,"Purchased"]
["1-7",">2","7","02",3107927,{"$error":"#NAME?"},"Lagerteil",null,2,4,null,null,3107927,null,"MLG10A-0590 Sender",null,null,"-",null,"",4.3741270105900005,"",null,"Fehr Kategorie auf Lagerteil geändert",null,null,"02","Released","(MLG10A-0590R10501 Sender)","SICK","Sender zu Empfänger","Purchased",null,2,null,"Purchased"]
["1-8",">2","8","02",3107928,{"$error":"#NAME?"},"Lagerteil",null,2,4,null,null,3107928,null,"MLG10A-0590 Empfänger",null,null,"-",null,"",4.4301950621400001,"",null,"Fehr Kategorie auf Lagerteil geändert",null,null,"02","Released","MLG10A-0590R10501","SICK","1216430","Purchased",null,2,null,"Purchased"]

{"sheet":"Tabelle1","index":2,"n_rows":21,"n_cols":23,"rows_kept":21,"cut":false,"hidden":false,"merged":[]}
["$SELECT$","$FLAGS$","$ATTACHMENT$","ArtNr","T","L","B","X","KBez","Ref1","Bezeichnung","Bezeichnung 2","Netto","GesBst","in Gebr.","LgBst","VLgBs","WGR","Kennz.","LiNr","Lieferant","LiArtNum","Lagerort"]
["","","","240770","E","","T","","240770","Schaltschrank","Steuerschrank nach Schaltplan","",0,0,0,0,0,"120","2","78682","INTER","",""]
["","","","240771","E","","T","","240771","","Kettenspanner STB","n.Zg. Fremdfertigung",0,0,0,0,0,"120","2","72444","Wuppe","",""]
["","","","240772","E","","T","","240772","","Kettenschiene unten STB","n.Zg. Fremdfertigung",0,0,0,0,0,"120","2","72444","Wuppe","",""]
["","","","240773","E","","T","","240773","","Kettenschiene oben STB","n.Zg. Fremdfertigung",0,0,0,0,0,"120","2","72444","Wuppe","",""]
["","","","240774","E","","T","","240774","","Halbflansch STB","n.Zg. Fremdfertigung",0,0,0,0,0,"120","2","72444","Wuppe","",""]
["","","","240775","E","","T","","240775","","Halbflasch 2","n.Zg. Fremdfertigung",0,0,0,0,0,"120","2","72444","Wuppe","",""]
["","","","240776","E","","T","","240776","Schaltschrank","PC-Schrank nach Schaltplan","",0,0,0,0,0,"120","2","78682","INTER","",""]
["","","","240777","E","","T","","240777","","Steigleiter Podest STB","n.Zg. Fremdfertigung",0,0,0,0,0,"120","2","72444","Wuppe","",""]
["","","","240778","E","","T","","240778","","Halter \"Sicherer UFS\" STB","n.Zg. Fremdfertigung",0,0,0,0,0,"120","2","72444","Wuppe","",""]
["","","","240779","E","","T","","240779","","Abstützung 3 STB","n.Zg. Fremdfertigung",0,0,0,0,0,"120","2","72444","Wuppe","",""]
["","","","240780","E","","T","","240780","","Abstützung vorne 1 STB","n.Zg. Fremdfertigung",0,0,0,0,0,"120","2","72444","Wuppe","",""]
["","","","240781","E","","T","","240781","","Abstützung vorne 2 STB","n.Zg. Fremdfertigung",0,0,0,0,0,"120","2","72444","Wuppe","",""]
["","","","240782","E","","T","","240782","","Abstützung 2 STB","n.Zg. Fremdfertigung",0,0,0,0,0,"120","2","72444","Wuppe","",""]
["","","","240783","E","","T","","240783","","Halter Lichtgitter STB","n.Zg. Fremdfertigung",0,0,0,0,0,"120","2","72444","Wuppe","",""]
["","","","240784","E","","T","","240784","","Halter Lichtgitter 2 STB","n.Zg. Fremdfertigung",0,0,0,0,0,"120","2","72444","Wuppe","",""]
["","","","240785","E","","T","","240785","","Verband 3 STB","n.Zg. Fremdfertigung",0,0,0,0,0,"120","2","72444","Wuppe","",""]
["","","","240786","E","","T","","240786","","Kabelpritsche 1500 STB","n.Zg. Fremdfertigung",0,0,0,0,0,"120","2","72444","Wuppe","",""]
["","","","240787","E","","T","","240787","","Halter \"Sicherer IN40\" STB","n.Zg. Fremdfertigung",0,0,0,0,0,"120","2","72444","Wuppe","",""]
["","","","240788","E","","T","","240788","","Halter ZFS unten STB","n.Zg. Fremdfertigung",0,0,0,0,0,"120","2","72444","Wuppe","",""]
["","","","240789","E","","T","","240789","","Halter ZFS oben STB","n.Zg. Fremdfertigung",0,0,0,0,0,"120","2","72444","Wuppe","",""]