{"text_format":"1","workbook":"xlsx","n_sheets":3,"sheets":["Gelbe Zeilen","Stueckliste","Tabelle1"],"not_rendered":{"charts":0,"images":0,"macros":1,"external_links":0,"defined_names":3,"comments":0,"pivot_tables":0},"unopened":[],"bounds":{"document_bytes":16777216,"sheet_cells":100000,"rows_first":2000,"rows_last":500,"rows_between":2000,"halvings":0,"cell_chars":16384,"cell_head_chars":4096},"cells_cut":0,"cells_raw":0,"read":"whole","date_system":"1900"}

{"sheet":"Gelbe Zeilen","index":0,"n_rows":46,"n_cols":42,"rows_kept":46,"cut":false,"hidden":false,"merged":[]}
["Positionierung","Level","Position Number","Revision Number","Number","Bearbeitung","Fehr Kategorie","Oberfläche","Quantity","Stückzahl","Länge [mm]","Breite [mm]","File Name","Rohmat Artikel","Title","Abmass","Norm","Material","Oberfläche","Bestand","Masse [kg]","Position","Abmass","Änderungsgrund","Blechstärke [mm]","Ersatz für","Revision","State","Typ","Zulieferer","Zulieferer Artikelnummer","Category Name","Rohmat Gewicht [g]","Kettenlängen","Bemerkung","Category Name","Laserteil bearbeitet","Laserteil gekantet","Beschaffung","Gesamt KG","IFW Art."]
["1-1-1-1",">>>4","1","-",3202602,"schw","Stahlbau",null,2,4,null,null,3202602,null,"Kettenschiene oben STB",null,null,"-",null,"",25.814551288161301,"",null,null,null,null,"-","Released","",null,null,"Assembly",null,2,null,"Assembly",null,null,null,{"$f":"J2*U2","v":103.2582051526452},240773,{"$f":"IF(IFERROR(FIND($A2,$A3),0),_xlfn.IFNA(_xlfn.XLOOKUP($O2,Tabelle1!$K$2:$K$100,Tabelle1!$I$2:$I$100),\"nicht gefunden!\"),\"\")","v":"240773"}]
["1-1-1-1-1",">>>>5","1","-",3202600,"schw","Stahlbau",null,1,4,6580,null,3202600,"161179 ","Kettenschienenprofil unten","4k-Rohr 40x40x3 - 6580","DIN EN 10210-2","S235JRH",null,"",22.298731033980101,"","4k-Rohr 40x40x3 - 6580",null,null,null,"-","Released",null,null,null,"Part",null,6580,"Sägeliste nach Zeichnung","Part",null,null,null,89.194924135920402,null,{"$f":"IF(IFERROR(FIND($A3,$A4),0),_xlfn.IFNA(_xlfn.XLOOKUP($O3,Tabelle1!$K$2:$K$100,Tabelle1!$I$2:$I$100),\"nicht gefunden!\"),\"\")","v":""}]
["1-1-1-1-2",">>>>5","2","01",3124590,"schw","Stahlbau",null,2,8,52,36,3124590,162101,"Abdeckblech","Blech 3 - 52x 36","EN 10029","S235JRG2",null,"",4.358021267E-2,"","Blech 3 - 52x 36","Oberflächenbeschaffenheit geändert",3,null,"01","Released",null,null,null,"Part",null,2,null,"Part","ohne Bearbeitung","ohne Kante",null,0.34864170136,null,{"$f":"IF(IFERROR(FIND($A4,$A5),0),_xlfn.IFNA(_xlfn.XLOOKUP($O4,Tabelle1!$K$2:$K$100,Tabelle1!$I$2:$I$100),\"nicht gefunden!\"),\"\")","v":""}]
["1-1-1-1-3",">>>>5","3","-",3202601,"schw","Einkaufsteil","Blank",1,4,6605,null,3202601,138517,"C-Profil L=6605","HM 20/12 - 6605",null,"ST","Blank","",3.4286598288316199,"","HM 20/12 - 6605",null,null,null,"-","Released","C-2010 (6m)",null,null,"Purchased",null,6605,"Sägeliste nach Zeichnung","Purchased",null,null,null,13.71463931532648,null,{"$f":"IF(IFERROR(FIND($A5,$A6),0),_xlfn.IFNA(_xlfn.XLOOKUP($O5,Tabelle1!$K$2:$K$100,Tabelle1!$I$2:$I$100),\"nicht gefunden!\"),\"\")","v":""}]
["1-1-1-2",">>>4","2","-",3202633,"schw","Stahlbau",null,14,28,null,null,3202633,null,"Gleiterhalter aussen STB",null,null,"-",null,"",3.8598691347807299,"",null,null,null,null,"-","Released","",null,null,"Assembly",null,14,null,"Assembly",null,null,null,108.07633577386044,"Nicht gefunden",{"$f":"IF(IFERROR(FIND($A6,$A7),0),_xlfn.IFNA(_xlfn.XLOOKUP($O6,Tabelle1!$K$2:$K$100,Tabelle1!$I$2:$I$100),\"nicht gefunden!\"),\"\")","v":"nicht gefunden!"}]
["1-1-1-2-1",">>>>5","1","-",3202630,"schw","Stahlbau",null,1,28,810.4,121.8,3202630,206073,"Gleiterhalter aussen","Blech 5 - 122x 810","EN 10029","S235JRG2",null,"",3.7197858847807304,"","Blech 5 - 122x 810",null,5,null,"-","Released",null,null,null,"Part",null,1,null,"Part","ohne Bearbeitung","mit Kante",null,104.15400477386045,null,{"$f":"IF(IFERROR(FIND($A7,$A8),0),_xlfn.IFNA(_xlfn.XLOOKUP($O7,Tabelle1!$K$2:$K$100,Tabelle1!$I$2:$I$100),\"nicht gefunden!\"),\"\")","v":""}]
["1-1-1-2-2",">>>>5","2","-",3202802,"schw","Stahlbau",null,2,56,61,35,3202802,206073,"Gleiterrippe","Blech 5 - 35x 61","EN 10029","S235JRG2",null,"",7.0041624999999996E-2,"","Blech 5 - 35x 61",null,5,null,"-","Released",null,null,null,"Part",null,2,null,"Part","ohne Bearbeitung","ohne Kante",null,3.9223309999999998,null,{"$f":"IF(IFERROR(FIND($A8,$A9),0),_xlfn.IFNA(_xlfn.XLOOKUP($O8,Tabelle1!$K$2:$K$100,Tabelle1!$I$2:$I$100),\"nicht gefunden!\"),\"\")","v":""}]
["1-1-1-3",">>>4","3","-",3202634,"schw","Stahlbau",null,4,8,null,null,3202634,null,"Gleiterhalter Einlauf STB",null,null,"-",null,"",3.2465520193977198,"",null,null,null,null,"-","Released","",null,null,"Assembly",null,4,null,"Assembly",null,null,null,25.972416155181758,"Nicht gefunden",{"$f":"IF(IFERROR(FIND($A9,$A10),0),_xlfn.IFNA(_xlfn.XLOOKUP($O9,Tabelle1!$K$2:$K$100,Tabelle1!$I$2:$I$100),\"nicht gefunden!\"),\"\")","v":"nicht gefunden!"}]
["1-1-1-3-1",">>>>5","1","-",3202631,"schw","Stahlbau",null,1,8,651,121.8,3202631,206073,"Gleiterhalter aussen","Blech 5 - 122x 651","EN 10029","S235JRG2",null,"",3.1765103943977202,"","Blech 5 - 122x 651",null,5,null,"-","Released",null,null,null,"Part",null,1,null,"Part","ohne Bearbeitung","mit Kante",null,25.412083155181762,null,{"$f":"IF(IFERROR(FIND($A10,$A11),0),_xlfn.IFNA(_xlfn.XLOOKUP($O10,Tabelle1!$K$2:$K$100,Tabelle1!$I$2:$I$100),\"nicht gefunden!\"),\"\")","v":""}]
["1-1-1-3-2",">>>>5","2","-",3202802,"schw","Stahlbau",null,1,8,61,35,3202802,206073,"Gleiterrippe","Blech 5 - 35x 61","EN 10029","S235JRG2",null,"",7.0041624999999996E-2,"","Blech 5 - 35x 61",null,5,null,"-","Released",null,null,null,"Part",null,1,null,"Part","ohne Bearbeitung","ohne Kante",null,0.56033299999999997,null,{"$f":"IF(IFERROR(FIND($A11,$A12),0),_xlfn.IFNA(_xlfn.XLOOKUP($O11,Tabelle1!$K$2:$K$100,Tabelle1!$I$2:$I$100),\"nicht gefunden!\"),\"\")","v":""}]
["1-1-1-4",">>>4","4","-",3202628,"schw","Stahlbau",null,14,28,null,null,3202628,null,"Abstützung STB",null,null,"-",null,"",4.8254875671925603,"",null,null,null,null,"-","Released","",null,null,"Assembly",null,14,null,"Assembly",null,null,null,135.11365188139169,"Nicht gefunden",{"$f":"IF(IFERROR(FIND($A12,$A13),0),_xlfn.IFNA(_xlfn.XLOOKUP($O12,Tabelle1!$K$2:$K$100,Tabelle1!$I$2:$I$100),\"nicht gefunden!\"),\"\")","v":"nicht gefunden!"}]
["1-1-1-4-1",">>>>5","1","-",3202629,"schw","Stahlbau",null,1,28,553.79999999999995,419.9,3202629,206073,"Biegeblech 3","Blech 5 - 420x 554","EN 10029","S235JRG2",null,"",4.6816461296925596,"","Blech 5 - 420x 554",null,5,null,"-","Released",null,null,null,"Part",null,1,null,"Part","ohne Bearbeitung","mit Kante",null,131.08609163139167,null,{"$f":"IF(IFERROR(FIND($A13,$A14),0),_xlfn.IFNA(_xlfn.XLOOKUP($O13,Tabelle1!$K$2:$K$100,Tabelle1!$I$2:$I$100),\"nicht gefunden!\"),\"\")","v":""}]
["1-1-1-4-2",">>>>5","2","-",3124582,"schw","Stahlbau",null,2,56,48,45,3124582,206073,"Rippe Abstützung","Blech 5 - 45x 48","EN 10029","S235JRG2",null,"",7.1920718750000001E-2,"","Blech 5 - 45x 48",null,5,null,"-","Released","",null,null,"Part",null,2,null,"Part","ohne Bearbeitung","ohne Kante",null,4.0275602500000005,null,{"$f":"IF(IFERROR(FIND($A14,$A15),0),_xlfn.IFNA(_xlfn.XLOOKUP($O14,Tabelle1!$K$2:$K$100,Tabelle1!$I$2:$I$100),\"nicht gefunden!\"),\"\")","v":""}]
["1-1-1-5",">>>4","5","-",3202598,"schw","Stahlbau",null,2,4,null,null,3202598,null,"Kettenschiene unten STB",null,null,"Generisch",null,"",36.449751853067298,"",null,null,null,null,"-","Released","",null,null,"Assembly",null,2,null,"Assembly",null,null,null,145.79900741226919,240772,{"$f":"IF(IFERROR(FIND($A15,$A16),0),_xlfn.IFNA(_xlfn.XLOOKUP($O15,Tabelle1!$K$2:$K$100,Tabelle1!$I$2:$I$100),\"nicht gefunden!\"),\"\")","v":"240772"}]
["1-1-1-5-1",">>>>5","1","-",3202597,"schw","Stahlbau",null,1,4,6760,null,3202597,116454,"-","U-Stahl 40 x 35 - 6760","DIN 1026-1","S235JRG2",null,"",32.957266107347699,"","U-Stahl 40 x 35 - 6760",null,null,null,"-","Released",null,null,null,"Part",null,6760,null,"Part",null,null,null,131.8290644293908,null,{"$f":"IF(IFERROR(FIND($A16,$A17),0),_xlfn.IFNA(_xlfn.XLOOKUP($O16,Tabelle1!$K$2:$K$100,Tabelle1!$I$2:$I$100),\"nicht gefunden!\"),\"\")","v":""}]
["1-1-1-5-3",">>>>5","3","-",3202596,"schw","Einkaufsteil","Blank",1,4,6720,null,3202596,138517,"C-Profil L=6720","HM 20/12 - 6720",null,"ST","Blank","",3.4924857457196401,"","HM 20/12 - 6720",null,null,null,"-","Released","C-2010 (6m)",null,null,"Purchased",null,6720,null,"Purchased",null,null,null,13.96994298287856,null,{"$f":"IF(IFERROR(FIND($A17,$A18),0),_xlfn.IFNA(_xlfn.XLOOKUP($O17,Tabelle1!$K$2:$K$100,Tabelle1!$I$2:$I$100),\"nicht gefunden!\"),\"\")","v":""}]
["1-1-1-6",">>>4","6","-",3183621,"schw","Stahlbau",null,2,4,null,null,3183621,null,"Kettenspanner STB",null,null,"Generisch",null,"",4.0953163328932902,"",null,null,null,null,"-","Released","",null,null,"Assembly",null,2,null,"Assembly",null,null,null,16.381265331573161,240771,{"$f":"IF(IFERROR(FIND($A18,$A19),0),_xlfn.IFNA(_xlfn.XLOOKUP($O18,Tabelle1!$K$2:$K$100,Tabelle1!$I$2:$I$100),\"nicht gefunden!\"),\"\")","v":"240771"}]
["1-1-1-6-1",">>>>5","1","-",3123597,"schw","Stahlbau",null,1,4,261,170,3123597,207897,"Biegeblech Kettenspanner","Blech 10 - 170x 261","EN 10029","S235JRG2",null,"",3.47181877913349,"","Blech 10 - 170x 261",null,10,null,"01","Released",null,null,null,"Part",null,1,null,"Part","ohne Bearbeitung","mit Kante",null,13.88727511653396,null,{"$f":"IF(IFERROR(FIND($A19,$A20),0),_xlfn.IFNA(_xlfn.XLOOKUP($O19,Tabelle1!$K$2:$K$100,Tabelle1!$I$2:$I$100),\"nicht gefunden!\"),\"\")","v":""}]
["1-1-1-6-2",">>>>5","2","-",3107187,"schw","Stahlbau",null,2,8,190,65,3107187,206073,"Rippenblech Kettenspanner","Blech 5 - 65x 190","EN 10029","S235JRG2",null,"",0.31174877687999997,"","Blech 5 - 65x 190",null,5,null,"02","Released",null,null,null,"Part",null,2,null,"Part","ohne Bearbeitung","ohne Kante",null,2.4939902150399997,null,{"$f":"IF(IFERROR(FIND($A20,$A21),0),_xlfn.IFNA(_xlfn.XLOOKUP($O20,Tabelle1!$K$2:$K$100,Tabelle1!$I$2:$I$100),\"nicht gefunden!\"),\"\")","v":""}]
{"$rows_left_out":27}
{"sheet":"Stueckliste","index":1,"n_rows":327,"n_cols":39,"rows_kept":327,"cut":false,"hidden":false,"merged":[]}
["Positionierung","Level","Position Number","Revision Number","Number","Bearbeitung","Fehr Kategorie","Oberfläche","Quantity","Stückzahl","Länge [mm]","Breite [mm]","File Name","Rohmat Artikel","Title","Abmass","Norm","Material","Oberfläche","Bestand","Masse [kg]","Position","Abmass","Änderungsgrund","Blechstärke [mm]","Ersatz für","Revision","State","Typ","Zulieferer","Zulieferer Artikelnummer","Category Name","Rohmat Gewicht [g]","Kettenlängen","Bemerkung","Category Name","Laserteil bearbeitet","Laserteil gekantet","Beschaffung"]
["1",1,1,"-",3202584,null,"Montage",null,1,2,null,null,null,null,"HW-GT",null,null,null,null,null,0,null,null,null,null,null,null,null,null,null,null,null,null,null,null,"Assembly"]
["1-1",">2","1","-",3202583,"mon","Montage",null,1,2,null,null,3202583,null,"Greiferträger 1 kpl",null,null,"-",null,"",2376.1747370494904,"",null,null,null,null,"-","Released",null,null,null,"Assembly",null,1,null,"Assembly"]
["1-1-1",">>3","1","-",3202599,"schw","Stahlbau","Nasslackierung\nFarbanstrich gem. Bestellangaben\nGrund- und Deckanstrich\nSchichtdicke 70µm total \nLauf- Anschluss- und speziell\ngekennzeichnete Flächen sind abzudecken",1,2,null,null,3202599,null,"Greiferträger STB",null,null,"-","Nasslackierung\nFarbanstrich gem. Bestellangaben\nGrund- und Deckanstrich\nSchichtdicke 70µm total \nLauf- Anschluss- und speziell\ngekennzeichnete Flächen sind abzudecken","",1558.98571385379,"",null,null,null,null,"-","Released",null,null,null,"Assembly",null,1,null,"Assembly"]
["1-1-1-1",">>>4","1","-",3202602,"schw","Stahlbau",null,2,4,null,null,3202602,null,"Kettenschiene oben STB",null,null,"-",null,"",25.814551288161301,"",null,null,null,null,"-","Released","",null,null,"Assembly",null,2,null,"Assembly"]
["1-1-1-1-1",">>>>5","1","-",3202600,"schw","Stahlbau",null,1,4,6580,null,3202600,"161179 ","Kettenschienenprofil unten","4k-Rohr 40x40x3 - 6580","DIN EN 10210-2","S235JRH",null,"",22.298731033980101,"","4k-Rohr 40x40x3 - 6580",null,null,null,"-","Released",null,null,null,"Part",null,6580,"Sägeliste nach Zeichnung","Part"]
["1-1-1-1-2",">>>>5","2","01",3124590,"schw","Stahlbau",null,2,8,52,36,3124590,162101,"Abdeckblech","Blech 3 - 52x 36","EN 10029","S235JRG2",null,"",4.358021267E-2,"","Blech 3 - 52x 36","Oberflächenbeschaffenheit geändert",3,null,"01","Released",null,null,null,"Part",null,2,null,"Part","ohne Bearbeitung","ohne Kante"]
["1-1-1-1-3",">>>>5","3","-",3202601,"schw","Einkaufsteil","Blank",1,4,6605,null,3202601,138517,"C-Profil L=6605","HM 20/12 - 6605",null,"ST","Blank","",3.4286598288316199,"","HM 20/12 - 6605",null,null,null,"-","Released","C-2010 (6m)",null,null,"Purchased",null,6605,"Sägeliste nach Zeichnung","Purchased"]
["1-1-1-2",">>>4","2","-",3202633,"schw","Stahlbau",null,14,28,null,null,3202633,null,"Gleiterhalter aussen STB",null,null,"-",null,"",3.8598691347807299,"",null,null,null,null,"-","Released","",null,null,"Assembly",null,14,null,"Assembly"]
["1-1-1-2-1",">>>>5","1","-",3202630,"schw","Stahlbau",null,1,28,810.4,121.8,3202630,206073,"Gleiterhalter aussen","Blech 5 - 122x 810","EN 10029","S235JRG2",null,"",3.7197858847807304,"","Blech 5 - 122x 810",null,5,null,"-","Released",null,null,null,"Part",null,1,null,"Part","ohne Bearbeitung","mit Kante"]
["1-1-1-2-2",">>>>5","2","-",3202802,"schw","Stahlbau",null,2,56,61,35,3202802,206073,"Gleiterrippe","Blech 5 - 35x 61","EN 10029","S235JRG2",null,"",7.0041624999999996E-2,"","Blech 5 - 35x 61",null,5,null,"-","Released",null,null,null,"Part",null,2,null,"Part","ohne Bearbeitung","ohne Kante"]
["1-1-1-3",">>>4","3","-",3202634,"schw","Stahlbau",null,4,8,null,null,3202634,null,"Gleiterhalter Einlauf STB",null,null,"-",null,"",3.2465520193977198,"",null,null,null,null,"-","Released","",null,null,"Assembly",null,4,null,"Assembly"]
["1-1-1-3-1",">>>>5","1","-",3202631,"schw","Stahlbau",null,1,8,651,121.8,3202631,206073,"Gleiterhalter aussen","Blech 5 - 122x 651","EN 10029","S235JRG2",null,"",3.1765103943977202,"","Blech 5 - 122x 651",null,5,null,"-","Released",null,null,null,"Part",null,1,null,"Part","ohne Bearbeitung","mit Kante"]
["1-1-1-3-2",">>>>5","2","-",3202802,"schw","Stahlbau",null,1,8,61,35,3202802,206073,"Gleiterrippe","Blech 5 - 35x 61","EN 10029","S235JRG2",null,"",7.0041624999999996E-2,"","Blech 5 - 35x 61",null,5,null,"-","Released",null,null,null,"Part",null,1,null,"Part","ohne Bearbeitung","ohne Kante"]
["1-1-1-4",">>>4","4","-",3202628,"schw","Stahlbau",null,14,28,null,null,3202628,null,"Abstützung STB",null,null,"-",null,"",4.8254875671925603,"",null,null,null,null,"-","Released","",null,null,"Assembly",null,14,null,"Assembly"]
["1-1-1-4-1",">>>>5","1","-",3202629,"schw","Stahlbau",null,1,28,553.79999999999995,419.9,3202629,206073,"Biegeblech 3","Blech 5 - 420x 554","EN 10029","S235JRG2",null,"",4.6816461296925596,"","Blech 5 - 420x 554",null,5,null,"-","Released",null,null,null,"Part",null,1,null,"Part","ohne Bearbeitung","mit Kante"]
["1-1-1-4-2",">>>>5","2","-",3124582,"schw","Stahlbau",null,2,56,48,45,3124582,206073,"Rippe Abstützung","Blech 5 - 45x 48","EN 10029","S235JRG2",null,"",7.1920718750000001E-2,"","Blech 5 - 45x 48",null,5,null,"-","Released","",null,null,"Part",null,2,null,"Part","ohne Bearbeitung","ohne Kante"]
["1-1-1-5",">>>4","5","-",3202598,"schw","Stahlbau",null,2,4,null,null,3202598,null,"Kettenschiene unten STB",null,null,"Generisch",null,"",36.449751853067298,"",null,null,null,null,"-","Released","",null,null,"Assembly",null,2,null,"Assembly"]
["1-1-1-5-1",">>>>5","1","-",3202597,"schw","Stahlbau",null,1,4,6760,null,3202597,116454,"-","U-Stahl 40 x 35 - 6760","DIN 1026-1","S235JRG2",null,"",32.957266107347699,"","U-Stahl 40 x 35 - 6760",null,null,null,"-","Released",null,null,null,"Part",null,6760,null,"Part"]
["1-1-1-5-3",">>>>5","3","-",3202596,"schw","Einkaufsteil","Blank",1,4,6720,null,3202596,138517,"C-Profil L=6720","HM 20/12 - 6720",null,"ST","Blank","",3.4924857457196401,"","HM 20/12 - 6720",null,null,null,"-","Released","C-2010 (6m)",null,null,"Purchased",null,6720,null,"Purchased"]
{"$rows_left_out":308}
{"sheet":"Tabelle1","index":2,"n_rows":21,"n_cols":23,"rows_kept":21,"cut":false,"hidden":false,"merged":[]}
["$SELECT$","$FLAGS$","$ATTACHMENT$","ArtNr","T","L","B","X","KBez","Ref1","Bezeichnung","Bezeichnung 2","Netto","GesBst","in Gebr.","LgBst","VLgBs","WGR","Kennz.","LiNr","Lieferant","LiArtNum","Lagerort"]
["","","","240770","E","","T","","240770","Schaltschrank","Steuerschrank nach Schaltplan","",0,0,0,0,0,"120","2","78682","INTER","",""]
["","","","240771","E","","T","","240771","","Kettenspanner STB","n.Zg. Fremdfertigung",0,0,0,0,0,"120","2","72444","Wuppe","",""]
["","","","240772","E","","T","","240772","","Kettenschiene unten STB","n.Zg. Fremdfertigung",0,0,0,0,0,"120","2","72444","Wuppe","",""]
["","","","240773","E","","T","","240773","","Kettenschiene oben STB","n.Zg. Fremdfertigung",0,0,0,0,0,"120","2","72444","Wuppe","",""]
["","","","240774","E","","T","","240774","","Halbflansch STB","n.Zg. Fremdfertigung",0,0,0,0,0,"120","2","72444","Wuppe","",""]
["","","","240775","E","","T","","240775","","Halbflasch 2","n.Zg. Fremdfertigung",0,0,0,0,0,"120","2","72444","Wuppe","",""]
["","","","240776","E","","T","","240776","Schaltschrank","PC-Schrank nach Schaltplan","",0,0,0,0,0,"120","2","78682","INTER","",""]
["","","","240777","E","","T","","240777","","Steigleiter Podest STB","n.Zg. Fremdfertigung",0,0,0,0,0,"120","2","72444","Wuppe","",""]
["","","","240778","E","","T","","240778","","Halter \"Sicherer UFS\" STB","n.Zg. Fremdfertigung",0,0,0,0,0,"120","2","72444","Wuppe","",""]
["","","","240779","E","","T","","240779","","Abstützung 3 STB","n.Zg. Fremdfertigung",0,0,0,0,0,"120","2","72444","Wuppe","",""]
["","","","240780","E","","T","","240780","","Abstützung vorne 1 STB","n.Zg. Fremdfertigung",0,0,0,0,0,"120","2","72444","Wuppe","",""]
["","","","240781","E","","T","","240781","","Abstützung vorne 2 STB","n.Zg. Fremdfertigung",0,0,0,0,0,"120","2","72444","Wuppe","",""]
["","","","240782","E","","T","","240782","","Abstützung 2 STB","n.Zg. Fremdfertigung",0,0,0,0,0,"120","2","72444","Wuppe","",""]
["","","","240783","E","","T","","240783","","Halter Lichtgitter STB","n.Zg. Fremdfertigung",0,0,0,0,0,"120","2","72444","Wuppe","",""]
["","","","240784","E","","T","","240784","","Halter Lichtgitter 2 STB","n.Zg. Fremdfertigung",0,0,0,0,0,"120","2","72444","Wuppe","",""]
["","","","240785","E","","T","","240785","","Verband 3 STB","n.Zg. Fremdfertigung",0,0,0,0,0,"120","2","72444","Wuppe","",""]
["","","","240786","E","","T","","240786","","Kabelpritsche 1500 STB","n.Zg. Fremdfertigung",0,0,0,0,0,"120","2","72444","Wuppe","",""]
["","","","240787","E","","T","","240787","","Halter \"Sicherer IN40\" STB","n.Zg. Fremdfertigung",0,0,0,0,0,"120","2","72444","Wuppe","",""]
["","","","240788","E","","T","","240788","","Halter ZFS unten STB","n.Zg. Fremdfertigung",0,0,0,0,0,"120","2","72444","Wuppe","",""]
{"$rows_left_out":1}