{"text_format":"1","workbook":"xlsx","n_sheets":13,"sheets":["Übersicht","AAAAA","BBBB","CCC","DDDD","EEEE","FFFF","GGGG","HHHH","IIIIII","JJJJJ","KKKKK","LLLL"],"not_rendered":{"charts":0,"images":0,"macros":1,"external_links":0,"defined_names":1,"comments":0,"pivot_tables":0},"unopened":[],"bounds":{"document_bytes":16777216,"sheet_cells":100000,"rows_first":2000,"rows_last":500,"rows_between":2000,"halvings":0,"cell_chars":16384,"cell_head_chars":4096},"cells_cut":0,"cells_raw":0,"read":"whole","date_system":"1900"}

{"sheet":"Übersicht","index":0,"n_rows":23,"n_cols":7,"rows_kept":23,"cut":false,"hidden":false,"merged":[]}
[]
[]
[]
[]
[]
[null,"Blatt","Blattname","Zellwert A1",null,"Sollwert Blattname","Sollwert A1"]
[null,2,{"$f":"IF(\nB7>COUNTA(Inhalt),\n\"- - -\",\nMID(INDEX(Inhalt,B7),FIND(\"]\",INDEX(Inhalt,B7))+1,31)\n)","v":"AAAAA"},{"$f":"IFERROR(INDIRECT(\"'\"&(INDEX(Inhalt,B7))&\"'!A1\"),\"- - -\")","v":"aa"},null,"AAAAA","aa"]
[null,3,{"$f":"IF(\nB8>COUNTA(Inhalt),\n\"- - -\",\nMID(INDEX(Inhalt,B8),FIND(\"]\",INDEX(Inhalt,B8))+1,31)\n)","v":"BBBB"},{"$f":"IFERROR(INDIRECT(\"'\"&(INDEX(Inhalt,B8))&\"'!A1\"),\"- - -\")","v":"bb"},null,"BBBB","bb"]
[null,4,{"$f":"IF(\nB9>COUNTA(Inhalt),\n\"- - -\",\nMID(INDEX(Inhalt,B9),FIND(\"]\",INDEX(Inhalt,B9))+1,31)\n)","v":"CCC"},{"$f":"IFERROR(INDIRECT(\"'\"&(INDEX(Inhalt,B9))&\"'!A1\"),\"- - -\")","v":"cc"},null,"CCC","cc"]
[null,5,{"$f":"IF(\nB10>COUNTA(Inhalt),\n\"- - -\",\nMID(INDEX(Inhalt,B10),FIND(\"]\",INDEX(Inhalt,B10))+1,31)\n)","v":"DDDD"},{"$f":"IFERROR(INDIRECT(\"'\"&(INDEX(Inhalt,B10))&\"'!A1\"),\"- - -\")","v":"dd"},null,"DDDD","dd"]
[null,6,{"$f":"IF(\nB11>COUNTA(Inhalt),\n\"- - -\",\nMID(INDEX(Inhalt,B11),FIND(\"]\",INDEX(Inhalt,B11))+1,31)\n)","v":"EEEE"},{"$f":"IFERROR(INDIRECT(\"'\"&(INDEX(Inhalt,B11))&\"'!A1\"),\"- - -\")","v":"ee"},null,"EEEE","ee"]
[null,7,{"$f":"IF(\nB12>COUNTA(Inhalt),\n\"- - -\",\nMID(INDEX(Inhalt,B12),FIND(\"]\",INDEX(Inhalt,B12))+1,31)\n)","v":"FFFF"},{"$f":"IFERROR(INDIRECT(\"'\"&(INDEX(Inhalt,B12))&\"'!A1\"),\"- - -\")","v":"ff"},null,"FFFF","ff"]
[null,8,{"$f":"IF(\nB13>COUNTA(Inhalt),\n\"- - -\",\nMID(INDEX(Inhalt,B13),FIND(\"]\",INDEX(Inhalt,B13))+1,31)\n)","v":"GGGG"},{"$f":"IFERROR(INDIRECT(\"'\"&(INDEX(Inhalt,B13))&\"'!A1\"),\"- - -\")","v":"gg"},null,"GGGG","gg"]
[null,9,{"$f":"IF(\nB14>COUNTA(Inhalt),\n\"- - -\",\nMID(INDEX(Inhalt,B14),FIND(\"]\",INDEX(Inhalt,B14))+1,31)\n)","v":"HHHH"},{"$f":"IFERROR(INDIRECT(\"'\"&(INDEX(Inhalt,B14))&\"'!A1\"),\"- - -\")","v":"hh"},null,"HHHH","hh"]
[null,10,{"$f":"IF(\nB15>COUNTA(Inhalt),\n\"- - -\",\nMID(INDEX(Inhalt,B15),FIND(\"]\",INDEX(Inhalt,B15))+1,31)\n)","v":"IIIIII"},{"$f":"IFERROR(INDIRECT(\"'\"&(INDEX(Inhalt,B15))&\"'!A1\"),\"- - -\")","v":"ii"},null,"IIIIII","ii"]
[null,11,{"$f":"IF(\nB16>COUNTA(Inhalt),\n\"- - -\",\nMID(INDEX(Inhalt,B16),FIND(\"]\",INDEX(Inhalt,B16))+1,31)\n)","v":"JJJJJ"},{"$f":"IFERROR(INDIRECT(\"'\"&(INDEX(Inhalt,B16))&\"'!A1\"),\"- - -\")","v":"jj"},null,"JJJJJ","jj"]
[null,12,{"$f":"IF(\nB17>COUNTA(Inhalt),\n\"- - -\",\nMID(INDEX(Inhalt,B17),FIND(\"]\",INDEX(Inhalt,B17))+1,31)\n)","v":"KKKKK"},{"$f":"IFERROR(INDIRECT(\"'\"&(INDEX(Inhalt,B17))&\"'!A1\"),\"- - -\")","v":"kk"},null,"KKKKK","kk"]
[null,13,{"$f":"IF(\nB18>COUNTA(Inhalt),\n\"- - -\",\nMID(INDEX(Inhalt,B18),FIND(\"]\",INDEX(Inhalt,B18))+1,31)\n)","v":"LLLL"},{"$f":"IFERROR(INDIRECT(\"'\"&(INDEX(Inhalt,B18))&\"'!A1\"),\"- - -\")","v":"ll"},null,"LLLL","ll"]
[null,14,{"$f":"IF(\nB19>COUNTA(Inhalt),\n\"- - -\",\nMID(INDEX(Inhalt,B19),FIND(\"]\",INDEX(Inhalt,B19))+1,31)\n)","v":"- - -"},{"$f":"IFERROR(INDIRECT(\"'\"&(INDEX(Inhalt,B19))&\"'!A1\"),\"- - -\")","v":"- - -"},null,"- - -","- - -"]
[null,15,{"$f":"IF(\nB20>COUNTA(Inhalt),\n\"- - -\",\nMID(INDEX(Inhalt,B20),FIND(\"]\",INDEX(Inhalt,B20))+1,31)\n)","v":"- - -"},{"$f":"IFERROR(INDIRECT(\"'\"&(INDEX(Inhalt,B20))&\"'!A1\"),\"- - -\")","v":"- - -"},null,"- - -","- - -"]
[null,16,{"$f":"IF(\nB21>COUNTA(Inhalt),\n\"- - -\",\nMID(INDEX(Inhalt,B21),FIND(\"]\",INDEX(Inhalt,B21))+1,31)\n)","v":"- - -"},{"$f":"IFERROR(INDIRECT(\"'\"&(INDEX(Inhalt,B21))&\"'!A1\"),\"- - -\")","v":"- - -"},null,"- - -","- - -"]
[null,17,{"$f":"IF(\nB22>COUNTA(Inhalt),\n\"- - -\",\nMID(INDEX(Inhalt,B22),FIND(\"]\",INDEX(Inhalt,B22))+1,31)\n)","v":"- - -"},{"$f":"IFERROR(INDIRECT(\"'\"&(INDEX(Inhalt,B22))&\"'!A1\"),\"- - -\")","v":"- - -"},null,"- - -","- - -"]
[null,18,{"$f":"IF(\nB23>COUNTA(Inhalt),\n\"- - -\",\nMID(INDEX(Inhalt,B23),FIND(\"]\",INDEX(Inhalt,B23))+1,31)\n)","v":"- - -"},{"$f":"IFERROR(INDIRECT(\"'\"&(INDEX(Inhalt,B23))&\"'!A1\"),\"- - -\")","v":"- - -"},null,"- - -","- - -"]

{"sheet":"AAAAA","index":1,"n_rows":1,"n_cols":1,"rows_kept":1,"cut":false,"hidden":false,"merged":[]}
["aa"]

{"sheet":"BBBB","index":2,"n_rows":1,"n_cols":1,"rows_kept":1,"cut":false,"hidden":false,"merged":[]}
["bb"]

{"sheet":"CCC","index":3,"n_rows":1,"n_cols":1,"rows_kept":1,"cut":false,"hidden":false,"merged":[]}
["cc"]

{"sheet":"DDDD","index":4,"n_rows":1,"n_cols":1,"rows_kept":1,"cut":false,"hidden":false,"merged":[]}
["dd"]

{"sheet":"EEEE","index":5,"n_rows":1,"n_cols":1,"rows_kept":1,"cut":false,"hidden":false,"merged":[]}
["ee"]

{"sheet":"FFFF","index":6,"n_rows":1,"n_cols":1,"rows_kept":1,"cut":false,"hidden":false,"merged":[]}
["ff"]

{"sheet":"GGGG","index":7,"n_rows":1,"n_cols":1,"rows_kept":1,"cut":false,"hidden":false,"merged":[]}
["gg"]

{"sheet":"HHHH","index":8,"n_rows":1,"n_cols":1,"rows_kept":1,"cut":false,"hidden":false,"merged":[]}
["hh"]

{"sheet":"IIIIII","index":9,"n_rows":1,"n_cols":1,"rows_kept":1,"cut":false,"hidden":false,"merged":[]}
["ii"]

{"sheet":"JJJJJ","index":10,"n_rows":1,"n_cols":1,"rows_kept":1,"cut":false,"hidden":false,"merged":[]}
["jj"]

{"sheet":"KKKKK","index":11,"n_rows":1,"n_cols":1,"rows_kept":1,"cut":false,"hidden":false,"merged":[]}
["kk"]

{"sheet":"LLLL","index":12,"n_rows":1,"n_cols":1,"rows_kept":1,"cut":false,"hidden":false,"merged":[]}
["ll"]