{"text_format":"1","workbook":"xlsx","n_sheets":2,"sheets":["Liste","Maske"],"not_rendered":{"charts":0,"images":0,"macros":1,"external_links":0,"defined_names":2,"comments":0,"pivot_tables":0},"unopened":[],"bounds":{"document_bytes":16777216,"sheet_cells":100000,"rows_first":2000,"rows_last":500,"rows_between":2000,"halvings":0,"cell_chars":16384,"cell_head_chars":4096},"cells_cut":0,"cells_raw":0,"read":"whole","date_system":"1900"}

{"sheet":"Liste","index":0,"n_rows":223,"n_cols":123,"rows_kept":223,"cut":false,"hidden":false,"merged":[[0,5,0,6],[38,5,39,5],[55,5,56,5],[49,5,50,5],[32,5,37,5],[60,5,61,5],[118,5,119,5],[161,5,162,5],[86,5,89,5],[138,5,140,5],[66,5,71,5]]}
["auff","üllen","Extern","Obst","Lidl","Artikel",null,"Min 2025","MAX 2025","Min 2026","MAX 2026","letzter Preis ","Einkauf","Soll","Ist",{"$f":"TODAY()+5-WEEKDAY(TODAY())+4*(WEEKDAY(TODAY())>7)","v":"2025-12-18"},{"$f":"IF(TODAY()>P1-1,\"\",P1-7)","v":""},"2025-01-02","2025-01-09","2025-01-16","2025-01-23","2025-01-30","2025-02-06","2025-02-13","2025-02-20","2025-02-27","2025-03-06","2025-03-13","2025-03-20","2025-03-27","2025-04-03","2025-04-10","2025-04-17","2025-04-24","2025-05-01","2025-05-08","2025-05-15","2025-05-22","2025-05-29","2025-06-05","2025-06-12","2025-06-19","2025-06-26","2025-07-03","2025-07-10","2025-07-17","2025-07-24","2025-07-31","2025-08-07","2025-08-14","2025-08-21","2025-08-28","2025-09-04","2025-09-11","2025-09-18","2025-09-25","2025-10-02","2025-10-09","2025-10-16","2025-10-23","2025-10-30","2025-11-06","2025-11-13","2025-11-20","2025-11-27","2025-12-04","2025-12-11","2025-12-18","2025-12-25","2026-01-01","2026-01-08","2026-01-15","2026-01-22","2026-01-29","2026-02-05","2026-02-12","2026-02-19","2026-02-26","2026-03-05","2026-03-12","2026-03-19","2026-03-26","2026-04-02","2026-04-09","2026-04-16","2026-04-23","2026-04-30","2026-05-07","2026-05-14","2026-05-21","2026-05-28","2026-06-04","2026-06-11","2026-06-18","2026-06-25","2026-07-02","2026-07-09","2026-07-16","2026-07-23","2026-07-30","2026-08-06","2026-08-13","2026-08-20","2026-08-27","2026-09-03","2026-09-10","2026-09-17","2026-09-24","2026-10-01","2026-10-08","2026-10-15","2026-10-22","2026-10-29","2026-11-05","2026-11-12","2026-11-19","2026-11-26","2026-12-03","2026-12-10","2026-12-17","2026-12-24","2026-12-31","2027-01-07"]
[0,{"$f":"IF(O2<N2,1,0)","v":0},0,0,{"$f":"IF(OR(O2<(N2*0.51),H2=Q2,H2=P2),1,0)","v":0},null,"Artikel 1",{"$f":"MIN($R2:BQ2)","v":99.99},{"$f":"MAX($R2:BQ2)","v":99.99},{"$f":"MIN($BR2:DR2)","v":0},{"$f":"MAX($BR2:DR2)","v":0},{"$f":"IFERROR(LOOKUP(100000,R2:DS2),0)","v":99.99},{"$f":"SUM(N2-O2)","v":0},2,2,{"$f":"INDEX(R2:DS2,MATCH(P$1,R$1:DS$1,0))","v":0},{"$f":"IFERROR(INDEX(R2:DS2,MATCH(Q$1,R$1:DS$1,0)),0)","v":0},null,null,null,null,null,null,null,null,null,null,null,null,99.99,99.99,null,null,null,null,null,null,null,null,null,99.99]
[{"$f":"A2","v":0},{"$f":"IF(O3<N3,B2+1,B2)","v":1},{"$f":"C2","v":0},{"$f":"D2","v":0},{"$f":"IF(OR(O3<(N3*0.51),H3=Q3,H3=P3),E2+1,E2)","v":1},null,"Artikel 2",{"$f":"MIN($R3:BQ3)","v":58.99},{"$f":"MAX($R3:BQ3)","v":58.99},{"$f":"MIN($BR3:DR3)","v":111},{"$f":"MAX($BR3:DR3)","v":222},{"$f":"IFERROR(LOOKUP(100000,R3:DS3),0)","v":111},2,2,null,0,0,null,null,null,null,null,null,null,null,null,null,null,58.99,null,null,58.99,null,null,null,null,null,null,58.99,null,58.99,null,null,null,null,null,null,null,null,null,null,null,null,null,null,null,null,null,null,null,null,null,null,null,null,null,null,null,null,222,111]
[{"$f":"A3","v":0},1,{"$f":"C3","v":0},{"$f":"D3","v":0},{"$f":"IF(OR(O4<(N4*0.51),H4=Q4,H4=P4),E3+1,E3)","v":1},null,"Artikel 3",{"$f":"MIN($R4:BQ4)","v":247.99},{"$f":"MAX($R4:BQ4)","v":307.99},{"$f":"MIN($BR4:DR4)","v":0},{"$f":"MAX($BR4:DR4)","v":0},{"$f":"IFERROR(LOOKUP(100000,R4:DS4),0)","v":307.99},0,7,7,0,0,null,null,null,null,null,247.99,null,null,null,null,null,null,null,null,null,null,null,null,null,null,null,null,null,null,null,null,null,null,null,null,null,null,null,null,null,null,null,307.99]
[0,1,{"$f":"C4","v":0},{"$f":"D4","v":0},1,null,"Artikel 4",{"$f":"MIN($R5:BQ5)","v":239.99},{"$f":"MAX($R5:BQ5)","v":239.99},{"$f":"MIN($BR5:DR5)","v":0},{"$f":"MAX($BR5:DR5)","v":0},239.99,0,1,1,0,0,null,null,null,null,null,null,null,null,null,null,null,null,null,null,null,null,null,null,null,null,null,null,null,null,239.99,null,null,null,null,null,null,239.99]
[{"$f":"IF(O6<N6,A5+1,A5)","v":0},{"$f":"B5","v":1},{"$f":"IF(O6<(N6*0.51),C5+1,C5)","v":0},{"$f":"D5","v":0},{"$f":"E5","v":1},null,"Artikel 5",{"$f":"MIN($R6:BQ6)","v":167},{"$f":"MAX($R6:BQ6)","v":167},{"$f":"MIN($BR6:DR6)","v":0},{"$f":"MAX($BR6:DR6)","v":0},167,0,8,8,0,0,167]
[{"$f":"A6","v":0},1,{"$f":"C6","v":0},0,1,null,"Artikel 6",{"$f":"MIN($R7:BQ7)","v":221.45},{"$f":"MAX($R7:BQ7)","v":319.99},{"$f":"MIN($BR7:DR7)","v":0},{"$f":"MAX($BR7:DR7)","v":0},221.45,-5,4,9,0,0,null,null,null,null,null,null,299.99,null,null,null,null,null,null,null,null,null,null,null,null,null,null,null,null,null,319.99,null,null,null,null,null,null,null,null,null,null,null,null,null,null,null,221.45]
[0,{"$f":"B7","v":1},{"$f":"IF(O8<(N8*0.51),C7+1,C7)","v":0},0,{"$f":"E7","v":1},null,"Artikel 7",{"$f":"MIN($R8:BQ8)","v":410},{"$f":"MAX($R8:BQ8)","v":450},{"$f":"MIN($BR8:DR8)","v":0},{"$f":"MAX($BR8:DR8)","v":0},410,0,2,2,0,0,450,null,null,null,null,null,null,null,null,null,null,null,null,null,null,null,null,null,null,null,null,null,null,null,null,null,null,null,null,null,null,null,null,null,null,null,null,null,410]
[{"$f":"A8","v":0},1,{"$f":"C8","v":0},0,1,null,"Artikel 8",{"$f":"MIN($R9:BQ9)","v":139.99},{"$f":"MAX($R9:BQ9)","v":179.99},{"$f":"MIN($BR9:DR9)","v":0},{"$f":"MAX($BR9:DR9)","v":0},145.99,-1,5,6,0,0,null,null,null,null,null,null,null,null,null,null,null,null,null,null,null,null,null,179.99,null,null,null,null,null,null,null,null,139.99,null,null,null,null,null,null,null,null,145.99]
[0,1,0,0,1,null,"Artikel 9",{"$f":"MIN($R10:BQ10)","v":399.99},{"$f":"MAX($R10:BQ10)","v":399.99},{"$f":"MIN($BR10:DR10)","v":0},{"$f":"MAX($BR10:DR10)","v":0},399.99,0,1,1,0,0,null,null,null,null,null,null,null,null,null,null,null,null,null,null,null,null,null,null,null,null,null,null,null,null,null,399.99]
{"$rows_left_out":214}
{"sheet":"Maske","index":1,"n_rows":270,"n_cols":38,"rows_kept":270,"cut":false,"hidden":false,"merged":[[6,36,6,37],[6,20,6,21],[1,23,1,24],[2,23,2,24],[6,23,6,24],[6,27,6,28],[7,32,7,33],[6,5,7,6],[1,9,1,10],[1,16,1,17],[6,9,6,10],[6,16,6,17],[2,9,2,10],[2,16,2,17],[6,13,6,14],[1,32,1,34],[2,32,2,34],[6,32,6,34]]}
[{"$f":"TODAY()+CHOOSE(WEEKDAY(TODAY(),2),0+(MOD(NOW(),1)>=11/24)*3,2,1,0+(MOD(NOW(),1)>=11/24)*4,3,2,1)","v":"2025-12-22"},{"$f":"A1+5-WEEKDAY(A1)+4*(WEEKDAY(A1)>4)","v":"2025-12-25"},{"$f":"A1+7","v":"2025-12-29"}]
[null,null,null,null,null,null,null,null,null," Preisspanne 2025",null,null,null,{"$f":"IFERROR(VLOOKUP(L3,Liste!$G$2:$H223,2,0),\"\")","v":58.99},{"$f":"IFERROR(VLOOKUP(L3,Liste!$G$2:$I223,3,0),\"\")","v":58.99},null," Preisspanne 2025",null,null,null,{"$f":"IFERROR(VLOOKUP(S3,Liste!$G$2:$H223,2,0),\"\")","v":""},{"$f":"IFERROR(VLOOKUP(S3,Liste!$G$2:$I223,3,0),\"\")","v":""},null," Preisspanne 2025",null,null,null,{"$f":"IFERROR(VLOOKUP(Z3,Liste!$G$2:$H223,2,0),\"\")","v":""},{"$f":"IFERROR(VLOOKUP(Z3,Liste!$G$2:$I223,3,0),\"\")","v":""},null,null,null,"Preisspanne 2025",null,null,null,{"$f":"IFERROR(VLOOKUP(AJ3,Liste!$G$2:$H223,2,0),\"\")","v":594.15},{"$f":"IFERROR(VLOOKUP(AJ3,Liste!$G$2:$I223,3,0),\"\")","v":699}]
[null,null,null,null,null,null,null,null,null," Preisspanne 2026",null,{"$f":"INDEX(J:J,_xlfn.AGGREGATE(14,6,ROW(J9:J27)/(J9:J27<>\"\"),1))","v":"Artikel 2"},null,{"$f":"IFERROR(VLOOKUP(L3,Liste!$G$2:$J223,4,0),\"\")","v":111},{"$f":"IFERROR(VLOOKUP(L3,Liste!$G$2:$K223,5,0),\"\")","v":222},null," Preisspanne 2026",null,{"$f":"INDEX(Q:Q,_xlfn.AGGREGATE(14,6,ROW(Q9:Q27)/(Q9:Q27<>\"\"),1))","v":"Weisbrot"},null,{"$f":"IFERROR(VLOOKUP(S3,Liste!$G$2:$J223,4,0),\"\")","v":""},{"$f":"IFERROR(VLOOKUP(S3,Liste!$G$2:$K223,5,0),\"\")","v":""},null," Preisspanne 2026",null,{"$f":"INDEX(X:X,_xlfn.AGGREGATE(14,6,ROW(X9:X27)/(X9:X27<>\"\"),1))","v":{"$error":"#NUM!"}},null,{"$f":"IFERROR(VLOOKUP(Z3,Liste!$G$2:$J223,4,0),\"\")","v":""},{"$f":"IFERROR(VLOOKUP(Z3,Liste!$G$2:$K223,5,0),\"\")","v":""},null,null,null,"Preisspanne 2026",null,null,{"$f":"INDEX(AG:AG,_xlfn.AGGREGATE(14,6,ROW(AG9:AG27)/(AG9:AG27<>\"\"),1))","v":"Artikel 205"},{"$f":"IFERROR(VLOOKUP(AJ3,Liste!$G$2:$J223,4,0),\"\")","v":0},{"$f":"IFERROR(VLOOKUP(AJ3,Liste!$G$2:$K223,5,0),\"\")","v":0}]
[null,null,null,null,null,"auffüllen",null,null,null,"Coupon",null,null,null,null,null,null,"Coupon",null,null,null,null,null,null,"Coupon"]
[null,null,null,null,null,"Obst und Gemüse",null,null,null,null,null,null,null,null,{"$f":"SUM(O9:O27)","v":222},null,null,null,null,null,null,{"$f":"SUM(V9:V27)","v":0},null,null,null,null,null,null,{"$f":"SUM(AC9:AC27)","v":0},null,null,null,null,null,null,null,null,{"$f":"SUM(AL9:AL27)","v":3271.6499999999996}]
[null,null,null,null,null,"Lidl",null,null,null,"Bonus",null,null,null,{"$f":"SUM(O9:O29)","v":222},{"$f":"IF(O5>5000,SUM(O9:O29),SUM(O9:O28))","v":222},null,"Bonus",null,null,null,{"$f":"SUM(V9:V29)","v":0},{"$f":"IF(V5>5000,SUM(V9:V29),SUM(V9:V28))","v":0},null,"Bonus",null,null,null,{"$f":"SUM(AC9:AC29)","v":0},{"$f":"IF(AC5>5000,SUM(AC9:AC29),SUM(AC9:AC28))","v":0},null,null,null,null,null,null,null,{"$f":"SUM(AL9:AL29)","v":3271.6499999999996},{"$f":"IF(AL5>5000,SUM(AL9:AL29),SUM(AL9:AL27))","v":3271.6499999999996}]
[null,null,null,null,null,"auffüllen",null,null,null,{"$f":"A1","v":"2025-12-22"},null,null,null,{"$f":"IF(J5=\"Bonus\",N6,O6)","v":222},null,null,{"$f":"B1","v":"2025-12-25"},null,null,null,{"$f":"IF(Q5=\"Bonus\",U6,V6)","v":0},null,{"$f":"B1","v":"2025-12-25"},{"$f":"C1","v":"2025-12-29"},null,null,null,{"$f":"IF(X5=\"Bonus\",AB6,AC6)","v":0},null,{"$f":"C1","v":"2025-12-29"},null,null,"Extern",null,null,null,{"$f":"IF(AG5=\"Bonus\",AK6,AL6)","v":3271.6499999999996}]
[null,"N1 imin","N1 max","www",null,null,null,"O1 min","O1 max","Artikel","ME","Min","Max","Preis","Summe",null,"Artikel","ME","Min","Max","Preis","Summe",null,"Artikel","ME","Min","Max","Preis","Summe","Y","AB",null,"Artikel",null,"ME","Min","Preis","Summe"]
[1,{"$f":"IF(VLOOKUP(F9,Liste!G$2:H223,2,0)=VLOOKUP(F9,Liste!G$2:P223,10,0),1,0)","v":0},{"$f":"IF(VLOOKUP(F9,Liste!G$2:I223,3,0)=VLOOKUP(F9,Liste!G$2:P223,10,0),1,0)","v":0},null,{"$f":"IF(VLOOKUP(F9,Liste!$G$2:O223,9,0)<1,1,0)","v":1},{"$f":"IF($F$7=\"auffüllen\",VLOOKUP(A9,Liste!B2:G223,6,0),IF($F$7=\"Obst und Gemüse\",VLOOKUP(A9,Liste!D$2:G223,4,0),IF($F$7=\"Lidl\",VLOOKUP(A9,Liste!E$2:G223,3,0))))","v":"Artikel 2"},"●",{"$f":"IF(AND(TODAY()<Liste!P$1,VLOOKUP(F9,Liste!G$2:H223,2,0)=VLOOKUP(F9,Liste!G$2:Q223,11,0)),1,0)","v":0},{"$f":"IF(AND(TODAY()<Liste!P$1,VLOOKUP(F9,Liste!G$2:I223,3,0)=VLOOKUP(F9,Liste!G$2:Q223,11,0)),1,0)","v":0},"Artikel 2",{"$f":"IFERROR(VLOOKUP(J9,Liste!$G$2:AT223,7,0),0)","v":2},">>=WENNFEHLER(MIN(SVERWEIS(J9;Liste!$G$2:$H223;2;0):SVERWEIS(J9;Liste!$G$2:$J223;4;0));0)<<",">>=WENNFEHLER(MIN(SVERWEIS(J9;Liste!$G$2:$i223;3;0):SVERWEIS(J9;Liste!$G$2:$K223;5;0));0)<<",{"$f":"IF(M9=\"Huhn\",(VLOOKUP(J9,Liste!$G$2:$L223,6,0)*1.8),VLOOKUP(J9,Liste!$G$2:$L223,6,0))","v":111},{"$f":"IF(K9>0,(K9*N9),0)","v":222},null,"Graubrot",{"$f":"IFERROR(VLOOKUP(Q9,Liste!$G$2:BA223,7,0),0)","v":0},{"$f":"IFERROR(VLOOKUP(Q9,Liste!$G$2:$H223,2,0),0)","v":0},{"$f":"IFERROR(VLOOKUP(Q9,Liste!$G$2:$I223,3,0),0)","v":0},{"$f":"IF(T9=\"Huhn\",(VLOOKUP(Q9,Liste!$G$2:$L223,6,0)*1.8),VLOOKUP(Q9,Liste!$G$2:$L223,6,0))","v":{"$error":"#N/A"}},{"$f":"IF(R9>0,(R9*U9),0)","v":0},null,null,{"$f":"IFERROR(VLOOKUP(X9,Liste!$G$2:BH223,7,0),0)","v":0},{"$f":"IFERROR(VLOOKUP(X9,Liste!$G$2:$H223,2,0),0)","v":0},{"$f":"IFERROR(VLOOKUP(X9,Liste!$G$2:$I223,3,0),0)","v":0},{"$f":"IF(AA9=\"Huhn\",(VLOOKUP(X9,Liste!$G$2:$L223,6,0)*1.8),VLOOKUP(X9,Liste!$G$2:$L223,6,0))","v":{"$error":"#N/A"}},{"$f":"IF(Y9>0,(Y9*AB9),0)","v":0},{"$f":"IFERROR(VLOOKUP(X9,Liste!$G$2:BH223,7,0),0)","v":0},{"$f":"IF(AA9=\"Huhn\",(VLOOKUP(X9,Liste!$G$2:$L223,6,0)*1.8),VLOOKUP(X9,Liste!$G$2:$L223,6,0))","v":{"$error":"#N/A"}},{"$f":"IF(VLOOKUP(AG9,Liste!$G$2:O223,9,0)<2,1,0)","v":0},{"$f":"IF($F$7=\"auffüllen\",VLOOKUP(A9,Liste!A$2:G223,7,0),IF($F$7<>\"auffüllen\",VLOOKUP(A9,Liste!C$2:G223,5,0)))","v":"Artikel 46"},"●",{"$f":"IFERROR(VLOOKUP(AG9,Liste!$G$2:BH223,7,0),0)","v":3},{"$f":"IFERROR(VLOOKUP(AG9,Liste!$G$2:$H223,2,0),0)","v":330},{"$f":"IFERROR(VLOOKUP(AG9,Liste!$G$2:$L223,6,0),0)","v":350},{"$f":"IF(AI9>0,(AI9*AK9),0)","v":1050}]
[2,{"$f":"IF(VLOOKUP(F10,Liste!G$2:H224,2,0)=VLOOKUP(F10,Liste!G$2:P224,10,0),1,0)","v":0},{"$f":"IF(VLOOKUP(F10,Liste!G$2:I224,3,0)=VLOOKUP(F10,Liste!G$2:P224,10,0),1,0)","v":0},null,{"$f":"IF(VLOOKUP(F10,Liste!$G$2:O224,9,0)<1,1,0)","v":0},{"$f":"IF($F$7=\"auffüllen\",VLOOKUP(A10,Liste!B3:G224,6,0),IF($F$7=\"Obst und Gemüse\",VLOOKUP(A10,Liste!D$2:G224,4,0),IF($F$7=\"Lidl\",VLOOKUP(A10,Liste!E$2:G224,3,0))))","v":"Artikel 12"},"●",{"$f":"IF(AND(TODAY()<Liste!P$1,VLOOKUP(F10,Liste!G$2:H224,2,0)=VLOOKUP(F10,Liste!G$2:Q224,11,0)),1,0)","v":0},{"$f":"IF(AND(TODAY()<Liste!P$1,VLOOKUP(F10,Liste!G$2:I224,3,0)=VLOOKUP(F10,Liste!G$2:Q224,11,0)),1,0)","v":0},null,{"$f":"IFERROR(VLOOKUP(J10,Liste!$G$2:AT224,7,0),0)","v":0},{"$f":"IFERROR(VLOOKUP(J10,Liste!$G$2:$H224,2,0),0)","v":0},{"$f":"IFERROR(VLOOKUP(J10,Liste!$G$2:$I224,3,0),0)","v":0},{"$f":"IF(M10=\"Huhn\",(VLOOKUP(J10,Liste!$G$2:$L224,6,0)*1.8),VLOOKUP(J10,Liste!$G$2:$L224,6,0))","v":{"$error":"#N/A"}},{"$f":"IF(K10>0,(K10*N10),0)","v":0},null,"Weisbrot",{"$f":"IFERROR(VLOOKUP(Q10,Liste!$G$2:BA224,7,0),0)","v":0},{"$f":"IFERROR(VLOOKUP(Q10,Liste!$G$2:$H224,2,0),0)","v":0},{"$f":"IFERROR(VLOOKUP(Q10,Liste!$G$2:$I224,3,0),0)","v":0},{"$f":"IF(T10=\"Huhn\",(VLOOKUP(Q10,Liste!$G$2:$L224,6,0)*1.8),VLOOKUP(Q10,Liste!$G$2:$L224,6,0))","v":{"$error":"#N/A"}},{"$f":"IF(R10>0,(R10*U10),0)","v":0},null,null,{"$f":"IFERROR(VLOOKUP(X10,Liste!$G$2:BH224,7,0),0)","v":0},{"$f":"IFERROR(VLOOKUP(X10,Liste!$G$2:$H224,2,0),0)","v":0},{"$f":"IFERROR(VLOOKUP(X10,Liste!$G$2:$I224,3,0),0)","v":0},{"$f":"IF(AA10=\"Huhn\",(VLOOKUP(X10,Liste!$G$2:$L224,6,0)*1.8),VLOOKUP(X10,Liste!$G$2:$L224,6,0))","v":{"$error":"#N/A"}},{"$f":"IF(Y10>0,(Y10*AB10),0)","v":0},{"$f":"IFERROR(VLOOKUP(X10,Liste!$G$2:BH224,7,0),0)","v":0},{"$f":"IF(AA10=\"Huhn\",(VLOOKUP(X10,Liste!$G$2:$L224,6,0)*1.8),VLOOKUP(X10,Liste!$G$2:$L224,6,0))","v":{"$error":"#N/A"}},{"$f":"IF(VLOOKUP(AG10,Liste!$G$2:O224,9,0)<2,1,0)","v":0},{"$f":"IF($F$7=\"auffüllen\",VLOOKUP(A10,Liste!A$2:G224,7,0),IF($F$7<>\"auffüllen\",VLOOKUP(A10,Liste!C$2:G224,5,0)))","v":"Artikel 180"},"●",{"$f":"IFERROR(VLOOKUP(AG10,Liste!$G$2:BH224,7,0),0)","v":0.79999999999999982},{"$f":"IFERROR(VLOOKUP(AG10,Liste!$G$2:$H224,2,0),0)","v":479.99},{"$f":"IFERROR(VLOOKUP(AG10,Liste!$G$2:$L224,6,0),0)","v":549},{"$f":"IF(AI10>0,(AI10*AK10),0)","v":439.19999999999987}]
{"$rows_left_out":260}