{"text_format":"1","workbook":"xlsx","n_sheets":12,"sheets":["Eingabe","Hausverwaltungen","Vorbelegung","Wert1914","Denkmalschutz","Antrag","Druck_Antrag","Druck_Wert1914","Druck_Berechnung","Druck_Beiblatt","Druck_Angebot","Berechnung"],"not_rendered":{"charts":0,"images":28,"macros":1,"external_links":1,"defined_names":13,"comments":1,"pivot_tables":0},"unopened":[],"bounds":{"document_bytes":16777216,"sheet_cells":100000,"rows_first":2000,"rows_last":500,"rows_between":2000,"halvings":0,"cell_chars":16384,"cell_head_chars":4096},"cells_cut":0,"cells_raw":0,"read":"whole","date_system":"1900"}

{"sheet":"Eingabe","index":0,"n_rows":115,"n_cols":15,"rows_kept":115,"cut":false,"hidden":false,"merged":[[24,1,24,3],[20,12,20,14],[16,10,16,12],[17,1,17,6],[16,1,16,6],[17,10,17,15],[21,1,21,8],[24,4,24,7],[18,1,18,2],[20,1,20,2],[20,5,20,6],[23,4,23,5],[19,1,19,2],[19,5,19,6],[18,4,18,7],[22,2,22,6],[12,10,12,12],[10,14,10,15],[12,4,12,6],[15,1,15,6],[15,10,15,15],[14,10,14,12],[13,10,13,12],[13,1,13,6],[11,1,11,2],[12,1,12,2],[14,4,14,7],[11,10,11,14],[11,6,11,8],[11,4,11,5],[10,1,10,2],[10,10,10,12],[2,0,3,0],[6,10,6,13],[9,13,9,16],[6,3,6,7],[7,3,7,7],[8,3,8,7],[8,1,8,2],[6,1,6,2],[9,1,9,2],[7,1,7,2]]}
[{"$f":"[1]Tabelle1!$B$1","v":"2026-01-05"}]
["Tarifstand:"]
[{"$f":"Vorbelegung!B1","v":"2026-03-01"}]
[]
[]
[]
[null,"Großkunde:",null,"Schotes Bauträger GmbH",null,null,null,null,null,null,"Prämienberechnung für Beginn in:",null,null,null,2026]
[null,"Eigentümer:",null,null,null,null,null,null,null,null,"Laufzeit:",5,"Jahr/e"]
[null,"Versicherungsort:"]
[null,"Wert 1914:",null,null,{"$f":"IF(Eingabe!D10=0,\"Wert 1914 angeben\",D10*Berechnung!B69)","v":"Wert 1914 angeben"},{"$f":"IF(D10>0,\"Neubauwert\",\"\")","v":""},null,null,null,null,null,null,null,"Jahresbeitrag inkl. Vers. Steuer"]
{"$rows_left_out":106}
{"sheet":"Hausverwaltungen","index":1,"n_rows":2,"n_cols":7,"rows_kept":2,"cut":false,"hidden":true,"merged":[]}
["Großkunde auswählen:","Nr. HV","Strasse und Nr.","PLZ","Ort","Telefon","Emailadresse"]
["Schotes Bauträger GmbH","230000404","Süchtelner Str.68","41066","Mönchengladbach","02161 - 241940","j.schufen@schotes.de"]

{"sheet":"Vorbelegung","index":2,"n_rows":19,"n_cols":16,"rows_kept":19,"cut":false,"hidden":false,"merged":[[3,1,3,2],[4,1,4,2],[10,1,10,4],[6,11,6,12],[6,7,6,10],[3,6,3,8],[4,6,4,8],[8,1,8,4],[2,11,2,12],[3,11,3,12],[13,7,13,11],[14,7,14,11],[11,7,11,8],[11,9,11,10],[12,11,12,12],[12,8,12,10],[6,13,6,14],[16,12,16,14],[17,12,17,14],[9,1,9,3],[16,8,16,10],[17,8,17,10],[13,2,13,4],[18,1,18,3],[18,7,18,14],[7,1,7,3],[15,8,15,10],[15,12,15,14],[12,13,12,14],[7,13,7,14],[8,13,8,14],[9,13,9,14],[10,13,10,14],[7,7,7,10],[8,7,8,10],[9,7,9,10],[10,7,10,10],[11,13,11,14]]}
[1,"2026-03-01",null,null,null,null,null,null,null,null,null,null,null,null,null,2]
[null,null,null,null,null,null,null,null,null,null,null,null,null,null,null,{"$f":"Berechnung!F108","v":""}]
[null,"Jahr:",null,null,null,null,null,null,null,"F-LW-ST","F-LW-ST-EE","Vers.Steuer VGV:",null,null,null,{"$f":"Berechnung!F112","v":{"$error":"#VALUE!"}}]
[null,"Baukostenindex:",null,null,null,null,"Mindestbeitragssatz:",null,null,null,null,"Vers.Steuer Sonst.:",null,null,null,{"$f":"Berechnung!F110","v":{"$error":"#VALUE!"}}]
[null,"gl. Neuwertfaktor:",null,null,null,null,"individueller Beitragssatz:",null,null,null,null,null,null,null,null,{"$f":"Berechnung!H117","v":{"$error":"#DIV/0!"}}]
[null,null,null,null,null,null,null,null,null,null,null,null,null,null,null,{"$f":"Berechnung!F122","v":{"$error":"#DIV/0!"}}]
[null,null,null,null,null,null,null,"Wird auf Berechnung und Angebotsdruck angezeigt !",null,null,null,"Nr. Vertriebspartner",null,"Name Vertriebspartner",null,{"$f":"Berechnung!F120","v":{"$error":"#DIV/0!"}}]
[null,"Speicherort für Berechnungen:",null,null,null,null,"Art:","AXA Versicherung",null,null,null,"Mitarbeiter","VEP Nr.","Name Mitarbeiter"]
[null,"O:\\ImmoGrandeTool\\Berechnungen\\",null,null,null,null,"Name:",null,null,null,null,null,"01"]
[null,null,null,null,null,null,"Ihr Berater:",{"$f":"IF(Eingabe!$G$27<>\"\",VLOOKUP(Eingabe!$G$27,Berechnung!$G$76:$I$79,2,FALSE),\"\")","v":{"$error":"#N/A"}}]
{"$rows_left_out":10}
{"sheet":"Wert1914","index":3,"n_rows":33,"n_cols":23,"rows_kept":33,"cut":false,"hidden":true,"merged":[[32,12,32,14],[1,1,1,11],[4,1,4,4],[30,1,30,4],[28,1,28,7],[2,12,2,19],[3,12,3,19],[27,12,27,14],[28,12,28,14],[29,12,29,14],[21,16,21,19],[4,12,4,19],[27,18,27,20],[22,16,22,19],[20,17,20,20],[23,18,23,19]]}
[null,null,null,null,null,null,null,null,null,null,null,null,null,null,null,null,null,null,null,null,null,null,26]
[null,"Ermittlung der Versicherungssumme 1914 für Wohngebäude",null,null,null,null,null,null,null,null,null,null,"Ermittlung der Bauausführungen und -ausstattungen",null,null,null,null,null,null,null,null,null,2]
[null,"nach Wohn-/Gewerbefläche und Ausstattungsmerkmalen für Wohn- und teilweise (max 49 % der Fläche)",null,null,null,null,null,null,null,null,null,null,"Der für den jeweiligen Gebäudetyp angegebene Wert berücksichtigt folgende übliche Bauausführungen und -ausstattungen:",null,null,null,null,null,null,null,null,null,false]
[null,"gewerblich genutzte Gebäude der Bauartklassen I und II oder Fertighausgruppen I und II",null,null,null,null,null,null,null,null,null,null,"Außenwände mit gefugtem Mauerwerk, Putz, Verkleidung oder Verblendsteinen; Parkett-, Teppich- oder Fliesenböden; Doppelfenster",null,null,null,null,null,null,null,null,null,false]
[null,"Ermittlung des Gebäudetypes",null,null,null,null,null,null,null,null,null,null,"oder Isolierverglasung; Naßräume und Küche gefliest; Bad/Dusche; Zentralheizung und zentrale Warmwasserversorgung",null,null,null,null,null,null,null,null,null,false]
[null,null,null,null,null,null,null,null,null,null,null,null,null,null,null,null,null,null,null,null,"Wert 1914",null,false]
[null,"ohne Unterkellerung",null,null,null,null,null,null,null,null,null,null,"Bauausführung",null,"Innenausbau",null,null,null,"Installation",null,null,null,false]
[null,"Flachdach",null,null,"DG nicht ausgebaut",null,null,"DG ausgebaut",null,null,null,null,"Dach","Außenwände","Decken/Wände","Fußböden","Fenster","Türen","Sanitär","Heizung",null,null,false]
[null,null,null,null,null,null,null,null,null,null,null,null,null,null,null,null,null,null,null,null,null,null,false]
[null,null,null,null,null,null,null,null,null,null,null,null,null,null,null,null,null,null,null,null,null,null,false]
{"$rows_left_out":24}
{"sheet":"Denkmalschutz","index":4,"n_rows":34,"n_cols":23,"rows_kept":34,"cut":false,"hidden":true,"merged":[[9,16,10,19],[28,12,28,14],[32,4,32,6],[32,8,32,10],[25,12,25,14],[26,12,26,14],[27,12,27,14],[24,4,24,6],[24,8,24,10],[23,16,23,20],[26,16,26,19],[27,16,27,21],[25,4,25,6],[26,4,26,6],[27,4,27,6],[25,8,25,10],[27,8,27,10],[26,8,26,10],[7,12,7,14],[8,12,8,14],[4,8,4,10],[4,12,4,14],[13,4,13,6],[14,4,14,6],[8,8,8,10],[11,12,11,14],[13,12,13,14],[14,12,14,14],[13,8,13,10],[10,12,10,14],[12,4,12,6],[9,12,9,14],[12,8,12,10],[12,12,12,14],[11,8,11,10],[11,4,11,6],[7,4,7,6],[8,4,8,6],[6,8,6,10],[7,8,7,10],[4,4,4,6],[5,4,5,6],[3,7,3,10],[3,11,3,14],[3,3,3,6],[1,4,1,5],[6,4,6,6],[6,12,6,14],[13,16,13,17],[12,16,12,17],[12,18,12,19],[13,18,13,19],[16,12,16,14],[16,16,17,19],[18,16,18,17],[18,18,18,19],[19,16,19,17],[19,18,19,19],[25,16,25,19]]}
[]
[null,"besteht Denkmalschutz?",null,null,{"$f":"Eingabe!D12","v":0},null,null,"Zuschlagberechnung Wert 1914 für denkmalgeschützte Gebäude"]
[null,null,null,null,null,null,null,null,null,null,null,null,null,null,null,null,null,null,null,null,null,null,0]
[null,null,null,"ohne denkmalfachlichen Mehraufwand",null,null,null,"mittlerer denkmalfachlicher Mehraufwand",null,null,null,"hoher denkmalfachlicher Mehraufwand",null,null,null,null,null,null,null,null,null,null,0]
[null,null,null,null,"Katergorie A",null,null,null,"Kategorie B",null,null,null,"Kategorie C",null,null,null,null,null,null,null,null,null,0]
[null,null,null,null,null,null,null,null,null,null,null,null,null,null,null,null,null,null,null,null,null,null,0]
[null,null,"Fassade",null,null,null,null,null,"künstlerische Bauzier/Fassadenschmuck",null,null,null,"reichhaltig verzierte Fassade mit"]
[null,null,null,null,"ohne Bauzier oder Fassadenschmuck",null,null,null,"wie z. B. Putzfassade mit einfacher Zier,",null,null,null,"Gesimsen und Friesen, Kapitellen,"]
[null,null,null,null,null,null,null,null,"schmiedeeiserne Geländer",null,null,null,"Säulen, Wandbemalungen, Schnitzwerk"]
[null,null,null,null,null,null,null,null,null,null,null,null,"an Balken, Steinmetzarbeiten",null,null,null,"Außenbereich"]
{"$rows_left_out":25}
{"sheet":"Antrag","index":5,"n_rows":28,"n_cols":23,"rows_kept":28,"cut":false,"hidden":true,"merged":[[25,3,25,8],[25,9,25,10],[15,4,15,5],[21,7,21,8],[8,8,8,9],[14,2,14,5],[14,8,14,9],[10,1,10,2],[22,1,22,2],[11,3,11,9],[10,3,10,9],[20,3,20,4],[20,5,20,6],[20,7,20,9],[12,1,12,10],[23,3,23,9],[2,14,2,19],[2,12,2,13],[7,16,7,17],[6,16,6,17],[8,17,8,22],[2,9,2,10],[5,8,5,9],[6,8,6,9],[7,8,7,9],[3,9,3,10],[12,14,12,16],[3,2,3,7],[24,3,24,8],[22,3,22,9],[9,12,9,16],[13,12,13,22],[10,19,10,22],[13,1,13,8],[15,1,15,3],[15,7,15,8],[17,1,17,9],[18,1,18,9],[19,1,19,9],[21,1,21,2]]}
[]
[null,"Antragsangaben:"]
[null,null,null,null,null,null,null,null,"Nr Vertriebspartner:",{"$f":"Vorbelegung!N15","v":{"$error":"#N/A"}},null,null,"Wohngebäude",null,{"$f":"IF(Eingabe!M22=\"Ja\",Druck_Angebot!A34,\"wird nicht beantragt\")","v":"wird nicht beantragt"}]
[null,"Großkunde:",{"$f":"Eingabe!D7","v":"Schotes Bauträger GmbH"},null,null,null,null,null,"Nr Großkunde:",{"$f":"Eingabe!G26","v":"230000404"}]
[null,null,null,null,null,null,null,null,null,null,null,null,{"$f":"IF(Eingabe!M22=\"Ja\",\"Vertragsbeginn:\",\"\")","v":""},"01","06",{"$f":"IF(Eingabe!M22=\"Ja\",Eingabe!O7,\"\")","v":""},{"$f":"IF(Eingabe!M22=\"Ja\",\"Vertragsablauf:\",\"\")","v":""},{"$f":"IF(Eingabe!M22=\"Ja\",\"01\",\"\")","v":""},{"$f":"IF(Eingabe!M22=\"Ja\",\"01\",\"\")","v":""},{"$f":"IF(Eingabe!M22=\"Nein\",\"\",IF(AND(Eingabe!M22=\"Ja\",O5>\"01\"),P5+Eingabe!L8+\"1\",P5+Eingabe!L8))","v":""},{"$f":"IF(Eingabe!M22=\"Ja\",\"Vertragsdauer:\",\"\")","v":""},{"$f":"IF(Eingabe!M22=\"Ja\",Eingabe!L8,\"\")","v":""},{"$f":"IF(Eingabe!M22=\"Ja\",\"Jahr/e\",\"\")","v":""}]
[null,{"$f":"IF(Eingabe!M22=\"Ja\",\"Wohngebäude:\",\"\")","v":""},null,null,"X",{"$f":"IF(Eingabe!M22=\"Ja\",\"Neu\",\"\")","v":""},null,{"$f":"IF(Eingabe!M22=\"Ja\",\"Änderung zu\",\"\")","v":""}]
[null,{"$f":"IF(Eingabe!M23=\"Ja\",\"Haus- und Grundbesitzerhaftpflicht:\",\"\")","v":""},null,null,null,{"$f":"IF(Eingabe!M23=\"Ja\",\"Neu\",\"\")","v":""},null,{"$f":"IF(Eingabe!M23=\"Ja\",\"Änderung zu\",\"\")","v":""},null,null,null,null,"Wie wird das Gebäude genutzt?",null,null,null,"Wohnzwecke",null,{"$f":"IF(Eingabe!D19=0,\"Nein\",\"Ja\")","v":"Nein"}]
[null,{"$f":"IF(Eingabe!O22=\"Ja\",\"Glas:\",\"\")","v":""},null,null,null,{"$f":"IF(Eingabe!O22=\"Ja\",\"Neu\",\"\")","v":""},null,{"$f":"IF(Eingabe!O22=\"Ja\",\"Änderung zu\",\"\")","v":""},null,null,null,null,null,null,null,null,"Gewerbliche Nutzung",null,{"$f":"IF(Eingabe!D20>0,\"Ja\",\"Nein\")","v":"Nein"},null,{"$f":"IF(S8=\"Ja\",\"Flächenanteil:\",\"\")","v":""},0.2]
[null,{"$f":"IF(Eingabe!O23=\"Ja\",\"Gewässerschadenhaftpflicht:\",\"\")","v":""},null,null,null,{"$f":"IF(Eingabe!O23=\"Ja\",\"Neu\",\"\")","v":""},null,{"$f":"IF(Eingabe!O23=\"Ja\",\"Änderung zu\",\"\")","v":""},null,null,null,null,null,null,null,null,{"$f":"IF(S8=\"Ja\",\"Gewerbeart:\",\"\")","v":""},"Büro"]
[null,null,null,null,null,null,null,null,null,null,null,null,{"$f":"IF(S7=\"Nein\",\"Wird das gesamte Gebäude ständig benutzt?\",IF(AND(S7=\"Ja\",S8=\"Ja\"),\"Wird das Gebäude bewohnt und die Gewerbeeinheiten benutzt?\",\"Wird das gesamte Gebäude ständig bewohnt?\"))","v":"Wird das gesamte Gebäude ständig benutzt?"},null,null,null,null,"Ja",null,"besonderer Hinweis:"]
{"$rows_left_out":19}
{"sheet":"Druck_Antrag","index":6,"n_rows":222,"n_cols":15,"rows_kept":222,"cut":false,"hidden":true,"merged":[[88,13,88,14],[85,7,85,14],[216,0,219,15],[221,0,226,15],[15,0,18,14],[99,0,102,15],[133,0,139,15],[123,0,128,15],[145,0,152,15],[154,0,155,15],[158,0,163,15],[165,0,167,15],[169,0,174,15],[176,0,181,15],[220,0,220,15],[97,13,97,14],[187,0,187,15],[182,0,182,15],[157,0,157,15],[156,0,156,15],[214,0,214,15],[188,0,188,15],[130,11,130,14],[194,0,194,15],[207,0,207,15],[211,0,211,15],[215,0,215,15],[175,0,175,15],[183,0,186,15],[189,0,193,15],[195,0,201,15],[203,0,205,15],[208,0,210,15],[212,0,213,15],[206,0,206,15],[202,0,202,15],[74,5,74,6],[168,0,168,15],[164,0,164,15],[110,12,110,13],[119,7,119,12],[120,7,120,12],[142,2,142,7],[142,11,142,14],[142,0,142,1],[141,9,141,10],[142,9,142,10],[144,0,144,15],[153,0,153,15],[130,1,130,4],[141,0,141,1],[141,2,141,7],[141,11,141,14],[83,5,83,6],[97,0,97,9],[79,0,79,9],[79,13,79,14],[94,1,94,11],[92,13,92,15],[88,0,88,9],[39,5,39,6],[27,0,27,14],[28,0,28,14],[30,8,30,10],[31,6,31,13],[56,11,56,13],[56,7,56,10],[30,6,30,7],[70,13,70,14],[53,0,53,5],[52,2,52,14],[58,4,58,12],[76,6,76,9],[76,10,76,14],[24,8,24,10],[83,0,83,1],[22,6,22,14],[74,13,74,15],[54,7,54,8],[54,9,54,14],[37,14,37,15],[83,13,83,15],[57,9,57,13],[40,5,40,6],[40,7,40,14],[51,0,51,12],[35,5,35,6],[35,13,35,15],[74,0,74,1],[60,0,60,13],[61,0,61,13],[62,0,62,13],[70,0,70,9],[43,12,43,13],[38,0,38,4],[38,5,38,6],[25,16,25,19],[24,11,24,14],[10,0,10,11],[38,14,38,15],[2,7,2,12],[4,12,4,13],[13,6,13,14],[24,1,24,6],[5,10,5,13],[6,10,6,13],[7,10,7,13],[8,10,8,13]]}
[null,null,null,"– Anmeldung zur Rahmenvereinbarung"]
[]
["Großkunde",null,null,null,null,{"$f":"Eingabe!G26","v":"230000404"},null,{"$f":"Eingabe!D7","v":"Schotes Bauträger GmbH"}]
["Vertriebspartner",null,null,null,null,{"$f":"Vorbelegung!N15","v":{"$error":"#N/A"}}]
[]
["Wohngebäude",null,null,null,null,null,{"$f":"Antrag!E6","v":"X"},"Neu",{"$f":"Antrag!G6","v":0},"Änderung zu",{"$f":"Antrag!I6","v":0}]
["Haus- und Grundbesitzerhaftpflicht",null,null,null,null,null,{"$f":"Antrag!E7","v":0},"Neu",{"$f":"Antrag!G7","v":0},"Änderung zu",{"$f":"Antrag!I7","v":0}]
["Glas",null,null,null,null,null,{"$f":"Antrag!E8","v":0},"Neu",{"$f":"Antrag!G8","v":0},"Änderung zu",{"$f":"Antrag!I8","v":0}]
["Gewässerschadenhaftpflicht",null,null,null,null,null,{"$f":"Antrag!E9","v":0},"Neu",{"$f":"Antrag!G9","v":0},"Änderung zu"]
[]
{"$rows_left_out":213}
{"sheet":"Druck_Wert1914","index":7,"n_rows":123,"n_cols":9,"rows_kept":123,"cut":false,"hidden":true,"merged":[[103,6,103,7],[99,1,99,2],[99,5,99,6],[99,3,99,4],[74,10,74,12],[77,5,77,6],[77,7,77,8],[63,5,63,6],[65,5,65,6],[64,5,64,6],[71,5,71,6],[71,7,71,8],[4,1,4,2],[4,4,4,6],[5,1,5,3],[116,6,116,7],[111,0,111,2],[111,6,111,8],[36,0,36,7],[37,0,37,7],[38,0,38,7],[112,0,112,2],[113,0,113,2],[72,1,72,2],[77,1,77,2],[77,3,77,4],[71,1,71,2],[71,3,71,4],[116,0,118,2],[10,1,26,3],[17,5,17,7],[19,5,19,8],[21,5,21,8],[65,1,65,2],[63,3,63,4],[64,3,64,4],[63,1,63,2],[64,1,64,2],[65,3,65,4],[95,5,95,6],[95,3,95,4],[95,1,95,2],[95,7,95,8],[99,7,99,8]]}
["Ermittlung der Versicherungssumme 1914 für Wohngebäude"]
["nach Wohn-/Gewerbefläche und Ausstattungsmerkmalen für Wohn- und teilweise gewerblich"]
["genutzte Gebäude der Bauartklassen I und II oder Fertighausgruppen I und II"]
[]
["Antragsteller:",{"$f":"Eingabe!D8","v":0},null,"vertreten durch:",{"$f":"Eingabe!D7","v":"Schotes Bauträger GmbH"}]
["für Objekt:",{"$f":"Eingabe!D9","v":0}]
[]
[]
[]
[]
{"$rows_left_out":114}
{"sheet":"Druck_Berechnung","index":8,"n_rows":50,"n_cols":8,"rows_kept":50,"cut":false,"hidden":true,"merged":[[38,4,38,6],[39,4,39,6],[35,4,35,6],[9,5,9,7],[6,2,6,6],[7,2,7,6],[8,2,8,6],[28,4,28,6],[31,4,31,6],[22,4,22,6]]}
[]
[]
[]
[]
[null,"GroßkundenNr.",{"$f":"Eingabe!G26","v":"230000404"},"VEP Nr.:",{"$f":"Vorbelegung!N15","v":{"$error":"#N/A"}}]
[]
["Großkunde:",null,{"$f":"Eingabe!D7","v":"Schotes Bauträger GmbH"}]
["Eigentümer:",null,{"$f":"Eingabe!D8","v":0}]
["Versicherungsort:",null,{"$f":"Eingabe!D9","v":0}]
[null,null,null,null,null,"Wert1914 laut WE"]
{"$rows_left_out":41}
{"sheet":"Druck_Beiblatt","index":9,"n_rows":56,"n_cols":5,"rows_kept":56,"cut":false,"hidden":true,"merged":[[54,3,54,6],[55,3,55,6],[30,4,30,6],[22,3,22,6],[23,3,23,6],[39,3,39,6],[40,3,40,6]]}
[]
[]
[]
[]
[]
[]
["Beiblatt vom:",{"$f":"TODAY()","v":"2026-04-20"},"zum Antrag auf"]
[{"$f":"IF(Antrag!N5<>\"\",Antrag!M3&\", \",\"\")&IF(Antrag!N18<>\"\",Antrag!M16&\", \",\"\")&IF(Antrag!N23<>\"\",Antrag!M21&\", \",\"\")&IF(Antrag!N28<>\"\",Antrag!M26,\"\")","v":"Wohngebäude, "}]
[]
[]
{"$rows_left_out":47}
{"sheet":"Druck_Angebot","index":10,"n_rows":119,"n_cols":7,"rows_kept":119,"cut":false,"hidden":true,"merged":[[10,2,10,6],[12,2,12,6],[11,2,11,6],[40,4,40,6],[30,0,30,2],[17,0,17,4],[35,4,35,6],[23,0,23,3],[32,4,32,6],[30,4,30,6],[32,0,32,2],[33,0,33,3]]}
[]
[null,null,null,null,null,null,{"$f":"TODAY()","v":"2026-04-20"}]
[]
[]
[]
[]
[]
[]
[]
[]
{"$rows_left_out":110}
{"sheet":"Berechnung","index":11,"n_rows":122,"n_cols":14,"rows_kept":122,"cut":false,"hidden":false,"merged":[[82,7,82,9],[83,7,83,9],[84,7,84,9],[85,7,85,9],[74,7,74,8],[75,7,75,8],[76,7,76,8],[77,7,77,8],[78,7,78,8]]}
["Beitragsberechnung"]
[null,null,null,null,null,null,null,null,"Für Neubauten wird ein in Abhängigkeit vom Gebäudealter"]
["Gebäude",null,null,"Beitragssatz",null,null,"Rabatte",null,"(abzustellen ist auf das Kalenderjahr der Fertigstellung) abgestufter Nachlass gewährt."]
["bei Schadenquote < 60 %",null,null,"F,LW,ST,EE","F,LW,ST",null,"Laufzeit 5 J.",null,"0 -5 Jahre","6-15 Jahre","16-30 Jahre","über 30 Jahre"]
[null,null,null,{"$f":"IF(Vorbelegung!K5=\"\",Vorbelegung!K4,IF(Vorbelegung!K5<Vorbelegung!K4,Vorbelegung!K4,Vorbelegung!K5))","v":0},{"$f":"IF(Vorbelegung!J5=\"\",Vorbelegung!J4,IF(Vorbelegung!J5<Vorbelegung!J4,Vorbelegung!J4,Vorbelegung!J5))","v":0},null,0.05,null,0.2,0.1,0.05,0]
[]
["Objekt","Baujahr","Geb.Alter","Wert 1914","Elementar","Beitragssatz","PUG","Beitrag 1914","Netto","Rohre","Rohre","Netto"]
[null,null,null,null,"Ja / Nein","%o","%o",null,null,"auf dem VSGrund","außerhalb VSGr."]
[{"$f":"Eingabe!$D$9","v":0},{"$f":"Eingabe!$D$11","v":0},{"$f":"IF(Eingabe!O7=B68,B68-B9,C68-B9)","v":0},{"$f":"Eingabe!$D$10","v":0},{"$f":"Eingabe!$D$13","v":0},{"$f":"IF(E9=\"Ja\",$D$5,E5)","v":0},{"$f":"IF(Eingabe!H14=\"ja\",F9 +0.15,F9)","v":0},{"$f":"(D9*G9)/1000","v":0},{"$f":"IF(Eingabe!O7=B68,H9*B70,H9*C70)","v":0},{"$f":"IF(Eingabe!H16=\"ja\",90,0)","v":0},{"$f":"IF(Eingabe!H17=\"ja\",90,0)","v":0},{"$f":"I9+J9+K9","v":0}]
[]
{"$rows_left_out":112}